##TITLE=1H_Pr 5044-2
 CDCl3
 8 sc, 
 24.10.2022
##JCAMPDX= 6.0         $$ Bruker NMR JCAMP-DX V2.0
##DATA TYPE= NMR FID
##DATA CLASS= NTUPLES
##ORIGIN= UXNMR, Bruker Analytische Messtechnik GmbH
##OWNER= root
$$ XWIN-NMR		Version 3.5
$$ Mon Oct 24 16:13:32 2022 Russian Standard Time (UT+4h)  she@DPX200
##.OBSERVE FREQUENCY= 200.1313499994
##.OBSERVE NUCLEUS= ^1H
##.DELAY= (6, 6)
##.ACQUISITION MODE= SIMULTANEOUS
##.ACQUISITION SCHEME= undefined
##.AVERAGES= 8
##.DIGITISER RES= 18
##SPECTROMETER/DATA SYSTEM= spect
##.PULSE SEQUENCE= zg30
##.SOLVENT NAME= CDCl3
##.SHIFT REFERENCE= (INTERNAL, CDCl3, 0, 15.7039)
##AUDIT TRAIL= $$ (NUMBER, WHEN, WHO, WHERE, WHAT)
$$ ##TITLE= Audit trail, XWIN-NMR		Version 3.5
$$ ##JCAMPDX= 5.01
$$ ##ORIGIN= Bruker BioSpin GmbH
$$ ##OWNER= she
$$ F:/spectra/data/she/nmr/H-F/1/audita.txt
$$ ##AUDIT TRAIL=  $$ (NUMBER, WHEN, WHO, WHERE, WHAT)
(   1,<2022-10-24 16:12:31.21 +0400>,<she>,<DPX200>,
      <created by zg, POWCHK disabled, PULCHK disabled
       configuration hash MD5:
       00 E9 B6 7A A2 85 ED C7 34 08 36 98 17 FE 4E 26
       data hash MD5: 16K
       3F 16 CA 0A 85 EC BD 25 C9 69 70 83 1A A5 E8 2F>)
$$ ##END=
$$ 
$$ hash MD5
$$ 90 A4 8D E5 FE BC A9 E3 1E 75 55 9D 0B 5E 6C 5E
##$RELAX= 
##$RELAX= 
##$RELAX= 
##$RELAX= 
##$RELAX= 
##$RELAX= 
$$ Bruker specific parameters
$$ --------------------------
##$DU= <F:/spectra>
##$EXPNO= 1
##$NAME= <H-F>
##$PROCNO= 1
##$TYPE= <nmr>
##$USER= <she>
##$AMP= (0..31)
100 100 100 100 100 100 100 100 100 100 100 100 100 100 100 100 100 100 
100 100 100 100 100 100 100 100 100 100 100 100 100 100 
##$AQSEQ= 0
##$AQ_mod= 1
##$AUNM= <au_zg>
##$AUTOPOS= <>
##$BF1= 200.13
##$BF2= 200.13
##$BF3= 200.13
##$BF4= 200.13
##$BF5= 200.13
##$BF6= 200.13
##$BF7= 200.13
##$BF8= 200.13
##$BYTORDA= 1
##$CFDGTYP= 0
##$CFRGTYP= 5
##$CHEMSTR= <none>
##$CNST= (0..31)
1 1 145 1 1 1 1 1 1 1 1 1 1 1 1 1 1 1 1 1 1 1 1 1 1 1 1 1 1 1 1 1 
##$CPDPRG= <>
##$CPDPRG1= <>
##$CPDPRG2= <>
##$CPDPRG3= <>
##$CPDPRG4= <mlev>
##$CPDPRG5= <mlev>
##$CPDPRG6= <mlev>
##$CPDPRG7= <mlev>
##$CPDPRG8= <mlev>
##$CPDPRGB= <>
##$CPDPRGT= <>
##$D= (0..31)
0 1.2 0 0 0 0 0 0 0 0.06 0 0.03 0 0 0 0 0.0002 0 0 0 0 0 0 0 0 0 0 0 0 
0 0 0 
##$DATE= 1666613550
##$DBL= (0..7)
120 120 120 120 120 120 120 120 
##$DBP= (0..7)
150 150 150 150 150 150 150 150 
##$DBP07= 0
##$DBPNAM0= <>
##$DBPNAM1= <>
##$DBPNAM2= <>
##$DBPNAM3= <>
##$DBPNAM4= <>
##$DBPNAM5= <>
##$DBPNAM6= <>
##$DBPNAM7= <>
##$DBPOAL= (0..7)
0.5 0.5 0.5 0.5 0.5 0.5 0.5 0.5 
##$DBPOFFS= (0..7)
0 0 0 0 0 0 0 0 
##$DE= 6
##$DECBNUC= <off>
##$DECIM= 32
##$DECNUC= <off>
##$DECSTAT= 4
##$DIGMOD= 1
##$DIGTYP= 9
##$DL= (0..7)
0 120 120 120 120 120 120 120 
##$DP= (0..7)
150 150 150 150 150 150 150 150 
##$DP07= 0
##$DPNAME0= <>
##$DPNAME1= <>
##$DPNAME2= <>
##$DPNAME3= <>
##$DPNAME4= <>
##$DPNAME5= <>
##$DPNAME6= <>
##$DPNAME7= <>
##$DPOAL= (0..7)
0.5 0.5 0.5 0.5 0.5 0.5 0.5 0.5 
##$DPOFFS= (0..7)
0 0 0 0 0 0 0 0 
##$DQDMODE= 0
##$DR= 18
##$DS= 0
##$DSLIST= <SSSSSSSSSSSSSSS>
$$ [...]
##$SUBNAM2= <"">
##$SUBNAM3= <"">
##$SUBNAM4= <"">
##$SUBNAM5= <"">
##$SUBNAM6= <"">
##$SUBNAM7= <"">
##$SUBNAM8= <"">
##$SUBNAM9= <"">
##$SW= 18.0517283424941
##$SWIBOX= (0..15)
0 0 2 0 0 0 0 0 0 0 0 0 0 0 0 0 
##$SW_h= 3612.71676300578
##$TD= 16384
##$TD0= 1
##$TE= 0
##$TE2= 300
##$TE3= 300
##$TEG= 300
##$TL= (0..7)
0 120 120 120 120 120 120 120 
##$TP= (0..7)
150 150 150 150 150 150 150 150 
##$TP07= 0
##$TPNAME0= <>
##$TPNAME1= <>
##$TPNAME2= <>
##$TPNAME3= <>
##$TPNAME4= <>
##$TPNAME5= <>
##$TPNAME6= <>
##$TPNAME7= <>
##$TPOAL= (0..7)
0.5 0.5 0.5 0.5 0.5 0.5 0.5 0.5 
##$TPOFFS= (0..7)
0 0 0 0 0 0 0 0 
##$TUNHIN= 0
##$TUNHOUT= 0
##$TUNXOUT= 0
##$USERA1= <user>
##$USERA2= <user>
##$USERA3= <user>
##$USERA4= <user>
##$USERA5= <user>
##$V9= 5
##$VALIST= <valist>
##$VCLIST= <CCCCCCCCCCCCCCC>
##$VD= 0
##$VDLIST= <DDDDDDDDDDDDDDD>
##$VPLIST= <PPPPPPPPPPPPPPP>
##$VTLIST= <TTTTTTTTTTTTTTT>
##$WBST= 1024
##$WBSW= 4
##$XGAIN= (0..3)
0 0 0 0 
##$XL= 0
##$YL= 0
##$YMAX_a= 584654
##$YMIN_a= -678412
##$ZGOPTNS= <>
##$ZL1= 120
##$ZL2= 120
##$ZL3= 120
##$ZL4= 120
##$ABSF1= 10
##$ABSF2= 0
##$ABSG= 5
##$ABSL= 3
##$ALPHA= 0
##$AQORDER= 0
##$ASSFAC= 0
##$ASSFACI= 0
##$ASSFACX= 0
##$ASSWID= 0
##$AUNMP= <proc_1d>
##$AZFE= 0.1
##$AZFW= 0.1
##$BCFW= 1
##$BC_mod= 2
##$BYTORDP= 1
##$COROFFS= 0
##$CY= 11.3945322036743
##$DATMOD= 1
##$DC= 2
##$DFILT= <>
##$DTYPP= 0
##$F1P= 2.36226072786647
##$F2P= -0.459571619588291
##$FCOR= 0.5
##$FTSIZE= 0
##$FT_mod= 4
##$GAMMA= 1
##$GB= 0.15
##$INTBC= 1
##$INTSCL= 1
##$ISEN= 128
##$LB= 0.24
##$LEV0= 0
##$LPBIN= 0
##$MAXI= 10000
##$MC2= 0
##$MEAN= 0
##$ME_mod= 0
##$MI= 1.114404
##$NCOEF= 0
##$NC_proc= 0
##$NLEV= 6
##$NOISF1= 3.799351
##$NOISF2= 2.8
##$NSP= 1
##$NTH_PI= 0
##$NZP= 0
##$OFFSET= 15.70392
##$PC= 1
##$PHC0= -18034.23
##$PHC1= 11.2007
##$PH_mod= 1
##$PKNL= yes
##$PPARMOD= 0
##$PSCAL= 0
##$PSIGN= 0
##$REVERSE= no
##$SF= 200.130013532006
##$SI= 16384
##$SIGF1= 3
##$SIGF2= 2
##$SINO= 400
##$SIOLD= 16384
##$SREGLST= <1H.CDCl3>
##$SSB= 0
##$STSI= 0
##$STSR= 0
##$SW_p= 3612.71676300578
##$SYMM= 0
##$S_DEV= 0
##$TDeff= 0
##$TDoff= 0
##$TI= <>
##$TILT= no
##$TM1= 0
##$TM2= 0
##$TOPLEV= 0
##$USERP1= <user>
##$USERP2= <user>
##$USERP3= <user>
##$USERP4= <user>
##$USERP5= <user>
##$WDW= 1
##$XDIM= 8192
##$YMAX_p= 0
##$YMIN_p= 0
$$ End of Bruker specific parameters
$$ ---------------------------------
##NTUPLES= NMR FID
##VAR_NAME=  TIME,          FID/REAL,        FID/IMAG
##SYMBOL=    X,             R,               I
##VAR_TYPE=  INDEPENDENT,   DEPENDENT,       DEPENDENT
##VAR_FORM=  AFFN,          ASDF,            ASDF
##VAR_DIM=   8192,          8192,            8192
##UNITS=     SECONDS,       ARBITRARY UNITS, ARBITRARY UNITS
##FACTOR=    0.0002768,     1,               1
##FIRST=     0,             0,               0
##LAST=      2.2672688,     0,               0
##MIN=       0,             -678412,         0
##MAX=       2.2672688,     584654,          0
$$ Real data points
##PAGE= N=1
##DATA TABLE= (X++(R..R)), XYDATA
0@%%%%%%%Qj6J6j6J8k6M0m8N6p2R6j20J37j61K00k41K82l32L88m55N31o14P06
30C77q08R23j051J194j350J522j714J925k155K404k679K982l313L672m064M493
46B358m963N477o037O650p325Q072q895R805j0822J1965j3258J4732j6427J8407
60I739k0755K3592k7096L1548l7435M5624n7861P8338j20865L54795n83832k54284
72e58492J143146m99470n66726P20258L8875p64916O12175M05286r24539j0698
82d05101R42626m47959o15552O81416K18323o91890K04490M44429m64463j41044
92b74725N38532j83218l96947M29856K00111n62446K5519N43263k12505m38976
102c31536L39858K61545l47095k3646K69713k38396j18117M27778j01990n11607
$$ y = [0, 0, 0, 0, 0, 0, 0, 0, 8, -8, 8, -8, 10, -16, 24, -24, 32, -40, 56, -64, 73, -88, 112, -129, 153, -179, 209, -246, 285, -329, 377, -431, 492, -559, 635, -715, 807, -907, 1018, -1137, 1267, -1412, 1570, -1743, 1929, -2135, 2358, -2605, 2872, -3165, 3485, -3840, 4232, -4663, 5142, -5680, 6285, -6973, 7759, -8668, 9739, -11016, 12576, -14520, 17028, -20407, 25217, -32644, 45694, -75171, 279624, -304208, -558492, 584654, 85184, -481542, 238716, 277591, -487325, 124850, 530136, -394403, -405101, 537525, 89566, -525986, 155430, 373753, -318137, -113647, 330782, -133681, -274725, 263807, 80589, -316358, 113498, 313609, -248837, -223318, 319945, 107440, -331536, 8322, 269867, -77228, -100874, 168839, -69557, -187674, 240104, 138114, -373493]
112c73493L39431M55369m99113k60656N13582l1853l78046K88876J08984m12878
122b49797K23588L71925m85320j80490N76107q9699m78127L22236K49832m00585
132a40330L5621L16926k58931j21254L36177j10449k67106K89215J24980l48276
142a43427J5525K83918j05639j69114J05744N1515m2443L4608k3922q3245M6674
153b9806J03785l4163j32651J1360J82945J675k15242K6692J97125q7782j09575
164h5637J37300k6410j19422J78767K7467k74531J12259K59733k51553j40080
174a82107L19604l3979k74359J87191J21172k59145O8745K07206k29981n9901
184a35554L02006j12231k63286K36053J41469k68107K761K04839j05507p3036
$$ y = [-373493, -34062, 421307, -77806, -338462, 175120, 143267, -234779, 54097, 163081, -249797, -26209, 345716, -139604, -320094, 256013, 166314, -311813, 10423, 260255, -140330, -104709, 212217, -46714, -167968, 168209, 57760, -209346, 79869, 204849, -143427, -127902, 156016, 50377, -118737, -12993, 38522, -3921, 30687, 6765, -76480, -29806, 73979, 39816, -92835, -81475, 101470, 103145, -112097, -85405, 111720, 23938, -85637, 51663, 25253, -94169, 84598, 112065, -162466, -50207, 209526, -42027, -182107, 137497, 103518, -170841, 16350, 137522, -121623, -52878, 154328, -75653, -135554, 166452, 54221, -209065, 26988, 168457, -99650, -96889, 107950, 2443, -70593]
194g0593J48531o1168j28940J55932P4396j92161j6684J84055k1671j46457M4127
205c0633R4533o4572m2938Q0796k1162q7233R5227O3989j67236m352K01157r0671
217B6905j76274J86182Q4705k30756N3061J93150j81936o9853K45831r7636k04825
228a71446K50269P5813l15250R5975K64032k35692j14464K80523p2347k10581
238a53168K20166N4371k74916J17105K15948k40441q4673K66718o2073j98006
248a38969J61701P1052j86557N7229J40099j40960n3621J66469k7223j39459Q2501
259g738Q9805j02164l7182J00678l107q7025L9678O7197p5546l7028J07104j5200
271C9472j21864Q2021R8155j46419l3764J73135o2567j43572J50742N1273j91580
$$ y = [-70593, 77938, 16770, -112170, 43762, 118158, -74003, -90687, 93368, 71697, -74760, -30633, 63900, -672, -43610, 37186, 16024, -71209, 24018, 88007, -79229, -83581, 117576, 26905, -149369, 36813, 121518, -109238, -56177, 136973, -44963, -114816, 131015, 33379, -171446, 78823, 154636, -160614, -64639, 199393, -36299, -150763, 129760, 57413, -153168, 66998, 121369, -153547, -36442, 179506, -60935, -145608, 121110, 59037, -138969, 22732, 93784, -92773, -35544, 104555, -36405, -90026, 76443, 49220, -90239, -7738, 82067, -20097, -57279, 43399, 40292, -46733, -7055, 60142, -15404, -52432, 54672, 39472, -82392, -371, 97784, -48635, -82399, 90736, 28169, -115403, 35339, 86612, -104968]
282a04968P4474J56644j83216n2084K28996q2363j84233J93748O8833k29364P6196
293c7337J76554j85927n4796K20089q2529j65893J79591N3971k02423O4455J47942
304A13697j44433n2162J58659m6458j16977J06333M5147j20361J9685R5876o0184
315a178n6432P3648K1515o9879N846O3949k6893n5165N4590L9614q1158n076R9773
328F3154m6525q8691J02280L9525j35103L8209J19778j17554n4235J59414m6742
339C3510j42611J38485O2756j84362M7424J57110j43766o7922J83817m8104j50235
350a13898J43839N8866j77692N3207J43534j34970n7231J61016l7141j24688J04431
361A9273N1631j21171K4194R2745p4217m2738Q7356o715p4127L4851M8938m7147
$$ y = [-104968, -30494, 126150, -57066, -109150, 119846, 37483, -146750, 46998, 115831, -113533, -37337, 139217, -46710, -101506, 118583, 36054, -129839, 49752, 103723, -98700, -34245, 113697, -30736, -82898, 75761, 29303, -87674, 18659, 63806, -56555, -36870, 59006, -1178, -57610, 16038, 37553, -32326, -26480, 37469, 10576, -44589, 10001, 49615, -31543, -36619, 63154, 16629, -72062, 30218, 69743, -65360, -27151, 92627, -24927, -79162, 80252, 33510, -109101, 29384, 92140, -92222, -44798, 112312, -31454, -99376, 84441, 36337, -113898, 29941, 88807, -88885, -35678, 107856, -27114, -84345, 76671, 39530, -85158, 19273, 70904, -50267, -26073, 66672, -7545, -50283, 37073, 30358, -43769, -8918, 40020, -7127]
373g127k8603M7568J2631m9770K817N2061k6925m6492N8821K2695q4467K5494
385b1297Q6889q0203n0952J21227j3502j20696Q7530P2533j35622J3199J32009
396I1115j01595p2242J53897k3321j47821J12552Q1267j61029J3839J44906j01039
407i471p5460J41710j8938j24523R7171O1414j31554J8034J15823p7721o4236
418f7751J03130N444q8649M0780N2903n9035j2510N7543j7710m5748L6313L3832
430C8542n0289k3242O1651O455p1878J8788O6827n2660m1223P8393r453q1758
442e9847O9837M8443j15805J5259J24464q6694q3058J36786O368j36191P8780
453a658Q3287j32623P075J33950r7300p7769J51280r757j48861R2348R1890j36371
$$ y = [-7127, -35730, 11838, 24469, -25301, -22484, 29577, 2652, -43840, 14981, 37676, -46791, -21297, 65592, -14611, -65563, 55664, 42162, -78534, 8996, 81529, -54093, -40894, 91115, -10480, -82722, 71175, 47854, -99967, 12585, 93852, -67177, -53338, 91568, -9471, -84931, 56779, 37841, -86682, 10489, 71903, -59651, -41617, 74206, -3515, -67751, 35379, 40823, -47826, -7046, 45857, -13178, -25688, 31855, 14145, -31603, 4710, 38542, -11747, -34989, 26662, 33117, -38761, -19973, 46854, -5806, -47029, 31364, 21911, -59847, 9990, 58433, -57372, -42113, 82351, -4343, -87401, 49385, 55753, -80438, -1658, 81629, -50994, -43919, 90031, -7269, -85038, 66242, 56485, -92376, -28, 91862, -44509]
465d4509r672J24554o7181o7738J05627r937j00677P4179N9990j06243r593J02652
477E1452l0912p2382N0301L4418m8949J252L9262k6945k5408M8534J2732o5272
489c1917N796P6661l1583p3507O1982M8125q4642k908Q3262n3525m9975R4512
501D2281j4084j02141Q3545O6589j34936J245J41224p5149r7012J22290J7656
512E1508j18357O7319O5347j21893J8688J29270r6484q7162J40290J9546j32149
523f4077M5499Q0240q1683q263P9206n6704m7681R2464K759r7277L2803P6038
535E3324n2740m6081N4234J6564m6362P114L3980k6174j7660M3173l508n4899
547c9035L5508N6887o9811l8977R7458M556j00639L9468P1066p2550j1735P7871
$$ y = [-44509, -54181, 70373, 3192, -64546, 41081, 31144, -69533, 4646, 64636, -41607, -51200, 51452, 20540, -51842, -1541, 32877, -16072, -14820, 24442, -2503, -27911, 20623, 33355, -31917, -26121, 50540, 18957, -54550, 7432, 55557, -29085, -31993, 51269, -2256, -52231, 42281, 28197, -73944, 9601, 76190, -58746, -57501, 83723, 8574, -88438, 33852, 51508, -66849, 470, 65817, -56076, -37388, 91882, -4602, -91764, 48526, 68072, -64077, -18578, 61662, -20021, -28284, 50922, -5782, -53463, 39001, 41760, -55517, -22714, 53324, 584, -45497, 8737, 25301, -21061, -13947, 20033, -6141, -23801, 19372, 15864, -39035, -3527, 53360, -16451, -55428, 42030, 46586, -54053, -14585, 56481, -16069, -27804, 50067]
559E0067n9790m7636J14738j2595j31749P5876J00659j18021l5422J14548l8924
570A1751o7862R0599o904j00308P9213O8363j21470j0211J21341m4937q1469P7365
582A5471K5584p4796K6674M5859n6054m202O1374l2421m9232N3683L1172o1216
594a8104j7085N6778O602m9169J256L5689j3660j5564K6232j5664l4304N3641
606A6648K7949q6061l674J00058l1287q1530O3610L4567p2489K7614N1779p9538
618c2354j907J01719n7192q2940J01378L1753j12216K8582Q2498p4064k5585Q2297
630D1969l6693n6411P9798N314r1506M5058P1781p6241l4506P8441j359n4554
642b8909K5448J9745l1761J5268K7812l8088j9168N0525J3505n4198q127N3189
$$ y = [50067, -9723, -57359, 57379, 44784, -86965, -11089, 89570, -28451, -63873, 50675, 11751, -56111, 34488, 27584, -72724, 6489, 74852, -46618, -56829, 64512, 19575, -61894, 15471, 41055, -33741, -7067, 38792, -17262, -21464, 39910, 7489, -41743, 11940, 43112, -18104, -35189, 21589, 28191, -20978, -19722, 15967, 2307, -13257, 12975, -2689, -36993, 16648, 44597, -41464, -45138, 54920, 23633, -57897, 5713, 40280, -32209, -4595, 47184, -32354, -34261, 67458, 10266, -72674, 28704, 60457, -51759, -23177, 59321, -14743, -40328, 41969, 5276, -51135, 28663, 33977, -57529, -12471, 59310, -16931, -51437, 27004, 25645, -28909, -3461, 16284, -15477, -209, 27603, -10485, -29653, 20872, 34377, -19821, -27948, 25241]
654B5241O41m7802J1975L2565k7822p849L6859k7953l1629O0500O046p9236L1687
667a6777P0818o8063l5637Q4610j4378o9671N9882K6097p9362L3379O5340q2274
679b6036k0988J04201l2485q7324P2532M2619q2790J2172N9803n5669j4655P1412
691D2792l4286o0437O6363L0020p4595J174N9203k4532l1862L2846K828k9540
703b0026J9020K1736l2665j0797M0839P49m3809J3006M3067k7784l2805M2874
715A3405J2457m8774J7554L7887m6298r022O1115l1574n4620O7870K3050q5573
727d2523J9586P2611n9620l2098P5494k2992n9463O8316J9097q8158L2350P4093
739E6693p0682l2928Q3148j5393o2837N3616K2656o5329K1940N1667n3004k1301
$$ y = [25241, 25882, -21920, -9945, 22620, -5202, -13051, 23808, -4145, -35774, 24726, 30772, -48464, -16777, 54041, -14022, -49659, 34951, 20573, -49098, 10784, 36881, -42481, -9102, 56238, -26036, -47024, 57177, 24692, -62632, 9900, 52519, -30271, -18099, 41704, -13965, -28620, 42792, 8506, -51931, 14432, 44452, -30143, -28969, 30234, 5702, -26160, 6686, 9514, -20026, -1006, 20730, -11935, -22732, 18107, 18856, -24953, -11947, 31120, 3336, -29469, 13405, 25862, -22912, -5358, 32529, -13769, -22791, 38324, 6750, -47870, 20000, 43050, -42523, -22937, 49674, -9946, -42044, 33450, 10458, -49005, 19311, 38408, -49750, -17400, 56693, -13989, -46917, 36231, 20838, -41999, 11617, 34273, -31056, -9116, 42551, -10453, -31754]
751c1754O1916j1223n1258L3081K7860m0733m600L4224j3495k2854K2459R085
763A2708k7074K023K9234j3667k8704K7003K2651l8249p029M3910j4564l6131
775b7889L8093J4614n0770J8915M5846n0270k0146O6963j7596n9707N2250K8030
787C8333o8680J3983N7921n2693k4552O8415j9223n7848N3985K4600o7333J5060
799a8032N5124m5247k4410N6347j0539m4515L6788K0595m5070O874L7967k4460
811A422k1591L1788M973k9607P617K2277j5526j5116K0337O955k5243J980K6911
824A7177j5997k3533K9956R971m0003J1335L7881l5111j9894N0452q794m8104
836c4664L9818K6929n7898R010N5123m2595k9563O2816q669n7350M4177L0054
$$ y = [-31754, 30162, 18939, -32319, 762, 28622, -12111, -16711, 17513, 4018, -18836, 3623, 12708, -14366, -12343, 16891, 3224, -25480, 1523, 24174, -14075, -21104, 22806, 8242, -27889, 10204, 24818, -25952, -7037, 38809, -11461, -31607, 35356, 17760, -41947, 10303, 38333, -30347, -16364, 41557, -11136, -35688, 32727, 13504, -44344, 9641, 34241, -33092, -18032, 37092, -8155, -32565, 23782, 13243, -31272, 5516, 26111, -18959, -12085, 25882, 1422, -20169, 11619, 16592, -13015, -5398, 16879, 1353, -13763, 6574, 13529, -11714, -9734, 17177, 1180, -22353, 7603, 17574, -22429, -11094, 26787, -8324, -28218, 22234, 13440, -34664, 5154, 32083, -25815, -16805, 38318, -4277, -33840, 28976, 20307, -37043, 7134, 37188]
848C7188o2466Q055N5928m2576k9148N7684p618n0867L6631K5662n0350M689M4080
861B6892k9688k4500L9749J762l5818J6809K3543k5313q196K7316m408k2267J3724
874c95J7497k0384j0185K6269K79k8767J2948K4758k7349j2685L6532q362l6137
887b5981L0804J9596m6262O338M5651l5512k6512N2715m535n1170L6344K9620
899C1096n4376N018N1831l6873k8298N5557n464n1068L6233K8727n1137K724M6458
912C0428k9628k5741M1981j307l8869K3087K2769l4762l228L1933j2462k3143
924a8942K0626J1057k2996k87K0836p951j6778J5349J2096k1611k712K6393r254
937E826k4519K4139J5164l5035L654L6263k4827k3986M0858j222m2316K7622K6972
$$ y = [37188, -25278, -17223, 38705, -3871, -33019, 24665, 17047, -33820, 2811, 28473, -21877, -17188, 26892, -2796, -27296, 12453, 14215, -21603, -4794, 18749, -6564, -14760, 12556, 8148, -14119, -395, 17102, -3282, -13467, 12802, 13081, -15686, -2738, 22020, -5329, -18014, 18518, 10156, -25981, 4823, 24419, -21843, -15505, 30146, -5366, -31878, 20837, 16302, -34868, 1476, 31096, -23280, -18262, 33569, -3304, -31602, 23955, 18491, -32577, 3656, 32383, -18754, -16030, 30428, 800, -24941, 17040, 15733, -23136, -49, 22720, -12042, -15270, 16663, 4201, -18942, 1684, 12741, -10255, -10542, 10294, 2343, -14435, 914, 13010, -8601, -11313, 15080, 5826, -18693, 5446, 20610, -14425, -10771, 25492, 665, -23321, 17537, 16315, -26001, 1621, 28593]
950B8593m7214M47M8336l0689l1677M9425J110m9744K8536L1632m7661o99M7455
963B7850k8696k8763M6017J823m4624K4208K8937l7753m911L7022j5709k4094
975a8693K7456O632k8422Q442K1767j8509j2860K2483K633k2759M982J9166j2597
988b79j4589J9081N953k4101P335K2506k1204j3424L2956l504l3655K3481K3917
1001B4473l7922k121M0784k2492k6708M0575J382m3303K5924K8785m5156k483
1013a8262M6664k5229l1752M2108M334m2670K1382K6686l8014k275L8997k0665
1025A304k6353L4011O977l3847J1501K3696k1703q459K4189m907j8281J3918J0947
1038A2993j8220k627J9155m246j8281J0526J5198j7804q529K1678k798k1949J5141
$$ y = [28593, -18621, -18174, 30162, -527, -32204, 17221, 18331, -31413, -2877, 28755, -18906, -19605, 27850, -846, -29609, 16408, 18231, -26393, -2185, 26752, -11001, -15912, 21110, 5401, -18693, 8763, 15395, -13027, -4585, 17182, -1327, -14187, 8296, 10929, -11830, -6848, 12318, -279, -14868, 4213, 10166, -13935, -6600, 15906, -5298, -18722, 14234, 10730, -22925, 556, 24473, -13449, -15570, 25214, 2722, -23986, 16589, 17971, -25332, 592, 29377, -15779, -18262, 28402, 3173, -28579, 13529, 17863, -24807, -3425, 23261, -14753, -17028, 21969, 1304, -25049, 8962, 15939, -17908, -6407, 17289, -4414, -12873, 11316, 6409, -11872, 2046, 12993, -5227, -7854, 11301, 7055, -11226, -700, 14498, -3306, -11835, 9843, 7045, -14904, 237]
1051B37J4309k6744R78K9686k0197k1959L5077M338l8347J7294K7973l2942o040
1064a6337L7840j8697k6618L7475N084m1669J9957L0385l6175r027L8785j4423
1076F580k7281K9811O356l3112J3402K3605k7161q089K9347p959k3354J8123J2173
1089A2441k0689j181J7796o477j2058J2634N813j5796J727J7792q558j6886J7327
1102C885J1469k2947j142K4115j2355j7483K3960K185k8817J6087K2221l2400
1114a1222o506L7314j4506k9454L1119R717l6988J4052K8383l2248q165L8493
1126A9989j5192k8940L2892R996l6896J1721K8468k6136j0607L0301q688k2506
1138a5598K1891Q330k6710O327K1832j6903j3264J9906L277j8120M362J2486j0009
$$ y = [237, 14546, -12198, -11220, 18466, -1731, -23690, 11387, 15725, -22622, -5328, 22645, -10297, -16337, 21503, 2806, -23812, 13663, 18747, -22922, -2965, 27420, -8755, -17782, 21003, 6580, -20701, 9110, 15466, -17646, -4244, 19361, -7800, -15889, 13458, 5499, -17855, 268, 12441, -8248, -9429, 8367, 1890, -10168, 2466, 8279, -7517, -5790, 12002, 3444, -13442, 3885, 15354, -7593, -8735, 15380, 3025, -14458, 9502, 11687, -17130, -1043, 21178, -11222, -17728, 19586, 5080, -24374, 6745, 16462, -20526, -6474, 21909, -10339, -18504, 19989, 4797, -24143, 8749, 18745, -18151, -6430, 22038, -4098, -14705, 15596, 6908, -15598, 6293, 14623, -12087, -5760, 16072, -831, -14095, 5811, 9088, -9032, -4670, 7816, -2193]
1151b193o590J3523j6j5974P562J5652j4643j1060K1379K090k2712J0889J7686
1164A5593k1393n119K6711j1376k1899K6469P389l2942J1311K7179k7713j1633
1176a7423L4090r532k8175K6186J0416l2641J0292K6114k7432j0156L3363q130
1188F972k7224K2629J2773k6772M745K1458j7134r297K2672l381j9679J2909J3042
1201A3713j7028m810J6784l033j3423Q255Q175j2739k719J4529m367j4987J1993
1214C43J0347j8684k231K1614r441j7783K0182P170k4821Q201K1325k1831p803
1227a3412K8883q862k5199K4806J1683l1513O911K6188k2354j1693K8916p515
1239F839k4736K2811J0533k9362N997K4435j9368j2645K4245k386k0430J4086
$$ y = [-2193, -8783, 4740, 4724, -11250, -3688, 11964, -2679, -13739, 7640, 9730, -12982, -2093, 15593, -5800, -10919, 15792, 4416, -17483, 8986, 16375, -16567, -5256, 21923, -5790, -17423, 16667, 7135, -21040, 5146, 15562, -17079, -6787, 19327, -8105, -18261, 15102, 6972, -20252, 2377, 15150, -11622, -6877, 14581, -2553, -11850, 10822, 7441, -12238, 671, 13713, -3315, -8125, 8659, 5626, -7797, 458, 8633, -4106, -6825, 7704, 3337, -11650, 343, 10690, -7994, -10225, 11389, 1948, -15835, 4347, 11517, -13304, -5103, 16222, -5609, -13412, 15471, 6609, -18590, 6216, 17899, -13614, -6703, 19485, -2869, -14562, 14354, 6839, -17897, 4914, 15447, -13915, -7918, 16517, -2851, -15496, 8749, 6363, -14067, 19]
1251A9J0453j8744N69J7927r155j1678J4182M969j4631J559J3479o706r725J0801
1265C319N303j3694J548J3542r117j0626J6014K572k0081P235J7754j8418q015
1278a2664K3186n611k1033J8947R738k6167O326K3936k0917j1695K8412m600k4820
1291a6962J9664J3035k6740M307K3640j8566j1550K5141l572k2633J6099J2052
1303A3915k1591J32J9544j1444j1820J5963J940j5977O029J1520j1230n749J3089
1316D321K22j2596N563J0336r907n728J3190M32j4193P542J1973j4629m333J8253
1330A0446n362j6817J5801Q282k2240M155K0385j6855j1503K4041l478k2655J7281
1343A481J1938k5223K973K3736j7518j2892K4889j921k2666J5648J2978k2484
$$ y = [19, 10472, -8272, -7703, 10224, 1069, -10609, 3573, 8542, -6089, -4530, 8949, 2243, -7482, 3319, 8622, -5072, -3524, 10018, 901, -9725, 6289, 8861, -11220, -3985, 13769, -4649, -12664, 10522, 4911, -16122, 2825, 12563, -13604, -7278, 16658, -4259, -15954, 12458, 7858, -16962, 2702, 15737, -11003, -6696, 16944, -1622, -13172, 11969, 8397, -14236, 1863, 13915, -7676, -7544, 12000, 556, -11264, 4699, 6639, -9338, -3309, 8211, -3019, -8768, 4321, 4543, -8053, -2490, 7846, -2061, -7789, 5401, 5833, -8360, -818, 11155, -3474, -7807, 10446, 5084, -11733, 4068, 12350, -9890, -5735, 14650, -2205, -13708, 10333, 6855, -15800, 1481, 13419, -11804, -8831, 14905, -2613, -15505, 9384, 7463, -15203, 445, 13423, -9061]
1355i061J614K0730j2565j2173J8875J235j8301R371J1550j4400l439J4837m570
1368C703j1893R122O576j1729j483J1517m176r827Q541N915j2085q25J4140o798
1382F98j1017J3169N406j6775M504J6050j4035q120J9986l342j8844J5085J0857
1395A3622k2172K276K1078j5545j2239K2579j485k1714J4190J2122k1735Q28K0625
1408A2430j3764j2262J9990P00j9519J0850J1896j6034j899J6149o802j0503J2364
1421C596L323j2889L430J0907q049o680J0666J667j0573K484R503p330o503J0449
1435D001J159j2267M778J0624j1796n407J5453k895j5072J1881R073j7549J130
1448f887J8057j2047j0498J9316q66j8758J2560J2226k0313J25J9934j1602j2325
$$ y = [-9061, -7447, 13283, 718, -11455, 7420, 8655, -9646, -275, 11275, -3125, -6564, 8273, 3703, -8190, 932, 7508, -4221, -5704, 5813, 1637, -8190, 351, 6266, -5819, -6644, 7496, 698, -10319, 2850, 8256, -8519, -4015, 12035, -2000, -10120, 9866, 6524, -12320, 2765, 13622, -8550, -6274, 14804, -741, -12980, 9599, 8114, -13600, 590, 12712, -9023, -8195, 12430, -1334, -13596, 6394, 7094, -12425, -1575, 10321, -5713, -7612, 8537, 1735, -8768, 3596, 6919, -5970, -2540, 8367, 318, -6362, 4304, 5971, -4602, -2118, 7385, 55, -6448, 4001, 5160, -7107, -2329, 8295, -3501, -8908, 6545, 3650, -11422, 459, 9532, -8017, -6887, 11170, -877, -11375, 7941, 7075, -11683, 877, 13103, -7210, -7085, 12849, 1247, -11078]
1461a1078J8704N02j8445J0362J1046j6900j281J6805q893j1214J4046K609j4397
1474h134M822J0280r730m226J0850j240r164O285O144q445k169R373j260r133
1488e747N825P576r286l506J1546k568j0747Q870N781j3789J803J3850j0554r558
1502a0504J6551J78j7160R440J1503j6572j396J7236r462j1142J7045J251j8412
1515a1444J0476J2527j6742k416J7761p270j2099J3833K993j4610O163J0141j2453
1528c140k970J3244m174j0719Q400N783j0184j024Q963l486o348O334K652p963
1542d632J389Q406n446o871R519M141j1774J439J1441o997p063J1430j1j2158
1556g187Q504P949j4496l11J6020r064j2299J5603L277j6988O412J1592j3879
$$ y = [-11078, 7626, 8128, -10317, 45, 11091, -5809, -7090, 9715, 822, -10392, 3654, 6263, -8134, -3312, 6968, -2762, -6988, 3862, 2622, -6542, -257, 5887, -2558, -4727, 4646, 3386, -5747, 78, 7654, -1632, -5138, 6408, 3840, -6907, 1963, 7744, -6045, -4242, 9608, -946, -10504, 6047, 6225, -10935, -1495, 10008, -6564, -7960, 9276, -186, -11328, 5717, 6968, -11444, -968, 11559, -5183, -7599, 10162, 2892, -9207, 4626, 7619, -6991, -828, 9313, -3140, -6110, 7134, 2960, -7759, 641, 6424, -3760, -4784, 4179, 693, -5655, 679, 3331, -4632, -3243, 5163, -283, -7154, 2365, 6506, -5268, -3829, 7612, 615, -6448, 4982, 4971, -7187, 1317, 9266, -5230, -5541, 10479, 1415, -10884, 4719, 7996, -8992, -2580, 9012, -4867]
1569d867k011J5302q367j1201J5370K770j6932O397J2865j1795n272J3574k703
1582C130r461Q962L337j1447L954R727q240o455J0519J904j0210J683Q055n106
1596C52m430N946L89o960M037N809q704k836J1957k186j2312P669Q917j1889j499
1611e740J2241n801p761J2150mj3906R280J0620j5544l087J7232n616j3062J2067
1625C069L918j3634N557R446j3203j502J4969p274j1912J2215N636j3625J651
1638d689J0339o253m267Q120j820o931O747M202r069m06R503k169q410M481O439
1653E817n383l417N726n61n160N290J917r164K219J0211p545q746J1436L316j2545
1668f589L158R902r202k691J1338n857q870J3322K084j5399N875J3155j1375o284
$$ y = [-4867, -6878, 8424, 57, -11144, 4226, 6996, -9936, -3539, 9326, -2469, -7741, 5833, 3130, -6331, 2631, 5968, -5479, -1525, 8202, -38, -6493, 4026, 5930, -4280, -2597, 5458, 352, -4078, 1868, 2257, -4703, -666, 5143, -3561, -6397, 5560, 3374, -8938, -1269, 7648, -4241, -5740, 6501, 700, -7061, 5089, 5085, -8821, 459, 11079, -4465, -7552, 9680, 4064, -8998, 3069, 6987, -6647, -1090, 8356, -4847, -6349, 8620, 1346, -10566, 1649, 7285, -6340, -4689, 5650, -603, -4870, 3250, 1430, -5501, 1246, 5448, -3621, -4027, 5476, 3307, -5103, -622, 5817, 434, -2983, 2743, 2182, -2978, 2312, 4229, -4935, -2716, 7495, -50, -8796, 2640, 5956, -6589, -3431, 6471, -2731, -5422, 5916, 59, -8811, 4511, 6595, -8804, -2929, 10226, -1149, -7433]
1682g433J3311j690j0235Q728L116j1529M836R697j1184m967J3177r38j1832N253
1696a690P013p244j638O251l227m130O404R63p761K285Q019m978o400P001M588
1711E456p900n64P300l414m210P089l93r067O601O934j1468k264J3415m137j1494
1726h116R191N059j1372K772Q565r937k394J2904m971j1976J1832N942j3885J603
1740d783J1591o872n655J0364k160q431Q381M094j1090J374J0543n839p409Q213
1754B321K420p943J821M968m543k201N766j538o112M705M881p007k660P962k68
1769B572p799L821O038o954j018P771l882n704Q686J477j0810M375R631r040m749
1784e585J1229k260r417P815L908j0881K936R255r222m641J1870j897j0655P071
$$ y = [-7433, 5878, 4188, -6047, 2681, 5797, -5732, -896, 8801, -2383, -7350, 5827, 4889, -6943, -1690, 5323, -1921, -3559, 2692, -535, -4665, 1739, 2702, -5059, -2774, 5245, 267, -6133, 868, 5456, -2444, -3008, 4292, 878, -3332, 3757, 3364, -5703, 898, 7832, -3636, -5900, 7515, 3378, -8116, 1075, 6134, -5238, -2466, 6099, -3838, -6232, 6672, 1701, -10275, 1557, 7499, -6386, -4783, 6808, -64, -5719, 4645, 2485, -5946, 2435, 6529, -4561, -3187, 7356, 1517, -5892, 2321, 4741, -3202, -1381, 3587, -956, -3157, 2609, 1071, -5041, -336, 4545, -2462, -5122, 2840, 2572, -5227, -1406, 4632, -2322, -3340, 4431, 549, -5155, 3531, 5008, -5802, -1427, 8204, -836, -5585, 5644, 3384, -6033, 1782, 5690, -5191, -2255, 7000, -2222, -6863, 5007, 3110, -7545, -474]
1798d74N622r262L64Q313n276m311Q179n39p747M842N467o803j778O851p41n639
1814b932L368L571m777r99N056j908m654M375K645o485j93P146l522o103O525
1829A113K339q206K130P655p041l434R576j878q714P597M977j0785J801R901p150
1844a19n581J0593q21r758O621N404r679K38R243o146n819R142P0q679M376N738
1860D823p532j631P632k716n180N122K554o354J184N694l818l677N786J524o085
1875b674J293N686l377l886N369R50o372K951M856o582j829P804k485p623O707
1890G88M032r284J461Q152o152m477Q819j037q636O766M806r597R90R450o081
1905@n495Q940P23q651M698N492p873l5P159m222n066O933J131p221J697N616
$$ y = [-474, 5148, -4114, -3750, 4563, -713, -5024, 3155, 2616, -5131, -289, 5178, -1625, -3403, 3448, 2707, -2932, 436, 4007, -770, -1769, 3287, 1379, -3275, 1100, 3745, -2740, -2933, 4213, 691, -5412, 1113, 3452, -4754, -2624, 5031, -2010, -5444, 4132, 2254, -6460, 1137, 6114, -4671, -2870, 7031, -119, -5700, 4893, 4072, -5686, 935, 6339, -3340, -3102, 6141, -5, -5824, 3318, 3388, -5291, -915, 4823, -2709, -4340, 3292, 576, -4604, 518, 3072, -3282, -2098, 3596, -222, -3899, 1887, 3411, -2674, -1381, 4305, 928, -2958, 2411, 3361, -3011, -60, 4796, -1786, -3615, 4189, 1704, -5919, 788, 4820, -4464, -3003, 5149, -1003, -5480, 3339, 2302, -6334, 432, 5238, -4359, -3369, 6081, 0, -5495, 3445, 4168, -4483, 215, 5707, -2166, -2201, 4958, 736, -4330, 2603, 3734, -3487, -1790, 3826]
1921C826m287l158N123r8m534K576K666m183r42N265j110m791L404M012n199j633
1937c063O322j668m821M494K365o030J335O210n829l430Q093p88p992M732N186
1952E116p865m39P491n006m507Q057n50q093N313N564q407q39Q260l467n331O228
1968A525J775o495K664M748n378j426O138j339n420M020K956m909r70M809j518
1983A180l447K963J368l875r5M389k925l413M646J562n800J193N718m279l296
1998d111O500k33o228M720L648o873N26P071m502m808P645N33p914L768N299o880
2014a839j183O960l586m955O717O03p514L747N104o000k084O889j753m986M073
2029A93K331m918R41M289l080k423M651M69m616J523M093l181k534M039Q27m326
$$ y = [3826, -461, -3619, 1504, 1406, -3128, -552, 2114, -2069, -3011, 2254, 1144, -3647, -243, 3769, -1430, -3063, 3259, 1591, -3230, 1264, 3629, -2401, -1066, 5144, -685, -4115, 3978, 3190, -4802, -70, 5116, -2749, -3188, 4303, -703, -5210, 2847, 2297, -5796, -483, 5081, -3326, -4165, 4095, 628, -4703, 1525, 3300, -3195, -531, 4217, -1161, -2587, 3551, 2212, -3208, 812, 3768, -1141, -2111, 2698, 1180, -2267, 696, 2064, -1811, -1906, 2483, -442, -3855, 791, 2353, -3447, -2254, 3464, -815, -4111, 2389, 2156, -4072, 648, 4296, -2577, -2051, 5020, 518, -4290, 3355, 3888, -4026, -258, 5041, -1839, -3022, 3938, 352, -4603, 2114, 2717, -4797, -1050, 4054, -1946, -4030, 2859, 1106, -3880, 193, 2524, -2394, -1453, 2836, -244, -2667, 1984, 2453, -2163, -640, 3453, 272, -2262, 1777, 2604, -1722]
2045a722J046L676l732j460M866j848m837M205L332o605J4O646l331m965O161
2060A446Q76o158L036M832o223n75P215l611n597O887K066p352K168N546n068
2075e12k128O170k519m682N118J824o754J704N540m296l381M811J002m644J752
2090i95K807l132m57L692j700l131L413K567m672p34N276q78m901L204K627l895
2106i09j53M086l347k178N671j001o492M231M504o678j343O620j947n160N007
2121I11Q28n265L160M176o492o35P210k564n768N040K957n339O38L893k814j539
2137a603M471j916m000M413K237n265m44M559j205l714J986J755k423K12J795
2152H58k005j351M048p2m676J733M717l339l427M635J190m278J860K210l283L49
$$ y = [-1722, -676, 3000, -732, -2192, 2674, 826, -4011, 194, 3526, -3079, -3065, 3581, 250, -4715, 1446, 2322, -3836, -800, 4032, -2191, -2766, 4449, 838, -4759, 2128, 4194, -3158, -990, 4556, -512, -2640, 3530, 1011, -3671, 1447, 3271, -3483, -1779, 3761, -535, -3916, 895, 1897, -2747, -995, 1812, -1320, -1777, 1915, 215, -2916, 497, 3064, -1608, -2342, 2934, 2056, -2845, 359, 2986, -909, -1062, 3024, -323, -2501, 3170, 2169, -4323, -92, 4412, -2266, -3609, 3011, 1064, -4096, 911, 1739, -3526, -366, 3810, -2682, -3317, 3893, 1329, -4439, 601, 3558, -1781, -1143, 2750, -64, -1603, 2868, 952, -3048, 1365, 3602, -1663, -2107, 2452, 1247, -2467, -481, 1274, -1149, -937, 858, -1147, -2498, 1550, 1478, -3198, -1465, 3252, -87, -3514, 1121, 2311, -1967, -107, 2103, -1180, -831]
2168h31M384l327l517N942P50o425J747N158l971k500M421j276l176M111K10n638
2184c938K842M892n151k936N943M66m929K137K371k819P08K602l037j276M481
2199B356l44m275J635L505k231k360K447Q78k252P9J762k215p5K975j431l782
2215c328L464K682m915j094N005r49l677K819J314l495J958K877m574l59N835
2230C563k159m915M144L066m885j9L942k826j461M105j732l768M155J812n695
2245b673L59N164k719l289L472Q49k762J177J638k960L40L583j900k939K957K075
2261B372k979r75K929J87k412J402P91k065O71K297k649j508L887k2m586J722
2277i38L594l458j925L901o95l091L170J136m523J701M294m193k051N329n77m248
$$ y = [-831, 3553, 226, -3291, 2651, 3401, -3024, -1277, 3881, -90, -2590, 1831, 555, -2621, 1490, 1700, -3938, -1096, 3796, -1355, -4291, 1652, 2118, -2811, -674, 1697, -1122, -414, 2188, -849, -2125, 2356, 2012, -2263, -628, 2877, 646, -1714, 733, 1611, -641, -562, 1200, -1015, -1090, 1885, 454, -3328, 136, 2818, -2097, -3191, 1814, 865, -2812, 7, 1321, -2174, -216, 2661, -1913, -2272, 3563, 1404, -3511, 633, 3699, -1186, -1205, 2737, -89, -1550, 2555, 823, -2945, 1210, 3022, -2673, -2314, 2850, 131, -3158, 314, 1163, -1599, -422, 1216, -1744, -1404, 2179, 279, -2660, 297, 2372, -607, -1582, 1347, 1534, -878, 524, 1315, -750, -79, 2218, -431, -1939, 1948, 1926, -2660, -938, 2656, -802, -2727, 1174, 479, -2612, 558, 1694, -2829, -1128, 3166, -1027, -3078, 2251, 1674, -2574]
2293b574K656K704l796J19L488k611j746M002o52l911K445K624l613p75L327r45
2309G42k494J730J129k598O91K130j650j716K713L40k928Q22K906j647k182K920
2325I08P17k995J448J771k719k7L276j614l211L601J057m132O01L971l032k034
2341b414M035r66l434L109J617m099M37M045k776k082L957l32l232J986K633l506
2357a022j73L253j665k055K883N46l046Q49K764k187j280K203M3k406J139J611
2373A457k102r37K696q76k016J634J480k553m34L317j516k305K609R21k965R19
2389f71K622k263j333L701q70l101K614K176m120L34L450k137k375L182J92l509
2405b108K177J648l345L44L155j757k807L160R99l353J002K144j968m76K063l97
$$ y = [-2574, 82, 2786, -1010, -891, 2597, -14, -1760, 2242, 1590, -2321, 124, 2748, -865, -1640, 1687, 742, -1752, -22, 1107, -1491, -800, 1330, -320, -2036, 677, 1017, -1911, -1089, 1817, 170, -2012, 908, 1625, -1370, 78, 1849, -870, -897, 2379, 765, -2446, 1155, 2212, -1920, -1319, 2652, -380, -2414, 1621, 655, -2779, 330, 1947, -2152, -1715, 2330, -446, -2528, 1429, 1097, -2135, -149, 2484, -1022, -1195, 2058, 393, -1662, 1221, 1767, -1279, -430, 2334, 147, -1133, 1070, 1113, -1293, -154, 1457, -645, -1582, 1114, 238, -1778, -144, 1336, -1217, -1651, 1666, 150, -2155, 454, 1375, -1590, -671, 1951, -312, -1645, 2056, 1186, -1915, 699, 2875, -1245, -911, 2539, 402, -1973, 1209, 1401, -2108, 69, 1717, -1628, -1284, 1871, 114, -2693, 467, 1466, -1887, -885, 1259, -709, -1185, 878, 481]
2421D81j798J758J167k515k90K661m02k197J647J122j802n82J853p13j755K115
2437G50M47k896J200K223k650j232L123k10l193K148J822k939O87K521k095j624
2453a918L480k08l674K332K671l489n05L421j464k058K210N94l067J648K184l227
2469a070o09L347j053k516J600J343k133j22K003r90j059J879m7j931O67K249
2485A558j736j090K151L25k111P40J747j513n61K093r91j990J879J296l081J86
2501a098L073k183j871K869M78l287J645J476k563J38K820j991j691L035N84l206
2517a772J469K229k468l28K527j019j931K385J58k506R33K174j794j304K332k05
2533H80j642M14J352j465n87J635n62j492J311J253k173q3K244r04j756J995R01
$$ y = [481, -1317, 441, 1608, -907, -1197, 1464, 1062, -1135, 512, 1634, -168, -750, 1103, 390, -1365, 750, 1197, -1699, -499, 1724, -926, -2158, 965, 755, -2438, -290, 1532, -1407, -720, 1801, -294, -1918, 1562, 1354, -2320, 12, 2683, -806, -1311, 2110, 646, -1412, 798, 1392, -1675, -27, 2157, -1070, -1679, 1668, 615, -1901, -301, 1042, -1091, -1213, 790, -200, -1259, 620, 573, -1358, -691, 1558, -178, -1268, 883, 1208, -903, -163, 1584, 71, -490, 1603, 612, -1378, 501, 1797, -1284, -1098, 1975, -208, -2079, 790, 1268, -2019, -374, 1102, -1461, -1323, 1497, -494, -2185, 850, 1434, -1772, -303, 1926, -542, -870, 1657, 638, -1293, 1092, 1250, -1256, -323, 1851, 57, -1247, 1085, 880, -762, -348, 1004, -461, -1048, 587, 25, -1467, -156, 1097, -1076, -1159, 1085, 181, -1575, 420, 1321]
2550A321k358M99J781j409q10K185l19k254J785J507k748l13L038j702j925K113
2566C91P70k909J396J570k192j83K522j257k127K507P16k620O24K118j651p83
2582a108J962q0j767J270J055k054L16J780p18j673J467P40j920J85J645r21j063
2599h84J040O54j781O12J368j875n03K077j84k347J806J237k159j13K371j096
2615B23j237J953l1k032J227J892k725l83L000j010j937J425J106k527Q40J445
2631A229k000n22K312p60j972J535J170k034l19J900n25j003J232K24j236R73
2647B04O62j251l40J787q5j896Q23J479j268q15J610j46j387R12P03k209Q06J551
2665A140j349j239J909M10k282Q74J493j648j58J916j063j123J788N03k663R89
$$ y = [1321, -1037, -538, 1243, -166, -976, 1209, 890, -1364, 421, 1928, -820, -1133, 1905, 203, -1722, 391, 1161, -1748, -352, 1218, -974, -1157, 1365, 108, -2019, 488, 1204, -1416, -792, 1326, -325, -1108, 854, 774, -993, 277, 1332, -722, -406, 1374, 656, -1017, 450, 1190, -730, -545, 1100, 179, -884, 156, 810, -971, -359, 1009, -866, -1369, 708, 524, -1823, -17, 1220, -939, -1052, 1319, 223, -1014, 939, 908, -1124, 103, 1995, -730, -1113, 1887, 877, -1060, 365, 1471, -1056, -216, 1229, -771, -1293, 1019, 259, -1713, -178, 992, -1042, -1361, 539, 14, -989, 243, 467, -769, 204, 866, -385, -725, 1062, 977, -919, -96, 1383, 115, -700, 910, 764, -623, 289, 992, -1217, -411, 1140, -209, -1448, 461, 871, -1411, -537, 956, -692, -850, 1066, 3, -1120, 668, 1171, -1492, -503]
2681e03K266j870j077K298m02j519J186O04j560M26J540j433j121K016lj927M18
2698f61J528j236n95J151k20p03O28N18j332K20J451q69j052J143J241j757n6
2715f01J600p11j115J575Nj733J539P44k107k89K335j070j690J897P72k251N47
2732e53J388j498K1J506j111j351J741P55j993K23J735r08p82J607oj437J115
2749D52P20j601j78K010r69j428J329N60j300n7J176o87m61Q00j94j179P16Q83
2767E92j321l30J425m1j446O95J266j128m16J483p54j018J522O6j601Q67J678
2784A539j837o53J768l66j414J342N57j534K89J348j531n28J791n74j698J487
2800a4J100j884r6J368n10r07J102J57r71P97P52r55l74J136P6j368N89R62q73
$$ y = [-503, 1763, -107, -1184, 1114, 712, -807, 379, 983, -577, -151, 1389, -44, -1165, 851, 848, -1079, -661, 867, -369, -964, 187, -33, -736, -108, 410, -922, -702, 749, -120, -1172, -29, 1212, -545, -601, 999, 288, -827, 748, 753, -980, 559, 1303, -804, -1093, 1242, 172, -1518, 379, 1151, -1100, -553, 835, -663, -642, 864, -247, -1598, 143, 898, -1095, -872, 863, -45, -827, 780, 774, -663, 452, 1172, -429, -607, 1403, 434, -994, 335, 895, -405, -462, 714, 27, -434, 366, 172, -1007, -291, 592, -729, -1059, 366, 325, -1121, -426, 840, -288, -704, 779, 25, -993, 529, 595, -1006, -139, 1539, -298, -951, 817, 451, -963, 379, 936, -598, -309, 1039, -492, -1020, 771, 197, -1501, -14, 1086, -798, -894, 474, -36, -943, 159, 316, -655, 142, 894, -61, -435, 701, 777, -591, -2, 960, 87]
2819H7n33R94l34j082J027M74j220MJ629j092j208J469K34j490O62J322j521k80
2837h58J537p65q42J218N55j667L38J756j141p55J557k62j377P09R36j598J23
2854e36J553n70j276J257P4j409M66R72r15n84J512o29p26P63M37r85J85J205
2872G94q86p83J284K32q13N6J028n05r79J253k00r75P49P03j437j6J545j115q89
2891i54J366K85j695K72J514j099n26J477p42r15R58J102j721K54J369j128o23
2908h06J469k51q34R85K53j007j66J325q26q06J064O05j544M11J022q08q81J049
2926B54q2q65M96M80p86k81J101l81p10N33Q92j009q8Q46l7j025Q01L79j154O36
2946@Q25r00m58J354m28j011P25P02j399P2J090q00m24R45j31q96N97O89j187
$$ y = [87, -446, 548, 214, -868, 159, 633, -587, -583, 1046, -46, -1254, 215, 449, -1041, -379, 943, -578, -858, 679, -86, -928, 290, 845, -822, -484, 1272, 131, -624, 933, 671, -706, 3, 939, -659, -536, 1017, 447, -829, 428, 502, -907, -441, 531, -384, -968, 544, -85, -811, -48, 389, -596, -411, 794, -92, -875, 409, 641, -172, -116, 912, 407, -572, 681, 481, -494, 255, 958, -479, -495, 1050, -65, -954, 412, 697, -998, -726, 788, -311, -837, 640, -102, -1017, -59, 1043, -678, -424, 945, -183, -806, 663, 412, -422, 563, 816, -191, -357, 968, 142, -664, 400, 1005, -539, -128, 894, 86, -795, 254, 172, -693, -197, 283, -503, -784, 317, -64, -774, -241, 651, -358, -446, 400, 363, -662, 139, 518, -636, 0, 825, -75, -533, 821, 393, -618, 107, 809, -590, -518, 572, -228, -652, 293, 162, -734, -137, 552, -635]
2965f35Q1R15n33m06O10N21r95L95P40n09o57J152m62o21N74O62p37n18J063l77
2985B63n99M09Q8l26p1O20n83p19J102K18j033K20Q66o55m50J051k39r91J142
3004C13M72j104M37R46j375j77J093j5r94K26Q91r04j40J096j012n13R40K31j245
3023h34M17R73r13j55R90l99o99N49K09k26j67P80o64k06P39K33q77L85O16m66
3043B85o15Q39l10o66N57N57q20l96J184l78j104P70Q29j254J47P87q05l19Q54
3062A42M0r79R79N70j092k8J066p56n24J050K02j187L68P25r33O00M31n11n68
3081d05P91L6j074K74Q93o97m58J056m01o85N17L81n04k83Q14k97p43O96O58r84
3101d15K18O20l9q25O83K15o57J33P53p78l27R65l28p32O28M56r05j06J013q40
$$ y = [-635, -554, 361, -172, -578, 32, 553, -442, -47, 693, 184, -473, 679, 217, -404, 170, 832, 95, -423, 640, 263, -336, 73, 161, -165, -236, 384, -199, -918, 184, 402, -631, -411, 455, -200, -650, 401, 162, -829, 313, 785, -319, 118, 1064, -311, -488, 605, 590, -404, -178, 713, -191, -331, 765, -247, -760, 180, 411, -834, -417, 556, -357, -512, 478, 79, -620, -71, 138, -88, -255, 525, -139, -345, 394, 627, -250, 135, 751, 285, -330, 509, 199, -467, 90, 647, -173, -569, 615, 237, -867, -97, 732, -522, -375, 412, -393, -712, 142, 182, -797, 182, 752, -340, -368, 698, -58, -582, 468, 670, -517, -149, 576, -357, 243, 674, 163, -405, 386, 422, -652, -378, 515, -182, -640, 416, 15, -670, -153, 228, -276, -559, 255, -42, -785, -89, 569, -415, -197, 423, 384, -441, 242, 457, -200, -67, 686, -92, -419, 546, 218, -514, 114, 570, -335, -441, 572, -268]
3121b68n04J125k34r17Q45M85r69K1P23j52q51J039k00p42L97Q25o41k16P17N3
3141E36r93N98L57o18k43J084p07m59M58K37m01p6Q44r45j06O23k00m68J26Q55
3161E02p92k56Q00k05m23N15L52o90m3R15p26m22R24j04r10O18J63l09j59R06
3181F56n09o04Q25k4o99K65O01p92m60Q89K06j025O91L10o06K95M91l77n38O78
3201B73J00q08L43P09m88k64O24k77p42M44N54o83n4O29k68o73M98N54r57J29
3221c57O31p60l0Q66k11n44N79L70q24j49J109p29m19J041j98r05O05N51q15n3
3241b42O42k83n90O85K60r38K58N21k57o79P28q1n87M42L68n39j1N16j25k20L33
3262B01K23o41L17L43k67m21N19M1m18P4N20m25l73N27j58n38N56K54o22j59P93
$$ y = [-268, -772, 353, 119, -798, 47, 532, -437, -416, 307, 155, -696, 343, 143, -599, -202, 623, -18, -234, 483, 536, -457, 141, 498, -120, -363, 721, 14, -445, 13, 250, -151, -227, 617, -328, -434, 189, -11, -479, -353, 502, -290, -546, 254, 49, -374, 141, 493, -197, -240, 675, -51, -473, 451, 347, -563, 55, 218, -91, -250, 656, 147, -457, 368, 344, -355, -90, 511, -281, -741, 148, 354, -671, 20, 330, -276, 19, 510, 133, -405, 273, 373, -435, -92, 617, 129, -135, 489, 212, -530, -86, 468, -215, -269, 360, 92, -581, -83, 471, -486, -357, 274, -486, -516, 350, 139, -405, 174, 544, -280, -429, 680, -49, -468, 573, 375, -530, 75, 626, -189, -242, 400, 117, -473, 212, 472, -466, -208, 313, 56, -623, 105, 24, -563, -121, 247, -292, -303, 213, 88, -132, 201, 424, -217, 100, 443, 176, -245, 274, 315, -103, -29, 491, 66, -307, 220, 62, -476, 80, 334, -288, -447, 346]
3283C46o06j18O84k06n33K23M79o02n1P04j32o18P05J7l95r7P27o38q8P82l84
3304A99m64O70J91o71j34M14n7n06L06J59m04o6M36k11m46O07N4n56J04M87l16
3325b04K7M89j11n50P91n5p69L37O50o23j42L01K69o24L03N42q05n8M86p9q21
3346f46P44j09n07L12O21p03j54O21j65k64L6N64o68O9M23m5l10M45J12m43K54
3367A87L26n88j8N42l58k00J7M45o72o9O89j88o76N03K32m75N2N90m18m38O38
3388A21j62m05M33M16p20R0O85n33j4j0N82o47Q8O49p72J32M22l76j42J70K39
3409B46o44J39N24n73k4M31M9n61J25M68k17m30P86l65l25L96L36l62K06M02p16
3430a09oL55j81n0j98O35m70j36L61j77m45O64K60p78k3K88p8m30N20L17p37K16
$$ y = [346, -260, -378, 306, 100, -433, -210, 269, -333, -384, 320, 188, -430, 275, 292, -103, -200, 527, -111, -199, 583, 199, -265, 405, 596, -75, -209, 205, 148, -358, -52, 107, -297, -363, 73, -138, -584, 23, 77, -479, -375, 112, -204, -177, 312, 201, -349, 442, 387, -382, -45, 605, -18, -160, 141, 410, -214, 89, 631, -174, -232, 254, 175, -646, 98, -11, -518, -206, 415, -288, -442, 179, 14, -250, -214, 350, -318, -249, 174, 129, -181, 264, 376, -67, 187, 513, -75, -93, 449, 91, -109, -92, 353, -319, -388, 301, 113, -563, -60, 172, -303, -251, 339, -79, -517, 121, -41, -446, -13, 403, -317, -227, 458, -75, -89, -99, 483, -164, -76, 573, -199, -67, 355, -21, -163, 7, 246, -398, -259, 265, -308, -332, 99, 148, -413, -288, 180, -37, -467, 319, -46, -371, 25, 361, -1, 205, 607, -109, -115, 240, 59, 9, -189, 446, -24, -160, 201, 24, -421, 243, 503, -275, -298, -10, -88, -518, 2, 319, -418, -202]
3452b02P53q00K78K22l10l93P52O3o52K42J64l44J05L32J80n51L83K34n28m8K55
3473A35m9k28L11k28j01Q2K68m29k17N28l0l31K96K56k94r4M28r6m24N14K07o91
3495a87K47L82n90j45N22j3l43J47K88l45l31O57k25n32O79j57o21K88M06m02
3515b75O3L38L4m22M81J21o07N6P79o02m3K04K80m08N4L17m13p6L29J38n69J69
3537e2O21o09l44O74k42l63K80M45p54K77pN9m25O15L4o33O34J51n76J27J39J98
3559B49k63L32K5n43J95N69n67O8K08j61o21N07P3m50j08N86j35l25M06J66m64
3580b53K46M40n83J91o3J3r4K54K34n01l9N20n87K38J97k0n06J04M23j46l53M22
3602A37J04n24J71K13o06L56L99k04k86L19m1n13O38q5j15j26N74j42m27L63J29
$$ y = [-202, 551, -249, 29, 251, -59, -452, 300, 363, -289, -47, 117, -227, -122, 210, 390, -161, 222, 456, -72, -120, 135, 86, -142, 169, -59, -160, -78, 190, -239, -456, 72, 42, -289, 7, 263, -31, -125, 303, 207, -217, 297, 504, -187, 60, 442, -148, -293, 229, 216, -127, 20, 308, -37, -368, 289, 64, -468, 211, 54, -567, -279, 127, -275, -212, 126, 160, -262, 219, 340, -267, -211, 568, -34, -77, 127, 407, -1, 53, 370, -43, -119, 210, 348, -221, -52, 569, -40, -384, 290, 48, -315, -35, 410, -344, -67, -74, -15, -440, 175, 209, -424, 210, 361, -215, -88, 51, 249, -14, 318, 343, -200, -5, 564, -3, 65, 273, 112, -509, -2, 71, -379, -487, 99, -36, -361, 45, 211, -253, -7, 433, -150, 41, -22, -9, -103, 151, 385, -116, -155, 365, -222, 16, 213, 193, -313, -209, 214, 68, -285, 137, 241, -283, -112, 101, -505, -149, 250, 46, -240, 79, 38, -475, 163, 78, -37, -163, 411, 269, -158, 205, 334]
3623C34m24J46M33n12q4K16L22p74L34L11m72r5N30l20k24K50J63L6m04K83k24
3644a75o9K32N2k21L06p8j42R0J81l0l83M19j68mn2K73l14j01q0M07j38oK70n16
3668b47r0O07r8k65M42k86l77J6M96m30q5N61j03m22K41L93k24m47P46l84j10
3689f6K50k4n18O06J43k88m8J42j30k42K70K86l58j35K62k83j44L83m0k93L10
3710H3j4k02J4N20l70l93K84K03m6p0K56m34R6M17l4l32m9M30l56k66N66m16j77
3733b90M07J33o37N50J82n94M8K78r6k08N2L26l37J16Q9K26m41M79j01k57K72
3754A97j9k08r3J78M4k74K24J21j70m9M95n48j82L94K8M3n93M87k18k77M51j08
3776g7k58K89J48j22J26J63j44l59J94L41k42L2P2k25j57M73q9n63J87N25l99
$$ y = [334, -90, 56, 489, -23, -107, 109, 431, -343, -9, 302, -170, -265, 265, -55, -279, -29, 134, 170, -234, 49, -175, -244, -12, 40, -181, 125, 47, -95, -5, 176, 146, -237, 182, 14, 10, -42, 231, -83, -184, -264, 143, 5, -1, 269, -247, -337, 270, 172, -93, 349, 63, -314, -298, 198, -232, -317, 244, 141, -281, -40, 353, 129, -318, 428, 44, -66, 184, 160, -358, 248, 391, 103, 55, 197, 67, -175, 95, 381, 23, -112, 150, -133, -277, 106, 66, -227, 83, 69, -133, -119, 401, 31, -362, -78, 125, 79, 9, 265, -169, -73, 344, 310, -22, -71, 359, 3, -263, 303, -113, -290, 117, 250, -387, 163, 345, -249, -201, 77, -19, -227, -175, 151, -186, -70, 19, 245, -196, 283, 182, -75, 197, 178, -30, -123, 55, 99, -175, 49, 170, 0, -49, 446, -102, -284, 110, 138, 181, -412, 75, -143, -420, 31, -77, -335, -46, 102, -20, 106, 269, 125, -234, -40, 301, 59, 91, 163, -62, -219, 254, 165, -398, -211, 314, -85]
3797h5M4J03R5m97M6J81j39J9K68j03l01L27j80q1kL72p3Op8J67J7j82L33j80
3821G7j17J97k77L7J48J50m16K10K42m30J50L87k77l57L78k2k26N6k03M24n16
3842c85L63J25q7j57J17J4m4K61q4n3L78km07j4K92m01j01J81K1k99J64K82k56
3865i2j61K26p1l29L81L43n57k7K66jO1lj46J8k1L63l42ML22J5k91Q4J66l93K48
3890F3K44l48n4Q0K73m17P7L14q2m66K93j88k74N43j10k77J80K64k56P5L63k40
3912E7l74P29l06m04N36J51m55r5J09J40j43M01p4m34J9M1o2k30K11M38m71J94
3934b2M4K22o29L13J23n5j63M42m54MO18l85k34K03L26o30K12M48k42n81N13j63
3956i0j6J78N3l92L2K66l39J37L29j54k37J10Q5n8j18K12j9l14M27j61j89n4M50
$$ y = [-85, -41, 62, 157, -340, -294, -113, -252, -233, 35, -68, -369, -42, -222, -303, -305, 67, -6, 0, -78, 89, 106, -76, 257, 77, -40, 157, -120, -83, 65, 215, -201, 9, 251, -179, -29, 358, 81, -276, 102, 80, -146, -90, -293, 131, -385, -22, 103, 16, -141, -24, -10, -54, 207, 123, 70, 448, 446, 39, 25, 317, -84, -185, -4, 17, -282, -118, 164, -92, -253, -27, -98, -427, -46, 297, -260, -287, -21, -22, 39, 36, -110, -92, -113, 250, -92, -88, 234, 249, -42, 42, 208, -185, 63, 307, -41, -95, -15, 258, -159, -82, 232, 150, -316, -23, -211, -485, 58, -52, -329, -149, 115, -141, -66, 297, 57, -317, 412, 106, -298, 238, 389, -66, -161, -52, 88, -55, 346, 272, -162, -143, -102, -164, -394, -183, 255, -216, -22, 22, 244, -385, -72, 51, -4, -167, 275, -179, -175, 443, 58, -176, 27, 353, -277, -65, 383, 141, -440, 73, -90, -106, 72, 125, -267, -235, 31, -308, -171, 158, 4, -233, -123, -38, -96, -214, -2, -21, -335, 92, -69, -258, -312, 138]
3979A38J72l17J09J32j93k15M57l92O2J25o3k81L72K34n20j11M81l86M7J25K18
4000A94k61n3K10j58N3j73L69n89M03M39l53k20L16j34k27K69j39P7N3j00p6j56
4022b56J56K64n11L22P1l54J05K24J74m22K45j77j21J28K98j5l73J42K13j22J79
4043A70nk91J29L47k88l8K7J52m57P0K60l7j38L64j85k98K61q1k64O8O32l91l40
4066c33K76J93m44L53J02j09K27j70j4j27K06J42m60K76j3k04k04N51P8k50p0
4087FK88k28j97J86n9r0Q8p5j12n3L82j77j49J90J57l74K48J89l39LK67k5j88
4110f2k7L55j41m0k4J03k1L9J63m17k77Q04o21qL17l81K1N16j36k29j12j9J75
4133b2k04L33r9j43K52P8k90J28K96j06k42M3J09j39j87K97o4q7J01k57q0L78
$$ y = [138, 310, -7, 102, 234, 41, -174, 283, -109, -47, 78, 15, -266, 106, 340, -180, -291, 190, -196, -149, -24, 194, -67, -120, 90, -68, -15, -188, 181, -408, -5, 434, 81, -139, 177, 43, -184, 85, -54, 23, 76, -24, -100, -256, -100, 164, -347, -25, 46, -308, -203, 21, 195, -227, 18, -159, -280, -152, 146, 131, -242, -100, 113, -9, 170, 165, -126, 3, 350, 62, 24, 51, 203, -254, -184, 76, 39, -99, 265, 80, -218, 43, -38, -302, -234, 398, 7, -333, -57, 136, -308, 45, 147, 38, 265, 95, 81, -46, 160, 302, -158, 118, 105, -99, -303, 248, 326, 76, 6, 294, 66, -131, 55, -4, -94, -6, -81, -193, -246, 136, -41, -190, 0, 157, -217, 31, 220, -119, -116, 151, 126, -62, -89, 266, 125, 85, 61, 164, 143, 182, 345, -72, -349, 455, -166, -174, 143, -238, -217, 299, 163, -66, -178, -197, -22, -226, 107, 8, -135, 117, 195, -95, 33, 329, 223, -19, 24, 133, -6, -193, 104, 40, -47, 54, -203, -283, 95]
4155I5j56l2M3K74m76k48M32j68J22R3R3l13o5N19M3m46L22j21k59J72L51j99
4177G6j2N0L1k7l46L15q9j53K12j88J73J56l14j78K7L10j49Q2J1Q2l57L16K14
4200B42m00K41K56m02R1J91J17l26Q4J42k05j02J07Q7l88L09k7j6O4j66J29j71
4222a43J60q0J85o6j31j19j13L48j51p7M1K10J29k10K52k38K00J34k5m06M7L9
4244a4j21o6M00j69k28lL16K15j71k57J05j32j42L71j83k1J31j73j67K73K19k66
4266h3j03J12J62j57M00k22m3P8M8j17j3K72k64R6L4j67k23K25j49N4l8J9O9k76
4290b86L94l47K26k49K78K2j04M35l64j52L80k86r4J79j13l6L5M1K40j5n0J22
4312B56l47J35L1K43n12J16M5L4o8J4k2K4K55j67j38J5M42j28l36J63J49l37Q6
$$ y = [95, -61, -93, -50, 224, -252, -500, -68, -236, -114, -21, 72, -241, -306, 213, 256, -190, 132, 11, -248, -76, 275, 76, 64, 114, 145, 118, -228, 87, -2, -155, 57, -131, 42, 198, -116, -294, -267, 43, -106, -24, -13, 69, -288, 28, 242, -158, 83, 339, -63, 28, 219, 336, 10, 94, 236, 31, -71, 36, 123, -265, 44, 17, 1, 65, -101, 28, -143, 17, -63, 122, 56, -75, -194, -307, 41, -110, -187, -146, 64, 193, -17, 235, -3, 197, 331, 306, -100, -53, -14, -135, -201, 199, 30, -198, -201, 115, 330, 159, -98, 7, -125, -267, 104, -79, -100, 31, -142, -309, -36, 183, -83, -186, -74, 88, -69, 331, 109, 66, 144, 192, 75, 62, 334, 70, 166, 200, 33, -190, 35, -114, -60, -98, -79, -10, -286, 108, -239, -13, -262, 16, 38, -66, 369, 5, -147, 233, -53, -147, 32, -81, -117, -82, -41, 199, 184, 134, 256, -91, 44, 75, 318, -194, -78, -33, 1, -67, -53, -75, -51, 204, 37, -101, -86, 356, 228, -108, 55, 204, -133, -47]
4335d7L84j99q4K31j87k96M20j42k6J2K06k47l05N42r7l63K74J59n49K35J55l74
4357b98L05j80J52j43Q8Q0l7j24K73L1j94j92J42J70j63K57k64r5M10K9j80l27
4379b60M08j10j85l4Q1o4J5O6J20j24j93J57P4R9m3j6N7J58k71J6j19M23k95J96
4403A56M1j53L0m5O0k77L21j06p8O9P9l70j0K66J51j88j57J60j07J60j61J12p6
4426a23J87j49J43p7J76j85K25pj34k46M57k19j5j4J39k74j22J85L3p6J5K28k17
4449g0o2R9mk53K55K32l39J41J34k21J43p3Qk03K37k47Q0J63O7k08P5j4J66j27
4473b1J24L7k3j14k07K87j00N7Nj12N2m2RK2j16L25j53k05J72J73mr0K19l80K38
4498A53K7j78k9K52k09L7J57m25M6j76L62j27P8K20j41j84J24r2J15l23P26l82
$$ y = [-47, 337, 138, 54, 285, 98, -198, 222, 80, 54, 66, 272, 25, -280, 262, 165, -198, 76, 235, -314, -79, 76, -298, 7, -173, -21, -164, -76, 4, -33, -157, 116, 147, -47, -239, -97, 73, -90, 167, -97, -192, 218, 247, 67, -260, 148, 38, -147, -181, -100, -164, -149, -83, 37, -87, -280, -123, -49, 50, 7, -9, 48, 206, -65, -49, -168, 255, -40, 156, 197, 44, 74, 29, 89, -188, 133, 27, -51, 18, 97, -273, -283, -17, 134, -54, -211, -51, -158, 2, -159, -47, -123, 64, -85, 58, -19, 157, -28, 197, 190, 56, -190, 267, 48, 33, 19, 158, -116, -238, -53, -20, -96, -81, 147, -70, -132, -33, -37, -290, -35, 197, -142, -1, 133, -88, 55, -18, -10, -213, 24, -223, -143, 20, 87, -121, -46, -60, 106, -21, 103, 140, 117, 3, -204, 83, -17, 40, 45, -67, -15, -57, -48, -26, -142, 183, 30, -175, -3, 170, 166, 76, 295, -85, 153, 180, 2, -27, 225, 16, 53, 210, -215, -169, -345, 17, -110, -32, 188, 47, -137, -13, -105, 10, -313, 413, 31]
4520C1q9M2O8k24o2L47j07j91L27r7l69M08j12R0j7r2J03J8j12L7M6j50M13l86
4544g8lR0O7j95lK71l26m1K63J1j11o4K98j96j46K29j13q2J02N8r7J28N6j81K13
4569A50O4m59K68K78m00o4J7M33l47k93R7K66Kj8j16r5K38J61O3m08K67M1M8j40
4593E3j33J83l42M43J89m13J30p1l37L13L69m09P0J42k11Kp7r7K67k93J95K00
4615A73n06K83M16n25M09l72K46j19K8M0k15J33K99k79L83o45K25j25Q7J01M1
4636G8J3p5j70O6r0k19L23o1j03RJ22Q2j39M1M00k70K1j43Q9K4J40l5po1k4P1
4662H2j94J67K66l75m6K66J4M8q7j56J50l51K92J2m01J53J68j71n0J67j2j6L8
4685c6k76M62l7p9k65L35R3k14K78k71M8k9R2j46j93J46P1l9M2P9J10k69k42L63
$$ y = [31, -58, -16, 52, -172, -234, 113, 6, -185, 142, 45, -324, 84, -28, 62, 45, -47, 56, 74, -38, -1, 45, -105, 308, -78, -81, 9, 76, -119, -122, 149, -177, -218, 45, 56, -55, -119, 179, -17, -163, 66, -47, -129, -27, 31, -66, 62, 118, -63, 150, 214, -245, 23, 301, -99, -163, -146, 287, -60, -353, -256, 10, 12, -6, -122, -217, 21, 182, 245, -163, 104, 145, 193, 53, -80, 103, -239, 204, 393, -20, 110, 39, -298, 15, 384, -25, 45, 187, -24, -22, -99, -196, 71, -222, -27, 173, -333, -50, 366, -159, 250, -122, 124, 5, 33, 73, -142, -9, 290, 11, 394, -251, -26, -151, -64, 37, 78, 91, 16, -154, -88, -178, -397, -74, -135, -238, -229, -107, -25, -164, -123, 277, 7, 28, -115, -26, -2, 138, 103, 96, 35, 11, 82, -112, 55, 321, -54, -100, 166, 180, 228, 141, -15, 135, -216, 76, 88, -313, -160, 8, -163, -213, -46, -58, -74, -36, -312, 150, 113, 34, -231, 104, 197, -17, 261, -10, 38, 9, 101, -45, -238, -92, -21, -60, -18, 61, 171, -98, -340, 23]
4709B3nk84L6J07j60J58L60l4j72p8L44l83J14R1m2O3j67L09m25L3L10k18j30
4732a50L95l77K42J8j68J86j72K85l47r7L0M7K01k59O3j33K69k2l05J93J30J53
4754A82l46N70m62L6o9J57l33N64r0j19j23j03J52j61K14J4l8m10K65J43M1j89
4776a05L55k59j05J55j43m7J85M6k58p3M79J40l65J09M3k98K10J37k19O6j11K64
4798B06m54M0M09k23r9R5R1k6k65pn3q0K45j5k1K47l9p6j03K35L6l9j09N9j26
4823g2L75l95J81j64J30j11j07L29r3j71j05L37j92J5M0J06k65J85k5J38j75K31
4845A92l26j41L75o2J16r1M4j12lO1Op3J65O6k08j54J86l6j96%K32j61q5M09j95
4870Ij6l11L57q9j27K99L7k57K34j06m2O6p2P5p3K21j54l8K14j20k70J75k58K23
$$ y = [23, 18, -266, -230, -123, -283, -125, 235, 201, 29, -49, 295, -88, 26, 117, 75, 138, -29, 280, -145, -112, 198, -20, -150, 245, -132, 110, 128, -40, 146, -26, 259, -88, -185, -155, -108, 93, -166, -103, -236, 33, 11, -294, -101, 29, 182, -164, 406, -56, -20, -89, 68, -265, 299, 209, 90, -33, -136, 16, -145, 69, 83, 45, -365, -100, 43, 84, -105, 250, -9, -114, 41, -102, -149, 36, 82, -176, -249, 230, 370, 5, 114, 157, -141, 69, 206, -13, 53, -58, 206, -248, -208, 201, -22, -121, -26, 65, 39, -226, -233, -286, -366, -121, -136, -157, 90, 51, -25, -128, 107, 143, 104, -5, 54, -72, 303, -92, 89, -75, 55, -56, -163, 166, 73, -98, -203, 134, -58, -43, -3, 103, -162, 23, -2, 136, -39, 192, -134, -275, 100, 38, 154, 63, 107, -5, -8, 53, 59, -14, 151, 217, 9, -145, 41, 5, -191, -191, 41, -120, -205, 204, 9, -7, -318, 39, -50, -177, 122, 159, -98, 136, 30, -12, 54, -18, 57, -16, 205, 51, 13, 227, 107, -163, 12, -246, -23]
4894b3K89k19j24P4k44R2P6j88K95k96J67K08Mj55j37l15K32k7L67j78P1J48j
4917A16k8j1j39R7k05j05L28k90K02J58J53m59L11k52j13J47Jn8J03N5J09n2p3
4940eM3j93K43j48j6L7O8j82J60K1j48J39O4j10J13k7j51J96Lm5K19r2j89l1o1
4965i2J01k5j00K39k8N6k36k07K81j4k27K42J55j27m6J60j95Q8rM5J02m7r1j34
4989a09K23k05J49j07R1j45J76K8k4l62J25L15k60P7J58k67j2L0J10n7J66J33
5011B33j62l3l3K74l15J61J60k37J8j23J74r2K1O8J34j16j61O3j77K11j1q8n3
5034h4M6j35J68J97l0j71k06M3K01r8r7K12k5R4QpK4Lj34p0J18Q4l86L00N9N5
5060A69m40K30j36M3p8O2j9J00J09k8j01J66K1l5m%r1J48q7J30k12j07K61j6K57
$$ y = [-23, 266, 47, -77, -3, -247, -155, -79, -267, 28, -268, -101, 107, 111, -44, -181, -496, -264, -291, 76, -102, -31, 117, 116, 88, 77, -62, 35, -170, -275, 53, -237, -35, 123, 276, -183, 128, -124, -237, -90, -89, -147, -44, 11, 120, 68, -5, 38, -155, 88, -60, -76, -39, 29, -153, 7, 28, -120, 19, 83, -27, 86, 59, -92, 104, 107, 62, 281, 189, 0, -31, -92, 9, -16, -116, 123, 95, 151, -85, -292, -11, -25, -252, -10, 145, 18, -28, 132, -63, 25, 16, 61, 163, 116, 25, -109, 114, -91, 58, -49, 42, -103, 73, 101, 77, -285, -160, 155, -105, -28, 130, -137, -149, -119, -9, -66, 100, 233, 71, 38, 5, 279, -36, 125, 285, 48, 66, -57, 117, 25, 46, 114, 248, 132, -29, 34, -143, 68, 57, -31, -84, -38, -173, -5, 192, 162, -9, -215, -172, 29, -69, -166, 46, 21, 115, 123, 116, 140, 143, 9, -61, 57, 141, -245, 55, 114, 169, -271, -41, -177, -134, -212, -150, -169, -69, 40, 12, -89, 77, 98, 63, 59, 59, -32, 116, 29, 159, -53, -160, 101, 85, 342]
5085C42m37K20j33Rj91L78m4k17M1L50k78l0n1j8K43l26j16N1K75qj12J83k32
5108a01J24Qj75K63q3P4j23J7J43k2j73J09jL3J82j69r5j46kN9J0M4N3j10k6J13
5134Fj8l4J1J93l78J99J66k64J43r2J05J27o8K8o1PQ7j75j0N3m8k24LO67o67K67
5160B3r2q6J73q6Q8l53K39R6ml94M17r7J4K13j5j59p2J34j40K97j43J23nk63J07
5185A5j23J00K70k60K20o6k16J72l92K40j66J09J55%j93J80N9j39l6O8Q9m6k8
5208A2R4N8k3l5J26l16j20K66J55j05k7K01j78m1Oj33j68K63j39J48k69K97j33
5231f1J22j25K73O1j69o6O7j0k25K41J30j21j16J9k5K2m8K61k66O0j84K84k98
5254a74K01O7pk25P5j11p0M99m86m6M7K53k10J10Q8L44l11k16K4K63k57K19K28
$$ y = [342, -95, 125, -8, 1, -190, 188, 144, -73, -32, 318, 40, 10, -41, -59, 184, -142, -258, -207, 68, 60, -52, 131, -101, 23, 31, -144, 119, 36, 110, -13, 4, 147, 125, -48, 61, 60, 93, 275, 106, 11, -135, -137, -78, -68, -24, 29, -81, -107, 6, -12, -46, -35, 158, -220, -21, 145, -119, 24, -68, 37, 164, 96, 124, 63, 70, 157, -18, -28, 25, -23, -247, -244, 423, -244, 23, -69, -155, 18, -68, 20, -333, -94, 2, -2, -396, 21, -76, -62, 151, 136, -23, -95, 39, -101, 196, 53, 176, 171, -92, 15, -108, -8, 262, 2, 222, 156, -60, 112, -280, -40, -206, -97, 58, 58, -135, 45, 104, -35, -71, -3, 86, 40, 12, 106, 164, 141, 106, 232, -84, -204, 62, 217, 112, 85, 286, 108, 67, 73, -60, -228, 35, -104, 44, -225, 72, -61, 61, -64, 209, 270, 101, 35, 102, 92, -133, 108, 238, 117, 1, 20, -5, 17, -31, 230, -36, 24, -160, 124, -174, 27, 94, 87, -138, -63, -174, -244, 255, -231, -277, -230, 23, -187, -77, 11, 355, 44, -172, -148, 115, -142, 77, 305]
5277C05k70Q2k05j7J99j20k9P4o3K0R2j43p5J76J46j50k86K49j84J60j01R9K02
5300A61K6l07J38j91R2P9J37J01j60J45j57J6k21K38o7J56j71j09J66j70jl8K43
5323A06O9p3j14k39K96Q2k23J92k90L67n5J4k68M1L96l25n9R3J48n4j61J36k42
5346a63M2K58k03qQ8j44J91r6k7Q8j1J17l33r2K97M8j23N9J52k17p3L3J86J33
5370B02l69J41K86l67K89p2j7nJ06k29R2j90n1M2J91O8j9j90k62J06J43J30k31
5393b06Q1J68jj75K04j15K9j11L14K9l4L5j05j40O3R2l41J73K80j4j97q7K35p
5417A70k72j33J66j68L25n2j93P7p4R5K85j99p7N9j14L40m69K12R5j27j48K45
5439D3K6j75K65r6M6q1J41n1k79M02j53k32J07Lk69K01O8r3Q8l9J16p7j6L65k38
$$ y = [305, 35, 117, -88, -105, 94, -26, -55, 19, -44, -24, 68, -75, -150, 26, 172, 22, -264, -15, -199, -39, -140, -41, 161, 187, -120, 18, -173, -81, -2, 135, 236, 76, 221, 64, 80, -141, 97, 30, 186, 15, -94, 72, -98, -99, -137, 106, 175, 102, -12, -251, 45, 127, -96, 96, -194, 173, 118, 132, -136, -95, 301, -24, -83, 10, 158, 104, -57, 79, -163, -121, 137, -66, -74, 14, -130, 61, -35, -62, 26, 15, 132, -201, -293, 4, 52, -71, -12, 140, -77, -150, -117, 69, 202, -167, -26, 260, -107, 182, 110, 93, 88, 194, -35, 57, -133, -184, -142, 49, 117, 98, -92, -354, -248, -105, 25, -206, -125, 43, 42, -133, 71, -44, -15, -126, 188, 217, 183, 218, 113, -27, 36, 128, -213, -40, 240, 226, 29, -58, 177, 170, -102, -235, -69, -237, 88, 36, -157, -80, -154, -59, 226, 27, -50, 9, -105, 235, -234, -22, 73, -54, -202, 43, 69, -106, 159, 63, 109, 28, 169, 118, -161, 241, 88, -144, -37, -34, -303, -102, -34, -127, -39, -78, 38, -39, -55, 310, 72]
5464G2P9q6K07m10K61m7P6J7k3l36L81j34N0j24J7m9L56k44N6p2j76L78j77l35
5488b63L69j31Lq6O8j0q8r7K44J49k26l9J15K40l85L76k29O5j6J0j3k3k2M3j37
5513h3P0k8J32m10M19k76L02k22J00k21L93l06J53r7K0r8J73m3M2jK44l44J06
5536B5j56Q6N8J56j7j45q4k39K59p2m1L24k56j09J05P8K6J52k69J8J60j00mj0
5560e5jj7J53Jpl46M77r3J17k88K48r0j87R6P8m69L25O1q0K93j96j43K00r4j12
5585a29J11M3k56L25o4j75N0J1J98n7O3k63J73j01j9M4K55K21l60J44j51J2m3
5608C2k02R3o9K03N9k44Q6Q6J8l77M31k6j0m7j51K52o0k72J66M19m73K04p3K8
5632G3J84j54q2P5k09K9M30j23l4p0k02M9j4R3j96K71k27K0q0j80L36j57M5K36
$$ y = [72, 151, 65, 272, -138, 123, 76, 152, 169, 146, -190, 191, 57, 107, -17, 0, -49, 307, 63, 119, 47, -129, 249, 72, -263, 106, -25, -22, -108, -40, -50, -138, -235, 9, 158, -68, -107, 8, 248, -137, 239, 10, 75, 59, 69, 56, 33, 11, 54, -83, -13, -41, 91, -319, 100, -176, 126, -96, 4, -217, 176, -130, 23, -74, -54, -152, 21, -22, 20, 19, 263, -81, 25, -131, -45, 13, 169, 152, 7, -77, -316, -57, -129, -170, 154, -102, -211, -106, -28, -2, 150, -119, -101, 59, -41, -45, -55, -56, -73, 80, 81, 74, -272, 205, 112, 229, -59, 189, 99, -88, 8, 86, -383, -58, 3, -77, 216, 20, -123, 77, -17, -129, -18, 25, -231, 94, 30, -145, -95, -84, 114, 57, 120, -143, 30, -71, -90, -46, 209, 430, 70, 214, 63, 75, 32, -170, -77, -146, 57, 116, -128, -42, 44, 62, -315, 116, 90, 80, 33, -118, 134, 74, -198, -32, 387, -86, 118, 45, 73, 257, 103, 21, 96, -113, -84, 346, 223, 189, 119, -83, -34, -48, 45, -151, 120, -107, -87, -167, -347, -11, -168, -123, 113]
5656A13J41k56k4K89k42JL9K2j85K35P5j94j01K05Pj33M9k01J2j9N8N1k9J44k24
5681a67j51K11L28k92k0J95j72j3J67j82k8J72M9q5Q8j21K54k82j40J86P2J94
5703B63n0k91LJ23j16N4o1O7nJ07l8n5k17K34J26j08J16j35k33K75R6p8j98M5
5727g6o2R7J33o5R7k63L96j80jk20O2J82k94K49j57J19k1J27j29K7k4k9k00L32
5751A00j62L1J84k64L93p4j06k77M76j28k44K22l59K81J55j88R4j17j43K5N1j0
5773f0j69L08r8J49n52N13R2k65K21j93JL01k35l0q6N3L5J81j92k3OK6R0J66M0
5798B79k05P7m21pK42k53K74m5K88m57K70J79k81PJ7R5k14M3J11j28J47l18K70
5821c0J23m00M93l53K47r0M8K47j32l7j56J87k53J89m0j69J80n4k16J81PM1J40
$$ y = [113, 254, -2, -26, 263, 21, 22, 61, 83, -102, 133, 208, 14, -87, 118, 125, -8, 41, -160, -148, -167, -109, -58, -87, 57, -167, -318, -107, 221, -71, -91, 104, -68, -81, 86, -96, -124, 48, 97, 12, 100, -21, 233, -49, -189, -3, 69, 263, 213, -78, -75, 48, -68, -14, -75, -8, -13, 94, 56, 1, -216, 18, 144, 36, 152, 17, -216, 59, 155, 77, -121, -76, -138, -41, 92, 27, 124, -139, 257, 77, 76, -144, -82, 100, -194, 55, -102, 17, -4, 123, -6, 21, -3, -32, -232, 100, -62, -31, 153, -111, 282, 208, 102, -175, 301, 173, -71, 151, -208, 73, 228, 40, 134, 17, -126, -101, -50, -60, -229, 79, -19, 130, -422, 91, 183, -82, 139, -54, -53, 248, 13, -17, -103, -50, -15, 166, -26, -49, -43, -17, 73, 239, 279, 74, 151, -270, -277, -35, -288, -14, -59, 229, -228, 42, 221, -60, -53, -36, 59, -155, -112, -1, -129, 18, -300, -30, 93, -307, 186, -167, 80, -10, 38, 285, 153, 116, -40, 147, -106, 83, 43, -126, 54, 0, -216, -35, -28, 13, 153]
5844A53l21J4o2J93P6n6o8J86j74K65l38P4m6J66k5q8J35j30J68J79n90K3K13
5867e3K33l1n10L74r1o3j08M48j72lj29J00oK48j81p8P4L4o6Q1p9NQ5r5J50j78
5893a1J95m50N03j07k08J42r1R8J58q0k26K86k66l7K00j06J9J68m80J12r8P7L59
5916A57m08O5K91O4l52M99l20k77R9J36p9J69l5J2l28N16j81P1j93j6J72k02J44
5939DK95l42Jj7J35j56q1K73J81k02j59l0L66l40Q2J48o5p0J01j26o3N1k03K19
5963Br7K38j95Q0j2P8rJ3l51J14R5r9O9k10M42j01p0rJ39J7k35K37j32J11J8J34
5989B67k77p6M2K7R9p0j51J50j07J88J37l05J38j43O5N5M7j64J46K02l55j40K23
6012bJ49l88L13r0j40J26N6K11j70RRK4j24K9mm4O0j76J77k85J21J21p4J19J69
$$ y = [153, -168, -154, -216, -23, 53, -3, -71, 115, -59, 206, -132, -58, -104, 62, 37, -51, 84, -46, 122, 301, -289, -266, -53, 180, 149, -361, 13, -78, -141, -249, 199, 27, 24, -105, -5, -11, 237, 56, -22, 52, 86, 20, 101, 22, 27, 112, 17, 167, -11, 184, -266, 237, 130, -78, 64, -27, 71, 229, 149, -77, 209, -57, -94, 106, 0, 19, 187, -293, -181, -279, -202, 157, -251, -186, 105, 169, -183, 316, -4, -281, -182, -46, -125, 44, 9, 21, -307, 209, 28, 99, -94, -110, 62, -140, 4, 299, -43, -42, -59, 76, -80, -161, 112, 293, 91, -68, -98, 268, -72, 10, 158, 93, 23, 124, -2, -65, -14, -217, 2, -95, 143, -52, 28, 16, 94, 85, 98, -253, -139, -44, -143, -74, -284, 158, 57, -13, -22, 117, 134, -101, 136, 4, 115, 133, 267, -10, -86, -44, -17, 82, 12, -139, 11, -96, 92, 229, -76, 62, -81, -16, 39, 86, -78, 68, 270, -85, -225, -2, 147, -241, 72, -18, -158, -32, 24, 235, 65, 74, 83, 107, -17, 12, 8, -36, 24, -152, 25, -260, -139, -18, -92, 27, 196]
6037A96l21j1ON6j8N5JJ0Q1l1N8P0k48J65N2j67J7N1J59j95M1r7J48j78j50M59
6063B09l97R5o9J05L3j11k20L77P4j12P6k87L12jm3l7J11j10j80J6L18k80J85
6086F4k48M23k87K32k45K16K3j60K10k33j52L12J0m74j6J13J96r0L1L0O3j48J31
6109AM0m8J83j82M3J27k08J80l5k7k28J32K65k91r2n7K96j89j37K81n0J4q2j45
6133b09K04M5m5k48L76k61L09k11J57j95J95k21L51l32P1J54J42k91J3J1n0L47
6155C12m40J17M2l09M00j46J00l4l20J80J62j99J2o4K7m4L72l00L08k61j50L82
6177A47l00k8M91l69k5J63M9Nm1Nj55K14l9j10O1l06J85J36O2l19J64j98j8K07
6201a9J50l71K98k4J05j92r1J32l5R1Kk34J62Q5n8l2q3K03OP5k84K61k07J24O6
$$ y = [196, -125, -136, -130, -74, -92, -37, -36, -26, 55, 24, 82, 152, -96, 69, 121, -46, -29, 22, 181, -14, 27, -70, 78, -100, -250, 209, -188, -93, -162, -57, -24, -135, -355, 22, 96, -16, 60, -227, 85, 84, 41, 4, 115, 5, -175, -159, 159, -121, 64, -184, 239, -48, 184, -61, 155, 178, 18, 228, -5, -157, 155, 165, -309, -325, -212, -16, -106, -75, -45, 18, -130, 1, 41, -7, 176, -6, 37, 164, -44, 136, 101, 74, -154, -22, 243, -48, -140, -197, 99, -90, -227, 54, 4, 18, -64, -209, -5, 40, -5, -253, 123, -138, 171, -40, 117, -78, 117, -104, 247, -85, -14, 140, 282, -9, 4, 15, -35, 312, -128, -11, 31, -278, 122, -24, 76, 42, -278, -98, 64, -135, -123, -187, -160, -204, 168, -132, 176, -85, -235, 147, -153, -181, 310, -59, -84, 79, 128, 133, 92, 97, -58, 156, 117, 7, 68, -238, -53, 83, 145, -174, -10, -208, -226, -19, 131, -240, 58, 34, 139, -53, -144, -12, -47, 44, 46, -188, -26, 59, 1, -31, -114, 89, 95, 170, -114, 147, -60, 64, 130]
6226A30k42pk3K93k26p6K29j41PJ53l31L67j51J11L2m8j93J55q3o4J39K86k92
6249B5J41k54l1J53r6L0K43k24l8J8j56K45j91K48j89K3m4J9L85l81Q4j95J02
6272h3J60L0J3j26N9R5J35l39K83l08Q1j33J71j06o1L0N6N4K16l87p8J72n9o8
6296a93K31r7p5J4Q9j0j82M27k47L8l9KK0N0K22m84J92m5K67r8k28N6J01J71n43
6321c61K22p1O3L1O7J12j64K21j7k80J13M3K72m36J34M4m5J59j74J31o0K23l0
6344A97J6p3j27Jk41L13L5L5j91j23K38J15k05J60k91P1P9J08q9j59K43m9p0j9
6368b6r4K00n0j62J48J5K03K1k65j12J81M9j46j14K40J80l62J30N9j87j28J87
6390c3k48L63l58K99k93M00pQ0p2L1k38K78k2m28J65lJ0L07n0j75k59M56k49J09
$$ y = [130, -112, -119, -142, 151, -75, -151, 78, -63, -56, 97, -234, 133, -18, 93, 125, 77, -116, 39, -44, -108, 31, 317, 25, 166, -88, -119, 34, -62, -32, 211, -13, -51, -33, -189, 56, -135, 113, -76, -53, -97, -78, 307, -74, 10, -185, -83, 77, 107, 120, -6, 53, 148, 283, -56, 227, -81, 0, -133, 38, -68, -129, -99, -43, 11, 227, -160, -238, -66, -125, -193, 38, -59, -134, -120, -31, -41, -223, 204, -43, -5, -44, -42, -22, 28, 250, -234, -42, -87, 180, 82, -146, -90, 11, 182, -361, -139, -210, -147, -116, -49, 63, -101, 120, 103, -177, -64, -21, 251, -185, -51, -7, -52, 107, -67, 64, 4, 227, 197, 213, 140, 13, 14, -227, 86, 121, 156, -35, -158, 80, 195, -10, 150, -141, -70, 9, 117, 28, -131, 112, 63, -7, -26, -120, 80, 30, -132, 16, 31, 234, 255, -10, -122, 59, 108, -38, -152, 88, 268, -94, 36, 95, -92, -220, -33, -281, 82, -276, 23, -270, 130, 123, 203, 131, 162, -76, 202, 180, -248, -83, -86, -76, 231, 181, 6, -253, 203, -46, 63]
6414F3j34R9j96O8J76j92M16k61j00K5r3j22L20J19j29N4L2k94K58o4O0j7L28
6437D16l94o4K62k80J2j42K96j39J96Kk79o7mR1L08O0m58J85K2k11O1L5m7K26
6461H7j94K8K20k24K67j39j73K66j42m8K54p1k5j2K15k11j53o7L40k21K01j12
6483H6j59J40p1J65m62K80j39J69j88J34m5J80l5k31L29Nl98M41k1k38p8K33j53
6506e6m6J72j38J41j72J75J07l16L85m31k8k0K39j10J58k14p5K47j04K85k38K7
6528a2l2J53j72J69j28K25J29n01nj9J73oP5R3J5m5j29J57j53j68J25N7o6j07
6552a72J78k7Q5r1n5j65K87j17J1M29k84R1n5K34k26K2j74j91J40O6m2j83K54
6575A5K02j12L7K0j37J83k71kJ5o3lN0j83L28j85K3j1P9j08N9P7Q0p4K95l19K5
$$ y = [63, -71, 28, -168, -100, 76, -116, 300, 39, -61, -36, -129, -251, 69, 188, 59, 113, 145, -149, 109, 45, 105, 88, 416, 22, -42, 220, -60, -48, -190, 106, -33, 163, 165, -114, -181, -185, -94, 214, 274, -184, 1, 23, -188, -127, -92, -139, 87, -107, -79, 141, -83, 184, 45, -128, 138, -4, -52, 202, 131, 106, 94, 309, 98, -55, -122, 218, -3, 198, 86, -73, 67, -4, 161, -301, -21, -160, 9, -179, -45, -90, 90, 55, -176, 153, 158, -240, 201, 180, -58, -136, 97, -56, -102, 70, -68, 73, -99, 76, 183, -133, 252, -179, -207, -227, 12, -98, 60, -154, -229, 18, -86, 199, -39, -12, -44, 109, -63, 106, -22, 203, 332, -169, -174, -193, -20, -26, 49, 142, 157, 112, -17, 140, -13, -181, -56, 1, -65, -172, 6, -21, 64, -27, -82, -247, 40, -77, -66, 363, 79, 170, 115, 349, 123, 145, -29, -220, -80, -14, -56, -239, 15, 217, 105, 142, 162, 25, 208, -63, -65, -50, -113, -116, -66, -249, 79, -106, -83, -94, -15, -123, -64, 13, 93, 19, 314, -5, 20]
6601B0J40K0j63J53j92q7m5L10o2j8Rj59p0J00Kr5J43j25p7K4N3k4K31j29K78
6626B37l71J47j48J06J79j32l3k56M25k55m3J58r8l8L0K71j82j03K4L16l09J23
6648D8r2J2J20q7J06j26n6p3L35Rm37J40K64J03k92J42J11pk16k9n2K62l23P6
6672f2J51l5l7r9J81l04J92J70m50K73kj5J3L3o8jQ3j97P0p0K73K5M7q4l12K45
6698B0J70j22j22J08j8q3l4K12k48K66j39r4J10K41k40n2m2m6PL6R2m7q6N1K8
6723c2q0J05Q6j27J53OM3l80J95j42K25j23J37j75J49l24L84l3j68J02J2lj03
6746i3J24J9k6k2R9r9L9r2j48K34j27J26k6J7K4m4j83K44o9m8J75N3k18r9J56
6771A6J04l88K05K10k37l2J53J00l94L67j41p2M3J9J05M1j47P5j93K27K3L1k51
$$ y = [20, 160, 180, 17, 170, -22, -109, -154, 156, 94, 76, 85, -74, -144, -44, -42, -137, 6, -119, -196, -172, -119, -143, 88, -41, 237, -134, 13, -135, -29, 150, 18, -15, -271, 154, -101, -144, 14, -84, -122, -92, 179, -3, -106, -82, 234, -75, 48, -44, -32, 88, 1, 107, -19, -75, -148, 187, 196, -241, -101, 163, 266, -26, 116, 227, 220, 4, -25, -77, 185, -138, -62, 89, 54, 17, -82, 99, -205, -13, 157, -293, -20, -22, -37, -24, 9, -59, -60, 23, -174, -104, -174, 99, 124, 171, 87, -225, 20, 190, 68, -54, 54, 36, -47, -81, 131, -117, 149, 10, -84, 26, 267, 27, -25, -67, -113, -106, -70, 22, -25, -111, -60, -32, -112, -7, 79, -48, 105, 111, 154, -226, -31, -173, 52, -71, 66, -109, 40, -284, 100, 67, -101, 1, 13, 10, -93, 31, 50, 24, 2, 101, 2, 41, -51, -199, 35, -92, 34, 8, 25, 49, 5, -178, 66, -3, -51, 124, 177, -41, -140, 16, 120, -268, -63, 147, -90, -122, 31, 131, -263, 104, -37, -109, -66, -47, 58, 99, -48, 27, -166, 61, 84, 115, -136]
6794a36J51k13K40K97n09L37l4j80J29j76J40k14J1K31j42J63j34J80k62OL9K42
6816A66j40M2k60k9K05Q5n6R0J6k0q7L21j34j06k24J71o3p%N00l43k20L30l60
6840a23L5mK35k46JQ9j69J07j43K0K43mQ8o0j12N0J34M9o5k6k5p5M4J09o3j4n
6867G0n1r5q0O9J73pj94N6nj42J93JR2j11L6J68j31J3K2l01L77l17K57j95Q8J84
6893A70k65Q3J30j12J96j93j0K3J5J82l54M2q3L51J44l65l2R1j42k4K15j03K7
6916a4J37l52K91j72K44QJ61k62P3r1j15J3K81j7m47N1J60K65m05K28jj54J83
6939F5k04QP0l2LK05J7m5k73K12P6k1J16m93M82o5j07o6R6k39L81j44m9QP4n8
6965A7J34N7m12l7K33J52j77j07j59K02J12K5M5M1j00K06o3j46j18J30j98R9J51
$$ y = [-136, 15, -198, 42, 339, -170, 167, 133, -47, 82, -94, 46, -168, -157, 74, -68, 95, -39, 141, -121, -115, -76, 166, 26, 68, -192, -221, -16, 69, 13, 103, 119, 99, 12, 333, 199, 93, -131, 40, -23, -30, -30, 470, 127, -93, 237, -123, -88, -92, 143, -103, -102, -13, -182, -75, -218, -198, 45, 41, 129, 69, -43, 7, 141, 190, 125, 99, 74, -1, 43, 152, 89, 75, 70, 19, -76, -156, -87, 86, 79, -115, -59, -64, -206, -13, -12, 80, -31, 5, 173, 42, 55, 77, -224, 153, -164, 93, -102, -14, 170, -95, -12, 118, 6, 202, 9, -1, 22, 37, 219, -135, -93, -176, 175, 319, -46, -78, 13, -129, -153, 62, -41, -14, 123, -229, 62, -110, 134, 142, 303, 41, 114, 23, -92, -79, 202, 185, -262, -211, -51, 214, -191, 37, 36, -118, 65, -139, -131, -61, -93, -90, 115, 132, 87, -186, 26, 102, 81, 197, -296, 186, 121, 14, -52, 44, -195, 186, 42, -7, 1, 75, 17, 151, 208, -204, -241, -8, 144, -33, -140, -299, -97, 15, 40, 85, 126, 26, 232, 169, 23, -95, 35, -163, -64, 87]
6988H7j04J09K1j58K30k68J38r4j76J83K59l90L93l05q3J15K83r7q5k96M26n8
7010A30m1j10J8j38R6K8O8J84r2Nm9K7k4j5k02k9N3KM3m0J82k04K00k68K41K02
7036B67j85j1m5q1l7q7Q3r3K22p8J00M9J45k88j7O0j42L43q7P9l03J03N4j17J64
7061I8p4K8n0m2l1J72K01l80K06k96P9q5L5M9J40k68K17j34K48o6K90k90j3j55
7085a21J26M1K1k2j0O0m4J15l2r3r3Q0j82k40K47K39j42r4J98k01O6M30m95R1
7109e5j03J06k19K03j1J54k23Q9J92j02J33N6k62J06o6k06L59N5l97J18j22J01
7131i4J13k27J80K35j4k92p0J97j5mJ20j42m1j35R0j22J92J65j10j46K64l0l64
7154b50J88J62r9n4J05PK60j98j09P9M7j69M2N0j08k24K49k34J23J44J58q6J06
$$ y = [87, -17, 92, 113, -45, 185, -83, 55, -39, -215, -32, 227, -163, 230, -75, -158, -43, 240, 143, 58, -238, 188, 130, 89, -21, -3, -141, -45, -17, 51, 235, 143, 148, 99, 126, 102, 87, -115, -144, -91, -89, -46, -86, 96, -108, 92, -176, 65, 267, 82, 71, 26, -55, -92, -179, -96, -189, 33, -45, 55, 104, 249, -39, -56, 4, -138, 205, 118, 197, -106, -3, 51, -66, 98, 24, 52, 2, -40, -71, 101, 302, -78, 128, -168, -89, -174, -139, -90, 50, -218, -1, -135, 113, 47, 337, 47, 34, -121, 5, 46, 67, 45, 35, 95, 51, 166, 134, 41, -52, 28, -154, -394, -147, 92, -50, -144, 54, -147, -81, 349, -146, -55, -158, -52, -271, -68, -79, 75, -148, -59, 133, 31, 164, 220, -42, 64, -2, -208, 151, 206, -191, -73, -195, -94, 19, -208, -28, 207, 193, -99, -169, 28, 13, 9, 129, -13, -54, -189, -99, -221, -29, 136, 26, -120, 144, 114, -250, -62, 100, 1, -53, 52, 59, 319, 121, 12, 91, 138, -31, 11, 61, -47, -271, -22, -256, -133, 11, 169, 83, 189]
7177A89rL5k39K34l68j22J81J29Q3j60P9N5J51l22J59J15l22J05r1q3L59j27l4
7200cj51P4j27K80j04nJ54m8n5k05N22n09M71K7k21J24k16o3L08j90L1l36K19
7223b3p8K20K8j57J71j52j25r2M4j13K15o2O4P6J50kp5j09k07K24P9j18J96O7
7247B21l68K63P0k29p2L86k98j4K6K59k19n7J36k78%K83j35J77Q1r8N8m59K57
7270a0j61K37j40J83k17M1J83j49L2r7J58K0j21K00k13P1j43L81k92mq8J41q4
7293g2p0P7j18J88m6m34M18q7K29Rn4Q4j73j65J38p8K57J7p6q7J1K00k12m8K06
7318A14K7k72R0m2P0J60L4l51J80j69K44l38K64R0j79j58K35J04j51J19j36K0
7340d5L18j79j79Q1Q0rL01m64J62l7j07K39k65J2K30j01k5J9q8N7jr0K20p0QQ5
$$ y = [189, 180, 215, -24, 210, -158, -280, -99, 30, 113, -47, 32, 87, 238, -84, 75, 190, -132, -27, -118, -201, 158, 31, -3, -154, -80, -207, 73, -31, -36, 118, 70, 15, -190, 332, -177, 294, 321, 100, 224, 8, -55, 253, 63, 94, -242, -23, -101, 119, 147, -10, 161, 9, -116, -208, -164, -277, -62, -124, -60, 16, 166, 164, 89, -20, -227, -3, 76, -42, 154, 221, -147, 116, 186, -43, -115, 271, -27, -41, -15, 244, 25, -32, 104, -174, -174, 109, -26, 151, 232, 134, 192, -267, -10, -171, 66, -74, 109, -108, -67, 116, -33, -1, -98, 60, 80, -41, 159, -54, 17, -126, 255, -37, -41, -129, 12, -72, -142, -65, -183, 5, -41, -475, -57, -144, 85, 94, 40, 124, -49, -214, -76, -154, 103, 120, 44, -43, -32, 168, -44, -92, 114, 141, -131, -41, -83, -13, 147, 181, -170, 10, -159, 85, -253, 11, 101, -78, -236, -1, 103, -48, 71, -65, -45, 273, 94, -85, -4, 76, 67, 368, -96, 66, 29, -78, 161, -104, -92, 138, 37, 12, 31, -57, 0, -1, -91, 129, 59, 67, 152]
7366A52k67P4k4Q2pJ46j55J24k19J03ll84L88j76L22o7k70R7j87K34K47m75J75
7389i0j11J44K01m05O7K03j70J08j65K83k18K01nj64K66k31J88j39K66K72l96
7410A05k36R3M5n1q1K34J7k86j7O2m4K74j13j2j13O6j10o1J35j9K47j40j10P5
7434d0K61j36p7j10K1J76j15k8j5K89k81J93j16m45N64k68K97l91K09j73K21Q3
7456A19k05r2K31o7P3o0k76J36P1j4J15j55M6P1j49J33R0k2k38J88l3o8R4m0j30
7481a82J62O8k08J96k34J47k71J61K01j9j2K6m3n5J09Kp5k21L35k63L08r5%N8
7505I5k9j42pJ94o7j64J99k3j73O4J7K46K5o5k20n2K15Mk48J29K0r7J74j13J72
7530A54k2j62Q2j01R3P1n1K28j84j1j75Q8j32J75k5L9k02R3K9K9pJ95m38J98o6
$$ y = [152, -115, -41, -65, 17, 10, 156, 1, 125, -94, 9, 6, -378, 10, -166, 156, 89, -181, -84, -271, -37, 210, -265, -90, -201, -57, 144, -261, -194, 9, -161, -53, -218, 65, -153, 48, 43, -121, 145, -86, 102, -37, 229, 501, 105, -131, -38, 7, -44, -125, 109, 126, -160, -177, -115, -159, 115, 2, -10, -123, -57, -167, -228, -93, -112, 135, -5, -115, -40, 221, 85, 8, -102, -81, 95, -20, -48, -63, 226, -55, 138, 22, -423, 141, -127, 170, -221, -12, -185, 36, 119, -86, -178, 53, -14, 59, -1, -277, -141, -70, -84, 31, -124, -78, -7, -156, -23, 67, 45, -193, -5, -38, -106, -12, -52, -182, -20, 48, -160, 36, -198, -51, -322, -161, 40, 21, 9, 35, -8, -63, 46, 48, -27, -248, 87, -176, 132, 37, 37, 95, 66, -76, -83, 111, 44, -120, 79, 56, -117, -53, -36, 210, 235, 170, -50, -102, 113, 117, -131, -2, 18, -79, 95, -18, 154, 132, -30, 52, -49, 44, 115, 64, 292, 108, 97, -78, 10, -122, 53, 28, 67, -135, -42, -13, 16, 9, 204, -234, -36, -102]
7555a02J29j98Q3l6PJ04j21J53R7j90J91j41O8q2L32M3m47J66o3p8L53k20k1M9
7579G6k77K04J67q8p8O8K6j46j55K87j22J66p0M1j03P8j9J39k20o1L62m06K21
7602I0j92K65Qj57J6j35L10j76R2j77n3J69J68j39J59l4l50j02J03K71j63M5K78
7625B96m27J46o5l1M7LK50j25O0p2k18J77O6q4L5r5j78K49j25J76M6j98l2n7J30
7650b6N8K1n1R7j79nJ09k4o4j12M3K54l85K66k23J71Q1j66K37l4j23O3P8j19J60
7675A27j85J1j27q3M14k01o1j7J43j59K24k63J67J42k26O0K28j42K64l60J4M1
7697A1Q8q5O1r2P7M0k25k6o5L08j75R6m2n5j0P1J46j19J66j29M2l98J48K20K2
7722G5k57L65k1l1j96j11K55o9P7J09P8j95j93J41P2R7k33Q5r1L6j2J02j39Q4
$$ y = [-102, 27, -171, -88, -124, -117, -13, -134, 19, 116, -74, 117, -24, 44, -38, 294, 337, -110, 56, -7, -85, 268, 48, 27, 76, -201, 3, 170, 82, 4, 72, 98, -48, -203, 84, -38, 128, 58, 99, -4, 74, 55, 194, -26, -87, 275, -131, 90, -102, 163, 171, 14, 30, -105, 205, 29, 121, -56, -109, 60, 228, 89, 248, 214, -136, -238, -135, 136, -27, 18, 296, -131, 15, -50, -81, -34, -31, 219, 94, 154, 82, -136, 41, 107, 23, 58, -37, -215, 34, -91, 85, 131, -67, -99, -156, -26, 32, 53, 2, 99, -80, -85, 24, 0, -64, -176, -133, 121, -264, 2, -221, -50, 31, -135, 102, 68, -55, 8, 86, -33, 127, -58, -47, -174, -257, 157, -44, -105, -122, 21, -138, 86, -177, -10, 132, -94, -34, 194, 52, 316, -44, -30, 11, 99, 14, 75, -17, 60, 100, -125, -151, -216, 92, -83, 13, -29, -84, -94, -23, 123, 4, 170, 41, 83, -315, -167, 53, 75, -182, 183, 162, 131, -65, -176, 79, 10, 87, 196, 274, 79, -114, 27, 99, 196, -37, 48, -43, -7, -19, 83, -56, 28]
7746B8k98J39K00K8l81J26k9J66M2n9j69J71K32k18O4P6k36Q2K09N9rl94J35n6
7770i2J92l7m6j34m2M83l52K3j38MK41n6L4k36K76j89J19l5j05k1K8P5j68L18
7794A42j92J14j1q2j33m9M42l6j72r4J41M8j86J73km0n6r2OK3L5j8J63j73R7k37
7820a89M3J72Pn7j09J64J2k4J61j78J18n2k4l3r8K95k08o7J38j86J24q7O4p4M7
7845d1r5K89l6k23K02J04p5k72O4J25K80k16j75J36j41r4L80l55K40q4o0J92n1
7868I4j15k60R0K37k0p9n3l0o9R2j38J07m1K53j25mq4J43l4p7K63n5N3k38L35
7893B45k04m6o0k9J31K8J85k71j90j0l8K86L7j01J70j77m1K82k21l0J13q3J70
7916A46j44jJ93k13L7r3K17j20K14j99O8j14J34K47j87j04j02j00R8j92J84j21
$$ y = [28, -270, -131, 69, 97, -284, -158, -187, -21, 21, -38, -207, -36, 196, -22, 42, 118, -118, -36, 173, 232, 223, -171, -36, -92, 100, 63, 17, -117, -159, 324, -28, -5, -143, -139, 102, 46, 80, -156, 120, -69, 50, 15, -90, -111, -83, -8, -176, 142, -50, 64, 53, -29, -162, -211, 231, 195, 23, -71, 70, 118, -68, 105, 103, 63, 7, -85, -79, -56, -21, -39, 124, -49, 48, -189, -146, 26, 33, -24, -133, 31, 43, 19, 180, 2, 120, 68, 44, 11, -87, 208, 0, -67, 71, -115, 9, -78, -14, -88, -41, -136, 153, 117, -106, 96, 200, 125, -147, -83, 42, 322, 106, -69, 67, -74, -168, 212, -143, 97, 13, -47, 145, 94, -21, -281, -191, 46, 26, -53, -106, -136, -205, -113, -251, -144, -185, 68, -57, -61, -145, -2, -36, -113, 150, 95, 148, -90, 245, 41, -5, -65, -94, 37, 65, 250, -21, -211, -221, -259, 27, 64, -37, 133, -44, -85, 197, -24, -54, 59, -24, 146, 2, 1, 194, -19, 18, -75, 142, 22, 236, 37, 105, -9, 125, 372, 185, 81, -21, -121, -23, -215, -31, -152]
7938a52K86k19O9Lj19k8J1K74r7J93l56K03J15q9j49K52k17O6kK39m14K04rj74
7962a10L92l42o5J18K35l76J05O4p1j21K01J3o8m1L30k73K36k08K31l49K15k58
7984a42M59k52o3p0L4n5K57j72L1J89k25j9Q5N3j44jL9j12J08j04J65l4n8J01
8008G0n5l5p5R5k0L0J61l29J67Q2q0K28j59k06J51R4J52j13j66K89n1j96j43J36
8032B7k69K21R3J95l88R5K20l24J91N2k46m4J45O1J89j54j12k08K41L5K0O5N2
8055A57k54NJ51J75l02R1j67N3J95j31K80k54Q8j85P8Q9j9O1k32L0j58L3L43m0
8079H7j18p2K77j24J12L1k11R4o5K27k29r6L03k99L8M4J93l6k28J06l6O2k07n3
8103b00K11J17j53l4r2K42J00k05J80K4n9l50K78K63m24J09j03M00k41k75J66
$$ y = [-152, 134, -85, -16, -13, -132, -160, -149, 125, 28, 221, -135, 68, 183, 94, -55, 197, -20, 46, 44, 283, -131, 73, 64, -110, 282, -60, -125, -7, 228, -148, -43, 21, -50, -171, 30, 43, -25, -66, 264, -9, 227, 19, 250, -99, 116, -142, 317, 65, 2, -68, -34, -89, 168, -4, 27, 216, -9, -28, 57, 110, -34, -35, 4, -108, 0, -104, 61, 27, -31, 70, 15, -20, -95, 0, -20, 10, 171, -158, 9, 91, 11, 239, 80, -126, 25, 119, 271, 158, -8, 281, 230, 34, -109, 27, -242, -21, 72, 267, -121, -26, 194, -130, 61, 113, -133, -177, -32, 29, 218, 64, -48, -256, -15, 20, 40, 105, 157, -97, -92, 59, 234, -68, 23, -144, -91, 104, -27, 253, -1, 87, -98, -20, 69, 50, 111, -121, -91, -249, -216, 127, 87, -31, -103, 174, 50, 162, 193, -18, 76, 11, 238, 9, -87, 216, -83, -45, -1, 192, 156, -72, 34, -2, 60, -147, -200, 11, 128, -25, -59, -151, 91, 191, -14, 166, 190, 131, -219, 59, 322, -102, 7, -96, 304, 63, -212, -46]
8124d6O4r3M2j5K77k10K52L7k80j25K07k22K9jJ18J17j65O6k50J5J19J12J03j18
8148C3j54K89j89j21K5P9J88j19j61k4%L07J2n2k87K15R1j84Oj59J68q4J40R2
8172A11o0k3j44K15J02j41J68m19K41n8O3n1J03P0J0j7j25n5K68
$$ y = [-46, 18, -75, -33, -48, 229, 19, 271, 308, 28, -97, 110, -112, -83, -84, 34, 151, -14, 52, -198, -183, -64, 48, 151, 33, -121, 168, -21, -142, -117, -38, 150, 31, -130, -154, -154, 153, 165, 113, -174, 41, 132, -52, -46, -205, -37, -121, 19, 111, 51, 28, -116, 99, 201, 60, 228, -191, 50, -8, 55, 4, 107, 177, 187, 170, 45, -10, 258]
8191B58
$$ Imaginary data points
##PAGE= N=2
##DATA TABLE= (X++(I..I)), XYDATA
0@%%%%%%%%%%Qj6J6j6K4l2M0n3O1p2Q8j04J20j38J62j92K24k58K95l38L86m40
32b35M99n60O31p12P98q90R94j110J235j370J516j676J850k042K256k485K734
49A433l012L320l660M033m450M925n461O070o775P603q587R779j1259J3145j5643
64h539J9115k4258L2617m8335Q7149l39360l96801J176885j90815q49768O26907
75H4797L34839q00781L16528N99482q01245k23853R85658k36070p99256N88258
85D8357M25708p27043M529N82341l56118l00527N31728k8209m83254L15795L03838
96C17145n16558q5004N67645j22216m99899K91136L59529l55059j48673L19360
106A27406j09971k01114L46126J6421m85019K24854N01108m34767l75525N24948
$$ y = [0, 0, 0, 0, 0, 0, 0, 0, 0, 0, 0, 8, -8, 8, -8, 16, -16, 24, -29, 32, -40, 48, -56, 64, -74, 88, -104, 120, -138, 157, -181, 205, -235, 264, -296, 335, -377, 421, -469, 525, -585, 650, -720, 796, -880, 970, -1072, 1184, -1301, 1433, -1579, 1741, -1919, 2114, -2336, 2589, -2872, 3198, -3577, 4026, -4561, 5218, -6041, 7104, -8539, 10576, -13682, 18935, -29400, 57749, -281611, -678412, 498473, 307658, -542110, 84797, 419636, -381145, -64617, 534865, -266380, -490233, 495425, 259355, -539901, 48357, 474065, -252978, -248449, 333892, -22226, -322753, 208975, 180766, -302488, 13307, 317145, -199413, -284417, 283228, 161012, -338887, -47751, 311778, -43281, -191954, 127406, 17435, -183679, 162447, 178868, -306151, -81297, 419811, -14956, -390481, 134467]
116A34467J17440m64929J71030K56301l72271N5741M11415l72588k93114N54844
126A98336M8150n48315K19863L76497l83053j06090L77276j60872k27120L19497
136A14169N912l14611K12960K01223l35186n0586L28199o9959k28977J16492J07551
147H7187p9132m564M418o5229L9897R3941m4826j16243K2311J55509k095k04271
159a13097O494K13822n4999j60496J18860M7239j37686J05983Q3012k37017L9904
170h7981K83245j85298k09658K99118N5762l12391J17707K07065k37723k6770
180i6924K47951j58253j43097K78394k8713k97703J82723K08611k65316o8126
190a40453K46866o1320j43966J35398L100j44575J16110J04710j79607m3051J94049
$$ y = [134467, 251907, -213022, -41992, 214309, -157962, -102221, 309194, -63394, -356508, 198336, 246486, -301829, -81966, 294531, -88522, -194612, 182664, 21792, -205328, 114169, 120081, -194530, 18430, 219653, -115533, -166119, 162080, 92121, -136856, -20364, 87187, 8055, 3491, 7909, -57320, -17423, 76518, 31692, -84551, -62240, 93269, 91174, -113097, -106603, 107219, 52220, -108276, 10584, 57823, -79863, 26120, 109132, -127885, -87981, 195264, 9966, -199692, 99426, 155188, -157203, -39496, 167569, -70154, -96924, 151027, -7226, -150323, 128071, 99358, -198345, -15622, 192989, -72327, -140453, 106413, 45093, -98873, 36525, 39625, -104950, 11160, 115870, -63737, -106788, 87261]
201H7261m408j66685L4622J21904n3613o8606P3812J2278q6111N6751P9265j34085
213d7615m0378J89906m1212j98413J40959J37235k18281j9545K22569j22944j40805
224a38524K25499j1529k38421J81186J49942k96266R972L05178j73143j97308
234a83414K73560K1797k58769J55568J40218k61072L3581K58128j88703j56594
244a65700K66111Q477k43722J19238J37599j85037m767J69946j06967r9485J60638
255E6331J0255j57904N9269J16062r5677o1940J03880J7053r4602K2463P9166
266E4356n6766n3758R3512J4380j17570M7737J15694j16441p1411J65684j3234
277F2183j66831J09515J03258j80070R303J83077j35066j12378K16194j4961k18149
$$ y = [87261, 82853, -83832, -49210, 72694, 19081, -49525, 24287, 36565, -49546, 7205, 86470, -47615, -87993, 101913, 60701, -137712, 3247, 140482, -77799, -97344, 125225, 2281, -138524, 86975, 75446, -162975, 18211, 168153, -128113, -118141, 187037, 13894, -183414, 90146, 111943, -146826, 8742, 148960, -112112, -78531, 179597, -9106, -165700, 100411, 108888, -134834, -15596, 122003, -63034, -67801, 102145, -4822, -104307, 56331, 66586, -91318, -32049, 84013, -11664, -73604, 30276, 47329, -47273, -24810, 54356, -2410, -56168, 37344, 51724, -65846, -18109, 97585, -18856, -90267, 75417, 62183, -104648, 4867, 108125, -71945, -62642, 120435, -14631, -127009, 89185, 74224, -143925]
288a43925J44641J33376k22688M404K14293j38334j20722K14950j4827k02185
298a31017J39836J15188k00602Q207J83711j11425j02480J60022j32j43504Q1600
309e96Q2091j19921j1186J10744m4316p7212O8950L6880p3228p529O6633j6744
321A4566n9825M0637M8905o7837k4585R3942j8489r8261P6499O9649j22619k352
333d9770J35032p9523r2723J45162N952j59861R6201J08907j70157r167J79513
344A09566j01704j19310J72234R379j77012J01388J08874j69813k308J68751j00122
355g7j04063J56425R026j48834P6500R1488j18625j1067J12098n2989o8434Q5827
367B7275J6890q3088K3915O1491m3351l7881M7366J9672m8827o410N0541j4125
$$ y = [-143925, 716, 134092, -88596, -84192, 130101, -8233, -128955, 85995, 71168, -131017, 8819, 124007, -76595, -68388, 115323, 3898, -98582, 61440, 61308, -82196, -596, 81495, -38426, -49612, 61132, 16816, -60396, 8554, 45434, -27794, -35323, 31310, 14566, -45259, -4622, 44283, -23554, -48139, 45803, 27314, -70947, 5552, 75201, -47418, -49770, 85262, 5739, -86984, 58178, 64130, -95731, 470, 109377, -60780, -69947, 109566, 7862, -111448, 60786, 70165, -106847, -5459, 103415, -66398, -68706, 100045, -77, -104140, 52285, 61311, -87523, -11023, 80465, -38160, -49227, 62871, 9882, -58552, 27275, 44165, -38923, -15008, 46483, 3132, -34749, 12617, 32289, -16538, -22948, 27593, 13468]
379A3468n2301M2364L6645p3949r72Q9252n3000p3749J04601K1749j26954N2440
391b0406J03070j16174l1943J41820n8764j07829J34796K7302j58933P1540J20920
402A05399j44142l5133J60720o1564j16120J28227K8075j40869O1789R6274j21695
413c9039k2169J29369n2474r3224R5723L3915r9531K0874P2448n2727l1122O0565
425B2608l702n1271K8613M0005m2556k8314N6260J6232o7418M999P1491l5516
437A1431n7719O7328J7544q4536L9281O8708r6889j9984J25774n2478j09955J15934
449B4439M7717j43341L7474J16346j11143m0482J41182n3589j11493J30982L6687
460G4779j57242N4822J26463j20504n1283J37036l1669j00544R1851K9166j08889
$$ y = [13468, -38833, 3531, 40176, -33773, -34745, 54507, 1507, -72242, 32359, 54108, -72846, -20406, 82664, -33510, -65453, 76367, 17603, -90226, 44570, 71872, -87061, -15521, 105399, -38743, -73876, 86844, 25280, -90840, 37387, 65462, -75407, -13618, 82656, -39039, -61208, 68161, 15687, -77537, 18186, 52101, -47430, -26556, 45892, -6835, -37957, 22608, 18906, -32365, -3752, 36253, -6303, -34617, 21643, 37875, -29543, -24544, 46947, 11431, -46288, 21040, 38584, -45952, -6671, 62037, -34852, -54836, 70938, 18460, -91495, 24439, 72156, -71185, -33711, 82635, -28508, -68990, 72192, 18603, -92890, 38092, 74779, -82463, -27641, 98822, -21682, -72965, 64071, 32402, -68142, 23709, 52875, -56014]
471e6014M4623Q2792r5416l5215J07645j3416r0013M2726N3178n1810j6076M4923
483A7927j5358l1869L8576J9370n6932l640P2613j7324p6607M7336O4439p4974
495a6443k7089Q8234k5251p0800P6718K0811j03998M9340Q8977j14148l5545J43948
507G4754m0360j25434J03390N9432j27448K6076R7093j00169k4945J32466o0443
518A4412j13044J25006N5017j42019J6102J10881o7906m4107Q5510k6210o5897
529e2255P8711K5650r8504J6624Q8527m5585o1511N4862K9997n1669m421L9678
541B0104j7401k6525L4597P471n0005J8325N7769n2956n0029Q5757K4283j02500
553e1110J7806R0677n7975m3815Q0356k3751o6846R1064J9995j28690M5451J22020
$$ y = [-56014, -11391, 71401, -24015, -59230, 48415, 34999, -55014, -12288, 40890, -10920, -26996, 17927, 2569, -29300, 9276, 28646, -28286, -31926, 40687, 23363, -53244, -5908, 58531, -16443, -43532, 44702, 19451, -51349, 25369, 46180, -57818, -8478, 80499, -33649, -69194, 74754, 34394, -91040, 12350, 71782, -55666, -29590, 67503, -32666, -57611, 74855, 14412, -98632, 26374, 81391, -60628, -44526, 66355, -1551, -45658, 39852, 13642, -52255, 26456, 52106, -46398, -29774, 58753, 13168, -48343, 6519, 36516, -15153, -19574, 20104, 2703, -23822, 10775, 18246, -31759, -13434, 44335, -8621, -58650, 27107, 51390, -51110, -33304, 57373, -602, -44417, 35939, 12188, -54658, 36406, 56401, -72289, -26838, 95182]
565I5182j01669p1297J21865k910r6803O8331L2008j01784M4721Q8433j05731
576b9654m1141J26557j9067j05403O4800N4710p9966K660O3254m4182k4459O2022
588C0131j5463n6180M5945M0361n8689k3083N9848J1990n4048k625M2910p367
600A3730k7015J9423O32l2168L3821L3197p1970j8484R6193j3039r4991M8333
612a2338O1298p1457l956O6524n6021k9098R5772k6745r6660Q2798O0484j11580
624d0979l43J02186n4488n6680Q3249o439p3618O1390L2404r0304K0320Q4687
636F1385o4918n4735Q0981J4925o9422J5298L7435l0235j377L0629k8180k3252
648c1466M6075J6263n2647r874N4573N144n0787N257M2264j9750k1627L4050r770
$$ y = [95182, -6487, -77784, 44081, 41171, -55632, 12699, 44707, -57077, -12356, 76077, -29654, -70795, 55762, 36695, -68708, -3908, 50802, -29164, -26504, 36750, -7432, -31891, 30131, 14668, -41512, 4433, 44794, -13895, -36978, 22870, 34860, -19188, -21813, 21097, 13730, -13285, 6138, 6770, -25398, 8423, 41620, -30350, -48834, 47359, 34320, -60671, -12338, 48960, -22497, -26453, 40071, -15950, -45048, 50724, 23979, -72681, 10117, 70601, -40979, -41322, 60864, 6376, -50304, 32945, 26506, -47112, 14278, 46682, -43622, -23302, 61385, -3533, -58268, 22713, 37638, -31784, -16486, 20949, -9286, -10663, 19966, -8214, -31466, 14609, 30872, -21775, -31649, 22924, 28068, -22719, -17462, 24802, 5052, -16575, 17475, 7705]
661G705l6423M5311K0823p3100J1345P8403n1673n6723P9395J1051q1831L8881
673f836N0503p3603K750P6336o0110m5460R7986n890r9964N6260O7676q1924j3913
686c6189P5521l6257l8328O7381j0634o8823N3426M6785p4329j4226O9031j4822
698A8536m6632K9981J6337l2743Q936K5211k7232j6165L7000N585m2855N749M4398
711B6106k0103l8946L6186K4629m7021K445M5876l2270k5106N6649j0270o1146
723d2971N1414M1492q0199k081Q3089m2349n5301P1211M385p2351M7956M1090
735D5385q2828O649Q5209n4576n6380Q0688Q780p6238L6866M4661o2299L75O1849
748C8141l9436l7358O0979M671n8259K4129M0467l8695j5590L8762n255k8936
$$ y = [7705, -28718, 16593, 37416, -35684, -24339, 54064, 2391, -54332, 25063, 36114, -45717, -6836, 43667, -29936, -27186, 49150, -10960, -56420, 41566, 35676, -64288, -8028, 59648, -22276, -36189, 39332, 3075, -35253, 32128, 21494, -47329, 6097, 52882, -21447, -35673, 33358, 18536, -28096, 1885, 18222, -14521, -5585, 19626, -7606, -23771, 13229, 18814, -24041, -18292, 26106, 6003, -32943, 3243, 27872, -19149, -16704, 29172, -3098, -28204, 28445, 18175, -42971, 8443, 49935, -30264, -32345, 50744, 8395, -46906, 24305, 28690, -43661, 4295, 45385, -37443, -30794, 54415, -161, -56541, 24147, 32927, -43311, -6445, 38216, -24083, -23708, 38141, -1295, -38653, 22326, 26997, -31262, -7133, 33334, -5361, -20951, 17811, 12556, -16380]
760a6380J8347J5640k5806l780K8140q291k9695J9765K6203l3375j6274M2729
772A7223l528m2298K7137K7351m6432K071N1113l5007l4888O1849K129o6246L6480
785c046M6798o3179p372O7137l5562m3455O3562K852o6714L8038M3264o4403n022
798b7102O3419l2420m1300N3269O007n2902K5592L3365m3170o286M3383j6839
810E016l0322L0120J3555l1067K157K6366j1235j8523J7766J2032k2931k968K6486
823A6452q582k6334K2699J8052l6516m84M0633k3990l1514M4253O298n2299K4738
836f594L9622n0934r895N9496k6731m4605N5852J1467o2992K8065M6665n5999
848a6583j0889O2484k6622m4160N2852J1114n7118K3571L9840m6405j0319M9085
$$ y = [-16380, 1967, 17607, -8199, -11979, 16161, 7870, -21825, -2060, 24143, -9232, -25506, 17223, 13695, -28603, -1466, 25885, -20547, -18476, 32637, -2370, -37258, 24591, 26720, -39526, -3046, 43752, -19427, -26799, 40338, 4776, -38679, 24883, 27735, -38979, -941, 42323, -22080, -27102, 36317, 3897, -37403, 15866, 21873, -31029, -5437, 27928, -15242, -21528, 21855, 5016, -25306, 4814, 18369, -12698, -10541, 15825, 4590, -13933, 3833, 15865, -7066, -10034, 16452, 7870, -18464, 4235, 22287, -14229, -14713, 25920, 1930, -29584, 14669, 20967, -31332, -6594, 33028, -17906, -27801, 31695, 4964, -39641, 16211, 27678, -35314, -7249, 39416, -16583, -27472, 35012, 8390, -35770, 17082, 28196, -28922, -5351, 34489, -11916, -22235, 26850]
860B6850j9059l5967L6622J2458m0142Q617L0287k2859j5876K7190J347k4992
872a5524R316K0610j6991j3598K3339O057k7529O243K8207j9869j9893L3386L207
885A6961l8079J9794K9461l9873p665M7783k1943l8364M5930J1148n4855K0813
897h889M2408m7737j3287N5790k2377m2084M8520J2380n5755K1888M2450m6195
909a2888j2819N1953j7467l7108L8234J2468m2247J3664L1883l0630j2360L4176
921A6859n366k8647J7481J6460k2813n441K1677m176j9395J1196J4360j8222q339
934a4366K4514k951k6441J7042K1328l0357o223L7412j3919l1088L4498J2527
946B1976m3693J4998L6835l8725j4621N0627j5986m2649M1947J7131n2469J4056
$$ y = [26850, 7791, -28176, 8446, 20904, -19238, -10621, 19666, -3193, -19069, 8121, 9468, -15524, -6208, 14402, -2589, -16187, 7152, 13209, -14320, -8077, 20130, 261, -19632, 13754, 16961, -21118, -1324, 28137, -11736, -19401, 28382, 6439, -31925, 14005, 25153, -29702, -8889, 33519, -14218, -27505, 28285, 5908, -36176, 12344, 24724, -31031, -9143, 33307, -12888, -25707, 26246, 8779, -28329, 9905, 22373, -19874, -6210, 25673, -4957, -17317, 16859, 11493, -17154, 327, 16787, -6026, -11467, 10210, 6034, -13361, -2165, 12195, -6027, -14366, 10148, 7197, -19244, -2202, 19126, -11231, -17454, 19958, 6039, -25049, 9449, 21976, -21717, -6719, 30116, -8609, -23230, 27397, 11411, -31238, 10709, 27840, -24629, -10573]
958a0573M2357m0641j6761M9385j5113m0036L9221J5533m7779J2141L8140l2207
970f333j7179L9406n934l1189K3237J6005k9194J402K6892j4387j7036K1003P203
983A3896k2411J244K1244r336j7443J5875J0330k2315j51K4200j4756j9460K7758
996H675N340l5032J3694L0428l1949j3694M1275j0153l5173L3179J5146m3633
1008b1897J3218L8254l7103j6366M8549j1732m1253L5552J8840m4987R205L5902
1020B6182l1638j5267M0308j0532l3990K8661J6737l5840K692K9942j8033j6618
1032a7396K3773J816k1423J0080J4863j6369o508J9479m87j8860P829J7460j3856
1045D01j2305K0023L666k2964Q980J8938k1845p486K8840j0638k7361K7873J4192
$$ y = [-10573, 31784, -8857, -25618, 23767, 8654, -31382, 7839, 23372, -24407, -12266, 25874, -6333, -23512, 15894, 9960, -21229, 2008, 18013, -11181, -9779, 17113, 2726, -14310, 6693, 13896, -8515, -7271, 13973, 4637, -12806, 3069, 13399, -8916, -9067, 15133, 377, -19083, 8675, 14015, -21017, -7323, 23105, -8844, -22538, 18737, 8584, -26589, 6590, 21736, -21897, -8679, 29575, -7528, -23894, 24655, 12923, -28330, 7222, 26062, -18925, -9720, 26182, -5456, -20723, 19585, 9053, -24937, 3724, 20461, -15379, -12687, 17255, -778, -17396, 6377, 8193, -13230, -3150, 11713, -4656, -11164, 8315, 7828, -11032, -3203, 14257, 401, -11904, 8119, 11785, -11179, -2199, 16739, -5106, -12592, 16248, 5610, -21751, 6122, 20314]
1058B0314l8528N952L5130k6857j8429L7772o529l4298L0044J6906m1770Q057
1070a2236L8388k9470k0119L9729k817l4482K3723J7514l3066M454K9479k1768
1082f71j6302K9134k97k7211J3203J7686k0594o452J9868l960j5047R952Q721
1095H030j4610k374J7688n372j7534J3358J4996k0470o707K4925n161k1659J8720
1108C830J1075k7412P114K6822k5128j5486L6540l971l5560K3809K0513l6083
1120a3937J671L4070k4519j9325L6916l595l5898K5256K0124l6464J162L4748
1132B0209k0382j9919L0099Q50k7589J7068J5884k5096l84K5308j2280j7998J9362
1145E132P724j9490R80J5061p427r813J1615L048j5324L698J5668j1147j4165
$$ y = [20314, -18214, -12262, 22868, -3989, -22418, 15354, 8825, -25473, 4571, 21477, -20293, -12236, 26152, -3318, -23437, 16292, 13475, -21007, 2716, 20230, -12836, -8382, 21097, -671, -16973, 12161, 11864, -15347, -2144, 15542, -5052, -11504, 8364, 4404, -10643, -691, 8030, -6580, -8954, 8734, 3362, -14172, -814, 14182, -6288, -12995, 11930, 6769, -14890, 3830, 14905, -12507, -5393, 21429, -3699, -19185, 17355, 13384, -22176, 1633, 22146, -13937, -12266, 21804, -2715, -22040, 14876, 11281, -24617, 639, 20763, -15701, -14539, 20209, -173, -20092, 10007, 10857, -16732, 336, 16220, -8876, -9260, 16048, 3768, -14230, 5132, 12856, -6634, -5654, 9407, 1980, -7833, 3782, 6830, -8494, -4796, 10872, -275, -14440]
1158a4440J8538O600k2546M195K1027j6220j1916K5324k924k5471J9749J5919
1170A7835l0356J908L1522k0259k0264L2961Q17l2588J8810K0131l1188j56L0673
1183A9846k0155j9349L1779M25l2240J6451K0622k5937m157K5352j1899j5765
1195a5027K1085K688k1779Q982J7104j5634q554J7815P58j5039O034J0922j0609
1208a254n454J3821m20j5399Q256J2728j5895o837K0674l556k1153J5027J2813
1221A3351k3659L09K4167j5478j5727K6790m53k8140J7922J9540k9413k248L0649
1234A7610j5139k0227K7584K394k7814J5925J8449k7566k165K8213j3378j9518
1246a5632K2472M885k3592Q899J5650j7752n241J9111n651j5153J2395Q178j4937
$$ y = [-14440, 4098, 10698, -11848, -7653, 13374, -2846, -14762, 10562, 7638, -17833, 1916, 17835, -12521, -10613, 20909, 650, -19614, 13347, 14164, -18424, 386, 20517, -10671, -10827, 19846, -309, -19658, 12121, 12546, -19694, -3243, 17379, -8558, -12715, 12637, 738, -15027, 6058, 8746, -13033, -4051, 13053, -2581, -11135, 6680, 7438, -7601, -1567, 9355, -1254, -6708, 7113, 6693, -8706, -450, 12278, -3617, -10454, 10220, 6664, -14489, 538, 13351, -10308, -9999, 14168, -1310, -17037, 9753, 9300, -18840, -918, 18622, -10791, -13039, 17610, 2471, -17756, 9828, 12222, -15592, 333, 18782, -8784, -10949, 17264, 3886, -15632, 6840, 11725, -11867, -2968, 12682, -5070, -10311, 8800, 3149, -12004, 391, 8569, -6368]
1259f368j330J4268m118j1627R223P854j2252j645J4301n002j2928J3429P252
1272A1057j8666K370J9647j3687j3561K1404J414k3218J2513J5671k3491k361
1284a0908K6058j4617j8633K5773L582k8112J3044J9855k4433m255K6728j2104
1296A978j8187K3223M717k5134J0831J8256j9877n863K1432n922j6360J4311O818
1309A0223j6987K465J4024r316q934J2238K568j3231K759J1323p755q245J1483
1322B615L288j4068L610J3193j0729q278J7400n37j8150J1612J3410j9806k325
1335h765K2483j0639j6561K1271L933k4808J1011J8237k2624m697K5271j0562
1347C550j9588K1690N510k4962R060J8951k0267o009K2534p396j7121J7093O740
$$ y = [-6368, -7698, 6570, 2452, -9175, 48, 7902, -4350, -5995, 8306, 3304, -9624, 3805, 11057, -7609, -5239, 14408, 721, -12840, 8564, 9978, -13240, -727, 14944, -8547, -10908, 15150, 533, -18100, 7673, 11255, -16857, -3813, 16042, -8391, -12646, 14082, 1978, -16209, 7014, 11731, -13403, -2572, 15684, -4193, -10056, 11376, 5454, -10906, 3405, 10223, -6764, -4299, 9725, 409, -8525, 3713, 6281, -6950, -4191, 7132, -623, -8868, 2615, 5903, -8165, -4555, 8638, -2091, -10369, 7031, 6494, -11656, -44, 13366, -6440, -8765, 13718, 3079, -13482, 7789, 11722, -13086, -2075, 16162, -6462, -11159, 14112, 3550, -16038, 5652, 11162, -13800, -4740, 14211, -6056, -12065, 10469, 3073, -14048, 3045, 9785]
1360I785j9385M890J5601j2282p519J5777q98j3598P492R296j1037l579J1645
1373F188j606j0851O233Q151j0977l706J3161l152j3404J0167Q595j5777p05J7390
1387I707r332j2771J7136L421k0393R748J5844j9190m554K2920q752j7437J9944
1400F291N816k2918Q083J7521j8696n870K1609p434j7522J7317O546k0687N167
1413d777J6126j4363p052J6627k932j3781J0405P027j3177K30J2501n499q957
1426g622R568M372j0703J083R930m669q220R153M143j1863J629J2229q714q904
1440h588J4310J385j6409P220J2881j5511m424J8406p154j4772J6313M909j9847
1453a1281P293J6080j6892o680K1462n712j6952J6072O941j9093N318J5558j4361
$$ y = [9785, -9600, -4710, 10891, -1391, -8910, 6867, 5969, -7629, -137, 9159, -1878, -5457, 6188, 4582, -6269, -36, 8115, -2862, -6568, 6593, 3441, -9963, 204, 8799, -6978, -7683, 9707, 375, -12396, 4740, 8161, -12232, -2484, 13360, -5830, -10384, 12536, 3784, -13653, 6291, 12107, -10811, -2728, 14793, -3903, -9773, 11836, 4402, -13120, 4197, 10743, -9944, -4777, 11349, -3014, -10066, 6561, 3629, -10152, 253, 7280, -5897, -5667, 6834, 1335, -7622, 1946, 6318, -4385, -3302, 6628, 1959, -6261, 2892, 7035, -4828, -3199, 9030, 316, -8588, 5722, 7107, -9302, -2082, 10799, -4712, -9136, 9270, 2116, -12656, 3657, 8566, -11281, -3988, 12092, -4800, -11480, 9982, 4270, -12682, 3390, 10331, -8762, -3444, 12114, -2247]
1466b247o040J7481m025j4619J1702P193j5069J012J2642p879p372J0366J248
1479D393j0620M038P339p326m159R152L08r491L879Q471p435n411J1188L60j1091
1494f405N848Q847j1500k271J4484n983j2387J3791N032j7717M961J4683j3563
1507b180p187J7502m451j5054J3816O486j8815M620J6518j4304p923J7825k265
1520D588j5249J1352P951j4983K159J3051r510o554J3175n34j2187O632Q414r746
1534a441l181R682j766p988M925M579p820o05Q180l519q045P431N762j1047j619
1549f472J2429m263r767R878L982j2397M470J0921j2007m186J6253m452j4814
1562a0425J3018P745j6493J257J5275j1082p127J5361l311j4285J2399O998j7504
$$ y = [-2247, -8287, 9194, 5169, -9450, 2252, 9445, -5624, -4612, 8030, 151, -7221, 3145, 4393, -6227, -2189, 5150, -2176, -6335, 2817, 3125, -6366, -2487, 5984, -1451, -6862, 4326, 4686, -6405, -557, 8290, -3210, -5481, 9003, 3020, -9367, 4424, 9456, -8261, -3300, 11383, -2180, -9367, 8135, 3684, -11370, 2446, 8932, -9883, -5263, 11255, -3049, -10972, 6853, 4588, -10661, 691, 8642, -6341, -4182, 8869, -641, -7195, 5980, 5446, -6741, -109, 8305, -1441, -4622, 5060, 3294, -4694, 231, 4810, -3010, -3615, 4565, 1046, -6999, 432, 6194, -4853, -6472, 5957, 1694, -8073, 1805, 5787, -6610, -2140, 8781, -3226, -7412, 8841, 4389, -10425, 2593, 10338, -6155, -4898, 10377, -705, -7832, 7529, 4218, -10067, 2332, 9330, -8174]
1575h174K390J5469r946r822J3736Q03j1760O288O803j0603K87J1070o086q013
1589g558J0003M003j0235R8R528l626o308N823K787p386K058O422o397m941J0476
1604D747N77j2945N002J0498r905n830J2545k257j0616R380M593j3472M386J3032
1618I735j2614p207J7596j523j5770R622R179j3288Q58J2007r494n978J4381k975
1632D529j3585R914Q549j3413k121J2327m425p673P626N87p803M726N545q102
1646c319k611R721n52r099L193P839m946m580O124J336n584K931M337p572k08
1661b990J0234m864j0143J0057N955j2914P3J1608o553o979J0620j825j0362R675
1675A592N805j4909J596J4946q696j0338J3197K258j2055N848P127j0548Q38J1271
$$ y = [-8174, -5784, 9685, -261, -10083, 3653, 4456, -7304, -1016, 5787, -4816, -4529, 6541, 455, -7558, 2445, 6448, -3787, -3689, 5839, 2213, -4095, 1728, 4515, -2871, -813, 5609, -788, -5729, 4747, 5324, -7621, -2619, 7879, -2026, -7856, 4689, 2432, -8184, 1196, 5789, -7683, -3297, 9735, -2879, -10086, 7510, 5987, -9783, -161, 9018, -4270, -3412, 8595, -899, -6877, 7504, 4529, -9056, 858, 9407, -4006, -6127, 6200, 1775, -5898, 1728, 2315, -5488, -762, 4783, -3319, -5930, 3791, 3239, -5860, -2667, 5172, 226, -4354, 1770, 3106, -2478, 453, 4790, -2782, -2990, 7244, 2380, -7763, 2294, 8249, -4665, -4592, 7016, 463, -6516, 4104, 2279, -8083, 1592, 7397, -7512, -5916, 9030, 334, -10004, 3193, 5451, -6604, -756, 6371, -4177, -3339, 7932]
1689G932q116p260J2407K124j2902L140R450o314m365O998j158n665M940K224
1703C435p475O68Q233l800p596O037N676p730k413P777j444n812N536K193q080
1718d795L443Q534q916m908J2952p41j2485O386Q561j0687j459J0927o869o447
1732f504J2365j452j3243Q251R521j3655k435J3250m612q893R276J833r828N372
1746g54O714j0007j107J1437l884q995P363N252q199l81O639l395l320N234J80
1761B777o030L098N226n560m382P723R74q186J777O860n024m090P546j298p188
$$ y = [7932, -184, -7444, 4963, 7087, -5815, -2675, 6775, 461, -3904, 3094, 1936, -3729, 1211, 3435, -4040, -3372, 4861, 1061, -6535, -498, 5178, -2552, -4965, 2812, 1368, -4444, 1092, 3285, -4795, -1352, 7182, -1734, -6642, 6310, 5569, -6916, -530, 8031, -2656, -4115, 6812, -57, -6504, 5861, 4409, -8834, -583, 8938, -4717, -7152, 6098, 1486, -7407, 1869, 3702, -6126, -754, 5960, -4047, -5154, 6283, 2399, -6596, 767, 6019, -2180, -2561, 4078, 683, -2637, 2597, 2777, -3253, -155, 5071, -489, -4871, 2852, 3826, -4360, -2583, 4277, -747, -4837, 2709, 1411, -5777]
$$ [...]
8191g
##END NTUPLES=NMR FID
##END=
