##TITLE=1H_Pr 5037
 CDCl3
 8 sc, 
 13.3.2024
##JCAMPDX= 6.0         $$ Bruker NMR JCAMP-DX V2.0
##DATA TYPE= NMR FID
##DATA CLASS= NTUPLES
##ORIGIN= UXNMR, Bruker Analytische Messtechnik GmbH
##OWNER= root
$$ XWIN-NMR		Version 3.5
$$ Wed Mar 13 14:32:35 2024 Russian Standard Time (UT+4h)  she@DPX200
##.OBSERVE FREQUENCY= 200.1313
##.OBSERVE NUCLEUS= ^1H
##.DELAY= (6, 6)
##.ACQUISITION MODE= SIMULTANEOUS
##.ACQUISITION SCHEME= undefined
##.AVERAGES= 8
##.DIGITISER RES= 18
##SPECTROMETER/DATA SYSTEM= spect
##.PULSE SEQUENCE= zg30
##.SOLVENT NAME= CDCl3
##.SHIFT REFERENCE= (INTERNAL, CDCl3, 0, 15.7039)
##AUDIT TRAIL= $$ (NUMBER, WHEN, WHO, WHERE, WHAT)
$$ ##TITLE= Audit trail, XWIN-NMR		Version 3.5
$$ ##JCAMPDX= 5.01
$$ ##ORIGIN= Bruker BioSpin GmbH
$$ ##OWNER= she
$$ F:/spectra/data/she/nmr/H-F/1/audita.txt
$$ ##AUDIT TRAIL=  $$ (NUMBER, WHEN, WHO, WHERE, WHAT)
(   1,<2024-03-13 14:31:29.21 +0400>,<she>,<DPX200>,
      <created by zg, POWCHK disabled, PULCHK disabled
       configuration hash MD5:
       00 E9 B6 7A A2 85 ED C7 34 08 36 98 17 FE 4E 26
       data hash MD5: 16K
       38 5D 70 2A 90 A8 DB 68 C5 03 F1 AA A8 1E 24 E6>)
$$ ##END=
$$ 
$$ hash MD5
$$ 36 EA 3D 5E F6 21 ED 70 AB 3C 83 A7 2F D8 5D DF
##$RELAX= 
##$RELAX= 
##$RELAX= 
##$RELAX= 
##$RELAX= 
##$RELAX= 
$$ Bruker specific parameters
$$ --------------------------
##$DU= <F:/spectra>
##$EXPNO= 1
##$NAME= <H-F>
##$PROCNO= 1
##$TYPE= <nmr>
##$USER= <she>
##$AMP= (0..31)
100 100 100 100 100 100 100 100 100 100 100 100 100 100 100 100 100 100 
100 100 100 100 100 100 100 100 100 100 100 100 100 100 
##$AQSEQ= 0
##$AQ_mod= 1
##$AUNM= <au_zg>
##$AUTOPOS= <>
##$BF1= 200.13
##$BF2= 200.13
##$BF3= 200.13
##$BF4= 200.13
##$BF5= 200.13
##$BF6= 200.13
##$BF7= 200.13
##$BF8= 200.13
##$BYTORDA= 1
##$CFDGTYP= 0
##$CFRGTYP= 5
##$CHEMSTR= <none>
##$CNST= (0..31)
1 1 145 1 1 1 1 1 1 1 1 1 1 1 1 1 1 1 1 1 1 1 1 1 1 1 1 1 1 1 1 1 
##$CPDPRG= <>
##$CPDPRG1= <>
##$CPDPRG2= <>
##$CPDPRG3= <>
##$CPDPRG4= <mlev>
##$CPDPRG5= <mlev>
##$CPDPRG6= <mlev>
##$CPDPRG7= <mlev>
##$CPDPRG8= <mlev>
##$CPDPRGB= <>
##$CPDPRGT= <>
##$D= (0..31)
0 1.2 0 0 0 0 0 0 0 0.06 0 0.03 0 0 0 0 0.0002 0 0 0 0 0 0 0 0 0 0 0 0 
0 0 0 
##$DATE= 1710325888
##$DBL= (0..7)
120 120 120 120 120 120 120 120 
##$DBP= (0..7)
150 150 150 150 150 150 150 150 
##$DBP07= 0
##$DBPNAM0= <>
##$DBPNAM1= <>
##$DBPNAM2= <>
##$DBPNAM3= <>
##$DBPNAM4= <>
##$DBPNAM5= <>
##$DBPNAM6= <>
##$DBPNAM7= <>
##$DBPOAL= (0..7)
0.5 0.5 0.5 0.5 0.5 0.5 0.5 0.5 
##$DBPOFFS= (0..7)
0 0 0 0 0 0 0 0 
##$DE= 6
##$DECBNUC= <off>
##$DECIM= 32
##$DECNUC= <off>
##$DECSTAT= 4
##$DIGMOD= 1
##$DIGTYP= 9
##$DL= (0..7)
0 120 120 120 120 120 120 120 
##$DP= (0..7)
150 150 150 150 150 150 150 150 
##$DP07= 0
##$DPNAME0= <>
##$DPNAME1= <>
##$DPNAME2= <>
##$DPNAME3= <>
##$DPNAME4= <>
##$DPNAME5= <>
##$DPNAME6= <>
##$DPNAME7= <>
##$DPOAL= (0..7)
0.5 0.5 0.5 0.5 0.5 0.5 0.5 0.5 
##$DPOFFS= (0..7)
0 0 0 0 0 0 0 0 
##$DQDMODE= 0
##$DR= 18
##$DS= 0
##$DSLIST= <SSSSSSSSSSSSSSS>
$$ [...]
##$SUBNAM2= <"">
##$SUBNAM3= <"">
##$SUBNAM4= <"">
##$SUBNAM5= <"">
##$SUBNAM6= <"">
##$SUBNAM7= <"">
##$SUBNAM8= <"">
##$SUBNAM9= <"">
##$SW= 18.0517328524113
##$SWIBOX= (0..15)
0 0 2 0 0 0 0 0 0 0 0 0 0 0 0 0 
##$SW_h= 3612.71676300578
##$TD= 16384
##$TD0= 1
##$TE= 0
##$TE2= 300
##$TE3= 300
##$TEG= 300
##$TL= (0..7)
0 120 120 120 120 120 120 120 
##$TP= (0..7)
150 150 150 150 150 150 150 150 
##$TP07= 0
##$TPNAME0= <>
##$TPNAME1= <>
##$TPNAME2= <>
##$TPNAME3= <>
##$TPNAME4= <>
##$TPNAME5= <>
##$TPNAME6= <>
##$TPNAME7= <>
##$TPOAL= (0..7)
0.5 0.5 0.5 0.5 0.5 0.5 0.5 0.5 
##$TPOFFS= (0..7)
0 0 0 0 0 0 0 0 
##$TUNHIN= 0
##$TUNHOUT= 0
##$TUNXOUT= 0
##$USERA1= <user>
##$USERA2= <user>
##$USERA3= <user>
##$USERA4= <user>
##$USERA5= <user>
##$V9= 5
##$VALIST= <valist>
##$VCLIST= <CCCCCCCCCCCCCCC>
##$VD= 0
##$VDLIST= <DDDDDDDDDDDDDDD>
##$VPLIST= <PPPPPPPPPPPPPPP>
##$VTLIST= <TTTTTTTTTTTTTTT>
##$WBST= 1024
##$WBSW= 4
##$XGAIN= (0..3)
0 0 0 0 
##$XL= 0
##$YL= 0
##$YMAX_a= 126999
##$YMIN_a= -138485
##$ZGOPTNS= <>
##$ZL1= 120
##$ZL2= 120
##$ZL3= 120
##$ZL4= 120
##$ABSF1= 10
##$ABSF2= 0
##$ABSG= 5
##$ABSL= 3
##$ALPHA= 0
##$AQORDER= 0
##$ASSFAC= 0
##$ASSFACI= 0
##$ASSFACX= 0
##$ASSWID= 0
##$AUNMP= <proc_1d>
##$AZFE= 0.1
##$AZFW= 0.1
##$BCFW= 1
##$BC_mod= 2
##$BYTORDP= 1
##$COROFFS= 0
##$CY= 11.3945322036743
##$DATMOD= 1
##$DC= 2
##$DFILT= <>
##$DTYPP= 0
##$F1P= 15.7292609196834
##$F2P= 12.9074282941183
##$FCOR= 0.5
##$FTSIZE= 0
##$FT_mod= 4
##$GAMMA= 1
##$GB= 0.15
##$INTBC= 1
##$INTSCL= 1
##$ISEN= 128
##$LB= 0.24
##$LEV0= 0
##$LPBIN= 0
##$MAXI= 10000
##$MC2= 0
##$MEAN= 0
##$ME_mod= 0
##$MI= 1.114404
##$NCOEF= 0
##$NC_proc= 0
##$NLEV= 6
##$NOISF1= 3.799351
##$NOISF2= 2.8
##$NSP= 1
##$NTH_PI= 0
##$NZP= 0
##$OFFSET= 15.70392
##$PC= 1
##$PHC0= -25301.27
##$PHC1= 9.987313
##$PH_mod= 1
##$PKNL= yes
##$PPARMOD= 0
##$PSCAL= 0
##$PSIGN= 0
##$REVERSE= no
##$SF= 200.130013532006
##$SI= 16384
##$SIGF1= 3
##$SIGF2= 2
##$SINO= 400
##$SIOLD= 16384
##$SREGLST= <1H.CDCl3>
##$SSB= 0
##$STSI= 0
##$STSR= 0
##$SW_p= 3612.71676300578
##$SYMM= 0
##$S_DEV= 0
##$TDeff= 0
##$TDoff= 0
##$TI= <>
##$TILT= no
##$TM1= 0
##$TM2= 0
##$TOPLEV= 0
##$USERP1= <user>
##$USERP2= <user>
##$USERP3= <user>
##$USERP4= <user>
##$USERP5= <user>
##$WDW= 1
##$XDIM= 8192
##$YMAX_p= 0
##$YMIN_p= 0
$$ End of Bruker specific parameters
$$ ---------------------------------
##NTUPLES= NMR FID
##VAR_NAME=  TIME,          FID/REAL,        FID/IMAG
##SYMBOL=    X,             R,               I
##VAR_TYPE=  INDEPENDENT,   DEPENDENT,       DEPENDENT
##VAR_FORM=  AFFN,          ASDF,            ASDF
##VAR_DIM=   8192,          8192,            8192
##UNITS=     SECONDS,       ARBITRARY UNITS, ARBITRARY UNITS
##FACTOR=    0.0002768,     1,               1
##FIRST=     0,             0,               0
##LAST=      2.2672688,     0,               0
##MIN=       0,             -138485,         0
##MAX=       2.2672688,     126999,          0
$$ Real data points
##PAGE= N=1
##DATA TABLE= (X++(R..R)), XYDATA
0@%%%%%%%%%%%%%%%%%%%%%%%%%%%%%lPqRj1J2j2J2j2J2j5J8j8J9k2K6l0L2l3L8
49B1m3M5m9N5o0O7p6Q7j02J18j38J66k04K58l37M59o67J058j921M524k3854j17892
71a38485Q9411J44825k9775j09278n061Q3022O904o2468o383K7305K167J2469
83A4653J4664k7612n1790O40P7266L4155o8042m0235M0681K7729j8924j7418J5584
96A351J8168j4336k615R035l0131j4719M9388L2935l8935n3814J1882N2580k286
109A8503l4836J0053J7946j1239q038M219J672m211J0847K6504j7188m9779J1861
122b3686N1964k533m2336q15M0251n992n5926R236O5554n491n9408n40N1569N112
136B6959n4500o106O1654J3322n0682j9860K7095J8119j0294p674R422o320j4907
$$ y = [0, 0, 0, 0, 0, 0, 0, 0, 0, 0, 0, 0, 0, 0, 0, 0, 0, 0, 0, 0, 0, 0, 0, 0, 0, 0, 0, 0, 0, 0, -3, 4, -4, 5, -6, 6, -6, 6, -6, 6, -9, 9, -9, 10, -12, 14, -16, 16, -17, 21, -22, 23, -26, 29, -31, 36, -40, 47, -55, 63, -75, 91, -113, 145, -192, 267, -400, 658, -1263, 3261, -20593, -138485, -49074, 95751, 65976, -43302, -48363, 34659, 41563, -20905, -27288, 17, 2184, 14653, 29317, 1705, -50085, -49445, 27821, 61976, -6066, -46301, -5620, 22109, 3185, -14233, 1351, 19519, 5183, 2568, 11603, -18528, -33247, 16141, 49076, 10141, -43673, -31791, 20789, 18503, -16333, -6280, 11666, 427, -7611, -3392, -1720, -5931, 4916, 31420, 14232, -35547, -23686, 28278, 25745, -16591, -17406, 22845, 16853, -39073, -29837, 35717, 30226, -29182, -29722, 21847, 26959, -27541, -33647, 28007, 41329, -9353, -29213, -2118, 16001, 5707, -1967, 7455, 1135, -13772]
149a3772J3611J0414k0209n861K5818J3243k9525k7465K7904L3537j9949k3340
161a5594J6024J3948j5388j4313J6912J7420j6127j2215J3000M21j4295J740J5576
174G109L628j5756o159J2305p88q857R904J0262r158j0488N715J0124r089o754
188h002J9193O452k6034j1092K3584J4520k2048j8033K4608J9665k7343k2630
200b7160K0050K5535o502k1971j7J4201J04l968L205k937k398P027L777j0848
214a902j3918J0850K4214q464k7319J208K0767M028j4928m450J4709K133j2274
227e346K009P371m069j480O925M608r771j2568J0125J3895p643r343J724L251
241c12J8l581J600L323m351K541Q200q459r803Q433J4161l01j7359m494J7558
$$ y = [-13772, -161, 10253, -9956, -15817, 10001, 23244, -6281, -33746, -5842, 27695, 7746, -15594, 430, 14378, -1010, -15323, 1589, 19009, 2882, -9333, 3667, 4088, -10207, -8467, 7109, 10737, -5019, -11178, 1127, 339, -8518, 1386, 11648, 2490, -7998, -2283, 7841, -1248, -8002, 11191, 17643, -8391, -19483, 4101, 18621, -3427, -21460, 3148, 22813, -4530, -27160, -7110, 18425, 11923, -10048, -10065, 4136, 4240, 272, 3477, 540, -1858, 5169, 8946, -1902, -15820, -4970, 19244, 10780, -16539, -15331, 5436, 9464, -5464, -9914, 4795, 6928, -5346, -3337, 4034, -35, -1515, 5410, 10018, 247, -12321, -2196, 11699, 4056, -5287, -3563, -312, -294, -3875, -2275, 1048, -3303, -762, 7438, -1021, -10824, -2391, 11770, 11469, -5890, -10384, 7174]
256G174K538j4647o06R259J707p002o070N924L309n678L961L949o158k348L217
271a471M458J087n762K466N309o745k428O271j79k950j531K604J839r331j798
286h161J3011P60j0498j257N583M988m471n738P900M650o457j012Q49l89K480
301B238j65R3j450o057M069N244o151k516M350K284j191o116J325R120k856m337
317b116L860K66k048k21J019L495k572m890M851J93n155J735J638N73p7m222J829
334a842K581l154K622K908l570k4P40J065J597m277J283N454m837m042K754J454
350G12P44k539j820L887j684l219L546N10p14J472j482O12P74j871L439J004l690
367c19Q54L50o62R21k354M62K492l415k62J646k053P88K217k66P0k626L81N110
$$ y = [7174, 9712, -4935, -5541, 3718, 5425, -1577, -7647, -1723, 1586, -4092, -131, 3818, -2340, -4688, -1471, 2987, 4074, -1688, 778, 6087, -658, -3086, 3185, 3006, 56, -1475, 1129, 2968, -6363, -8161, 4850, 5610, -4888, -6145, -562, 4426, -45, -5783, 2117, 6767, 310, -702, 147, -242, 2238, 2073, 2166, 716, -5341, -1272, 3972, -2179, -4695, -345, 1939, 748, -5368, -4043, 5077, 2221, -2116, 1744, 2010, -38, -259, 760, 4255, 1683, -3207, 1644, 1837, -3318, -1583, 55, 628, 551, -3671, -1842, 739, -2415, 207, 3115, -455, -479, 261, 1326, 2923, -1354, -71, 5383, 546, -3496, -742, 712, 1456, -1083, -2903, 984, -700, -3919, -373, 137, -577, 895, -587, 25, 799, -1072, 2367, 3371, -319, 535, 885, 223, 1144, -1210, -748, 1744, -1671, -1933, -287, -2340, -1552, 665, 399, 469, -2157, -1776, 3334]
385C334j286k498R55J25J924l92l705N58J876L70N61m042k632M133K334n90k896
402a871k640M547L999l867k502J558L213K145l553l080K003J037J468l84m320
417b247o46K592O23K23k939j486M035J605k032j582m99L931K291l042j253P92
433C66M11J472n26j425Lj524N18J762j706j464p2O27L028j084l682J303L150J276
451B433l94k846K32J934j19J694p29m335l8L187K143k257o884P40Q931J428p631
468b511n751M631J0389r03r969j114O727M522k025o380o61M416J966Ll643m949
484e252K501N650J337n153o982L227J0525n85q863l031O258P989l179r344J501
499c401O766J400k360m816j13L845m01n03m3l587M37L425Q53r95m725M94P980
$$ y = [3334, 2048, -450, 505, 630, 2554, 2162, -1543, -985, 891, 1261, 1822, -2220, -4852, -719, 1615, 1025, -1871, -4511, 36, 4035, 168, -2334, -776, 2437, 4582, 1029, -2051, -48, 989, 2457, 2073, -2247, -2893, -301, 322, 545, -2394, -3880, 155, 1760, -272, -1854, -2353, 1578, 3869, 827, -426, 366, 777, 2249, 1723, 298, 301, -1223, -705, 1057, -649, -2113, -2185, -1558, 1470, 386, -3296, -1993, 1157, 2433, 2039, -807, -575, 1359, 1240, 2934, 2205, -2130, -2168, 1019, 3162, 905, -5979, -5239, 3692, 5120, -2511, -8262, -3631, 6758, 5855, -4114, -5228, 1499, 6021, 3996, -2384, -3045, 1371, 3337, 3340, -303, -5252, -2751, 2899, 4236, -917, -7899, -4672, 5853, 5268, -3595, -6626, -368, 7621, 4442, -4902, -3401, 3365, 4765, 2405, -2411, -2524, 1321, 920, 417, 374, -3213, -2776, 649, 1502, 507, -4218, -3724, 4256]
516D256m23o213o12M017L648k570n592M087M305n512k523L162L732k144q075K236
532d221R605k319q810J50O777N279o144o718N669N016k084j524j494k79K012N97
548A512J517k053o842L163P945j954p352l807P124Q626o201r343L531P116L021
563F003m798o217L595N566j033k054k635q55L899J174j572k257l830L264O196
578D446k582n642j596M813O806m172q130L659O923J48n010m078N822M332o284
593e45k489L880R81k428k896K604L999m245l846M967K250k218j499k94L789Q3
609B093k725J843L45k468J685J866q57k953k781M290M374n767m111L002L888J141
625B865m821k247M341K552q77j120k935J754L675m90j812k548o47M254R30l562
$$ y = [4256, 3833, -2380, -2992, 1025, 4673, 2103, -3489, 598, 4903, -609, -3132, 30, 3762, 1618, -6457, -4221, 5384, 3065, -5745, -5595, 1182, 6461, 317, -6401, -732, 4284, 2200, 676, -818, -1097, 915, 1512, 3029, 976, -5866, -2703, 5242, 3288, -4064, -7871, -747, 7879, 1678, -7665, -4134, 2982, 6003, 1205, -5012, -1417, 4149, 3116, 1062, -1573, -2428, 1471, 2645, 1073, -1184, -5014, -1750, 4446, 1864, -3778, -5374, -561, 6245, 2073, -6057, -2398, 4525, 4673, -337, -4415, 1407, 5739, -545, -3034, 846, 1827, -601, -3497, -893, 3106, -1139, -4985, -18, 2232, 14, -1485, -1779, 2010, 2093, -632, 1211, 1556, -912, 773, 2639, 1782, -1171, -3952, 338, 4712, -1055, -5166, -2164, 1724, 2865, -1956, -4203, 138, 2690, 1813, 693, -2242, -488, 3187, 2697, 885, -1663, -2310, 1944, 2874, -688]
641f88k004n85L824K879m511l647K265M389K151m294m820M684N382j965m490j151
657b581M218K589l905k484J589N61N71n48j516J20R8R18J724k076j753K761J308
674A594l55j424k83K265k29j646P16K7q49K2o3N91r95j702K054R14j747l32Q73
693e69Q72M49j220J78J381l26j02K21n69M56J7p48J62m88l89Q56j192j39Q25j98
713e23r4J69Q1J469j212r33K184J80j215Q2L55R24k69k301J145O22j124O0m21
732h21k35J301n59q09R07o12J059P47j860O49J069K17K44j718j05K602j135j774
750h33O34m1L32k11j435J047Q3q84J346m51m87J531o23K96N82j027N39P02r64
769A36O57L6j008M46l24l23Q23j683k1J676j265j83P46m67J238m42p38J753m38
$$ y = [-688, -2692, -3277, 547, 3426, -1085, -4732, -2467, 1922, 4073, -221, -5041, -357, 5025, 3060, -1430, -2581, 1637, 4226, 321, -2163, -574, -13, 558, 10, -1506, -1386, -1288, -370, 1354, -722, -2475, 286, 1594, 1239, -185, -468, 1797, 1568, -78, 638, 665, -184, -162, -225, 366, -629, -2331, -277, 637, -1110, -1442, -569, 303, 752, -468, -290, 1091, 765, 663, 884, 315, 771, 788, 40, 202, -286, -675, 181, -1011, -1150, -325, -523, -617, -448, -367, 1102, -110, -1043, 1141, 1321, 106, 188, 543, 1467, 1198, -1103, 42, 664, -460, -400, -821, -1056, 245, -314, -1123, -216, -828, 231, 978, -882, -233, 836, 1053, 1297, -421, -526, 2076, 941, -833, -199, -240, 92, -119, -1554, -507, -424, -1308, 38, -413, -900, 631, 8, 304, 886, -141, 398, 1100, 136, 793, 829, -179, 267, -57, -380, 443, -1240, -1261, 415, -850, -1033, -287, -754, 484, 42, -696, 1057, 619]
788F19p05J367r33j00O37q02N09K38k151J139K69j274J110r48j65J536q82l8J116
807E42j347R30J652j647J50K31j2J225j800q55J993p59p72J18j097J157O34j576
825a233N29L54m57J625m38j056J379K0K91J12j668P67J514j796m21O2k69J293
843F08j082j149J570j078M68J353j355J5J057l41J072m49j150J729M3j194N42
860F59q42K08N79j265L51K79j653J245O27j388M73J80N58Q75j281K29J538j187
878A85K57P17j055R1N6l40J343j835j175J783M3o84l6p79J361M18j099R48R7r94
898f98J554N15j077j65l23J270O66k529k90J516k08j90q90n89J341k71J04M43
916A79j217L96J764n64n03m40O53J431j093j295J356k42q09M20K93j91j028o62
$$ y = [619, -86, 1281, 348, 248, 885, 83, 592, 830, -1321, -182, 87, -1187, -77, -1025, -1190, 346, -536, -574, 542, -805, 125, 1777, 130, 280, 511, 499, 1724, -76, -931, 1062, 303, -469, -351, -1448, -291, 343, -1233, -704, -350, -807, 818, 380, -676, 703, 723, 1014, 1126, -542, 225, 1739, -57, -478, -416, -685, 608, -474, -1623, -53, -1131, -663, 690, -665, -650, 407, 66, 1138, 689, -461, 1268, 1311, 117, 659, -183, 25, 604, -661, -310, -31, -1684, -439, 188, -1200, -727, -547, 11, 886, -395, -166, 1372, 185, 442, 1159, 104, 195, 251, -89, 1254, -581, -1756, 27, 70, -614, -650, -1429, -68, 350, -749, 199, 296, -698, 856, 1371, 294, 129, -194, 1076, 1742, -787, -1077, 439, 231, 41, -849, -1438, -97, -368, -264, 179, -1038, -642, 1122, 558, 55, -385, 268, 1699, 606, -689, 667, 425, -384, 36, 329, 138, -890, -1552]
934a552K212K29k706L78J990L4p40r76J650Q84j802O67J295j070j128M99J528
951A392Q3l141l62L154K08k457q20R61J910o00j634J079O6J96J329m63j281J32
969b48J017J061q68k311P43J267k71m9j531p42K039P28p95j713o10L399J541l263
987f06j017J893J981o16k808P62K380j467j340J450p2j402p81J754J646l069k354
1004c666M193J813k910j556J528L234j315l022K339J955k443j149J603R41j106
1019D39k995J828K912k737k011J669J202K81j412n13K154m65n82J459o85o95Q42
1036F91J82K8m33j391R46P30j034M47j437l78K287L22j962r17P94L223l96m076
1054b374J201L494n44j838r80J897R23k488j98K568k075j595J835J311q15k925
$$ y = [-1552, 660, 889, -1817, -1439, 551, 585, -155, -1131, 519, 1403, -399, 268, 1563, 493, -635, -136, 1392, 1475, -1666, -2028, 1126, 1334, -1123, -1943, -982, 928, 328, -1306, -227, -161, 35, 1364, 901, -380, -248, 769, 1830, 962, -1349, -606, 661, 390, 341, -1190, -1932, 107, 835, 40, -1673, -2283, 1116, 2657, -606, -1623, 270, 2251, 1635, -1173, -411, 1969, 502, -838, 612, 540, -862, -1643, 111, 1757, -1312, -3666, 527, 2340, -570, -2126, -598, 2636, 1321, -1701, 638, 2593, 150, -999, 604, 1545, 439, -2556, -728, 2184, -553, -2564, -895, 307, 588, -824, -1337, 817, 352, -230, 1229, 544, -151, 691, 873, 901, 468, -923, 23, 753, -281, 166, -1271, -1649, 638, 960, -1002, -1919, -1125, 2098, 1702, -2374, -1173, 2321, 1777, -61, -1041, 856, 1779, -709, -907, 1661, -414, -2009, -174, 1137, 322, -2603]
1070b603Q23M506j471m177J878L003j49k579o75L129N77l472N90K441j678j253
1086a110O15J166k2k501N48K859j921j381J598O64k45q30K76J602q98j043J596
1103I73j33j102P25n21M83l69r15J306o14j755J857R52j865k52J051J561q40k252
1121a710J683K293k115q40J266M80m65j315J052J159k460n18K604n76j915m30
1137a807J765J497k183j254K874O43k250L36J288O58j509j031K273O5k594N82
1153f47J891j162j420K42J553K37k548O83K334j388q78J125Q50j81j166M11J732
1170A668j367j006J543Q3j030p76Q45R29j560j231K288M02k222L16J391L00p07
1187a34o70J693N39j859M85J492r13j067L68R35k95j703M96J472j073j131J048
$$ y = [-2603, -1780, 2726, 1255, -2922, -1044, 1959, 1810, -769, -1444, 1685, 2262, -1210, -620, 1821, 143, -1110, -495, 671, 649, -1852, -1304, 1555, -366, -1747, -149, 515, 270, -560, -284, 1318, 420, -623, 973, 840, -262, 463, -58, 425, 56, -859, 447, -167, -1922, -65, 887, -978, -1230, -179, 1382, 542, -1710, -27, 2266, 151, -689, 577, 1057, 592, -723, 329, 1488, -972, -1490, 1114, 538, -1377, -1807, -42, 1455, -728, -1982, 892, 1535, -715, -379, 909, 1567, 58, -973, 1300, 1365, -1229, -647, 1244, 82, -1338, -1096, 457, 694, -1854, -1171, 1163, -225, -1103, 22, 872, 691, -475, -64, 1668, 301, -705, 838, 921, -109, -885, -40, 889, -671, -1902, 386, 788, -1434, -1118, 273, 573, -134, -804, 889, 1428, -431, 54, 1546, 633, -434, -66, 869, 574, -1129, -633, 839, -234, -1365, -317]
1204c17P19l37j258J072J579j532r66J883N49j398o27J098J027j426j368J791
1220D89K88j771nQ82L90r42o55J559M78j929O81J431l37p84K06R46K39j508OJ675
1240A339r66j307P82M84p6j398L35J626r63j202J330N54o62j45K61J135o89j187
1258g49J622L74j753N40M17r6m57r10J038N23j786M89J391p16q00K17Q39N76j455
1277f96J87K262j258j047R96K11j85n27k95J023o98j278J498p5p27q9K84M45l
1296B8j269J535P51j396J26Q84r6r6o89N46R00j600j42J279p82p74J01M94N08
1315C08j049l32J951q59r91J328rL6l77k81R72p3j053R27J27q77K92m15K78J61
1335F4j407O66J080j241K32R02l61N2j27Q6J052q96k60J362q63o40O54pj6p89
$$ y = [-317, 402, 65, -1193, -121, 1458, -74, -1040, 843, 1392, -6, -633, 465, 1492, 66, -1302, 489, 777, -994, -999, -117, 273, -669, -1324, 235, 713, -1216, -535, 896, 559, -225, -19, 927, 1166, -342, -336, 1339, 373, -934, -152, 332, 256, -1142, -807, 819, -144, -1346, -16, 538, -124, -269, -8, 1127, 438, -749, 873, 1247, -506, 34, 451, 355, -102, -1012, 26, 549, -1237, -748, 643, -73, -873, -656, 183, 759, -696, -509, 1753, 495, -552, 444, 655, 470, -57, -352, 671, -27, -1305, 193, 118, -609, -698, -414, 31, 28, -1241, 294, 1045, -351, -225, 659, 563, 467, -222, 324, 1224, -376, -518, 761, -21, -795, -694, -200, 308, -741, -1073, 878, 19, -972, 356, 347, 383, 6, -275, 697, 624, -429, 498, 625, -252, 40, -375, -97, 64, -1343, -677, 403, -838, -606, 296, -65, -13, -140, -54, 998, 102, -158, 1204, 341, -299, 355, 348, 332, -457]
1355d57k12J151l30j438J036L48m78J21l61J113R6j242P84J025r61k85N78pL33
1374H14j081K64O47r93l50M63j62J01l17p4R60m90m52Q87L54p06M26k67N88J74
1394G86q32N20L4r86O27j94m53M49n60L48K72q52L72J028q35K77O7J19L20l63
1414A44N7O13o82k03O69m21l85k37J9N99l67q23P96J94l60K35KL69K19p07M89
1435B20O02n17o7K8j08L01n43k10M26k11j78K5k88L53Km52O34R1r6R2l2K40K99
1458F11n10J04M37l60k02j97J49J98n19m81P13j3j99l85k6P54L13r07M92L50j74
1479A48J65m79N36L26q42Q9Q11n09m67j42J93N45p79p17J215N9n08l8n6R16n8
1500D08q98L94R87o14j79k20L68K70r22o7J126o39o43J24K92N14o61n13J095L7
$$ y = [-457, -669, 482, 152, -1286, -250, 98, -380, -259, -620, 493, 589, -653, 131, 1156, 195, -90, 488, 481, 814, -267, -3, 644, -349, -699, -236, -398, -297, -614, -688, 272, -218, -670, 217, 571, -135, 291, 24, 612, 786, -46, 474, 508, -478, 149, -45, -498, -49, -609, -261, 11, -841, -469, 559, -276, 1, 68, 187, 507, 144, 201, 814, 132, -71, 598, 177, -208, -445, -426, 173, -194, -1017, -221, -27, -387, -152, -150, 219, 438, -269, 220, 822, 305, 238, 266, 158, 459, -84, -294, 132, -79, -257, -232, -520, -167, -165, -617, 17, 108, 12, 104, 72, 312, 611, 101, 205, 642, 282, 80, -117, 32, 230, -289, -770, -57, -70, -269, -654, -680, 74, 387, -520, -28, 322, 148, 313, -166, 370, 696, -146, -57, 754, 245, -222, -364, -171, 374, -405, -1122, 93, 152, -356, -394, -450, 466, 408, -490, -96, 891, 277, 98, -122, 246, 516, -406, -473, 653, 14, -629, -505, -213, 301, -360, -873, 222, 259]
1520B59p06M62qL23O1o04M25O57r67J12K51jrp00k27R55m71l66L14j66N18o8o75
1543f31P44K48k94R4K50j50K50p35M37N72r46m6K58j17K36o65l22R96k43q05O92
1564a77mM82Rr62J061M36r14M06M5p9om45K30M78q98k43N58j92j95n7K3N27J36
1587B19o14Q06j31j64J75k08M35J01p98M19K20p70K61j29k11N88n93j70N30l48
1607c82K32L32m39M63J84m88N31j48J0J50k74q3K95p69J03N35n46J56p2l26O21
1628H5k80l20O20R2l07L96l43M83jo20L83L41m00n6j58j4L62n95J8M05l40k87
1650e36L05p9K51j91j49O90K7n54P33j42j10J19m25J69K66o76J67K90l38p6P0
1671a89p6J71j84pM61n48K40M47k92J49J04r0L76l21%J44n02j28L36j29j56L8
$$ y = [259, -447, 15, 7, 330, 391, -213, 212, 869, -98, 14, 265, 264, 255, -445, -672, 283, -188, -554, -240, -406, 112, 44, -631, 113, 361, 67, 161, 411, 261, 511, -224, 213, 785, -161, -207, 51, -66, 170, -495, -817, 179, -64, -869, -177, -181, 301, 310, -652, 409, 845, -69, 337, 382, 303, 297, -148, 82, 560, -338, -581, -23, -215, -410, -467, -444, 83, 219, -395, 411, 280, 116, 291, 83, 518, 619, -179, 240, 460, -310, -49, -178, -389, 199, -394, -564, -34, -382, -150, 182, -257, 206, 390, -98, 433, 285, 295, 445, 171, 88, 383, -386, -283, 252, -294, -138, -210, -536, 85, -195, -515, 105, 197, -110, 286, -57, 426, 425, -195, 188, 529, 129, 73, -85, -99, 263, -332, -314, 91, -249, -536, -231, -310, -59, -250, -399, 291, 318, -236, 497, 355, 245, 364, -61, 108, 374, -302, -135, 155, -183, -259, -189, -265, -94, -278, -285, 176, -372, -132, 315, 23, 172, 276, 186, 562, 241, 241, 385, -117, -245, 91, -38, -194, -156]
1693a56j02K31k83k07O40J4k07J11m1O9J17k69M17L9m23K21J5Nj82l06J36K85
1715A24n36k6M22k68K85j55k24P64l20j90M24m5o1K0j21J23Q6m49l1J76k99K20
1737h1J8m16J46%K76J72l40L44K26n66M79J70k11n2j50K08J51m03MJ78k89k25
1759c61R7k40L30j40m5M04j0l20M75j54J92O6m87O89j64l97M57k86j46K40m95
1780b95jL29l35j94M93m42K78K50j97L79k2k66L19m4k82N06k60j95K21j34kj54
1802d8k14K41p5m53L77q5M4M61m89L50K93o71M61J08j19K06k63k08N60p47J01
1823a70L85m70J30J21p05J045l37n24N13J41k33L86k88K27K86n69Q3M66o20N0
1843h3J72l34L48k09j94M01l18j53N44m23M36j91k26K17L48m40K97M0j70O30n57
$$ y = [-156, -258, -27, -310, -517, 123, 137, -70, 41, 0, 69, 186, -83, 334, 373, -50, 171, 186, 191, 9, -297, -161, 124, -412, -438, -16, -284, 1, -154, -378, 386, 66, -124, 300, 255, 194, 214, 93, 216, 302, -147, -178, -2, -301, -81, -63, -479, -333, -333, -57, 115, -225, 119, 345, -221, 258, 428, 217, 165, 15, 223, 374, -29, -25, 153, -136, -361, -264, -504, -174, -314, -359, 45, 35, -285, 190, 36, 228, 294, -193, 496, 332, -65, 392, 106, -40, 200, -295, -296, 33, -302, -496, -3, -445, -167, 83, -114, 265, 243, -23, 296, 252, -30, 476, 216, 21, 242, 108, 106, -48, -262, -21, -96, -549, -172, -257, -213, 248, -241, 109, 402, -269, 192, 300, 181, 387, 124, -84, 476, -271, -170, 215, -255, -125, -4, -709, 336, -1, -525, -12, 129, -104, 282, -6, 221, 507, -62, 21, 487, -133, -83, 89, -245, 103, -106, -300, 101, -217, -370, 174, -249, 187, -4, -230, -13, 335, -105, 192, 232, 62, 692, 135]
1864A35k08L35l94J62J4n13O50k68n87N36J14k76K01k02N50L12q02L34K81k08
1884A66l1k4J07K48n77j80L87j28j31k55J77J91j29m03L98K98k23Q1R5J11J38
1905C16k22J4M66m76O6M0l06L20l89j5L9Q3k32J18k97M27J08l80M44K76l90J11
1927A21K8k1L21l53k55L36j84k8j42j27L97l69l10M14J6q8K80r2L44r0k51P5L68
1950C90j18K8k76J06K77n25QL15l85j99N2j23M43l63r7N21j47j29L91l28L79J28
1972C48l31J75K14j03l23R2k00J91j64j39l0M6n9J31k47K71K25n22O82m5l08L33
1994B37j87K23J33j49l28N34m26j61M9k19M59k67n26O39j76o4N3J74J55R3o15
2015c69M82M49m18k8J43j64L03o97P1N03k98l65N07l45M3nl25P38k56m4K70o3
$$ y = [135, -73, 262, -132, 30, 44, -469, 181, -87, -674, -138, -24, -300, -99, -301, 249, 561, -241, 93, 374, 166, 135, 111, 218, 466, -111, -291, 96, -32, -163, -418, -241, -50, -179, -582, -184, 114, -109, -28, 67, 178, 316, 94, 108, 574, 98, 164, 204, -102, 218, -171, -186, -147, -64, -296, -178, -475, -48, 60, -320, 124, 400, 10, 121, 149, 128, 449, 96, -159, 177, -7, -35, -177, -304, 93, -276, -586, -172, -156, -244, 36, -56, 288, 198, -53, 22, 390, 272, 300, 24, 130, 407, -118, -110, 205, -180, -379, -327, -450, -7, -370, -467, 54, -93, -222, 169, -159, 220, 348, 17, 192, 406, 303, -20, 72, -128, 63, -101, -240, -270, -224, -283, -152, -399, -128, 97, -425, 257, 212, -96, 237, 50, 273, 406, 257, -71, 463, 37, -124, -75, -294, 165, -102, -628, 11, -165, -229, -176, -2, 153, 246, -369, 113, 562, 144, 116, 259, 95, 398, -299, -228, 275, -23, -388, 119, -226, -183, -188, -513, 225, -31, -75, 195, 132]
2037A32N2J57m38L84L01r36O06j19l18K94j19j80L08l91j15L77j09k04M10l87
2057b95L61J67j86L32k72k18O36m81k62O91m30k1J3k7P3j89l47N60N3o23L61K84
2079A80j71J47m83O69J63p29J41K64l2n0n2n5N58o32m21P00l93j06K47n3O9n4
2101i3r1M63k49k01M91m4m2J47k22K49k12o34N08J88p12M40j24p6J85l93K43J71
2123hj66J14L50j64j37K46r5K09m79K24L02l75k42J44J18q6k68j95N30j69l23
2144d70M01K23k31K35r2J21J85m67J10M30p52M52J28j68j6j45j4J6j93m70R74
2165B57k95j92J87p4L47k43L4O38m35l33L73J31m50J22k07M21l50j81K19m6j82
2186b59J6J77K92l89n6M12L62l47l85O16p6k14j51J44M10o97j11M66k09m16K0
$$ y = [132, 184, 341, -97, 287, 588, -348, 258, 139, -179, 115, -4, -184, 124, -267, -382, -5, -114, -318, 92, -295, 66, 233, 47, 379, 107, -111, 525, 44, -218, 473, 43, 22, 35, 8, 81, -108, -455, 105, 158, -465, -104, 180, 9, 156, -327, 342, 505, -224, -83, 181, 149, 99, 47, -8, 550, -82, -503, 197, -196, -302, -55, -108, -39, -93, -184, 279, 30, -171, 320, 276, 234, 381, 159, 408, 196, -438, 70, 258, -454, -14, -138, -214, -29, -422, -179, -8, -174, -60, 290, 126, -11, 235, 140, 349, -130, 94, 396, 21, -221, -77, 41, -45, -313, -508, 22, -147, -470, -69, 154, -77, 158, 66, 187, 372, -95, 15, 445, -307, 145, 273, 105, 89, -56, -70, -54, -247, -717, 257, -38, -230, -43, -117, 230, -13, 21, 659, 224, -109, 264, 395, -55, 67, -140, 281, -69, -250, -31, -77, -259, -243, -66, 226, -163, -219, 193, 555, 208, -177, 439, 363, 149, -2, 142, 552, -145, -256, 210, 1, -415, -395]
2207c95R4L41k30l22O76L1m45K64L83k22L6m55N96j88m32N35j66j94kK5n5r0k21
2230d36J50N33n97R9K87m1J95j94J84J72l75l8L45r2k79J47o4pk13K3L75k50m09
2253d85K69L59l09J69k34O15j54o23M91L27j64k68n4K84k19l19L60J05k69k20
2273c39N30m50Pp3q2N82k07k35M45j71K5O0J8R6r8k99N17k61l63M05J90m58q6
2296b47q7J66J73n54M94K54k62j16K83K20Q0o39L17O47p09k82L99o6O5m20K19
2317f5K95m65l80P73j74m19L28K75n9l4l24N05J43n73N62j20j55q6L7j90K86m24
2339b64N5K53l43L54j04j25L77n72R0P28m04j65N79k57J17j7k79J85j42m76N70
2360A60q3n14J96K47k10P3k02J24O28o50J91L53k67l4J26K33J41o25pL61m46L56
$$ y = [-395, -301, 40, -190, -512, 164, 195, -250, 14, 397, 175, 211, -244, 352, 164, -268, 267, 101, -93, -95, -70, -125, -215, -436, -286, 247, -350, -251, 36, -5, 190, -4, 180, 352, -23, -61, 284, 192, -87, 60, -4, -11, -224, -201, 174, -76, -485, -216, 143, -166, 3, -231, 384, 230, -393, 98, 425, 261, -7, -61, 223, 4, -315, 45, 150, -119, -339, 191, -259, -252, -325, -407, 175, -32, -267, 178, 7, 32, 92, 110, 206, 108, -191, 326, 65, -298, 107, 297, -161, -247, -334, -168, 5, -549, -55, 199, -63, -179, 104, 324, 404, -235, 82, 729, 20, -262, 137, 71, 136, -284, -65, 230, -235, -615, 158, -16, -435, -107, 168, 109, 75, -249, 256, 399, -174, 388, 268, 113, 27, 64, -126, 160, -264, -209, 44, -299, 55, -49, -174, 203, -369, -279, 449, 45, -120, 459, 202, 319, 302, 23, 208, 66, -410, 160, 77, -437, -241, 6, -204, -131, -333, -209, 419, -231, -40, 313, 46, 12, 138, 371, 512, -113, -120, 241, -205, 151]
2382A51k84k4Q1Lk57L52q0m36P32l21K09L4j61J19J77k77J72J20k59J18pm78M20
2405A04k34rJ09k46Q7J34l07J93J88m0R2r4KL64m33J50K22r9l19J03N1J37r3l58
2429b96K80J4j93J49l6J39Q4j95J48l9O9q1J55l7Q2k41K7L50n86J44J50j84j20
2452b17J20j53K42j49j7K58j29j00L19J4j53K14J3j85K00l21L95k74l04K68q3
2473d2k3q2o3J15K83m65K00J89k47K6j25M63P9m00J23J56k71J3J74r3l2P6m50
2496c96L74k49J3L84k81o2K51k40K96J29m02M65o3r0J23j03P5K8n55J97N5o7M8
2519g0J52l91K40j26j05K40m0N8J52p1J47Ko6L3l2m5M1k2j56M8M3j91pp0j37K43
2545a30r3J72N3k77K23K21k29K17Nj49K03l67K71J21k16J3j05n0j09j67R2K74
$$ y = [151, -133, -157, -76, -73, -330, 22, -58, -494, 238, -83, 126, 160, -1, 118, 295, 18, 190, 310, 51, 169, 162, -316, 104, -130, -139, -30, -276, -189, -55, -362, -169, 19, -21, 71, -23, -21, 343, -90, 60, 282, 183, -136, -33, 18, 155, 62, -296, -16, -2, -195, -46, -82, 57, 141, -54, 94, 55, 124, 43, 198, 161, 243, 2, 29, 379, -207, -63, 87, -97, -217, -97, -250, -8, -157, -174, 84, -45, -145, 174, 188, 35, 249, 262, 77, 277, -44, 351, 77, -227, 41, -42, -65, -147, -210, -95, 188, -277, -77, 112, -135, -109, -234, 229, 308, -92, 31, 187, -84, -71, 103, 10, -22, 54, -396, -22, -271, -258, 126, -155, -217, 34, -206, 90, 219, -183, 282, 219, 129, 252, 149, 224, 252, -303, -106, -51, -118, -70, 82, -309, -69, -195, -300, -60, -100, -42, 110, 39, 186, 188, 122, 155, 123, 78, 119, 97, -59, -11, 32, -159, -166, -236, -373, -130, -223, -51, 2, -275, -52, 169, -60, 157, 162, 13, 216, -151, 120, 241, 25, 38, -67, -117, -226, -393, -301, -27]
2567b7r2J23m5j54J72J36r8K01j72n8K47k27Q6K7p3J6ql94L09o4j24J84k22O9
2591a88J41J95k31K27r0J4J90k66K57j84j78K68P5m04L49p7k90J78k05K33q5r2
2613a63J89Q7j44J41J28k21J07l4k60O63m13L4m4j74J26M0l79J29mr7L35k75K79
2636E0Q3j92Q7l3L8K14o3l32K88p0m3J35j65j24K22l28J73mj50L18j60kJ86j95
2660f7j51L98l33J4K42j5O2J03k47K40n2l31J43J74m02N8P4K53j42j41m3K32r7
2683b8P7M9l6Q9j16j27M67j97k14j8j25L59o9l18J59K5m17K65l5J2K63k5MK84
2707C28l06k4L2j0L27p7k74P0j32J92j93k72M43l7l17J30j28L48j74k2Q8K39k05
2730B6r6M50l34J4Q1j08K13k47j91J68j06K1N8j25k5J63k56L27J94l55J45K2N5
$$ y = [-27, -119, 4, -41, -195, -23, 113, 15, 216, 44, -14, 233, 6, 92, 119, 46, 62, 54, -340, -31, -95, -219, -35, -257, -188, -47, 148, -83, 144, 54, 68, 258, -8, 249, 65, -113, 155, 230, -174, 175, 98, -192, -14, -219, 14, -71, -163, 26, 113, -31, 110, 238, 17, 124, 90, -170, 493, 80, 114, 70, -104, 22, 62, -317, -188, -192, -289, 46, -229, 50, 133, -59, 28, -5, 33, 247, 184, -148, 140, 70, 27, 162, -3, -127, 95, -233, -60, -64, -214, 104, -56, -58, 128, -67, -218, 180, -153, -139, 103, 88, 150, 253, 6, 246, 194, -137, 6, 180, -222, -164, -90, 163, 21, -120, -163, 69, -28, 49, 98, 62, 151, 35, -92, 375, 178, -36, -54, -179, 180, 111, -207, -48, -23, -440, -175, -210, -198, 65, 40, 44, 328, 22, -2, 30, 20, 347, 270, -4, 66, -66, 126, -67, -339, 104, 67, -250, -120, -248, 100, -74, -96, -8, 231, 26, -70, 380, 46, 60, 141, 33, 246, -1, -192, -24, -130, -109, -51, -176, -201, -38, -294, 33, 227, -128, 17, 39, 94]
2753I4j7o6L2K51l50j22J93K2Q5j37P3j01L1k10Q3J20o7K16j00O1K25m50K14m1
2777C9k20M42j54j48K71l53j9J02j71P9J53k25k02K82p7O6m0O3J90oq9L05J07
2800C95k59j03L5o3j62M3R9pj74K96k26qk4k3jL23l09l1L29n5J27j64K52M2l92
2825f0j2K76k45L4nl57K53J27j28JP4j50N8K69p1J37k09J09m8j57K94j88j77L72
2849A97p3l01K04J44l11J45l06J41K4l8P4l9%J20K9n9K87j76m5K13j08l0n4r0
2873e2K79m35qR6P4l7k83K85p3K96l83K98J5j39J25J07lL4j14j35L34m07L0J07
2897A1l17L26k07K0J56j2l90K67K45k1J93l77J13J84p7j26K14l45K39j46o5J15
2919@j34K35j57k6Q2o7j46K23Q2j25K38k7k90J59l02K77J97k1j66Qj77J89M0m87
$$ y = [94, 77, 11, 43, 294, -56, -178, 15, 37, 122, -15, 58, -43, -12, -222, -139, -19, -86, 130, 30, 91, 316, -134, 80, 39, -181, 261, 107, -41, 230, -123, -142, -40, -211, -132, 21, -204, -406, -124, -201, -135, -175, -112, 78, 72, -17, 288, 395, 136, 33, 68, 5, -157, -114, -15, -22, -196, 100, -126, -134, -158, -181, -182, 141, -168, -199, 130, 75, 202, 38, 290, 332, -60, -72, 204, -41, -7, -12, -369, -116, 11, -117, -116, -42, -192, -134, 135, 64, 201, -8, 101, 53, -104, 190, 2, -175, 197, 124, -177, 27, 171, -140, 5, -301, -160, -136, -174, -100, -139, -139, -19, 10, -49, 238, 62, 17, 230, 122, 92, 38, -52, 227, -208, -216, -120, -46, -83, -366, -81, -154, 142, -241, 57, 72, -67, 58, 165, 162, 196, 82, -53, 281, -126, -96, 11, -306, 20, -187, -167, -11, -23, -413, -146, 99, 78, 271, -106, 7, 191, 114, -12, 202, -143, 96, -50, -115, 0, -134, 101, -56, -82, 0, -67, -213, 10, 92, -33, 205, 178, -112, 47, -255, 22, 219, 198, 32, 40, -137, 52, 92, -395]
2943c95M08m2k73k8J17K51j09J20m5L14k42k21L46P1j13N6j08J07j19j61j8J0
2965g4kj45Q0M4O8n6r8L18k9o1O8j14J78l99K24Qj39K46j45o3K08j73j04L97k52
2990a5J38l18N1K19q0j33K39P4k79J19j13K80J07l16K6K3j55M8k88K49K20m08
3012c12J53L48l49Q0J02rK3k2r0J81J47l82K34j45J19J72k80R2J18k83J3R1k95
3035b94L14k49RK49k7P6Q2j69J33mjrN0j99J22m7j05J2j06K45n7k18O7j02Q9R1
3061d8Q0p8J47k36K28N8J7l0J1Mj32J96j75j88k5r5K87m8l86K11J08pJ34j20l1
3086a18M15k01lO1k12K32q9N2j04p6N8J89k14k2%N2P7k43k9J44R0l36L10N7j55
3111f5J48j12R8R5R7q8L3m49K26n3j7K20m29K21J06o9j10K70j85J94j59K27K20
$$ y = [-395, 13, -29, -302, -330, -213, 38, -71, 49, 4, 318, 76, -145, 201, 272, 159, 215, 107, 214, 95, -66, -84, -74, -76, -221, -141, -97, -29, -85, -183, 135, 106, 45, 113, -1, 177, -222, 2, 10, -129, 117, -28, -91, 117, -56, -160, 237, -15, 123, -195, -144, 75, -5, -138, 101, 175, -104, 15, -98, 182, 289, -27, -1, 22, -133, -85, -373, -124, 96, -312, -159, 189, -160, -80, 22, 13, 36, 14, -76, 105, 252, -130, 104, -41, 78, 250, -30, 62, 180, -103, -90, 1, -294, 20, -229, -220, 29, 2, 78, 160, -9, 124, 120, 119, 110, 160, -39, 83, 36, -69, -57, -163, 82, 25, -193, -126, -228, -139, -48, 32, -46, 101, -135, 93, 151, 168, 138, 149, 153, 21, 217, 42, -146, -171, -266, 21, -27, -413, -202, -94, -101, 33, -87, -118, 297, 96, 93, 154, -58, 174, 85, 137, 33, -43, 15, 204, -10, -32, -32, 20, 97, -146, -175, -31, 59, -277, 33, 90, -65, 83, -29, 69, 164, 261, 173, 206, -243, -17, -70, -87, 133, -296, -75, 31, -38, -148, 122, -63, 131, -28, 199, 419]
3134D19k96j57L80l56j14Q6l8O7j67k82O08j23o2Ok03J01L33k72R0M4k08J71K36
3157B63k47P6j1j35K00j85k00L55l74j4K17q8J01QnK29k81k00M18j26q0K16k22
3180h5K15k0o3r0J21k25LR2Pk21J52J14Q0j62OJ93k60L91l75L42j34p9QK18l04
3205g6J69m5j83K76K6k70K1k6J06j75K21j79jQ1jK84k33J58k00j70J41J68j69
3228g7K18Oj75Ok41K71J3l00K77J6k63K25j23K40J96k33k29L78j07j43k5J38n7
3251A1J35k54n9J37o9PK5m2k2Oj8K80k26J7J04m0J07j02J8J51l57J0L62j97j21
3276a37m4J38P4J18l51M9J86j81L59k57k20L27q2J47J6j48L95o6k30M2j50r6o4
3299a75J45R6Q9k97L5J71k54K61l88M57J74m09J41O6m7q4J46r5P6r9o4J25j08
$$ y = [419, 123, -34, 346, -10, -124, -38, -76, -9, -176, -458, 150, 27, -35, -29, -232, -131, 202, -70, 20, 64, -144, 27, 263, 16, 92, 81, -54, 146, -39, -239, 116, -258, -272, -55, -143, -42, -34, -39, 190, -91, -291, 127, 1, -79, 137, -85, 130, 110, 47, -43, 78, -147, -144, -52, -45, -266, -114, 0, 80, -82, -76, 117, -143, 248, -127, 215, 81, 2, 10, 228, -76, 93, 48, -135, 141, 167, -103, -82, -108, -2, -177, 44, -135, -136, -55, -56, 228, -5, 153, -47, -217, -76, 92, -77, 141, 147, -28, -22, -263, 8, 21, -279, -2, 14, -249, -24, -147, 93, 289, 56, -173, 205, 98, -45, -70, 68, 11, 146, -108, -167, -30, -99, -92, -67, -109, -131, -125, -143, 137, -89, -72, 32, -8, 99, -3, 15, 166, -191, -181, 181, -16, -137, -181, -43, 31, 149, -202, -153, 33, -148, 211, -46, -266, 61, -21, 126, 142, -6, 389, 323, 93, 135, -15, -111, -175, -30, 66, 155, -142, -107, 64, -190, 71, -317, 140, 314, -95, 46, 112, 65, -19, 127, 32, 108, 9, -55, 70, -38]
3322c8j7J61r7k61K58j64K31J56m70L17j48J12J2K2K2n1N1q6Q4j60pQ7j68pJ00
3347f1j54L04J62n90M06J1jQ1o9K4O4j83J41o9k33L25j39j00P9m8k1m3k4R3K02
3372A57l16K3L47k37L5Q5q4K8j95p1L56j26n7n0J65l8j16j0N2p1q5J78j04k3J96
3397C9j5Q1n6j46K30o3J6o1KR8nk42K38K8k10j39J50O4j83K65j99P0k6k04M59
3422A91k05o2K19k34K11moJ35j04k52N2R0o7k9%p2P8j77K18K22k89J03r0j43L54
3447A39p6j49K76o0j12k8J02j9j95N2m6l5m7L58J4m60K14J68j7j08R0m7K6K21
3471B61j69J17j91K21l61n2L52j81j66K16j02J57o5j15mkP3J2j12O2N7L3J18p3
3495H6QL2k51N4J15R6k03L1oK55j79j89J89k5l0O2Qj0J12j51J31N7m6q8p8Q7M1
$$ y = [-38, -55, 106, 9, -252, 6, -158, 73, 229, -241, 76, -72, 40, 52, 74, 96, 45, 96, 10, 94, -66, -73, 14, -154, -161, -61, -215, 89, 251, -339, 67, 78, 77, 158, 89, 113, 177, -6, 135, 66, -167, 158, 19, -81, -2, -50, -71, -114, -138, -45, 157, -159, -136, 211, -26, 9, 94, 10, 38, -157, -228, 128, 2, -55, -105, 60, 22, -94, -104, -52, -123, -208, -30, -134, -157, 39, 24, 105, 49, -97, 133, 70, 86, 25, 27, 125, 120, -122, 116, 144, -66, -205, -55, 9, -174, 91, -108, -38, -64, -268, 191, -14, -76, 143, -91, 120, 116, 110, 245, 141, -111, -59, 31, -36, -65, -65, -137, -59, -236, -18, 204, -85, 18, -72, -215, 139, 63, -86, 190, 130, 18, -10, 92, 73, -122, -70, -116, -151, -198, 160, 174, -286, -72, 96, 79, -29, 61, 14, 40, 261, 92, 209, 18, 239, -122, -174, 178, -3, -169, 47, -55, 102, 37, -78, -82, -84, -11, 1, -111, -49, 8, 41, 159, 86, 94, 126, -125, -71, 44, 140, -63, -32, -38, 217, 38, -151, 38, 13, -17, 45, 53, 43, 155, 4, 135, 192, 146, 58, -20, 67, 108]
3522A08n0k84Q9k1Po6K09J37rk67J47j06r8K81Q5K7J31k61o0J58k27m0K49k68
3546a29o0K2K55n2J9j07l3J3L68l63R3K25p1j53o3J62j15o0M9j20K0M8n4K98k59
3571f7o6J32o0J42P0l1O3k42k5K78k04J04J7j47O3Pm8R6j66J31j77Q7O6L6k71
3596b12kJ24J82j77J47k14K39nl7p5M2j64K78r4j21K6r2J73K6M2l7j49M7R2p9
3621d0J03k98K72J10J50l47o8M05l62K6R0o6K0Jj40K61j28j46L65k53K58m00K41
3644E4lK04q8k05J15j44P3O9Rr0J54k01P8J01j78q7N3Q9J3k88K37O8jK44l57K27
3670A46r4j93L4K06j06Nm0O9Oj84P9J90k17O5J19m6j06K5j12K38O5o3k30K71j96
3695f9Q1L0l9Mk90L74j81R2j11J8l3K68j38p2L1k6K65j79p5J07J29j98L18l37
$$ y = [108, 58, -226, -137, -158, -151, -217, -8, 129, 120, -147, 0, -106, -204, 77, 162, 189, 320, 59, -1, 157, -70, -110, 139, -129, -189, -167, 88, 36, 55, -52, -85, -72, 296, -67, 26, 251, 180, 27, -36, 126, 11, -49, 0, -120, -100, -52, -106, 192, -67, -133, -1, -61, 81, 151, 120, 183, -59, -84, 194, -10, 94, 111, -36, 27, 34, -14, 82, -84, 47, -130, -43, 23, 59, -212, -214, -90, 92, -85, 62, -152, 87, 82, 45, -30, 12, -152, 126, 32, -89, -63, -155, 18, 44, 86, 49, -100, -53, 39, -40, 63, -235, 37, 147, 297, -50, -118, 287, -75, -49, 41, -25, -5, -4, -144, 117, -11, -157, 208, -45, 213, -187, 54, 51, 255, 167, -38, 77, -67, 6, 75, 84, -6, 148, -53, 25, 126, -52, -139, -86, 3, 16, -272, -35, 33, 32, 276, -81, 146, 52, -141, -107, 99, -7, -2, -42, 27, 33, -151, -72, 118, -99, -34, 85, 39, -67, -42, -154, 84, 149, 86, -144, 127, -69, 12, 42, 3, 7, -283, 91, -90, 2, -109, -91, -124, 144, 6, -66, -35, -61, 204, 25, -50, 57, 186, -12, 306, -31]
3719c1jr1rR0K45q7m19J79K1k3J3J5J94M3J0j83K19n7k2KK1j06k42L25j4k91J51
3746d8J10k24K61k76L01j74K36j74k6m0L32m55J07P7J6J31j52R2r1j41r8K33O2
3769E9k6q4O3m3R5KM1l22K53l6r6j70K63nN0j92K13p0q8M3k6J67J4p5j54J18K16
3796B10l71Q5Q9j32JK09q6J76j4p8N7j40k1R3q4J3l0j14J96j49q0J49n4j69J49
3821i5R2P3j18o3J86J9k20M9K45j55m4J52j11K1L2k81J20J07J34j13j00M4K18
3844A92j35j3j7k34J91J21K5O4ok47J06j06J07r9l4j57N0pJ96or0q4L05j43J38
3869A17N3n0J4j03o6nj96L00m3m7o3L8j52J33q2J71L9j81J47J01k87K28kK1Mk01
3895a12J92O2k87mL15l37J08J45k23K08Mk26K63j50j1L4J78j87J00K7K0mj17J86
$$ y = [-31, -32, -123, -132, -42, 203, 116, -303, -124, -103, -126, -113, -98, 96, 139, 149, -34, 185, 128, 106, 108, 129, 23, -219, 106, 92, -199, -48, 62, -162, 99, -177, 124, -50, 186, 12, -14, -54, 278, -177, -70, 7, 23, 154, 2, 94, 3, -138, -236, -3, 59, 33, -51, 12, -31, 64, 66, 107, -215, 38, 2, -94, -264, -1, -6, 44, -148, 65, -5, -93, -50, -76, 91, 105, 30, -124, -6, 210, -161, -76, 13, -119, -118, 91, 5, 181, 167, 89, 146, 6, -15, 78, -6, 7, -23, -137, 59, -90, -170, -21, -75, -244, -95, -3, 70, -48, -111, 75, 94, -126, -77, 168, 13, -31, 121, 10, 31, 63, -218, -98, 9, 143, 30, -70, -26, 192, 57, 44, 27, -207, -16, 105, 130, 194, 188, -59, 47, -59, 48, -51, -85, -242, -192, -199, -3, -9, -99, -183, 122, -21, 117, 170, 120, 134, 31, -35, -40, -236, 64, 21, -26, -89, -51, -203, -70, -152, 19, 58, -123, 24, 125, -162, 66, 64, 85, 89, -112, 80, 142, -145, -149, 166, -171, -63, 82, -141, 67, 71, -155, 108, -42, -53, -19, 159, -28, 72, 99, 119, 115, -2, 184]
3919A84o5j67P5r6q7J40j97L83J07l91J20L7K4o6L7P0Q5j96K9P6j9M8j2l19L11
3944A11o4k6j74j8J9q4L36k58J82j3n9J23p6K02j44j27J40qj82K41N0k32K97k46
3968a0j34M1j23J79L7q1J13K86m19L3Q4j44J72J3L2J21j92j43K03j95J84j2j62
3991a17K24Mn1k91J89%Pj46%J18J39l1j05J54J4j05jl1R7N4j04q7P9J8j63J71
4017C6j03J56l52J92Q0O0j58J15k56K61j8K07M7p3n0j16Oj23nQ6N4j98J40jj67
4042a80n5J75J84M5j44M2l3l0J16l7jp3p8L44k65j25l6o1J47j3q3l7K10k35K87
4067F4J7j71L18k68p2J05n0N2p7K26l16R0q0K19q9N1j92M5K20J2l41L25j50L7
4091b5J6j10L2J13P6o7K5k25J02j39J63m7K04k50J79J01j94Q3j72lK02k1o3P0
$$ y = [184, 119, -48, 27, -69, -156, -16, -213, 170, 277, -114, 6, 43, 67, 1, 38, 108, 193, -3, 26, 102, 83, 131, 119, -200, 111, 47, 21, -153, -171, -152, -236, 100, -158, 24, 11, -48, 75, -1, 201, 57, -70, 70, 62, -120, 121, 171, -61, 236, -10, -144, -103, -226, -47, -10, -91, 22, 308, -111, -78, 6, -138, 34, 47, 79, 200, 8, -135, 68, -127, 57, 45, -117, 107, 111, 60, -231, -42, -42, -35, -181, -181, -63, 76, 45, -60, 94, 108, 3, 2, -29, 68, 122, 18, -69, 10, 28, -135, 36, -67, 89, -263, -71, 9, 69, -89, 26, -230, 31, 13, 220, 267, 194, 144, 28, 34, -89, -94, -8, 46, -152, -12, -13, -180, -235, -60, 124, 169, 25, 67, 34, 4, 120, 83, 82, 9, -69, 275, 10, -115, -151, -212, -65, -78, -161, -198, 12, -223, 64, 81, -90, 228, -40, -112, -7, -57, -5, -82, 144, -172, -82, -162, 57, -32, 19, -173, -128, 92, 104, -237, 88, -62, -25, -9, -119, -87, 26, 102, 35, 60, -165, -63, -202, -39, -86, 118, -132, 47, 148, -46, 37, -135, -138, 64, 43, -20, 50]
4115E0L0k0p2j63K23J0Q7p2k0j02O8R8q1Kq1n4j38J77j29K19j03K62k04K9j68
4140a52J10J81j20kQ5J54l81J87j70K32j87P0qM0q9q4J57j39J8K61L0n5P6k72
4164e8J74q4p7N5O6r0j0rK2k87L16N1k09l0L40J9n5j66R2n4J06o8Q8n7J29k95
4190i1P6N9l44J56j30K16J42q0l7M5O4K5o2r9Q2j25K59K0j70Q4j64R7J55k32M7
4215gk4K8J14j45K9J42k26m4L90k27k51K03k41N24k01o8k5R9k15J88J64j76p4
4238d3m0L5R0m10M14m0j11J12k49K68J11j25K80k43qr7L06l12L03l81P8p9J02
4261c9J03j1l34K26J65j75J28j31l1L99l82K83j11j25Q2M5l8M6q6j73N2O9J06
4284F8M2k97j37K78K56k60J38R7j50J05j85J18R6Ol66J77k53L85m3l06K04L5J38
$$ y = [50, 80, 60, -12, -175, 48, 58, 145, 73, 53, -49, 19, 117, 36, 38, -43, -97, -235, -58, -187, 32, -71, 191, -13, 16, -152, -42, 139, 19, 17, 102, 256, -125, 62, -108, 124, -63, 7, -1, 39, -50, -134, 23, -116, -98, 163, 193, 138, 214, -58, 116, 32, -45, 10, 76, -14, -24, -33, -11, -298, 18, 69, -140, -170, 170, 189, 134, -32, 60, 6, 112, 44, 132, 75, 204, -91, -15, 44, -300, -144, -274, -58, 84, 4, -33, 12, 76, 101, 39, -60, 22, -103, 156, 176, 6, 90, -74, 23, 178, -54, -7, -31, -3, 111, -34, -5, 137, -89, -133, 257, 30, -221, -18, -259, 265, 64, -4, -29, 70, -145, 43, 207, 31, -43, -83, -48, 42, -368, 46, 6, -105, 7, -242, 26, 137, 12, 292, 49, 41, -56, 250, -62, 241, -140, -62, -141, -39, 64, 53, -281, -55, 110, -65, 63, -68, -99, 300, -82, 201, 90, -35, 47, 92, 54, 100, 14, -159, -107, -38, 68, 110, -187, -324, -46, 210, -50, 88, 185, 35, 140, -45, 73, 169, 175, -191, -14, -267, 118, 75, -231, -27, 8, 146]
4307A46j16k7O9j89J15P8j41k0J87j17J22J6p7j21K31j56rk1O3k94L45K3l2j54
4331g9J87o1k6j44J75j67J43P7k42K15l6j4o1j30J81J0k1n9K22k54R7K0J4j40
4355i3K5J25q7o4J61O9k60L13P4j36n6j69J16ql3n5J60l16J58R6O8j66M1N1j22
4380a08L1q7K77j60PO5m5K86j10j12Q1m3l01J53J8pL9j89K56o8o0j18Q7J30M3
4405F5N3K08k24k2j78J97k15J37R3j97L2N4j52J17j61Q9j7jj6K09j37j20K43o1
4429dJ78j31M1j52q7K07N5j34k8K33k72k4J50j88M3K94k75n0J82J89k15K00j50
4452F2j90J92mM1kk21l0J99o8K9m1k6O8j98K43N2j11K47k84J92M6j90J09k01J81
4477I5Q4j09q7pj20K07r4r7K00k04QP6J4j22J01J02n4r7L37n24N72k80m2J88j41
$$ y = [146, 30, 3, 72, -117, -2, 76, -65, -85, 102, -15, 107, 123, 46, -75, 156, 0, -9, -30, 33, -261, 84, 107, 75, -79, 108, 47, 21, -123, 52, -115, 28, 105, -137, 78, 42, 28, -33, -163, 18, 28, 7, -52, 170, -84, 13, 33, 47, -93, -68, 57, -30, -94, 67, 136, -124, 189, 263, 127, 71, -98, 18, 10, -23, -78, 82, -234, -76, 20, 88, -78, -37, 14, -108, -77, -164, 113, -47, -40, 25, -20, 266, 156, 44, 125, 82, -219, -66, -48, -55, -16, -205, 51, -17, -77, -195, -108, 22, 65, 118, 326, 102, 80, -98, 99, -116, 21, 114, -83, -51, 3, -149, -32, -193, -104, -121, -122, -138, 71, -66, -186, 57, -4, 174, 43, 84, -68, -155, 52, 107, -27, -55, 178, -94, -118, 32, -156, -113, 181, -94, -144, 38, 227, 12, 212, 62, -128, 64, 60, 101, 99, -122, -152, 47, -21, 8, -33, -59, 9, -189, 54, 106, -5, 242, -42, 150, 196, 6, 115, -86, 95, 179, 70, -17, -24, -144, 63, -31, -128, 72, -132, -124, -48, -34, -156, -55, 47, -7, -104, 233, -291, 281, 1, -41, 147, 6]
4502Fj3n2N0o4R1j56J27o2Ro8n2K32O6j52M9r8J40J11j12Jq9N5J01j33j44J97
4528D0j43M4k6j29K34j21p6K65l04K13J02j62K8J24j31o1J75M5m1j31J04L4k84
4551b01J66k54M06l5j41O9j10K33k10J04O9k02K02R4j87Pj45K38K24m21j29N0
4573a73J15pJ72p2p7J33j69O7q7J15j70L10o7m1K1j67L9K18j65j23J63L2l73K55
4597e1p7J25o7j41K92r1j00J58K2q1P8j45J66r3m5J7n8n6J89k79M45l00O2Pl2
4622e5L6N2j2r5RJ51K7k22K87R6l38K22k31J7k3j64L13r8Mj10J42mj68J63K01
4647B00k59N6P3p7J44N4k47O7J07l9k01J55J02k76P1N0R7n3m9j2J21o8r8M9j27
4672a60K29p0L6J16M1j69k06K13k4n8L2NP8lK65l70q7K05p7r8J39j02j34K29j76
$$ y = [6, -7, -59, -9, -73, 18, -138, -11, -73, -64, -132, -184, 48, 114, -38, 11, -87, 53, 164, 52, 53, -36, 19, 120, -13, -157, 40, -103, -59, -85, -214, 20, -101, -177, 88, -216, -3, 99, -63, -35, 89, -42, -103, 72, 117, 76, -55, 49, 83, -201, -35, -289, 117, 82, -59, 10, -100, 133, -77, 27, 96, -106, 96, 190, 3, 10, -135, 103, 327, -94, -223, -173, -58, -65, 107, 35, -42, 91, -78, -11, -98, 17, -153, 157, 90, 49, 70, -97, -58, 160, -5, -128, 35, 67, -306, -51, -128, -3, -70, -211, 81, -10, -110, 48, 70, -11, 67, -78, 88, -5, -50, -33, -91, -147, 42, -237, 208, -92, -30, -23, -55, -19, 33, 21, -74, -65, 86, 113, -109, 178, 274, -64, 158, -73, -56, -79, -243, 70, -28, -24, -134, 8, 4, -164, -1, 200, -59, -3, 70, -7, 137, 191, -56, 11, 118, 79, -122, 33, 135, -141, -70, -20, 77, 24, -25, -37, 84, 16, -82, -33, -160, 69, -1, 35, 151, 192, 23, -183, 30, 6, -52, -20, -15, 63, 60, 325, -45, -132, 73, -4, -102, 37, -65, -199, 30, -146]
4697a46K58n1J30k36J43k35K39j13j50K28j66M0j20K09j69J37q3m3L23j87p1J4
4719d9J3J14l1J1M2K7k15K23o1k4nJ25J0k39j20J87J0j11N8j15K64j90N2O6r4
4744e2L9M2M8k45J81j43J91q4O6j38J67k14PL3O0r1L0K6J71j30j15L83j52r5j07
4769a22J1J98j03n7K36k80K9J41k23J86K5N8k9p3p6J18j16oK54j64K23j40J5q9
4793A6m0k29N3R9L8R2M4j90R9L5J2j15l1L84l48P8k17L34J3q3K4l14L64j13J98
4818B03j97j8K6o9k0j07K19j51r8J58P0Q9P9k07J24m7J41j09k00K03j48J36j51
4841g4q3j18R2J99m1r7M7J48j41j84J09N3J39j20j50J75O4p5K48k38K00j54k03
4864b04J73O7l7r4J15L7mq0p0K69j75O1J46K7m3k01P5Q2l66J73o8K9m5K38p6k58
$$ y = [-146, 112, 61, 191, -45, 98, -137, 102, -11, -161, 67, -99, -59, -179, 30, -139, -2, -85, -128, 195, 8, -63, -49, -36, 78, 47, 58, 100, 127, -88, 135, 74, 50, 45, 170, 180, -59, -179, 8, 18, -93, -35, -150, 114, -76, -24, 42, -52, -13, 29, 77, -168, 13, -130, 61, -23, 43, -95, 72, -142, -135, -102, -42, -133, -103, -77, 94, -36, -151, 232, 80, -15, -122, -111, 87, -16, -73, 163, -117, -88, 53, -170, 16, 41, 99, 70, -3, -79, 39, -77, -83, 171, 7, 230, 90, 105, 16, -24, -253, -200, -101, -63, 29, 73, -117, -18, 17, 29, -86, -117, 267, -81, -3, -220, 114, 127, 44, 68, -246, 118, 5, 203, 6, -12, 14, -55, -75, -182, 37, -114, -212, -54, 16, 105, 184, -23, 101, 54, 195, 86, -114, 89, -59, 77, -74, -157, -275, -183, 16, -25, -122, -75, 73, -68, -252, -143, -90, 49, -71, -221, -46, 18, -57, 191, -47, 153, -1, -204, -31, 36, -1, -95, 20, 57, 53, -27, -97, 172, -3, 58, 204, 231, 188, -13, 62, 144, -222, -49, -117, -88, -133, 105, 29, -229]
4890b29L4K20j20J15O6N5O8K5k14jJ62k40j5J2O2j37J33j38J24p6J39J07Oj92
4914c4N2O4j15J33j70q2Q0j1J33ll4j65j7K84l2j66K08r2N2j39M9P2o3P1J18m09
4940b16J57j91K76n4l9lR0Rj42J88n1j37J08J59l49K37M2j76n1K11j45J94r8J95
4964B14l03N7R8p3O1j70N8M3r1O4j2l6M6k9K04j91l5L13k08r3K2J45n1o1J78M8
4990A98m31K87Q3m2j83Pk0J14j68J18r5j60K65R1j27R5l4M4P4j48O9j35J24l5
5014il0N4q8j74K26qKp7J8j24L10j0j2M4j72P9p2k4l0J56q9J3R2j35j52R9J55
5041D2k21Q9M2k5K9J6Q1j39l1Q9j26M46l72MR5o6N3p4J64r2m6n4MK83l38J14J02
5068F9j0r2P7j20J42N5k01M4j00J22N9pQ4k20j10K96K1k4R3l56R8m4R2R2j52K39
$$ y = [-229, -195, 25, -95, 20, 86, 141, 209, 234, 20, 19, 181, -59, -74, -62, 0, -137, -4, -142, -18, -94, 45, 152, 158, -34, 18, 82, -33, 100, -70, -152, -72, -83, 50, 47, 13, -152, -169, 115, 83, -83, 125, 33, 85, -54, -5, 67, 4, 75, 193, -216, -59, -250, 26, -28, -67, -70, 20, 29, -113, 75, 24, -113, -5, 154, -195, 42, 84, -92, -143, 68, -77, 117, 19, 214, -89, -32, 66, -7, 54, -116, -58, -15, -106, -42, -54, -90, -44, -73, 131, -60, -95, 218, 10, -83, -61, 84, 33, -28, 150, 198, -233, 54, 137, 95, -88, -81, -101, 13, -155, -37, -132, -292, -27, 64, -63, 32, -2, 42, 116, -32, 37, -98, 26, -9, -39, 15, -73, -247, -21, -29, -27, -104, -86, -210, 100, 90, 78, 122, -50, 29, -43, -67, -97, 59, -30, -17, 75, -60, -212, -113, 42, -179, -90, -48, -73, -44, -28, 53, -86, -117, -28, -154, 292, -80, -76, 19, -47, 6, -68, 96, 4, -42, -96, -92, 191, -147, -33, 69, 59, -33, 44, -76, 66, 121, -80, -36, -136, -14, 45, 38, 122, -98, -208, 88, 109, 85, 178, -178, -80, -124, -32, 60, -92, 147]
5094A47j56j17K61j41OK15k63l26K47K92k26m3Q1o9J68Mj72J38k16j4J58l0J20
5117F4j35L20j84k05J48Q3r3k8K2j47j3J4J13R8K7j32J0m8j38m0K02R9M1j07P
5142b2Q2j38J58j33m4J2J60j34k0M6R3JJ10j61J57o1M0k6k03J27mj38J47L6QJ67
5168B60l32K62p6j24l7k59K56N7j41K14j78M4m2o8K68r8q7J96N9K1k44R1J0p9
5192b7K9r4R1Q0l7k62K64K4ml4j28N4j43l1J63j5L7J31N0j24p3K28k17K9J12j29
5218b6P9j78R0J64l59L01m1P4K5k09q6J25PM1K13j19k26J04J98l07j02J89q4P6
5242e1J11k21K71po3J04k59J33r4k4K28Ok56J74o9k55L23k6j7mJ33j35n4J06n6
5267bj18R5J79j98Q3k24K79q3J00P7q8j95M1R4p6O4%kJ50l33K12P4j23r2K55k29
$$ y = [147, -9, -126, 135, -6, 0, 215, -48, -374, -127, 165, -61, -104, -23, -92, 76, 80, -92, 46, -170, -184, -26, -56, 64, -71, 249, 65, -140, 8, 91, -2, -30, -8, -155, -168, -154, -41, 57, 84, -48, -38, -86, -224, -264, -62, 37, 78, -29, -22, 60, -78, 80, -53, -97, -85, 75, -59, -79, -33, 60, 61, 171, 10, 167, 106, 146, 120, -83, 44, 40, -98, 49, 85, 93, 260, -72, 190, 114, -10, -47, -306, -50, 7, -134, 80, -98, -54, -96, -164, 104, 6, -81, 115, 174, 195, -49, 42, 52, -27, 2, -92, -1, 79, 42, -220, 44, 68, 64, 30, -98, -44, -187, -218, -55, -70, -33, 98, 148, 24, -49, 179, -38, -9, 103, -26, 53, -125, -35, 129, -230, 71, 30, 104, 129, -80, -166, -41, -34, 7, 220, 101, -125, -21, 177, -130, -232, -43, -127, -51, 60, -161, 110, 103, 40, 144, -115, 18, -76, -100, 128, 134, -122, 52, -17, -272, 51, 25, 8, 4, 137, 2, -52, 54, -2, -120, -25, 154, -44, 39, -185, 94, 11, 111, 188, 100, -95, -54, 40, -36, 28, 28, 26, 176, -157, 55, 129, 6, -86, 169, -60]
5293f0K20k31K2QM8j45J58mj72J46j31P1J77j24l0rk22L27j9j15oL0J24k30K1
5318a46M08l78K36j02O8j90R9K4j29J35j21K27j89J10M6Rj35k4NJ24n5k05O7K98
5342A82k97J31J14j02l03K35N3q6K06j46k1q7P8L8J3j86K55lm0J5r4N4r9J18Q9
5367A17k47K81Q5j45kk60O1K9J94j89j2o5J66J39l04J02jj19K69l7j89J91j13
5390d9R9J63k01j07q1J85j19L2k5l5K43k64n1J79k6J14k7k0j16M5J98j84p6p0
5414a93K17o1j12Q9J48j94j36Q0K49k65K99l86R9K70k18J13m7j00K13j82J09R2
5436H4n9k13K89j50j5J26J3j40k73K56mQ9k51K37J66j34j0K2J48j87Mj62K52p2
5460A6K1M2K1j95OM6Q3P6n0K3j49R8m1NJ21q7k09L14j65O5N9q2Mj02K9L2o3K22
$$ y = [-60, 160, -71, -49, -41, 7, -138, 20, 16, -156, -10, -141, -70, 107, -17, -47, -56, -278, 49, 30, -85, -91, -61, 63, -167, -146, 262, -116, 120, 18, 86, -104, -5, 19, -110, 25, -96, 131, -58, 52, 98, 107, -28, -52, -47, 77, 22, -183, -116, 182, -115, 16, 130, 28, -275, -40, 13, -73, 133, -13, -34, -121, -43, -5, 8, -178, 77, 74, 34, 49, -45, 9, -90, 28, 117, -130, 151, 236, 91, 89, -171, -110, -81, 113, -76, -88, -153, 13, 152, -152, -50, -51, -170, 99, 62, -127, 64, -49, 50, 213, 12, -95, -176, 9, -110, -78, -103, -138, 105, -159, -210, -31, -57, 57, 30, 10, -106, -61, 137, -47, -123, -193, 24, -37, -149, -60, 88, -106, -242, -162, 87, -178, 121, -265, -166, 104, -114, -1, -48, -148, 65, -117, -8, 84, 25, -188, 101, -49, -64, 62, 75, -65, -338, -82, -86, 3, -248, -11, 155, 21, 11, 33, 181, -6, -2, -164, 88, 16, 37, 79, 100, -95, -89, -43, 40, 116, 66, 89, -60, 38, -3, 2, 123, 36, -173, 141, -24, 41, 100, 18, 22, -80, -51, -19, -82, 140]
5488A40o8J65k30r3M7l5L04k80j9N5j1K31k92J9J4J36L7j65K18j24j01N6l5M0
5512Ij9N6q5j43l9N5J59m4J3jJ88j22Q5j10K9l6j39K02K0O9j28J04N6l85K63M2
5538I9m0p6k3N8Q6j74k4J08L2k57J87qO5J18j02Mpj85R9J71m8K9j52J32J63j54
5564A01r6jq3J87j88J22j9o5J63j03j00o6J72j13j06J85L4o4J37k62J60J5k5K
5588a3J6n4K58m11L57r6k34J72kn0J24j22J62j21K7%R1k81K25k05J39k5n5n1J78
5613B9LM2k2R5o4Oo4j2pK8R4k73K70k41J90n5J23k88J93j70J1J62p2Qr7M1o5n1
5641a86K85m2j19M2K75k95K56m8l01L6P7J69L3j44K11l18R4p1K4LJ09q2K7j4J2
5666C3ok44J86J01j72j48L33o2nJ57k54J25j68K16p2l9O5J34l47K41j44jj4M3
$$ y = [140, 72, 237, 7, -86, -39, -74, 230, -50, -69, -14, -25, 206, -86, -67, -53, 83, 120, -45, 173, 49, -52, 4, -31, 9, -10, 46, -39, -182, -221, -166, -7, -51, -38, -39, 149, 27, 112, 2, 31, -5, -144, 58, 78, 147, 19, 123, 179, -206, 57, 99, 59, -17, -40, 18, 104, -70, -94, 14, 46, -211, -24, -32, 33, 151, 49, 53, 46, -139, -40, 131, 83, 112, -40, 92, 255, 101, 5, 4, -79, 108, -80, 42, 23, -42, 121, 18, -82, -148, 24, -89, -195, -10, 24, -40, 97, -165, -5, 10, -15, -13, 3, -51, 207, -204, 153, 57, -177, -5, -7, -57, 67, -55, 107, -14, 13, 13, 104, -177, 48, -157, -18, -43, -98, -149, 29, 32, 74, 52, 147, 83, 89, 25, 13, 6, 34, 128, -145, 125, -116, 74, 19, 142, -146, 47, -123, -112, 50, -22, -14, -111, -70, -135, -186, 99, 57, -62, -20, 255, -40, 216, 168, -133, -97, -20, 149, 182, 38, 249, -69, 25, -46, -22, -19, 90, 8, 35, 21, 33, 27, -217, -31, 70, -102, -250, 83, 21, 16, 173, -81, 44, -124, 92, 20, -19, 46, 180, -167, 74, -70, -71, -85, -42]
5690d2J04Oq7N6k4m5J43j31J73j96j12K2Q3k2J12mk2M8r3p8l0L04k94P7J81j60
5716c1j59R4J20p0J86n9j71R2j48j8K41k8j59P3M8k02J18m4J1Q3M5q1J58j31O6
5741C4n9P6J18j9j0l4j24J22j64N4Rk4J43q6j10J8p6J9R6l0r7J27m3P7q5o8K91
5768A55k76J37OJ17l4j39K07m06N28l25J72k60K26o7N6j64J75r0k4j39J49p6J61
5791H9j91K34o0o4r3J88j24K01J14k55J58k21K17j21Kj65R9k42N39l15J56r9k5
5814B2j26L1J15N2k97J22L67l45n8K2J62J2q0q5L07j41K9j26M4L5j06j54K79l0
5838E1rj8j29K68j59M5k81J32K54k32J5qK75j70j43M1J56j32Qp0J50m0pOQ7k69
5864a79J69K6K4K24m29K31O0K7k35J14j27J21J12k93N4K93k37M8K2M1j0j65J62
$$ y = [-42, 62, 68, -19, 37, 13, -32, 111, -20, 153, -43, -155, -133, -50, -72, 40, 36, 14, 62, -31, -109, -139, 165, -129, -52, 129, -31, -190, -96, 24, -46, 140, 81, -90, 2, -146, -164, 77, 49, -110, -37, 11, -191, -73, -117, -106, -23, 22, -59, 99, -32, 34, -25, 51, 169, 150, 140, 106, -18, 104, -60, -6, 3, -21, 122, 36, -74, -56, -132, -113, -17, -47, -144, -17, -60, 17, -68, -136, 155, -121, 16, 22, 139, 105, -34, 173, -233, 295, -30, 142, -118, 108, 41, 97, -67, 108, 18, -6, -145, 4, -72, 89, -102, 132, 72, 8, -85, 103, -21, 180, 294, 39, 197, -24, 193, 72, 74, -91, 8, -234, 305, -10, 146, 47, 22, -104, -73, 42, 94, -203, -81, 286, -59, -117, -95, 67, 79, -1, -86, 221, 80, 109, -17, 27, 62, -44, -198, 81, 51, 42, 24, -105, 163, 4, 49, -232, -100, 154, -78, -63, -71, 204, 34, -109, -68, 88, -44, -36, -106, 44, 4, -3, 3, 90, -179, -10, 16, 40, 264, -165, 66, 126, 153, -82, 32, -95, 26, 138, -155, -101, 192, -45, 3, 25, 66, 56, -109, 53]
5887E3n2K49j16j19l0K3L6k13M2K19j84J53rlo1j8PJ38n4l1j8Nq3L52n04K03J30
5914A15m7NM4k23K22rp0p5O8l4Q3j01k8P8Q7O1l1l5k48K78m4K6k64L19k70R3J51
5941A51k41L03j90j32J18J5L1P5L9l00K41j57m0J08j22K8q6K25j77k6k7K86k13
5964i1K84p3j06j66K73j45J08j30L2o0P8J35j20O4j35K83k57R2Q8j45L9jLQ8j00
5989C8r9L0P3P4j5j21j18m1J93n7Q2l4j0l2jL2j12l1J5J36J4l8J68o3j84J71l51
6016b81L16l3K37k87J83o2m7K9k51L5P6N0K8j66k4J74O4J0k93K51J88k06O5n6
6040@J8k30J67J61l2j81m7L03k46J63pn7N3%j85J02j3L0NO8k9P8j94J50j2r8j01
6067a34J86LJ00j41J49j75Q0p3j56J71J76k54J15n1NK37l10J39O0m01J69k1O5
$$ y = [53, 1, 250, 134, 15, -15, 8, 44, -169, -127, 92, -92, 61, 52, 49, -12, -30, -23, 115, 61, 30, 12, 17, -66, 286, -218, -15, 115, 68, 73, 117, -106, 116, 107, 37, -38, 30, -4, 79, -22, -50, 28, 115, 176, 145, 110, -138, 140, 96, 122, -142, 177, -93, 0, 151, -90, 213, 23, -109, 9, 24, 55, 130, 169, -131, 110, -47, -87, 21, -101, -73, -159, 66, -111, -137, -164, 122, -91, 193, 120, 14, -152, 121, -24, 84, -46, -14, -74, 4, 139, 19, 83, -52, 231, -26, 66, 154, 9, 48, 47, 50, 138, 38, -61, -31, 42, 116, 101, -20, -138, -179, 14, -43, 39, 5, -5, -37, -38, -6, -118, -149, -134, 2, 16, -22, 146, 83, -101, 70, -281, 35, 2, 239, -48, 135, 73, 26, 55, -196, -161, -85, -35, -7, -173, -197, -23, 41, 51, -242, 9, 197, -9, 56, 0, 18, -212, -45, 116, 84, -97, -144, 159, -87, 76, 69, 12, 65, 65, -120, -18, -31, -1, 4, 72, 43, 121, -73, 77, 65, -33, -134, 52, 55, 155, 14, 163, -12, 68, -5, -161, 10, 186, -68, 47, -4, 1, 238, -72, 67, 127, -274, -105, -126, -61]
6090f1J4J1J21l19L12k14K27j22K67j77n6j93K14K20j56k09J56k0J00l6r8J57
6112A38j09J1J62k08M0J0j34P7M1M3j10j4j63J61J10L1J03j55M9j11L2J40j17
6135B7M5m17L42J70j62J3L8j01j94L65L8r2j62K63k54K13j94p6J0K49k26N4nl5
6159i1m5R1L6j10o4K30l6n0M1j24L9j09J06J9J97j47J59j73j7k12L62j47j31J14
6183f2j03K64o9m7M4j41%r7K22N6M0k50J17l2Q3J57j66J29Q4j67l03K38l4j21
6207a58K36n2n5j03NR0k6m5L22k83J24o4l4M0j82J81j51P8K16k6k77K96l1k75
6231a74J91n4J65j31J22j15R2J2j41j4q4J87l0J56j20K7k40J73j16L22k38Mj0
6254a6n9J59j0j42l7L5j18J91P8j80J41l3J8j03K83m15K26r5L6n5m2J95%N2K0
$$ y = [-61, -47, -36, 85, -234, 78, -136, 91, -31, 236, 59, 3, -190, 24, 244, 88, -121, 35, 15, 115, 79, -19, 138, 29, 40, 202, -6, 34, 44, -90, -13, 28, 71, -39, -53, -216, -55, 55, 86, 189, 34, 83, -28, 4, 144, 27, 72, -345, -3, 167, 5, 18, 56, -45, -239, 126, 164, 72, -90, 173, -81, 132, -62, -138, -128, 121, -105, -51, -56, -91, -136, -45, -9, -119, -183, 47, 11, -39, 2, -122, -83, -192, -86, -67, 130, -17, 142, -31, -48, -260, 102, -45, -176, -62, -165, 99, 30, -17, 27, -114, -114, -211, 11, 67, 107, -143, -26, -58, 25, 182, 16, 145, 229, 62, -241, -3, -37, -158, 78, 26, -29, -132, -127, -37, -63, -108, 214, -69, 55, -9, -43, -3, -185, -4, -155, -77, 139, 113, -164, 132, 101, -174, 17, -37, 128, -3, 119, 4, 96, 108, -33, -47, -131, 56, 26, 182, 62, 89, -151, 22, -94, 228, -10, -6, -16, -75, 84, 74, -68, -105, -70, -188, 3, 81, -99, 42, 9, 27, -76, 207, -208, 18, -77, -41, -96, -138, 57, 57, 109, 129]
6279A29j09M0Qr3n4J46L8q3L3p7k7K8J05q2M4l50K51o3K72j61J02j49J04N7j64
6304e5J7K53l27j2J81JO3j22J08k94J97k8P3J19j55j60J73l6J27l4j84j5P8M7
6328A5M6q1n2K51k43j06R7jL8J40j05n4o7q7J16K6m5R1o3j27J12K4K03Q6k93j3
6354i2J9J18q1R7O5l9p8k19K98j89K20j05j8j31N9n1J36p2J98j69k0N5j34K37
6378A04j40K2Q3j10J80j09r7J93j49K0N0j13mK28k76M4K5j87L5K47n3o8l1N3J24
6403G1j02O9j11K33j43J59j62J4k9q6L12l21K00j95J57J56j54q0J32k23k4J87
6425F0p3J44j36r1J69J07l51J64Q3P8k10n7K59j46R1j69J25l6O3j83K57p9JO2
6449A32j19l4j22J90k00j52K99K00j25j30P8n1N4J25j63J82j10M6j94P6q6mJ55
$$ y = [129, 20, 60, 68, -25, -79, 67, 105, 22, 55, -22, -49, -21, 84, 2, 46, -304, -53, -116, 156, -5, 97, -52, 52, 109, -55, -38, 215, -112, -124, 57, 58, 121, -1, 107, -187, 10, -18, 55, 174, 19, -141, 32, -4, 123, 89, -95, -110, -32, 15, 61, -20, -72, 179, -64, -170, -73, -74, -36, 104, -1, -55, -122, -209, -93, -67, -112, -21, -84, -211, -99, -75, 128, 214, -79, -92, -73, 45, -36, 61, 126, 87, 9, -210, 88, -101, 119, 14, -4, -135, -76, -127, 9, -63, 135, -34, -54, 1, -133, 104, -36, -14, 69, -41, 139, 30, -67, 126, -23, -3, 47, -66, -70, 158, -118, -74, -49, -236, -201, 46, -7, -75, -106, -53, 71, -31, 38, -73, 160, 17, 176, 14, 28, -1, -87, 225, -96, 104, -91, 66, 222, 68, -12, 120, -103, -127, 60, -13, 131, -5, -96, 73, 180, -171, -7, 76, 154, -56, -113, 146, 0, 91, -78, 47, 11, 74, -109, 148, 69, 70, 132, 13, -21, -143, 47, -153, -305, -6, 194, 69, -61, 17, -34, 20, 145, -18, 164, 54, 100, -94, -18, -104, -108, 47]
6472D7j16L2J52n5k03p2K43l1J8L3J80k76K08Rk70P3m0J62j80m9K27p2l8J74o1
6497I5k18N4L0O9j0J5J6n4l8J20n3j01J42j48J61q9j18K79j47J71k92J61k65J48
6521g2j21K21j87K41m0k74J03m9L3J55r2m3K54k06J2J4OR8K8pN8pj44N3K9j10
6547d7J15n7L5j13J78j46n1J05n4M7N6lm1j54Q1M4MJ08M7k13j0l7M3J5J68k0j99
6574i9J22K44m17j6J76q5J93j13Q1Qj97K3O6r3J69j70Q1J36K1k39q8K25J9j26
6598g9k9Q9n9J17j22L2P8k3J38j90q6J60J95k84J2M6J04k74J19LJ90p4L3j82j7
6623a03j5j7M08j35k61J06kJ35j35K2n9R6KJ3M5j70J82k79J55M3J13j35k2k4J97
6648A60l19K38J12l18L1N9j1J60j8k63J16Jk9R9q7Q4K4p1o7j24J76j01J28l7M9
$$ y = [47, -69, -37, 115, 60, -143, -215, 28, -3, 15, 48, 228, -48, 160, 169, -101, -28, -68, 94, -86, -135, 92, 20, -18, 156, 95, -123, -69, -39, 30, 20, 35, 51, -3, -41, 79, 26, -75, 67, -81, 80, -9, -127, 152, 5, 176, -116, 45, -220, -72, -193, 28, -159, 82, 42, -232, -129, -178, -145, 10, -82, -125, 129, -77, -65, -51, -45, 53, 81, 74, 132, 125, -19, 34, 63, -47, 68, 11, 46, -67, 111, -35, -86, 19, -35, 12, 68, 65, 24, -130, -49, -5, -1, 107, 154, -59, -69, -106, -63, -48, 120, 100, -99, 23, 267, -150, -166, 10, -75, 118, 5, 86, 94, -103, -80, -14, -107, 62, -108, -27, 109, 130, -109, -197, 28, 47, -79, -108, -19, -78, 39, -83, -51, 27, 4, 142, -48, -134, 26, 221, -63, -51, -5, 99, -175, -56, -53, 137, 63, 96, -86, -103, -118, -135, 273, 138, -123, -17, -19, 116, -19, 3, -56, 40, 42, 55, 100, -70, 112, -167, -12, 31, 144, 9, -13, -37, 160, -159, 79, 191, -127, -96, -37, -48, 112, 94, -169, -53, -52, -81, 18, -69, 15, 39, -32, -99, -223, -47, -148, -20, -57, -8]
6673hN8j41P1k9J94l60J35L04k76Q1JJ31k25J65j00o9J36M7o3O8o9k08O5Q1o6
6698g7N4J14j79K42r9ol0j36Q2J33p3p0K16p9r4J40k48J70P3n9l8J9Nj31J13l4
6724Hr0O8o7J47k5K0q2K3M6k11K77L8qj25j55J01Q3l15K85N3l9nJ65j49R1k00
6750f6q4K18p2l8N7J34j00p0JJ08j08N9n5m9J3o0j03K10m1p9J86n5o4R0r8R2k09
6777a83J16J85k49Q5K24k70J59J64j90J32j68l0Q3R3k59Rk4J70l3J12j74J38L7
6800A27q6k16K70M8p8j52QK7p4K98j17k74J17J43k39j9K43m4K14o5j89K10j06
6823D6l2Oj16M6k5K67o7j46k33M58k72J23r3Q4J94j91j20n6K68q5r2k1K29j99
6847b7M8k36L48j77j27L26j96J35rk38J80l4M5p0J16j39J33k9m3o4K07J0j45k7
$$ y = [-8, 50, -91, -20, -49, 145, -215, -80, 224, -52, 29, 30, 161, -64, 101, 1, -68, 68, 115, 52, 120, 51, -157, -92, -11, -77, -23, 91, -88, 154, 55, 49, 19, -117, -35, 98, 25, -45, 171, 92, -2, 138, -110, 60, 133, 74, 36, 55, 60, -71, 42, 8, -82, -14, -81, 66, 41, 61, -21, 2, 48, -163, 114, 152, 144, 19, -136, -35, 48, -267, 18, 71, 32, 27, 192, 43, 134, -66, -150, 68, -4, -42, 15, 149, 49, -21, -20, 88, -20, 39, -16, -65, -52, -112, -215, -5, -46, -125, 61, 6, -58, 32, -66, 26, -183, -67, 118, -131, -46, 178, -92, 67, 231, 41, 173, 5, -25, 58, 151, -108, -99, -123, 47, 14, 126, -48, 90, 127, 41, -175, 95, 143, 65, -87, -79, -52, -126, 172, 55, -219, -102, 41, -198, -217, 26, -18, 196, 131, -58, 152, 46, 14, 20, -96, -50, -75, 192, 125, -21, -254, 204, -68, 55, -38, 46, 240, 49, -71, -127, 141, 56, -36, -57, 172, -27, 21, -215, 133, -44, -171, 155, -41, 94, 85, -153, 27, -7, 38, -32, 84, -55, 78, 49, 6, -58, 149, 159, 14, -13]
6871a3lQ2k66L07o4N7k21qM7L30l31R2r3j07NP8K37p7ok0pj55L5rP6j06J12oj3
6900d7q7K37p0p2J6o8J26k04J77K3K28k73o0n0J13l3K1J71j20j88K18j1L5O1k20
6925g7J37j35J53j04J19Kj9j04PM5nM4Pj3n2K14j88m2m8J52j29P1p1J97q3Q9j66
6952Aj36m9K13k68l1L64k30P8J78j19J8p8P9LO3k22K16j23N8J88k47Ql8K14j26
6977A4Qm9J49j9J23j50n3kqk2j01J12mQk13L13j19J18k47N08l47J12m1k6k5j38
7003i9O2R1M5M1j53qJ28l77K62kK06k37O9k6m0j31K25j72O8m7J14L8k5j9M2j05
7029e0K25k19J0n8n5J00J6j0J53n3q9j6O8o4K25l35J68k00L0L49q5k8kO0n5j89
7055a04J88j80n9K73kN7r9O9j94J25r3om6j5J34P5o3m9P6j77K22n6N0q7OQ1j13
$$ y = [-13, -16, 66, -200, 107, 43, 100, -121, -129, -82, 248, -83, 9, -84, -191, -186, -108, 129, 52, 46, 26, 19, -136, -101, -110, -34, -140, -28, -34, -47, -134, 103, 33, -39, -23, -91, 35, -169, 8, 31, 259, -14, -74, -124, -11, -44, -23, 148, 28, -160, 58, 47, 82, 143, -77, 60, -75, 78, -26, 93, 95, 76, -28, -21, 24, 19, 63, 70, 57, 5, 219, 31, -11, -59, 93, -36, 35, -36, 161, 78, 167, 1, -135, -184, 29, -239, -270, 94, -136, -58, 120, 1, 19, -59, 20, 23, 86, -136, 80, -43, 15, 203, -44, -36, -74, 140, 14, 22, -27, 122, 103, 226, 76, 23, 21, 13, -9, -110, 2, -2, 6, -207, 106, -13, 105, -142, 366, 19, 131, 90, 64, 39, -99, -37, 54, 99, 140, -13, -21, 107, -270, -8, -10, 196, -41, 28, 2, -38, -169, 56, -116, -48, -95, 19, 57, 32, 13, 55, -50, 175, -44, -34, -92, -147, -47, -31, -41, 112, 59, -30, -46, 22, -42, 183, -152, 16, -184, -154, 195, 110, 82, 80, 140, 85, -104, 84, -96, -155, 118, 116, 173, 74, 143, -51, 74, -19, -25, -71, -86, 48, 123, 60, 11, 87, -90, 132, 76, 126, 39, 45, 126, 13]
7082A3r8Q7J77k28j31L62k09O1jJ46k29Q2q1J76r4L4o8j34J44m5J45L8p7k07O7
7107g0r5K43j02p7P8K06k60L29l16K34j62Po6M1L4J08J95l74R7J33r6j7q9K12
7131A93j98J35j13K85l94L3K54k36Q2j42J07r3R7k26J61n0J52j43J67Q2l27J33
7153d1K10P9k34kN0K8jL4j23o4J68Nn0j67J24K17k93K13qj17J56k83P9J12j01
7178iq0j4R2m5J50p5J23k64K9L36j70j62R6O9r8J60k10M8p7J88l1j6j69J92M6
7203A09k89J72p0p1j1L5K22j86J13J1n2j79J62q2K34k87J99J6l39K65P6O9N9l21
7227a45J5pO4QL2j25R0J24k04L26k00J6J46q4N9o2k8J15l13J09m7J80j05K01j39
7252B6K3P0j06Q8p5J4j83L72l10K81l94J24P3M0k23K78Q0j93q0J46n1o5L10l86
$$ y = [13, -85, 2, 179, -49, -180, 182, -27, 34, 33, 179, -50, 32, -49, 127, 33, 67, -1, -135, 9, -36, 109, 147, 70, -137, -70, -165, 78, -24, -101, -23, 183, -77, 252, -64, 170, 8, 15, -51, -10, 24, 132, 327, -47, 50, 183, 87, 70, -19, 193, -5, 130, 17, 302, -92, -59, 195, -41, 41, -101, 6, -87, 10, -216, -55, -105, 47, -96, 71, 153, -174, -41, 169, 248, 14, 12, 62, 90, 89, 123, 0, -64, 104, 109, 59, -108, 16, 233, -60, 153, 145, 28, 184, -99, -20, 92, -9, -89, -103, -11, -56, 94, 19, 142, -122, -93, 243, 73, -89, 7, 76, -22, 138, -72, -24, -101, 87, 56, 40, -129, 63, 109, -180, -8, -78, -149, -160, -125, 97, -89, 24, 35, -17, -196, -34, -116, 118, -169, 30, 46, -293, -28, 48, 117, 176, -145, -130, -137, -73, -65, -33, -158, -68, 56, -148, 178, -22, -6, 140, 56, 115, 53, 25, 140, -173, -64, -111, 69, -36, 165, 26, 49, 119, 13, 101, 26, 40, -143, 229, -81, 200, -194, -70, 3, 43, -180, 98, 178, -15, -95, 51, 0, -65, 245, -141]
7276a41K14J2j81K93k58M5j12K46k13O7J8L2J66k40N6N9O3p1o1J8Pr0p9J85j3
7301B2K3j42J63j08n4N0o3j39K69Qj34j24J30J06o0rMQ2K3j57K03q0P2j1k56P7
7327a05J03k1M9P2k5r7O1k0J05k07kK44N2L7Nl46k04L99j15K6j47J31Mj40j8j2
7353a71K53l2l8m2J16j46M0m6J56j03l9J90j70j31J95k01J43P7O6p2m5J70k83
7376a13K22r0J8P5J0j34O5j30K05J8r5k15J58J32j92L7j34K63r9M8l5M9j99n5
7400a91K38k1J35j61l7Q9k8O4j98J71nP3L5l8j71k1J04k34K12j11J83N0k42P3
7424c1j67K79j25O6o1J78M7k36J42k06j04J86K04r8j31O6p7J3j24J63J02k44N5
7447a03K28l2k26J32m1K66k16q5O5m0RJ78j46q9J38k0p1K58k25N7l9J4n5J12M0
$$ y = [-141, 73, 85, -96, 197, -61, -16, -128, 118, -95, -28, -10, 22, 188, -52, 4, 63, 126, 55, -6, 12, 19, -71, -150, 35, 22, 45, -97, 66, -42, -96, -46, -109, -248, 21, 29, -105, -229, -99, 7, -53, -62, -58, 24, 47, -110, 93, 13, 85, 74, -182, -105, -2, -23, 26, 98, 73, -24, 37, 17, 122, -85, -87, 157, 209, 246, 251, -95, -299, 100, -15, 11, -136, -5, -1, -141, -159, -171, 82, 50, 12, -30, 86, -60, -20, -66, 90, -13, -52, 138, -32, -163, 32, -169, -26, 51, 117, 45, 0, 170, -113, 109, 19, 37, 112, 122, -12, 53, -77, 128, 146, 51, -164, -6, 126, -66, -29, -163, 100, 1, 49, 14, 63, -136, -191, 47, 26, 161, 0, -37, 52, 24, 88, -110, 61, 56, 129, 164, 126, -45, -66, 38, -196, 16, -95, 88, 138, -104, -31, -198, 81, -44, 22, -39, 139, 186, -50, 92, -114, -218, -32, 172, 74, -57, 9, -68, -55, -179, -16, 86, -158, -103, 125, 93, -133, -1, -42, 224, 8, -77, -12, -52, -43, 135, -11, -100, 38, 18, -53, 205, -20, 37, -2, 12, -43, 69, 109]
7472A09j72M8M1j16J08o3K69J2k19K0j8P3k37K81j36J03m0o7KJ9j67J03P9j34
7496a02J60Q7lj20R6oL0P9j86l0k41L26n8Q1o8j86J90j02L1M3r0J59kO7k42K69
7522A82L2j74O0r3Lj1j14k9J45j96L23j21l6J6K14m7j82K5m5n0RJ40k5j12M5J31
7548I0j9j14q0J45j41J53j81L5J48j55L0Q7j09mJ74j47O9n9J17L1O6k30j7J80
7572F9%L9j07j55J17K05p4o5j2K27j11K6k30L41l60mK95j23l08K30Q5r8N7j5P5
7597A04m0R7r5j78L1OL32l43J92l3j23P2j92J5R4Kj17J22j04J72p0o2J71j0j07
7622f4R7L7kk05Q1K3Pl0J10kk50K50r1Q1j47R5n6J63r8R1J09j38J9J94l80J16
7648A0q2J16j36J70j51k4J36j30K06j58QK1njJ97n8p8oj02K1K28np7qk95M11j45
$$ y = [109, -63, -15, 26, -90, 18, -45, 224, 236, 17, 37, 19, 92, -145, 136, 0, 103, 63, -4, -2, 17, -150, -47, 32, -102, 58, 145, 142, 22, 118, 112, 142, 221, 35, 5, -236, 90, 32, 113, 45, -141, 49, -53, -22, 21, -69, 90, 88, 155, -87, 182, 214, 40, 100, 7, 10, -1, -115, -144, 1, -195, 128, 7, -29, -13, 201, 154, -28, -3, -48, -98, -89, 51, 26, -86, -41, 90, 71, -43, -123, 22, -119, 34, -147, -112, 36, -119, -89, -2, -111, -115, 59, -88, -19, -78, 39, 70, 136, -94, -111, 69, 69, 108, 1, -154, -37, 168, 94, 29, 17, 244, 133, 159, -71, 270, -90, -94, 201, 78, -230, 0, 85, -13, 44, 29, 104, 64, 161, 66, -112, -81, -75, 257, -86, 106, 73, -50, 22, -170, -155, -61, -59, -176, -54, -158, 14, -56, -118, 53, 43, -64, 33, 70, 68, -137, -56, -33, -26, -56, 54, 52, -198, 52, -39, 42, -105, -10, -66, 97, -1, 90, 199, 61, 80, 274, -106, 10, -72, 44, -92, 78, -73, -97, 39, -91, 115, -43, -35, -14, -19, -20, 177, 119, 41, 35, -67, -46, 182, 177, 100, 92, -203, 208, 63]
7675F3k6L3kj14K1J70j56p9J05n5J12j44n0K39k51q9L25j23R0L1k09J32L3M0j29
7700c3J68l0k59J17r4K15L7l55K66qj2J08j00P2M4r4k53P5J51N3Rl6R9j01J8n9
7726bj74P8J74r9J63r1k4p5K2K96k52j30q3J80J20q0oJ9o9k5L0K8J41j33j67K21
7752F2J08p2k88rM39l68K0J61J4J40k51J76kk54j87J49J32j29J01M5l10M78j97
7775d2j3N3M4l5K2j55l2J69j6L7K14k79j02L04j68J13l52L97Qk6j15k2R6k6j69
7800i5P7J9p9Q9j45J79N0M9j47l1M1K16j09J46k27l6J1j30L8r2K52o3K4k0jj63
7826a47oJ39j06mP4k8J03m7P6j94L02j82J36j18P7L0ol25K65J40k13J07j54O0
7850b1L0L08k83m8R5J21l59n7J68j55O3P7P6o3q4L36j85NO4m5K61j84l05l2J92
$$ y = [63, 37, 70, 68, -46, -25, 145, -11, -90, 15, -40, 72, -72, -122, 117, -134, -223, 102, -21, 69, 100, -109, 23, 56, 96, -33, 135, 105, -154, -37, -131, 84, 121, -234, 32, 24, 12, 120, 20, 92, 136, 42, -211, -136, 15, 68, 77, 41, 140, 39, 57, -2, -176, -98, 76, -23, 140, 49, 25, -50, -28, 268, 16, -114, -197, -17, 103, 23, 17, 36, -33, -58, -28, 0, 141, 8, -159, 62, 170, 98, -190, -199, 240, -128, -108, 53, 67, 207, -44, 132, 130, -124, -311, -162, -30, -159, -58, -13, -323, 155, -42, -55, -2, 42, 7, 29, -126, -158, 11, -5, 32, 246, -33, -135, 169, 1, 114, -238, 159, 167, 141, 26, 4, 100, 74, -95, -18, 1, -78, 11, -134, 45, 95, 144, -3, -34, 7, 223, 114, 260, 33, -3, 8, -122, -84, -176, 76, 13, 37, 17, 16, -147, -153, -14, -120, -124, -50, -78, 25, -22, 54, -140, 162, -20, 116, -2, 75, 105, 99, -226, 39, 179, -34, 73, -81, -21, 9, 317, 34, -14, 81, 202, -157, -214, -46, -201, -138, -61, 15, -48, -132, 204, 19, 24, 88, 43, 304, 120, -185, -217, -25]
7875b5j15O9L6J18p3K6j71M6P6O4L8j99m7J32j92K09P9n9q7lj15L99Pk65Q9n8
7901b1J26j30j06J29J32j61j93K82j4j2j1J25k24K86p7j09k2J2p7J3J18M8r8P4
7925I0K4j06R5K09k26J3J80k99l0J04M1L6Mn7k48pl4j1L95j48k9j20J64J45l08
7950a23J90j44m2JJ69l9m1kJ52r1q8P4R8p9P8j68k0o5J62M2r2o1J80J2j60J77
7976A20j49K58k48L1r4J16j7lj50J72P6j00K9K77k78r4N0J05r6j4L2R8k12J48
8000E7K0P2k20j4J75k4j48p9K94k74K48j58R8K17j12j09J0N2j45j77J29K43j20
8023C5J4kn6j57P1k2J70j31k2K0J29j57R2m2J04j19M0J69j66M0k95M56j60N6j25
8048e8kK07j63N2J29q1j29j19O2Q0J5j01J48K52l13J0Q3j33l03K29K59n2k01Q4
$$ y = [-25, -140, -71, -35, 83, 10, 36, -135, -89, -13, 51, 89, -110, -157, -25, -217, -8, 71, 12, -75, -78, -193, 206, 213, -52, 37, -21, 105, -25, -131, -2, 130, -31, -224, 58, 44, 32, 21, 146, -78, 208, 131, 22, 0, 12, -65, -52, 66, 114, 16, 90, 114, 8, 103, 312, 86, 99, 279, -20, -50, 54, 95, 131, 135, 78, -170, -177, -211, -222, 173, 25, -4, -124, 40, 185, -123, 67, -77, -119, -118, 51, 12, -29, -31, 121, 30, -58, 16, 114, 35, 113, -55, -75, -140, 22, 64, -28, -89, 91, 103, -57, 120, -29, 229, -19, 12, -82, 34, 17, 14, -136, 36, 112, 12, 41, 318, 40, -54, -4, 101, 5, -9, 23, 121, -91, 57, 77, 149, -71, -85, 90, 66, -82, -161, 133, -141, 107, -51, 47, 264, 152, 43, 53, 105, -40, -217, -88, 155, 35, 49, 47, -9, -166, -95, -117, 53, -78, -100, -80, 49, -108, -16, -58, 46, -73, -33, 136, -30, 10, -285, 171, 11, 67, -58, -60, 147, -16, 36, 165, 84, -45, -164, -102, -22, -7, -108, 40, 292, -21, -11, 72, -61, -364, -135, 124, 72, -129, -45]
8072d5Kp6J10Q9KM0j31qN3Jn7Q8k0N7j51r1J51r6K01j17j9j65R9J23p6j61K45
8099D8K07l06J69j69j78J63O7J09j39q6J19l4J42j39n6J26%j74K21J19l54K66
8121A21j40P0j47R4r1J13J35k6pq8k8J82k12J3L5N0j1j21P9pj69K27m9j2q5N3
8147b1rK32j93k8j14J81l3n7J43J4M6m6M5l86J76J46r7J2l3R2k04N7P2J8J49k14
8173e2J64l26M37k48q6R0ln3J13R9m0p6j21J51q5P4r2J25
$$ y = [-45, -43, -119, -9, 80, 82, 122, -9, -17, 36, 37, -20, 68, 48, 105, -46, -137, 14, -82, 119, 2, -17, -182, -83, 40, -36, -197, 48, 255, -51, 118, -51, -229, -66, 1, 110, -29, -115, 4, -30, 112, -27, -83, 43, 43, -131, 90, 209, -145, 121, -19, 51, -96, -2, -93, 20, 155, 129, 122, 34, 6, 188, -24, -11, 24, 74, 63, -58, 21, 14, -155, 72, 23, 11, -74, -21, -30, 202, 9, -19, -133, 48, 15, -42, 101, 115, 161, 115, 160, -226, -50, 96, -1, 11, -22, 70, -134, -77, -5, 13, 162, -52, 112, -214, 223, -25, -111, -21, -24, -77, 36, 135, 95, 19, -102, 49, -36, 38, -54, 71]
8191G1
$$ Imaginary data points
##PAGE= N=2
##DATA TABLE= (X++(I..I)), XYDATA
0@%%%%%%%%%%%%%oJ4j6J6j6K1k9L2m0M8n6O4p2Q8j04J20j36J52j75J99k24K56
35A36k88L22l62M07m54N05n61O22o91P65q46R34j029J136j252J379j519J673j843
54i66K035k253K499k779L101l480L933m481N162o042P224q896J1466j5973K6152
69A6702r3787K7683J76401p4785j15225l33J03042L221o6856j0186N1815J867
81A9559l445j76k3195l5740J8904O4827J9658p9654m0563N3187L5942k8448j9478
94a8622J5873J9635j5295j1707J1980j1390r764M3998K2495m7489m5968K4374
106b1880N5393m761m5942M657K4331j2940j2486P966N241r76M655J4010j4618
119B650l8723J6665N4816o773m6686k48L8572k166m7800Q002O2216r153o4950
$$ y = [0, 0, 0, 0, 0, 0, 0, 0, 0, 0, 0, 0, 0, 0, -6, 8, -8, 8, -8, 13, -16, 16, -24, 24, -32, 32, -40, 48, -56, 64, -72, 80, -95, 104, -120, 136, -152, 170, -192, 215, -239, 266, -295, 327, -364, 401, -445, 489, -540, 596, -656, 723, -796, 877, -966, 1069, -1184, 1315, -1464, 1637, -1843, 2090, -2391, 2771, -3271, 3953, -4943, 6523, -9450, 16702, -77085, -49402, 126999, 52214, -63011, -63344, 39698, 42919, -23937, -34123, 17692, 19559, 16114, 15938, -7257, -42997, -24093, 40734, 60392, -19262, -59825, -6638, 29304, 856, -18622, -2749, 16886, 1591, -10116, 1864, -9526, -19290, 24708, 47203, -286, -46254, -21880, 33513, 28752, -17190, -12533, 11798, -1142, -13628, -5662, -421, -1397, 3258, 17268, 2650, -36073, -19408, 35408, 28635, -18051, -18299, 20273, 18107, -29693, -21691, 40525, 31372, -33578]
132c3578J548N3962K658n1410n257N9044R691n8247j6475M0081K1399j5940j3250
145e774Q339P97j2659J0613J2982j7356p923K2146P305k8752k0973K9288L2282
158C0315k4475k9297J7307J8310j4740j2768J7294J6954j6249j5699J4765O242
170G959j3314J984J4706R9j6826o653J3595K748j0339O053Q602j0632j0169P329
184d858J0850n437p844J4409O805k3369p959K5764J2863k2253j6775K2317J8482
197B2995k7236k1769K4392K3970j3854k4647J836J8664R88q521K436N16k329N694
211C135K877q631p680J1338J9464j0214k7610M721K4063J032j7892n254J3843
224C192L242j4226O9J0648k974l250O106K734q245p808J0657J4541q938j2200
$$ y = [-33578, -32030, 21932, 24590, -26820, -32077, 26967, 36658, -21589, -38064, 2017, 23416, 7476, -5774, 2565, 3362, -9297, 1316, 14298, -3058, -10981, 11165, 18470, -10282, -31255, -1967, 30315, 5840, -23457, -6150, 12160, -2580, -15348, 1946, 18900, 2651, -13048, 1717, 7959, -5355, -3371, 11335, 11434, -5392, -12045, 1550, 4298, -6041, 12, 8614, -2018, -12187, -4858, 5992, 555, -7289, 7120, 13925, -9444, -17403, 8361, 21224, -1029, -17804, 4513, 22995, -4241, -26010, -1618, 22352, 8498, -16149, -14313, 4351, 5339, -3182, -746, -230, -2559, 3135, 6012, -2619, -10299, 1039, 20503, 10289, -17321, -12600, 11463, 12495, -5397, -10651, 3192, 6434, -7792, -7723, 2925, -49, -3299, 2807, 5541, -2704, -10512, 145, 14686, 5748, -6452]
238f452M373N674r39l430k08L207l207j442N977o327q819R689J2050m160j5606
253i620k209J8388M830j5881p10J1611P79q075m622O274N089o629p2M143o574
268c278l121N025L446n88m984L48O269m490l117P615J389m336r2K188J356n748
284b118k556J1536O31j2725j622P472K852m637n530O178N696p746k086M480J74
299aK389M34j819o8l262K456O358n752m125N386P16k867m477O01Q123k164p311
316e383M181J859k942J420J273K291j044m375M059K649n417J337L254j431q05
331I26l394M49L925l216j17K897l699j226K871K52J437k255k87N439k711m882
347c591M394K405o68j735k344L309l5m522K511J746k926Q03q93o63J891j242J619
$$ y = [-6452, -2079, 3595, 2656, -774, -982, 2225, -982, -2424, 3553, -2774, -11593, -1904, 10146, 5986, -9620, -11829, 6559, 11389, -4492, -5202, 6409, 7188, -887, -5509, 765, 5854, -775, -847, 3296, -3278, -6399, -1374, 2072, 1484, -3500, -3152, 3117, -1373, -4490, 3125, 4514, 178, 86, 2274, 3630, -2118, -4674, 6862, 7493, -5232, -6854, 618, 3470, -1167, -6697, -519, 5177, -2569, -4655, -175, -1, 2388, 2822, 1003, 935, -2327, 129, 6487, 735, -3390, 1996, 2712, -155, -4632, -4031, 4092, 1928, -5383, -1202, 657, -2285, -865, 408, 2699, 1655, -2720, 1339, 3988, -1429, -92, 3162, 1731, 926, -2468, -2019, 1906, -1310, -1427, 1470, -2229, -3455, -584, -332, 1105, -1150, -1437, 4002, 1291, -3591, 803, 3208, 2540, 805, -1539, 1770, 1735, -2787, -276, 1470, -1456, -653, -1546, -2209, -318, -1560, 59]
364E9K138l765K04K649p84P21m63j91K374k431j787K774j803n97K107j401j042
381a238j344l59M480n13m113J813J688N37M48k670N27L923o73m78k441k543M498
398A542K396l023k992j716L625L374m971l115L637K379Q21k868k689L545K517
413B462J22n14l300k15M005L80j523k243j566L289J436l672j980O29K824J985
429B119l713j860K637J050J178m5j430P98K7K08J678j340k092P64M43R88j198
446B12l948J251L196j04j301j900K47K983K43K28P0k941P45M188R00k696m810
463c437R33Q065k28r112l521N731Q053k845j0813J99Q635L204l659n481P13O358
479B795J532k298k600k737L258N719j269n905m344L436Q933k231j0397j113P484
$$ y = [59, 2197, -1568, -1364, 1285, 501, 1222, 759, 568, 2942, 511, -1276, 1498, -305, -902, 1205, -196, -1238, -2582, -2941, 1539, 1026, -3087, -1274, 414, 951, 1399, -1271, -744, 3179, 2506, 2028, -413, -2956, 1542, 3938, 915, -2077, -3793, -168, 3206, -1765, -4880, -1243, 1136, 1957, -911, -3600, -55, 2462, 2584, 2070, -1230, -1445, 2560, 2940, 1417, -826, -2392, 897, 2333, -1339, -3319, -2690, 134, 2119, -1594, -3454, -817, 233, 1411, 1366, -64, 734, 761, 969, 2647, 1307, -785, -21, 422, 1410, 212, -3736, -2485, 711, 607, -694, -2594, -2347, 636, 879, 1107, 1177, -1764, -1019, 3169, 4069, 1373, -3437, -2504, 5561, 5333, -3779, -7300, -1569, 6484, 3639, -7174, -6975, 1660, 4864, 1205, -4276, -3563, 2795, 4327, 2029, -571, -3308, -50, 5669, 4400, -1505, -5849, -2413, 6520, 4289, -6108, -7221, 263]
494B63N579m277q875K741Q671K60m091l228J090N024j43k382J72j843m6L392k32
511B075k516l055L19O346l73p286L63N207K156k724m928L720N342m609l081M597
527A553K785k502n957J985Q483k646r731J261P644K005o145o627O271O417m113
542F83k704K55N01K933L38k91q39m301K775P537l289p923p92O720O449p221j0030
559i199N414Q199n99n513n020M426O918k411l667m14N91L903J271l537j190j290
575b118K335N301l416o468L86M722M139m560q013M527P595j702n619j875N523
590G57M873n781l249N338J442l013k008J949L773l808m869M767L062m174k005
605b946Q68K769O34l460R53K151k069J388K228j224j950j287L843M027o009m420
$$ y = [263, 5842, 1565, -7310, -4569, 4102, 4362, 271, -2957, -1867, 3157, 3014, 632, 804, -1039, -1085, 2307, 2075, -441, -3496, -3177, 3169, 2796, -4490, -4127, 1080, 3236, 512, -4416, -696, 4646, 37, -3044, 1553, 4338, 1836, -4121, -2136, 6347, 3701, -6030, -4769, 2875, 4880, -1265, -7892, -1621, 4796, 683, -2021, -1766, -1265, 1668, 2006, 1715, 876, -3425, -650, 6887, 3598, -4325, -5117, 1603, 8052, 831, -9199, -3785, 4414, 3815, -1698, -6718, -2292, 4626, 2215, -1452, -1866, -1275, 2628, 3899, 362, -828, -2118, 217, 5518, 2102, -4366, -3980, 742, 4881, 321, -7692, -3165, 4430, 2728, -2891, -4766, 757, 5630, -151, -3400, 1938, 3380, 367, -1641, 308, 4081, 273, -4596, 171, 3233, -941, -2946, -2078, 691, 1325, -2135, -1182, 969, -1100, 288, 2516, 1292, -658, -1945, 1898, 5925, -84, -4504]
621d504M506L416j224m596k383M585K868l073j705j086J726M007o30k947m61O91
637h10L769P68m108j639J696K520J628m625l956L539L777l45m419l747M872N152
653D072k996m557N33M636K711l940k615K946J283m27m57j775l1P65L14N42k200
670a196j607K572J001j480q09j22K243N21j958Q81J134q40M06M75k49k53j415
687f96R61J553k530r22J475J0j32r78k71J591j37o88Q52k64L30Q35o82M76J89
706I72m46M65l18j054R99k21r00m3j1M35m63j391K038O31k033N29R70N14j65j194
726f86J065J403j310k15L16n75J141p99j203O19j21J8N88j663N0J575k29j36o13
745g75q6K461k71j997J111N32MJ22j461N12Q18j641N25K06j197Q31q6p88R53o17
$$ y = [-4504, 2, 3418, 2194, -2402, -4785, -200, 2668, -405, -2110, -3196, -1470, 2537, 1907, -1040, -1501, -810, 2959, 3727, -381, -2020, -324, 2196, 3824, -801, -4757, -1218, 2559, 2214, -2205, -5952, -1080, 4072, 1076, -3481, -2948, 1688, 4399, 459, -2156, 790, 2073, 1646, 1189, -586, -617, 148, 462, 1004, -1196, -2803, -231, 770, -710, -1519, -1641, 602, 1123, -835, 46, 1180, 340, 746, 1221, 972, 719, -696, 265, 1818, -712, -1634, -159, -149, -281, -1259, -1530, 61, -76, -764, 88, -176, 154, 989, 307, 783, 972, 526, 991, 673, -381, 618, 397, -503, -546, -557, -122, -585, -1976, 62, 693, -1340, -811, 159, 673, 508, -686, 379, 1782, 472, 257, 573, -2, 1139, 340, -863, -244, -365, -347, 241, -1422, -1372, 203, -26, -162, -775, -861, 1600, 1329, -668, 443, 975, 979, 1101, -360, 152, 970, -671, -146, 60, -1137, -306, -392, -1180, -227, -844]
765h44j83J697r51N90M85j163J053N24q74P44r03m46J648r92j574J202n46L42
783a91Oj450J228O09j445J559j35r32J619m95q7J275j834N00J116j212J66k2j259
802i84J485o91r42J077r53j43J599j328n7J149j55Q97o16j131K119K91j729O16
820E04o19N88O82j755j92J002j086O62j31j604J452P23m18M02j084P37K157j618
838D02o96J232m14Q39q10j314J238J16j347J150j089q77J265k72O6K05j154J588
856A28J025j699P65J43m3J157j065l21R55j205L48P77j667j56N63k89N71j144
874a157k57J672n16n50J411n84k79R02j30P50p63j383J773L51j406J35n71M27
892a75P42j660R9P52q96Q43P86j378R7M13J036R00k049l82K345k91p64k40o44
$$ y = [-844, -1027, 670, -281, 309, 794, -369, 684, 1208, 334, 1078, 175, -271, 1377, 385, -1189, 13, -533, -191, -185, -1635, -407, 202, -1243, 316, 181, -751, 868, 373, 286, 1561, -273, 227, 1343, 131, 297, 275, -984, 501, -190, -1132, -55, -1008, -1151, 448, -880, -937, 212, 57, 954, 338, -793, 1326, 1617, -112, 504, -115, 473, 1155, -600, -792, 210, -876, -214, -345, -1949, -497, 226, -192, 210, -874, -137, 2020, 402, -294, 938, 524, 1363, 553, -761, 477, 593, -754, 396, -693, -1570, -305, -577, -511, -306, -1460, 128, 1153, -546, 219, 362, 319, 1476, 411, 90, 1045, -160, 188, 965, -702, -858, -295, -584, -13, -1157, -1414, 258, -258, -808, 603, 19, -260, 642, 512, 1262, 499, -884, 889, 1240, -166, -31, -602, -175, 567, -1093, -994, -242, -1138, -295, 491, -887, -790, -377, 659, 1559, -490, -872, 1473, 1182, 418, 178, -466]
911d66Q16K24r65J75q05R0J595o82j222K30P33J138p49j093J513L69r44N10N86
930A053m71n06n55J476L52k712O6K096l09j356q64J266J229j593j87K064j007
947D2q96J003J445k57j992l62L112K1l097m98J414J449r75j986N92R34n16N33
965c4k17j216Q03J149N09k68j762Q39K069o23q46o77k59J622K77j555j527mK222
984E02J420l562j252K906J379p55k232N90K935r56j756J690L57j409k80J266J192
1001B035k596k141L540J631l774j374J980K217j247k986K154K825k537j200K314
1016H41J002j514j452J276K804k414k430K117J238r16j572n02J655J64j670J226
1032a47Rj230J475N27m17N5r34R71J603j531Qm92p24K065O9k387r02J378J949
$$ y = [-466, 350, 574, -391, -216, -1021, -931, 664, -18, -1240, -1010, -277, 861, 112, -981, 532, 901, -43, 467, 1053, 582, 76, -479, 997, 1349, -1363, -1297, 799, 490, -866, -1730, -464, 765, -828, -1015, 1049, 42, -854, 149, 1594, 1337, -655, -1017, 2095, 2116, -981, -1479, -65, 1384, 409, -1577, -985, -51, -567, -34, -251, -1467, -664, 485, 994, 726, -1036, -197, 1872, 1249, 403, -274, -533, 1089, 1366, -189, -1716, -1720, 502, 1922, -1640, -2892, 14, 1393, 638, -1594, -1004, 1931, 975, -781, 909, 1266, -143, -423, 843, 2035, -561, -2702, 838, 2469, -1305, -2679, -699, 1518, 271, -2715, -561, 2264, -273, -1473, 841, 1843, 329, -1123, 153, 2957, 543, -1887, 230, 1468, 552, -1020, -1522, 133, 297, -1373, -147, -138, -1368, 107, 634, 217, 272, -662, 309, 1912, 381, 389, -103, -827, 1238, 1307, -1080, -1982, -604, 1345]
1051A345l70l822O02M194p55k646K17J694J429k045p28K707j236j903K060J166
1067A909j753j874L90L842j250m814J826L589j093k397j67K762J099l577M14L113
1083B019j296j319R42J054l51j968L1L059j858k373J876N90p05n82j90J644n37
1100C6j570J849L88j212O74K96P8K4p95J111k9k002J464J200k117p81J332P59
1118G05n63k275J181K587k061j142J927L09o50l03N64J555j771j227K737M9k663
1135a041J8J640O64k013j702K803J119l156J33J926J42r89o46J862P49k506M57
1152e40K569j143j556L70J372j87j866p4K277j093j823J379O12m68p76K23J754
1169A030r41j274J814N45j263p4R95M77r69j287J716M71k203j02J543l65q99n16
$$ y = [1345, 975, -2847, -2245, 1949, 1194, -1452, -1235, 459, 1888, -157, -885, 1822, 586, -1317, 743, 1909, 156, -1718, -1328, 2514, 1264, -3550, -1724, 1865, 772, -1625, -1792, 970, 2069, -1508, -1094, 2019, 723, -596, 346, 1400, 1049, -919, -888, 2171, 313, -2060, -184, 406, -299, -881, -1071, 573, 36, -1534, 315, 703, -509, 165, 461, 539, 563, -232, 879, 850, -1152, 312, 1512, -605, -1386, -54, 705, 142, -2133, -952, 1635, -426, -1568, 359, 668, 18, -285, 279, 1834, 63, -1164, 1573, 1622, -1041, -1023, 617, 1281, -732, -2434, 369, 1488, -1668, -1535, 391, 533, -456, -1102, 760, 1509, -997, -540, 2029, 886, -670, -300, 1072, 885, -981, -1055, 1222, 129, -1694, -315, 297, -171, -947, -724, 1030, 89, -1185, 629, 1174, -89, -163, 832, 1309, 340, -947, 769, 1240, -963, -1065, 478, 113, -786, -1302]
1187a302J133P16j656K58J902r02o96P14P82J52j624N19J669j158j461J154O57
1204H57r05j019L52J399j162j250J763R86j655k48P70J322p87j424J769R75j935
1221a92k25J243l44r58l49J036L47j779NK011p01j331L92R36M31j135r9K064p85
1240E67j019Q64M70l19q56L8J274q42j675J248P43j176k89O44M03qj240J421O04
1259H52j408J52J288k44o18k31O50Q63j771j93J532o26j077M33L97Q6r87k09J979
1278H68p65j195J192N51m70k06r0J175k48j516J389M51j286M3K88j54Kj394J071
1297b94J186j945r8J736l87j02m97M70J101j138m50J709p30o94K17L19J03p27
1315b21p21J441k85j385Q16K62l12J8k85P66N47j313P54R00j026k0M97O8l3n68
$$ y = [-1302, -169, 547, -1109, -851, 1051, 149, -547, 167, 949, 1101, -523, -4, 1665, 507, -954, 200, 857, -48, -1067, -715, 684, -478, -1728, 35, 1021, -634, -882, -112, 1210, 423, -1001, 768, 1743, -192, -417, 826, 482, -476, -825, 211, 558, -1221, -1216, 795, 94, -1237, -845, 91, 522, -613, -712, 1352, 567, -452, 412, 882, 563, -293, -255, 1019, 177, -1498, -250, 493, -683, -972, -328, 75, 67, -1173, 248, 852, -556, -404, 884, 640, 22, -209, 441, 1304, -467, -660, 872, 246, -831, -398, -1, 85, -902, -1111, 868, 103, -1092, 100, 651, 181, -25, -115, 1060, 812, -704, 685, 1136, -150, -107, 181, 27, 29, -1365, -294, 892, -1053, -1151, 585, 198, 96, -401, 69, 1170, 32, -418, 1291, 561, -133, 84, 403, 506, -221, -942, 499, 214, -1171, -355, -93, -405, -387, -672, 94, 641, -672, 82, 982, -44, -64, 433, 501, 468, -100]
1335a00o5R19j100k65J071o93l48J45k87P84l74o00J366k79n81Q09m0K50k78l93
1355e9P32J19j573R08L20r00N5o4L01R6r30L71J023q76j11P93m6O01p94J7J006
1376I89o51o42P49j09l40J55n82L82r9q98Q29L78q33M29%k2O00k73J32N80o77
1397I7J14N52q83N69l9l10L20r32J58N72n66l76O52l47j47N83l41O47l08n47J357
1418H25j14o34O7K32K89j72p62L33J78o36o3P7J08L68q44K09Q61n93Q5L56L1K74
1440D75m05k81R98p6p02K17j29RK15r08K70J58k4j07p6n2L91k95R0N74j85j36
1462B1K96o7N27m02p67P23K59o32j04K3J22J60j061L41O03o27J46P3K69N30m81
1483d8k29R69l78l86J91J91L45m72o84Q64j35l79l09J02L76o3p42L53Q99m05n52
$$ y = [-100, -165, 754, -346, -611, 460, -233, -581, -436, -723, 61, -313, -913, 453, 174, -407, 402, 362, 612, 334, -59, 673, 792, -781, 127, 447, -453, -398, -462, -161, -65, -995, -624, 399, -477, -588, 205, 159, 760, -34, -17, 989, 338, -304, 445, 336, -4, 151, -431, -49, -148, -1046, -217, 161, -672, -243, -243, -265, 335, 62, 194, 774, 97, 211, 763, -120, 449, 410, 100, 420, -512, -354, 218, -348, -724, -72, -419, -566, 17, -324, 323, 15, -532, 825, 711, 77, 144, 376, 665, 493, -269, 64, 242, -394, -457, -380, -272, 96, -748, -539, 322, -271, -186, 170, 201, 475, 70, -211, 787, 711, 9, 226, 97, 106, 321, -587, -317, -159, -183, -290, -366, -418, -27, -322, -232, 342, 157, 21, 317, 250, 777, 375, -392, 331, 590, -42, -146, -123, -1, 159, -902, -561, 42, -585, -439, -366, -97, 433, -48, -277, 692, 314, -72, 119, 310, 655, 183, -501, 363, 228, -151, -460, -358, 18, -45, -787, -434, 465, 60, -492]
1504d92M01L33L48m70l55J057j06r41J73M93N1n69p93P12L47r66J98N45k79K43
1524g0m90K87R54r12j52P64K1p1l60r8R47k41j087N73j66J67m2p96M34N94o99
1545d43N5L80j76K28k70K4J157p60m78Q93k56j24K9m85P76k58r87N23J28l05J77
1566a72n71M87P62j015J58P37j19pk81J43O58o74m32Q72j61m51K59n05M27j71
1586e6p51O77L76o71L21J52j90O31p01K01O80n51l5K46m16O30m53k11N11k71m88
1607c69K25k91j14O89o33K33M40m54L63R4r0M74k19k42O58n18j66K21l41K63J29
1628C52j001N11K16m57N9O0J71K27o32L95O13m88K7M10k55P8j10k43O82m80k54
1649a19J73j77k38K68l14M60O0p87M55K73j79M6k1J42N30n07J36L10n57Q8L49
$$ y = [-492, -91, 242, 590, 120, -235, 822, 716, -225, -52, 441, 492, -77, -870, -158, 189, -777, -579, -34, -313, -70, -560, -273, 681, -231, -383, 381, 402, 331, -29, -127, 820, 579, -508, 65, -101, 66, 24, -772, -338, 256, -443, -388, -8, -184, 44, -226, -202, 955, 195, -283, 610, 354, 230, 259, -226, 550, 292, -695, -172, -44, -349, -172, -743, -256, 506, -509, -351, 386, 267, 260, -21, 122, 780, 106, -326, 546, 385, -66, 193, -312, 115, -56, -807, -130, 246, -425, -104, 48, -142, 489, -212, -11, 669, 118, 83, 329, -87, 543, 90, -121, 390, 119, -369, -144, -435, -549, 140, -493, -260, 180, -274, 89, 183, 93, 567, 348, 106, 764, 246, 80, 301, -40, 223, 352, -649, -138, 78, -379, -320, -260, -89, 138, -494, -99, 514, 26, 53, 463, 208, 286, 176, -67, 615, 135, -119, 54, -123, -361, -93, -407, 53, 113, -674, -219, 54, -125, -79, -100, 42, 572, 65, 201, 511, -46, 42, 391]
1670C91k86J01k7l53K52l03k77M75l00P0L16l02K22J32k65N42j91k66M57n0j75
1691A63j5k1kJ00n66L22q6m44L45J60J1k1l29J51O18m79o5M25J57nk16N8L72l49
1715B84m30M48l27l25J16n3K32J11o11M84j09j35M10o2J23J74l70J27L82k02J6
1736B83j94j99K77k10k77L69n07L53J21m82J58L42j00N8n9n3N06k47J04K16j30
1757C29l53K46j09N9j4n92L44j28n28M67J20r1K03l03J62L83l55L65J79k53M49
1778E80m64M5J39l06j86L47m89O4N7j22K03L7m33M44O0j82M74k62m3M11k63K14
1800C25J57m42L67%o36L20j72j29K02n78K29K93o53K75N57m41K85J58k43L03J04
1821B81m84O20k71k01K92l29J53J51m65J85J97o80L43J99k84M77n09J49M37l62
$$ y = [391, 105, 206, 179, -174, 78, -225, -502, -27, -327, -257, 59, -243, -21, 111, -154, 388, 197, -69, 388, 338, 163, 148, 127, 125, 225, -341, -19, -105, -549, -204, -44, -33, -54, -383, -232, 386, -93, -158, 267, 424, 419, 203, 261, 633, 284, -146, 302, -25, -350, -234, -287, -55, 56, -555, -71, -180, -315, 95, 33, 156, 330, -40, 87, 469, 267, 283, 89, -110, 167, -43, -320, 49, -458, -105, 16, -466, -308, 34, -66, -8, -67, -120, 386, 139, 243, 459, 329, -24, 222, 113, 172, 158, -434, -90, -218, -746, -279, -159, -250, -47, -350, -188, 195, -160, 205, 384, 131, 580, 116, 161, 300, -6, -192, 155, -334, -270, -213, -335, -132, -95, -528, -84, -24, -206, 268, 6, -37, 374, 111, 325, 482, 40, 407, 407, -229, 91, -81, -210, -8, -586, -357, -64, -717, -442, 115, -326, -41, 117, -126, 177, 281, -203, 417, 146, -55, 237, -92, 61, 212, -253, -68, 129, -551, -208, -9, -293, 184, -325, -176, 261, -101]
1841a01Q4K75j97M93q4m93N06k53m37L81k06J22Qm05j12N07o05K15L96j54K34
1862A74o0m42Q26j31l80K00j48p7L88o59L79K63p48L36j25j2K72n55K03M58k50
1883h8j44K94j54M20Jn75P76r5n02L13k69P3J77p00K67L95n11q4L71k31K56l18
1905c28o1P09l63P9J67n4J10Q5k73J50R8n48J79K6j57K19l31R4J30k19J61O1j22
1928a88L90m58O5N39J00k29J43j39o3K6m65J42N22n51j2n6J64J07l86j10N89k25
1950i5j51L70R5P2k05n1O07l82l69J02J28j8q7m98M85j06k56kK93j34K10k67K78
1973A9J57k18jK51o5L39k26m43L91j84o5J38nk23J98k48Q2M55o63k8L04j90K55
1996C0K3j54O21j92j09j05p7L27o5o90O13q6m32q8J81J09K32m25N8M09l31J1J60
$$ y = [-101, -17, 258, 61, 554, 470, -23, 483, 230, -207, 174, -32, 90, 98, -307, -419, 88, -517, -302, 94, -60, 174, 114, -328, 498, 367, -13, 187, 39, -38, 350, -309, 70, 333, -415, -79, -204, -216, 56, -499, -296, 162, -88, -232, 62, -92, 328, 329, -246, 530, 435, -67, 246, -23, 50, 227, -473, -206, 189, -322, -406, -35, -266, -10, -328, -389, 320, -43, 36, 203, 149, 259, 344, 71, 221, 319, -229, -50, -24, -181, 38, -293, -199, -69, -288, -127, -66, -188, 202, -256, -191, 348, 448, 219, 362, 223, 160, 186, -279, -137, 385, -166, -178, -234, -70, 37, -349, -459, 130, -95, -246, 124, 219, 291, 86, 35, 642, 260, -109, -7, 121, 103, 16, -482, 3, -103, -359, -361, -68, -202, 8, -259, 19, 176, -42, -43, 208, 143, 482, 256, -187, 204, 20, -45, 93, 88, -135, 63, -185, -103, 352, -311, -339, -35, -225, 30, 53, -101, 520, 328, 219, 114, 37, 364, 299, -391, 222, 136, -296, -384, -203, -94, 138, -287, -229, 180, -151, -140, 20]
2019B0J74J53k60N5L15l03k52L09n5k06J01m87N26J33p87N41Nl47K86k7j25L56
2041A25k01%N29m21N6M25n53M38l33p5L01m14j68M11l30j48K92l24K55M64n25
2062a96K97l05J57J47K65n95M94j78J26O4p24M95J71o26Q2L17j54N7r0r2N32p10
2084d66P6Q10l25R5p3J24K26k96k69P13l64l67K63l04J71j68j49K51J9m33M04
2105f2K32m14K66J3R3J16l75K98K38l48M2J50k89m9J17k13L65l92j88N94n78K5
2127c59K44J14q5N7j49L49K63n83L78K16k99k16P3K52o6n91K85L60o92QK32J36
2149g3M0k35j28P24k67Q0K16k94J83L8l06L35l24k44K52J17m06K76j17RP6l14
2171c62K65l9q2J58L54j85R9k9o7J87l49L16L69o50j40J56k14j20p5P0L92m96
$$ y = [20, 194, 347, 87, 142, 457, 154, -98, 211, 156, -50, 51, -436, 90, 223, -564, -23, -18, -365, -79, -106, -231, 125, -76, -76, 453, 32, 88, 513, -40, 398, 65, -10, 291, -123, -291, 120, -210, -358, -66, -390, -135, 329, -196, 101, -204, -47, 100, 365, -230, 264, 86, 212, 276, -448, 47, 218, -408, -326, -9, -163, -106, -196, -288, 244, -466, -390, 420, 95, 190, 117, 241, 467, 171, -98, 615, 251, -116, 147, -157, 14, -154, -303, -52, -33, -466, -62, 170, -244, 22, 35, 128, 244, -131, 167, 405, 57, 99, 249, -40, -89, 28, -185, 180, -212, -400, 194, -384, -359, -115, -1, -86, -29, -178, 171, 434, -149, 229, 445, 146, -70, 3, 255, 189, -402, -117, 243, -449, -441, -209, -73, -33, -268, -396, 328, 61, 141, 357, 63, 246, 284, -22, 313, -11, -255, -3, 114, -292, -16, -133, -124, -48, -362, -97, -136, -218, -60, 294, 109, 208, 179, 112, 299, -50, 266, 635, -15, -155, 1, -213, -333, -408, -338, 54, -442]
2193d42L5L46R7j38O1O0O70p18k8O11k60j81j06J56J29l34m09N43jn87K43J36
2215a17J8m0q5J96J74j68n0M03m52N7J31J8J19k53n4K68l92p2K17k4j08J36q0
2238a58K77j54k53O07l8n15K48L57n8j22o1K80n2o67M18J35m54j8K51J07j05l68
2260c43J08L85l26J2K67K3J42j31j36L89m61k07M09k5k83K34J5R0j99n32O73O6
2282A70n95K35J48J49N7m24N20jn02L57M44n08L5n9JJ2k45o9N74o70k0K93J6l3
2306a15J1K3L74k29k74N57l9k26J03j0M01l32n45M32l7n28L78J11k96K30m27M16
2328b2J52n25K52K51j09K21O2l47L72j67j07L02o30QM64j89k19J95k42R1K4k85
2350d48O00j03l42J57J21L9nj73N98m8p24L28L10l05k1l62J86K65o13K01O96n53
$$ y = [-442, -407, -61, 36, -102, -41, 19, 689, -29, -57, 554, 294, 113, 7, 163, 292, -42, -451, 92, 91, -496, -253, -117, -99, -139, -224, -28, 146, -22, -72, 331, -121, -64, 67, 85, 204, -49, -103, 165, -227, -299, -82, -106, -214, -78, -158, 119, -35, -288, 319, 281, -234, 14, 371, 313, 191, 130, 410, 358, -309, 109, 244, -210, -228, 23, 130, 25, -343, -235, 150, -176, -164, 103, 126, 268, 137, 1, 390, -71, -278, 131, 106, -177, 57, 72, 162, -37, -569, 104, 170, -425, -190, -42, 107, 164, -260, 260, 259, -243, 114, 558, 50, 85, 26, 27, 39, -206, -275, 299, -371, -391, -98, -82, -115, -104, -81, 293, 64, -210, 347, 308, 82, 185, 175, 576, 244, -301, 131, 94, -434, -56, 55, -241, -11, -438, -22, 130, -395, -143, 108, -1, 220, 282, -65, 307, 140, 33, 335, -295, -287, 177, -12, -231, -36, -278, -187, -163, -448, 152, 49, -293, -136, -15, 24, 19, -154, 444, 396, -328, 0, 310, 5, -16, -378, -192, 73, -540, -339, 357, -196]
2372a96K2Q5Q6K84j90r6L88k06l96L68R6k91p7J6J01O0m30J28J32l54K75J67k34
2395b62L21M3j04K92k77K61P0k25N2J18k81L04n72K24K45m53kL58k32p5L09k84
2417a70J91K0l71N21R3l88J64q4L55j92k81K31K90l78j47J42m2J20l80J72L22
2438A88m92r0K55K63p3m6p5M15p2k42L15l79l4J91j70J20J68l21J70l56j00M54
2460H9k05l09L81kJ1J5kL65j40j2J55l3l03j6O2j27J69k70QJ86j32j72J83j08
2484b07K46k48l8M62j29j42J45M6J32k08k4J45k4l22M12j98mN5m65K17Kj83K26
2507a04L0k47L91l9J18r8K22l39K02p9K51k53k70L61j89Jqq7j65J65k72J82M54
2530B27l57N6K48k01J68j13j25K87M1j7N1l07o9K91l28j5J19k92K51P9k60L25
$$ y = [-196, -174, -89, -3, 281, 91, -5, 383, 177, -219, 149, 245, -46, -123, -107, -6, 54, -376, -248, -116, -470, -195, -28, -262, 59, 102, -2, 290, 13, 274, 344, 119, 171, 289, 8, 312, -260, -36, 209, -244, -246, 112, -120, -195, 114, -170, 21, 41, -330, 191, 284, -104, 60, -24, 331, 139, -142, 89, 379, 1, -146, -4, -46, 74, -306, -134, 188, -304, -394, -139, 124, 51, 5, -70, 345, 273, 31, 346, -33, -67, 124, -46, 74, 242, -79, 91, -265, -365, 89, -116, -425, -44, -46, -35, -20, -22, 343, 203, 191, 346, 313, 10, -6, 56, -71, 98, -172, -164, 22, -110, -282, -99, -207, 39, -209, -247, 215, 86, -56, 89, 135, 267, 59, 35, 180, 156, -166, 246, 48, 44, 99, -366, -149, -147, -330, -104, -74, -321, 70, 31, 149, 51, 273, -66, 136, 57, 308, 55, -215, 146, -43, -42, -50, -137, -302, -137, -409, -227, 227, -130, -74, 174, -27, 141, 28, -97, 190, 231, 214, 265, -42, -111, 180, -148, -163, -44, -336, -85, -6, -266, 59]
2552E9j05J28Qj67J17L04m25J67N1j74P8Q6j01M1j62j93J67k5n0J05O6K37j29
2575H3l44K15J77j98J83p6pJ31l9j31J15k45J3J66k06J93j69QP3m2k04M85k58
2598g7J8M42m93J07L92m53R0K79k74J33j47j05L60k89k08L36k86J19N2k47L12
2619F1L0j76K34j6k79M39j41n1K00m59K16l8q9M9lj32j9K01l96M19j40m9J43j29
2643a25K54J5k98J92J47L0R4l88J53j6o2r2Q5j5j00n4l15O42l26p0L89j90OL0
2667a4p0K35J87k21QMP5k18K9j76J82j72k5K87k23l5J68l81L7L56k23K64M8j68
2691d6K3K26l5j46J93j73K67l36l1K97l47J0J18k02m2L2J23J07j24J6K33j66J95
2714A92j86j34K85n3LQ5k79J11K88k44k40P7M1K25m94J11K7L6LQ1L3O8Q6k14L36
$$ y = [59, -46, 82, 90, -77, 40, 344, -81, 86, 137, -37, 41, 127, 26, 67, -95, -288, -121, -146, -196, -91, -25, 212, 83, -261, -46, 131, -67, 116, 40, 33, 164, 125, -6, 109, -136, -123, 43, -163, 30, -139, -131, -58, -100, -304, 181, -77, -59, 383, -110, -3, 389, -64, 26, 305, 31, 164, 17, -88, 272, -17, -225, 111, -175, -56, -4, -251, 61, 91, -85, 149, 133, -146, 293, 152, 101, 301, -158, 58, 20, -69, -20, -23, -155, -174, 27, -369, 50, -90, -139, 4, -125, 129, 144, -154, 38, 185, 215, 309, -79, 74, 58, -4, -96, -11, -26, -126, -180, -495, 147, -179, -249, 140, -50, -44, -14, -84, 151, 338, 117, 125, 129, 204, -14, 15, -161, 21, -151, -176, 111, -112, -147, 21, -360, -323, 33, -190, 74, 122, -46, -23, 203, 168, 22, 215, 42, 309, -27, -58, 239, -108, -98, 20, -182, -224, -192, -69, 38, -86, -70, 163, -3, 192, 6, -128, 157, 104, 107, 192, -87, 24, 312, 68, -172, -95, -54, 171, -323, -212, -185, -149, -146, -65, -32, 36, 122, -92, 244]
2739B44o0k50J85n4o6j06q1J85J10k07j05K32k03J00p0J01J04o1J9L08k69j9P8
2762A15j44J99J08m77O0JR9j16n3R4Q8l18K27M7M8l4L57j37k09J29j51L65k98
2785@J13M0k66J73k7M6l09J08r6P7K10k92J61R7j71J39M0j08K26k49M68j9m52
2808i1J79K03l38J38n06K87J36r4j65R7j10L32j01n3J08P2m00M19K57l48J73q1
2830A14r5K1pR5j79j56J98j48K68k55qj4K51j33p7J30l3K01j89K7K80j73Q1M5
2854B44l58L60k76j01j23J89j39Om4M6K15j8k56L21N9n2Q0k19J81J64l49K12K54
2877C96n30J40j12q5J74j30k04M02n6l75M12k45K74j16m5L08%l24J35K9n2J21
2899A17j99Q2J91k33j5N7j81J9J57m3Q8L1j03K2q3J57L6l5J30q1q7R6j54M7Q4
$$ y = [244, 184, -66, 119, 65, -1, -107, -188, -3, 107, -100, -205, 27, -176, -76, -146, -45, 59, -2, 17, 325, 56, 37, 115, -29, 170, 278, -199, -139, -138, -39, -155, -208, -114, -26, -344, -117, -70, -22, -56, 301, 164, -45, 84, -67, 298, 0, 113, 153, -113, 60, 33, 79, -230, -122, -218, -141, 69, -223, -62, 35, -136, 3, 43, -65, 161, -88, 380, 361, -91, 88, 291, -47, 91, -415, -128, 8, -86, -251, -154, -264, 68, -33, -86, 22, 94, -306, 113, 370, 22, 195, 114, 19, 40, 33, 128, -51, -207, -9, -157, 111, -144, -152, -166, 85, -48, -125, 5, -28, 173, -16, 11, 291, 118, 199, 244, -114, 246, -30, -131, -254, -65, -204, -198, -242, -196, 19, 1, -255, 66, 125, 73, 153, -66, 115, 279, -70, 142, 396, -134, 6, -106, -191, -17, -147, -351, 51, -5, -380, 32, -213, 61, -55, -100, 208, 208, -116, 19, 48, -4, 117, -82, 0, 191, -42, -57, 0, -181, -162, -5, -48, 40, 71, -32, -10, -93, 64, 100, 65, 195, 114, 27, 123, -31, 16, 100]
2924A00l57O5J12p6k4K73j87J34k14J79R0O5m2j67K84k4l2l83L66j58r7J16N8
2947H1Qk93L3k5L22l36O2K88k57J55J44j38J71k89O1k7K38k57L19l42K77k0l13
2970a38q3K02j45J43M7N4k6k55O0K45J66l50J68j56K24P6l14K60l40J16L3j49
2992a62K8L0q6J89Nl50L52j54P8J7K21OJ67k88J7Rj34K45j96j32J10m3M0j96L2
3017a95K68M9j71p5J18k41L23o6q6O7j23K05L36m87R5JR9J17k78p1J10j17p6P
3041a91J58j72L9R3L6J93p9L1j1r1K90j75n3M9k59o7K92j91M3q4O9j5J05j24O4
3066e0n5kJ46J06p5J7KM9j66j38K13o0k36L01p0J51m2l24K17M9k35K19n2q5R3
3091b7J57j16J47J50k56j7q4M1J25j71j2Qr0K05j42m5k6P8j12J62j10O3K60k22
$$ y = [100, -257, -192, -80, -156, -180, 93, -94, 40, -174, 5, 95, 160, 118, -49, 235, 211, 179, -204, 162, 4, -93, 23, 81, 89, -204, -171, -196, 126, -210, -148, 140, -117, 38, 182, 44, 215, -74, -13, -40, 198, -59, 260, -82, 195, 175, -138, -221, -19, -164, -21, 26, 80, 54, -201, -141, 104, 270, -80, 88, -68, 156, 232, -82, 178, -162, -46, -13, -162, -134, -104, -190, -1, 4, -346, 6, -148, -70, -53, 168, 174, 341, 53, 70, 79, -55, 190, -6, -138, -28, -71, -31, -227, -195, 73, 122, -49, -124, -6, -247, 76, 10, -76, -9, -132, 73, 409, -78, 17, 18, 117, 234, -44, -115, -5, -122, -198, -191, -33, -205, -166, -73, -37, 156, 77, 108, 97, 6, 296, 121, 68, 117, -142, -209, 83, -108, -65, -149, -80, -95, 10, -114, -50, -105, -107, 39, 145, 70, 87, 89, 138, -28, -166, 47, -13, -249, 52, -18, 133, 91, -233, -16, 33, -202, 17, -35, -120, -27, 130, 14, 161, 311, 55, 38, -46, -5, 120, -51, -63, -55, -145, 60, -82, -127, -153, -75, -187, -25, -135, -72, 188, -34]
3115c4J32J29j81J37M8k41K97l18M7K2j23p0J41k54L66J3l83J54J1J7J96K3n3
3138G6K19k82K27j68k5J05j1l66K05O9j15o7r6K04J95k96l5K78k56K19Q6l61K87
3161I2j34M5J05j11M2n9Q3j39M4L2q1k00K1L87j26k99J05K63l9QLP1Jj73K4K87
3187B52j60J0j91Q7J24j07j30J47oj00O1j23K32o1P8q7m8j03L70j06j91J75r7
3210B6J37j29j12J07j05r0J27K9j04n1O7j46R2J47m2J8n1K03k02J78J10p7j56
3233b4K45k22L8m8N7k2k01K06k3m5j04J61O4l33K28j17J68n7l0J26J11j96J64
3256A46Pj07q1j1R1L9j76j40K75r2j12J79N5K1l1J09j51K9j29P8j98K12K00k32
3280a9k5o7J1j16K57j82M6o4J06j30K28lJ95j89O5r5q1K74l41Q7J30j54j30K66
$$ y = [-34, 98, 227, 46, 183, 231, -10, 287, -31, 16, 38, -85, -155, -14, -268, 98, 111, -272, -118, -107, -90, 106, 129, 76, 295, 13, 240, 72, 47, 152, 141, -225, -20, 49, -66, -133, -229, -25, 170, -126, -161, 117, -139, 80, 166, -195, 92, -42, 3, 108, -3, 39, -20, 63, -76, -32, 0, -81, -281, -260, 127, 1, -298, -193, 70, 31, 39, 42, 113, 114, -59, -35, 252, 92, 102, -89, -2, 122, 15, -115, 32, 26, -74, -13, -136, 96, 35, 113, 26, -22, -125, 245, 139, -52, 123, 26, 163, 34, -78, 29, -76, -166, -39, -10, -114, -165, -98, -244, -152, -5, -47, -29, -80, 123, -79, 99, 209, 132, -24, 221, -1, 37, -11, 46, 24, -177, 29, 6, -39, -143, 18, 82, -251, -23, -140, 28, -29, -59, 67, 178, -18, 146, 153, 46, -35, -46, 45, 84, -92, -232, 43, -49, -161, 18, 73, 94, 63, 172, 21, 50, -79, -1, -199, 13, 213, -19, -44, -111, -100, -216, 41, -141, -95, -159, -53, -183, 45, 42, 237, 48, 113, 18, -63, 211, -130, -43, 87, -67, -197, 69]
3304F9k04J83j03K7LN1j15j85K88P3K7j05k6j13R4L7J95k31L0M7k04J63N9j0j02
3329e2j05MK70m10J54J05k44L35j02PJ63j76n1L82q8j5k08j48K5R3n9J27o2j01
3353a56K29k81K77j78j04M9oR9K59P1m08K24J8L3L8k97K57k35l2nJ03R4l7O0l98
3378c26K23J11j16J43N1k65K9L49O4j97P4j56J53r8J9k0l7J59m21K49O2q6j93
3401b29L61o7j16k9J01m6j31K74p9Q5o3J10l96O5L45k74r1J33j24J06M9p7J57
3424F4Oq4J37o8J27j40n1J70m1j92J10L7j36L16l29kN3j24k35J91J75J14j22j90
3448b14L08q3n3J31j9JJ5l0L5J48m62J46M3j95K08J7j29J06j88N8K67k21J11J53
3472A53k71J67j0l35M93j47l5J37j67j48J82j03j19L31k81J80k5K4L9P7k19J40
$$ y = [69, -135, 48, -55, -28, -25, 26, -89, -274, 14, 87, 114, 9, -17, -130, -36, 1, 196, -35, -5, 42, -162, 1, 60, 50, -52, -157, -153, 117, -293, -139, -34, -278, 57, -45, -38, 125, -51, -102, 280, 192, 177, -31, -179, -154, -61, -120, 7, -55, -156, 73, -208, 69, -109, -213, -164, -170, -71, 188, 259, -149, 75, 93, 126, 164, -133, 124, -111, -143, -148, -45, 49, 12, 72, -326, -103, 8, -108, 35, 86, -179, -150, 199, 263, 66, 140, -16, 137, 39, 58, 38, 1, 160, -261, -12, 50, -36, -229, 132, 65, -51, -80, 21, -25, -156, 118, 39, 124, 61, 171, -225, -160, 185, -89, -180, -47, -171, -65, -16, -93, 64, 70, -14, 123, 55, 182, 42, -9, 161, 120, -72, 38, 75, -61, 255, -74, -76, -23, -147, -382, -191, -16, 98, -24, -214, 94, 11, -42, 89, 70, 71, 86, 56, 91, 239, -223, -77, -34, -229, -21, -4, -133, -27, -215, -157, 110, -111, 0, 153, -118, 49, 39, -296, 197, 50, 15, 152, -15, -163, 19, -84, -203, 128, -153, 27, 2, 26, 65, 142, -77, 63]
3494F3N5n6J6J7N7m0k22J62j3rJ8l10J8J27p8J12J26j60l7L5L3P8J13o1r3L1K17
3521A99j51m6R5j39o7P5j4O3k13r8J86J49j34r6R4k2J82Q0j20K51j69l32J50O1
3545a6J5P6k25RJ10j1M9j32J65j86J05P8J0R2j72K05j82j77K69r7R8K0k49L68
3569B22r7r4K5k13J21J59j31k95K62j12Q2J25p7K04k25l4N0nL1Lo8J89j47n6N1
3594c0J44l40K25k6l2Q1N6k5j77J8j08L82k84J89Q1k72K16J7k54L69m39J24J21
3617C6j33Q2Q4k09L6J79j67n9K31o9J62j64R3jO2p7r5R1J60m72K21ok4R0O2j90
3643g7l2J70k56Q6q7L19j41R7l2L9m1j90K63j90L3Nj9l6o4k2M8J26p2j15K12m4
3669b0K2N3p8N5j96K18J73k83R2O9n7J95k06kN6k35K45j69n0J81j14J05j62K00
$$ y = [63, 118, 62, 78, 95, 152, 112, -110, 52, 39, 30, 48, -262, -244, -117, -195, -83, 43, -117, -154, -119, -86, -8, 105, 44, -49, -18, 199, 48, 2, 97, -42, -109, -34, -48, 15, -198, -296, -110, 39, -95, -191, -97, -119, 63, 143, 23, 274, 105, -227, -77, -16, -1, 75, -150, -141, -31, -42, 7, -125, 40, -146, -41, 37, 47, 139, -33, 172, -10, -187, 82, -15, 83, 103, -146, 222, 125, 31, 56, -157, -36, 123, -8, -303, -41, -153, -71, 54, -23, 181, -44, -78, -28, -33, -2, 1, -67, 122, -25, -81, -30, 114, -226, -1, -27, -59, 22, 78, 53, -124, -106, -214, 168, -116, 73, 154, -118, 98, 115, -139, 230, -209, -85, 36, -97, -15, 69, -140, -104, 75, -92, -151, 80, 11, 173, 9, 102, 101, 163, 86, -9, 82, 242, -230, -9, -15, -39, 51, 113, -77, -109, 61, -195, -109, -196, 123, -18, 79, 47, 86, 45, -145, 118, -72, -39, -34, -53, -89, -153, -175, -127, -1, -73, -188, 24, -20, 2, 55, -23, 32, -164, 54, 227, -56, 36, 105, 48, 243, 37, 35, 91, -144, 101, -68, -118, 63, -51, 54, -108, 92]
3693I2l40L55k51J62J63j48lO2k09K2K04p2n9j69M3K18J02l71N8q0J98K7J87r8
3717I3P9j9k56J26J09j40J59k27J19oNp4R3p6q3j19J41M6k12J88J06j36J26j7
3741B5J53o2J00j81J37r1q1j23J9L15k43J18m5j34J61l05J00J93j73l6L26k64
3763i1J15J16k18L9K74k13J3K64l04J5m6K6k36R4J68J05o8j06M4j6m5M5p5J61
3787F1j76K71n0j59J53j60J40l13j0R4RP3P3R7j96k8p1J54j9J90k14L9K45j58
3811D5M7J2j09OJ05k77J51mj47K09m8M2j46J96Rj38J14O8J20l28l3J91j2j15k04
3836b46L60M4j47l6K20j26OJ6J0o4j2k04M0j8L97J4j95M0KPO3l11J13K31m12Q2
3862a26K01k42O1J59l21J73J9Q5Q2l08J18K30j16J46p1j23P8o4N0m3L67j99j59
$$ y = [92, -248, 107, -144, 18, 181, 33, 30, 92, -117, -95, 109, 37, -22, -191, -148, 70, 172, -199, -141, -221, -23, 4, 191, 93, 172, 153, -103, 23, 132, -8, 151, -76, 43, 37, 42, -32, 61, -15, -98, -217, -76, -30, -242, -54, 52, -84, 42, 25, 178, 116, 216, 35, 172, 81, 0, -123, -104, 211, -32, 86, 41, -93, 68, -237, -137, 56, -117, -153, 173, -91, 24, 140, -78, -39, 235, 22, 35, 299, -5, 10, -36, -10, -246, -152, 16, 121, 53, -53, -9, -25, -70, -25, -100, 61, -115, 156, 106, -53, 100, -60, 80, -233, -243, -149, -140, -67, 6, 103, -93, -121, -192, -38, -57, 133, -81, -42, 203, 45, 92, 104, -5, 1, 106, -171, -20, -24, -171, 38, -10, 32, -114, 82, 91, -47, 67, 135, 255, -73, -106, 85, 73, -42, -246, 114, 158, 11, -25, 195, 69, 75, 91, 101, 37, 25, -179, -139, -157, 240, 254, 59, 99, 101, 108, 171, -140, -27, 204, -208, -126, 75, -167, -106, 53, -268, -95, -76, 9, 91, -217, -99, 131, 15, 161, 90, -33, 45, -19, 31, -12, 355, 156, -3]
3885cJ07k58K55l44r9L49r5Q3k23N2J48L9k29L10p1J19Q6k28n2J87k18K54k54
3908h5j39M31j74k12K07j05N7k4J5J24o2P1M2j53J2%r3K39j89j12J66J01k40r9
3932b22K93j71J79q9k04L82j22k09J42j1L6L9N6o2O6j2j70J47j20J08j00p6J83
3955F3l81K11J60l23K84M8j37J75j87M5J62j54J14N3J57k38K0r1j63K8m4J55J22
3978G9m4j26N5M7o9K4J35j24O8P0o1j58K77m1j84K75l10p4J69Q4j30n6J81r3J95
4003A89m76K70J52o2j36l0j64K99K5R1j49l4J58j75J19J18k13l2J71k73J93j20
$$ y = [-3, 104, -154, 101, -243, -342, 7, -88, -5, -228, -176, -28, 11, -218, 92, 21, 140, 226, -2, -54, 133, -85, 169, -85, -224, 207, 33, -179, 28, -77, -20, -44, -29, 95, 33, 104, 146, -7, 5, 5, -88, 151, -38, -150, 16, 117, -123, -222, 71, -100, 79, -10, -214, 168, 46, -163, -21, -32, 4, 43, 99, 37, 103, 91, -79, 68, -52, 56, -44, -120, 63, -318, -107, 53, -270, 14, 62, -75, 100, -87, -42, 120, -34, 80, 133, 290, 52, 72, -19, -182, -154, -198, -43, 79, 35, -91, -36, 11, -58, -34, 101, -23, 45, 115, 54, -104, 173, 132, -52, 223, -87, -161, 8, 92, -38, -94, 87, -6, 189, -287, -17, 135, 73, -63, -93, -257, 42, 67, 158, 9, -25, 133, -42, 77, 195, -18, -50, 121, -152, 41, -79]
$$ [...]
8191A4
##END NTUPLES=NMR FID
##END=
