##TITLE=1H_Pr 5037-et-pe
 CDCl3
 8 sc, 
 27.10.2021
##JCAMPDX= 6.0         $$ Bruker NMR JCAMP-DX V2.0
##DATA TYPE= NMR FID
##DATA CLASS= NTUPLES
##ORIGIN= UXNMR, Bruker Analytische Messtechnik GmbH
##OWNER= root
$$ XWIN-NMR		Version 3.5
$$ Wed Oct 27 14:00:39 2021 Russian Standard Time (UT+4h)  she@DPX200
##.OBSERVE FREQUENCY= 200.1313468511
##.OBSERVE NUCLEUS= ^1H
##.DELAY= (6, 6)
##.ACQUISITION MODE= SIMULTANEOUS
##.ACQUISITION SCHEME= undefined
##.AVERAGES= 8
##.DIGITISER RES= 18
##SPECTROMETER/DATA SYSTEM= spect
##.PULSE SEQUENCE= zg30
##.SOLVENT NAME= CDCl3
##.SHIFT REFERENCE= (INTERNAL, CDCl3, 0, 15.7039)
##AUDIT TRAIL= $$ (NUMBER, WHEN, WHO, WHERE, WHAT)
$$ ##TITLE= Audit trail, XWIN-NMR		Version 3.5
$$ ##JCAMPDX= 5.01
$$ ##ORIGIN= Bruker BioSpin GmbH
$$ ##OWNER= she
$$ F:/spectra/data/she/nmr/H-F/1/audita.txt
$$ ##AUDIT TRAIL=  $$ (NUMBER, WHEN, WHO, WHERE, WHAT)
(   1,<2021-10-27 13:59:38.29 +0400>,<she>,<DPX200>,
      <created by zg, POWCHK disabled, PULCHK disabled
       configuration hash MD5:
       00 E9 B6 7A A2 85 ED C7 34 08 36 98 17 FE 4E 26
       data hash MD5: 16K
       81 3F E6 52 BB 51 D3 A3 C0 37 27 5C EA 7C 40 8D>)
$$ ##END=
$$ 
$$ hash MD5
$$ F3 E5 74 DC 11 15 89 08 2B BF AF B2 FE E8 A8 70
##$RELAX= 
##$RELAX= 
##$RELAX= 
##$RELAX= 
##$RELAX= 
##$RELAX= 
$$ Bruker specific parameters
$$ --------------------------
##$DU= <F:/spectra>
##$EXPNO= 1
##$NAME= <H-F>
##$PROCNO= 1
##$TYPE= <nmr>
##$USER= <she>
##$AMP= (0..31)
100 100 100 100 100 100 100 100 100 100 100 100 100 100 100 100 100 100 
100 100 100 100 100 100 100 100 100 100 100 100 100 100 
##$AQSEQ= 0
##$AQ_mod= 1
##$AUNM= <au_zg>
##$AUTOPOS= <>
##$BF1= 200.13
##$BF2= 200.13
##$BF3= 200.13
##$BF4= 200.13
##$BF5= 200.13
##$BF6= 200.13
##$BF7= 200.13
##$BF8= 200.13
##$BYTORDA= 1
##$CFDGTYP= 0
##$CFRGTYP= 5
##$CHEMSTR= <none>
##$CNST= (0..31)
1 1 145 1 1 1 1 1 1 1 1 1 1 1 1 1 1 1 1 1 1 1 1 1 1 1 1 1 1 1 1 1 
##$CPDPRG= <>
##$CPDPRG1= <>
##$CPDPRG2= <>
##$CPDPRG3= <>
##$CPDPRG4= <mlev>
##$CPDPRG5= <mlev>
##$CPDPRG6= <mlev>
##$CPDPRG7= <mlev>
##$CPDPRG8= <mlev>
##$CPDPRGB= <>
##$CPDPRGT= <>
##$D= (0..31)
0 1.2 0 0 0 0 0 0 0 0.06 0 0.03 0 0 0 0 0.0002 0 0 0 0 0 0 0 0 0 0 0 0 
0 0 0 
##$DATE= 1635328777
##$DBL= (0..7)
120 120 120 120 120 120 120 120 
##$DBP= (0..7)
150 150 150 150 150 150 150 150 
##$DBP07= 0
##$DBPNAM0= <>
##$DBPNAM1= <>
##$DBPNAM2= <>
##$DBPNAM3= <>
##$DBPNAM4= <>
##$DBPNAM5= <>
##$DBPNAM6= <>
##$DBPNAM7= <>
##$DBPOAL= (0..7)
0.5 0.5 0.5 0.5 0.5 0.5 0.5 0.5 
##$DBPOFFS= (0..7)
0 0 0 0 0 0 0 0 
##$DE= 6
##$DECBNUC= <off>
##$DECIM= 32
##$DECNUC= <off>
##$DECSTAT= 4
##$DIGMOD= 1
##$DIGTYP= 9
##$DL= (0..7)
0 120 120 120 120 120 120 120 
##$DP= (0..7)
150 150 150 150 150 150 150 150 
##$DP07= 0
##$DPNAME0= <>
##$DPNAME1= <>
##$DPNAME2= <>
##$DPNAME3= <>
##$DPNAME4= <>
##$DPNAME5= <>
##$DPNAME6= <>
##$DPNAME7= <>
##$DPOAL= (0..7)
0.5 0.5 0.5 0.5 0.5 0.5 0.5 0.5 
##$DPOFFS= (0..7)
0 0 0 0 0 0 0 0 
##$DQDMODE= 0
##$DR= 18
##$DS= 0
$$ [...]
##$SUBNAM2= <"">
##$SUBNAM3= <"">
##$SUBNAM4= <"">
##$SUBNAM5= <"">
##$SUBNAM6= <"">
##$SUBNAM7= <"">
##$SUBNAM8= <"">
##$SUBNAM9= <"">
##$SW= 18.0517286264689
##$SWIBOX= (0..15)
0 0 2 0 0 0 0 0 0 0 0 0 0 0 0 0 
##$SW_h= 3612.71676300578
##$TD= 16384
##$TD0= 1
##$TE= 0
##$TE2= 300
##$TE3= 300
##$TEG= 300
##$TL= (0..7)
0 120 120 120 120 120 120 120 
##$TP= (0..7)
150 150 150 150 150 150 150 150 
##$TP07= 0
##$TPNAME0= <>
##$TPNAME1= <>
##$TPNAME2= <>
##$TPNAME3= <>
##$TPNAME4= <>
##$TPNAME5= <>
##$TPNAME6= <>
##$TPNAME7= <>
##$TPOAL= (0..7)
0.5 0.5 0.5 0.5 0.5 0.5 0.5 0.5 
##$TPOFFS= (0..7)
0 0 0 0 0 0 0 0 
##$TUNHIN= 0
##$TUNHOUT= 0
##$TUNXOUT= 0
##$USERA1= <user>
##$USERA2= <user>
##$USERA3= <user>
##$USERA4= <user>
##$USERA5= <user>
##$V9= 5
##$VALIST= <valist>
##$VCLIST= <CCCCCCCCCCCCCCC>
##$VD= 0
##$VDLIST= <DDDDDDDDDDDDDDD>
##$VPLIST= <PPPPPPPPPPPPPPP>
##$VTLIST= <TTTTTTTTTTTTTTT>
##$WBST= 1024
##$WBSW= 4
##$XGAIN= (0..3)
0 0 0 0 
##$XL= 0
##$YL= 0
##$YMAX_a= 239257
##$YMIN_a= -286762
##$ZGOPTNS= <>
##$ZL1= 120
##$ZL2= 120
##$ZL3= 120
##$ZL4= 120
##$ABSF1= 10
##$ABSF2= 0
##$ABSG= 5
##$ABSL= 3
##$ALPHA= 0
##$AQORDER= 0
##$ASSFAC= 0
##$ASSFACI= 0
##$ASSFACX= 0
##$ASSWID= 0
##$AUNMP= <proc_1d>
##$AZFE= 0.1
##$AZFW= 0.1
##$BCFW= 1
##$BC_mod= 2
##$BYTORDP= 1
##$COROFFS= 0
##$CY= 11.3945322036743
##$DATMOD= 1
##$DC= 2
##$DFILT= <>
##$DTYPP= 0
##$F1P= 2.36226072786647
##$F2P= -0.459571619588291
##$FCOR= 0.5
##$FTSIZE= 0
##$FT_mod= 4
##$GAMMA= 1
##$GB= 0.15
##$INTBC= 1
##$INTSCL= 1
##$ISEN= 128
##$LB= 0.24
##$LEV0= 0
##$LPBIN= 0
##$MAXI= 10000
##$MC2= 0
##$MEAN= 0
##$ME_mod= 0
##$MI= 1.114404
##$NCOEF= 0
##$NC_proc= 0
##$NLEV= 6
##$NOISF1= 3.799351
##$NOISF2= 2.8
##$NSP= 1
##$NTH_PI= 0
##$NZP= 0
##$OFFSET= 15.70392
##$PC= 1
##$PHC0= -15154.86
##$PHC1= 14.80082
##$PH_mod= 1
##$PKNL= yes
##$PPARMOD= 0
##$PSCAL= 0
##$PSIGN= 0
##$REVERSE= no
##$SF= 200.130013532006
##$SI= 16384
##$SIGF1= 3
##$SIGF2= 2
##$SINO= 400
##$SIOLD= 16384
##$SREGLST= <1H.CDCl3>
##$SSB= 0
##$STSI= 0
##$STSR= 0
##$SW_p= 3612.71676300578
##$SYMM= 0
##$S_DEV= 0
##$TDeff= 0
##$TDoff= 0
##$TI= <>
##$TILT= no
##$TM1= 0
##$TM2= 0
##$TOPLEV= 0
##$USERP1= <user>
##$USERP2= <user>
##$USERP3= <user>
##$USERP4= <user>
##$USERP5= <user>
##$WDW= 1
##$XDIM= 8192
##$YMAX_p= 0
##$YMIN_p= 0
$$ End of Bruker specific parameters
$$ ---------------------------------
##NTUPLES= NMR FID
##VAR_NAME=  TIME,          FID/REAL,        FID/IMAG
##SYMBOL=    X,             R,               I
##VAR_TYPE=  INDEPENDENT,   DEPENDENT,       DEPENDENT
##VAR_FORM=  AFFN,          ASDF,            ASDF
##VAR_DIM=   8192,          8192,            8192
##UNITS=     SECONDS,       ARBITRARY UNITS, ARBITRARY UNITS
##FACTOR=    0.0002768,     1,               1
##FIRST=     0,             0,               0
##LAST=      2.2672688,     0,               0
##MIN=       0,             -286762,         0
##MAX=       2.2672688,     239257,          0
$$ Real data points
##PAGE= N=1
##DATA TABLE= (X++(R..R)), XYDATA
0 0 0 0 0 0 0 0 0 0 0 0 0 8 -8 8 -8 8 -16 16 -24 24 -32 40 -44 53 -64 72 -81 96 -112 128 -145 168 -191 215
34 215 -242 273 -307 344 -385 430 -478 532 -589 653 -724 799 -882 972 -1071 1182 -1301
51 -1301 1432 -1579 1742 -1924 2131 -2364 2631 -2943 3309 -3747 4283 -4954 5826 -7008 8708
66 8708 -11382 16207 -27645 116350 -38964 -280375 37663 204182 31291 -136598 -33842
77 -33842 46921 42199 25517 -8301 -94589 -35518 116652 87194 -125663 -131649 91165 143981
89 143981 -58833 -133191 5574 91412 22014 -42632 -37620 -4863 36080 51972 -22323 -77992
101 -77992 9026 94945 13842 -75968 -14001 55106 7305 -18177 17979 -9641 -42966 28972
113 28972 63675 -35382 -80513 27590 79418 -28213 -77645 20483 54866 -25043 -32581 30865
125 30865 1599 -53558 20008 78484 -29293 -92897 32057 101865 -20661 -93147 16840
136 16840 85050 -6029 -56699 7955 28553 -8356 2391 17266 -26681 -32638 37715 41433
148 41433 -43277 -50060 30865 42160 -24528 -37600 12075 21519 -7967 -5124 2782 -14102 -271
161 -271 31425 3992 -35766 -2126 40790 5027 -31727 5391 27772 -10729 -18368 21816 15838
174 15838 -28473 -14530 32643 9117 -36756 -7629 29003 -1358 -25020 3093 10407 -17774
186 -17774 -5118 29440 -1360 -42541 8 50049 6355 -49106 -8560 48581 15186 -34012
198 -34012 -10536 21359 11672 669 -1216 -13452 -9154 24259 22847 -27800 -35030 21839 36686
211 36686 -16829 -39545 4057 29388 -1455 -20699 -6729 1241 6489 13825 -4373 -26055 -1532
224 -1532 34436 11706 -33050 -13983 32565 19347 -20719 -14564 16333 13117 -6547 -3111 1270
237 1270 -5992 3983 13048 -7242 -20366 2349 19340 -3756 -22460 -59 15953 -4487 -14683
250 -14683 3540 9090 -6727 -4737 10456 1063 -11206 6116 14257 -4410 -9056 7591 9904
263 9904 -4700 -4160 8753 2764 -8369 842 8466 -3978 -9776 3612 8084 -8645 -11166 6484
277 6484 5661 -9276 -6315 5107 1480 -6592 254 6760 -3774 -5104 8552 6247 -8170 -1831
291 -1831 12772 5394 -10096 -1425 12126 2498 -7074 -207 4323 -63 -2028 17 -1365 -4700
305 -4700 1298 3721 -6782 -8970 3994 7019 -6200 -10596 3359 8527 -3687 -5722 3478 3698
319 3698 -184 822 2382 -396 229 7059 3360 -6876 -980 9289 2816 -7189 -2985 6006 2168
334 2168 -6203 -2518 2571 -1029 -2925 -1579 -1019 -2732 -1097 2648 -1766 -5560 1524 5650 -1856
349 -1856 -4130 2850 5765 -431 -2830 3000 4291 856 482 416 246 1649 1950 1 -3249 -961
365 -961 3421 -185 -5729 -2833 1926 743 -3554 -3771 219 -11 -454 579 -2243 -2878 1881 4810
381 4810 577 -5022 416 7241 2996 -2983 -1186 3274 4734 1680 -1957 -2356 730 4553 1879
396 1879 -5058 -5204 1318 4267 -255 -7804 -5147 3699 4119 -2897 -7577 -3171 5922 5539 -3413 -7349
412 -7349 124 9395 5205 -5269 -4626 3693 8239 3394 -4169 -4320 2583 7510 3837 -6764 -8242
427 -8242 4450 9952 -1164 -12559 -6456 8802 7370 -7304 -10890 -379 8154 2976 -6111 -6427
441 -6427 46 6521 6494 -3450 -8460 1014 11318 7190 -7089 -9679 6034 14743 1715 -12153
455 -12153 -5614 10146 8995 -5534 -9938 -877 6019 3812 -4196 -7523 -3700 3252 6002 -1887
469 -1887 -10279 -4562 8685 9433 -5497 -13407 1847 15227 3814 -10850 -4952 8977 7459 -2213
483 -2213 -3119 -735 129 5280 6097 -3854 -10416 -1224 12249 5426 -14404 -12171 9314 13942 -6399
498 -6399 -17202 -1106 11925 2996 -7347 -5444 495 4647 5652 890 -8266 -5652 10535 13855
512 13855 -4833 -14709 671 17886 8656 -14144 -13178 10063 16368 -3106 -16020 -2809 10171
525 10171 4099 -5334 -6604 -3870 2392 6965 1136 -9624 -10014 6757 14518 -2612 -17250 -2065
539 -2065 18203 9346 -13940 -10733 10707 12706 -2289 -6970 211 3407 1929 3815 385 -10039
553 -10039 -4269 12786 8001 -13653 -14737 7893 15736 -4622 -17363 -3098 12673 6562 -8690
566 -8690 -8902 2137 6452 3809 -1015 -6348 -2790 7574 10567 -2008 -13026 -1137 15729 8537
580 8537 -11424 -12287 7355 15538 -1385 -15681 -5003 11057 7492 -7597 -10471 670 5219
593 5219 1799 -1923 -5490 -4370 4902 8844 -2211 -12363 -1644 14261 6916 -10573 -8021 8765
607 8765 11566 -2928 -8796 1337 6780 2493 -1850 -2013 -1772 -390 3611 2287 -6397 -6595 3998
622 3998 6361 -3682 -8918 -1294 6045 1836 -4872 -3852 1553 4141 1472 -2470 -1581 461 2653
637 2653 3797 223 -3053 -331 4454 4144 -2040 -5201 855 6049 1858 -5329 -4892 2577 4117 -2676
653 -2676 -5146 -1236 2124 1169 -1827 -2704 -2313 392 3967 1338 -4900 -1744 5159 4176 -2384 -3742
669 -3742 2418 5288 1798 -2110 -1822 2440 3501 -604 -1862 -1096 252 2368 361 -3463 -2493 948
685 948 1820 -1921 -3603 -528 1583 486 -1147 -1728 -495 1577 1507 14 -1394 872 2802 797
701 797 -360 599 487 1230 1727 52 -1219 -8 1049 707 -1221 -1468 -855 696 467 -2707 -2525 374
719 374 744 -926 -1733 -1514 501 1229 44 -1174 -532 2106 2223 -365 -829 1085 2238 1762 -741
736 -741 -613 733 1740 770 -1614 -1703 1242 1081 -1586 -2367 -860 843 -142 -2057 -1878 156 701 -645
754 -645 -1761 -72 1069 559 -10 -485 715 1880 1088 -380 267 1054 1835 609 -770 396 1193
771 1193 876 -452 -885 309 468 -911 -1427 -1072 -6 147 -1673 -1314 -196 -302 -6 -857 -531 530
789 530 417 202 -2 41 937 1553 443 97 424 1711 886 -311 458 342 439 -259 -854 -189 361 -927
809 -927 -1333 -413 -537 -915 -534 -520 -359 -779 47 97 -371 -64 237 593 653 121 992 1194 441 705 671 300
831 300 1053 452 -135 125 347 339 -420 -795 -602 -286 -123 -901 -1005 -766 -575 -647 -272 -1037 -950 1135 651
852 651 -832 -621 1261 1777 327 -504 844 1346 1230 332 -93 278 607 935 529 -1628 -1194 1122
870 1122 742 -1566 -2047 -419 1115 -642 -1918 -1082 -471 879 195 -1512 -1360 802 1852 374 -1569
887 -1569 136 2136 1248 200 -351 69 1221 1550 447 -1321 -1157 1851 1860 -1400 -2516 381 2380
904 2380 -652 -3341 -867 965 -726 -960 -437 -1017 -798 1232 1525 -1429 -2492 1804 3625 -445
920 -445 -2598 252 3698 1631 -1554 -408 1147 1431 933 -450 -1165 -365 732 1030 -1274 -2784 -128
937 -128 1799 371 -2138 -2654 219 2175 98 -2588 -2079 2315 3414 -1180 -2750 1211 3048 609
953 609 -884 368 988 199 1491 1460 -2368 -2313 2745 3664 -2466 -5188 1325 4471 -1644 -4801 -229
970 -229 2892 -107 -2671 -424 585 -1533 -54 2081 -774 -2932 725 4478 699 -3944 -18
985 -18 4258 2076 -2069 -1274 2198 2264 -430 -932 -531 251 576 304 -1354 -1522 -649 647 422 -1166
1003 -1166 -2322 -1061 2414 1418 -3411 -2861 2777 3357 -1561 -3055 1689 4036 -385 -2263 1108 1684
1019 1684 -545 495 2263 -470 -3032 1191 4344 -1692 -5234 642 4625 -478 -5268 -506 3539
1034 3539 -594 -3436 0 1128 -917 -337 1599 125 -2514 468 3438 300 -2226 60 3112
1049 3112 1822 -1558 -824 1451 1252 427 -751 -1136 472 1226 -312 -1593 -904 516 247 -615 -163
1066 -163 -859 -1454 265 1384 -751 -2758 872 3970 -464 -3546 777 3507 166 -1866 851 2082
1082 2082 -158 -604 1931 409 -2120 198 2779 -243 -3920 -221 3344 -668 -3797 -366 1851
1097 1851 -587 -1660 20 491 -1190 -245 1119 -265 -1378 1301 2406 -233 -1752 828 1978
1112 1978 -188 -259 813 418 65 863 240 -1012 -714 1114 682 -1918 -1218 1001 189 -1986 -870
1129 -870 939 -992 -1424 1085 329 -1892 -295 2248 284 -1603 201 2295 355 -1584 794 1615
1145 1615 -208 -483 1230 558 -833 -34 1475 -374 -2284 249 1171 -936 -1603 113 725 -1307
1161 -1307 -1319 763 126 -1756 427 1604 -444 -1482 1114 2046 -969 -938 2104 1625 -675 -230 1551
1178 1551 606 -1026 339 1427 -717 -1189 893 561 -1258 -1109 710 39 -1791 -450 731 -704
1194 -704 -1000 387 157 -653 -560 995 493 -939 125 1754 412 -751 1161 1322 -212 -362 1286
1211 1286 608 -1357 44 1219 -183 -1192 182 891 -1117 -1555 586 745 -1774 -1129 880 -124
1227 -124 -1491 -202 1355 -355 -1358 861 1234 -628 -273 1331 1203 -286 -254 1685 333 -997
1243 -997 330 1128 -309 -954 271 731 -956 -875 756 -258 -1328 -264 63 -561 -1133 206 548
1260 548 -883 -591 966 114 -507 506 1276 393 -337 783 1147 -431 -280 1222 671 -721 94 894
1278 894 151 -1389 -68 787 -948 -955 185 -57 -972 -906 225 -147 -1149 -41 810 -345 -858 416
1296 416 1025 -21 -613 1068 834 -224 256 838 257 -124 161 613 -120 -801 406 305 -573 -550 87
1315 87 -115 -529 -443 60 -829 -415 -32 -365 -657 -176 510 246 -351 17 703 182 -420 615 577 218 241
1336 241 885 141 -400 105 706 -237 -689 34 297 -277 -718 -414 66 -541 -547 -26 -357 -474 74 419 -65
1357 -65 -461 289 891 37 -128 317 611 629 -127 357 377 257 688 125 -319 73 141 144 -366 -459 -43 -293
1379 -293 -424 -440 -633 -481 -272 -337 -130 -743 -166 512 121 -542 -14 533 589 4 -69 422 456 296 161 284
1401 284 -184 -26 583 144 -319 -560 69 350 -501 -1091 -310 365 -235 -879 -303 68 74 -308 -207 80 130
1422 130 184 539 84 -370 265 863 851 -59 -304 740 863 -462 -418 127 502 31 -704 -292 -49 -469
1442 -469 -256 -176 -363 -758 -360 388 4 -848 -183 692 707 -502 -438 658 988 -180 -216 607 891 46
1462 46 -199 304 481 -510 -414 593 -416 -814 -208 666 -339 -1444 -288 763 -57 -1273 -542 631
1480 631 281 -942 -255 584 -44 -394 448 443 -31 -375 1014 1080 -472 -510 790 747 -257 -750 409 974
1500 974 -404 -659 -204 14 -210 -344 -147 -77 -524 -234 -48 -414 -350 -383 206 675 -417 -700 394 914
1520 914 375 -396 569 1201 88 -321 427 590 141 -259 267 429 -818 -135 723 -7 -1042 -622 430
1539 430 326 -1022 -474 474 369 -933 -341 660 316 -438 392 392 -139 118 676 308 -114 -7 507 696
1559 696 -284 -378 -116 153 12 -13 -442 -31 -135 -373 -419 -743 -44 -90 -161 -116 -198 -13 200 93 -64 -90 133
1582 133 566 617 -251 -285 686 507 -292 -96 692 204 -302 398 274 -464 -530 265 168 -691 -712 277 -186 -790
1604 -790 -303 148 -116 -661 337 547 -245 -43 501 225 -161 246 821 234 -570 343 754 65 -335 262
1624 262 299 -64 -422 -9 -128 -537 -343 363 -514 -679 -201 269 -282 -535 -178 205 -200 244 572 -138
1644 -138 149 410 350 -115 280 761 345 -98 323 501 -111 -273 222 432 -393 -407 59 129 -788 -406 138
1665 138 -240 -635 -419 284 -267 -860 173 608 -181 -70 368 810 -178 -171 809 260 -368 224 707 252
1685 252 -265 271 276 -189 -427 -140 -98 -705 -269 -52 -72 -451 -231 279 -388 -667 306 -256 -152 68 440
1706 440 -62 -75 552 419 -147 239 588 248 -116 -203 769 259 -352 275 221 -547 -10 264 18 -585 -505
1727 -505 308 -16 -1105 -88 302 -208 -411 68 343 -140 -294 417 409 -200 223 332 485 -139 4 403
1747 403 389 -99 341 179 -28 -125 142 -337 -430 -325 106 -515 -584 51 -44 -373 -108 -164 77 -198 -29 368
1769 368 185 -384 502 413 -99 -138 660 571 -184 95 412 110 -138 76 -34 -107 -429 258 342 -403 -388 147
1791 147 -257 -581 -92 206 -141 -585 89 189 -253 -270 133 163 -190 -209 634 297 -283 375 463 -111 58
1812 58 193 69 -283 -246 350 -194 -727 86 13 -303 -515 -233 -85 -395 -509 186 -121 -295 310 433 22
1833 22 -173 534 266 -389 55 583 145 -78 298 214 157 21 47 188 -353 -135 287 -128 -592 -396 277
1854 277 -123 -770 -271 40 -163 -78 164 37 -251 -224 485 298 -201 174 510 -58 -195 562 508 54 -69
1875 -69 11 456 -179 -214 -158 -141 -355 -311 98 -589 -368 112 -34 -218 -314 78 34 -32 -21 497 -100 -171 515 444
1899 444 -118 -85 484 545 -79 -21 408 194 -150 98 -13 -150 -284 -32 30 -315 -683 -151 87 -273 -521
1920 -521 -113 104 -202 -136 51 1 -25 -63 -85 83 210 241 342 44 -6 393 122 -289 456 -323 92 220
1942 220 -44 -241 -235 77 47 -342 -476 -214 -151 -193 -388 80 307 -460 36 377 -350 -214 222 154 -96 -81
1964 -81 291 375 147 83 184 361 59 -236 -12 307 -276 -348 13 -57 -195 -163 -5 -115 -724 -179 276 36
1986 36 -434 -214 285 399 -245 -274 313 173 212 120 472 357 -152 172 434 74 -23 149 525 121 -225 -163
2008 -163 -71 -252 -267 -234 -175 -242 -243 33 6 -429 82 240 137 76 178 -116 383 275 144 171 368 300 -143 244
2032 244 342 158 -13 14 99 -12 -243 48 127 -229 -559 16 -28 -495 -529 -45 241 -374 -268 277 222 -370
2054 -370 34 405 342 -132 120 709 199 -107 383 220 30 -98 44 355 -341 -418 -22 -88 -281 -303 171
2075 171 -191 -457 -381 -128 -114 179 148 90 -90 -217 305 368 158 528 287 -24 391 289 21 -121 265 117
2097 117 -275 -428 251 -137 -271 -70 -157 -179 -491 -52 132 -198 -573 281 271 -127 -551 188 380 -110 -282
2118 -282 464 235 -297 280 435 170 -133 228 474 -99 -48 395 147 -83 -199 63 30 -323 -318 -154 -119 -315
2140 -315 -222 -279 -74 -212 -305 17 -249 46 129 98 392 473 46 32 -14 460 177 -90 452 372 -301 -98 345
2163 345 213 -245 -283 296 -106 -581 -211 214 -198 -271 -252 426 -265 -646 208 498 -15 -319 230 531 -192
2184 -192 -168 461 107 -253 197 147 95 -341 76 -142 -391 -100 99 -198 -192 -193 -109 -448 -165 -154 -369 -144 -48
2207 -48 223 -103 -356 -17 204 -103 -100 201 324 -102 399 301 192 41 323 209 -14 -471 -4 346 -82
2228 -82 -442 108 10 -413 -296 237 146 -372 85 64 -66 -252 -57 187 -131 97 267 236 136 310 455 90
2250 90 59 217 296 190 -134 302 81 -151 16 29 -194 -522 -12 -224 -111 -297 -157 116 -163 -187 270 -176
2272 -176 -373 154 198 184 -57 295 192 47 234 355 404 -91 -7 312 220 -201 155 33 120 -90 160 -45
2294 -45 -335 -184 -70 -256 -182 83 33 -91 -110 86 97 -392 -36 373 -34 174 67 389 58 104 152 296
2316 296 -84 -100 231 107 -223 38 -100 32 -188 19 72 -128 -373 -92 5 -354 -257 154 185 -194 -38 -59
2338 -59 -153 1 309 224 233 251 445 249 163 164 241 184 11 -14 90 13 -127 79 -74 -236 25 213 -222 -217 -54
2363 -54 -213 -191 -85 80 129 -105 218 286 260 29 -41 241 184 135 -70 -89 48 148 156 14 45 -27 -181 -64
2387 -64 -114 -138 10 6 -343 86 18 -272 190 -197 -150 120 300 1 72 -82 463 119 -58 299 205 327 51
2410 51 -18 418 -31 -147 115 -27 -246 46 -67 17 -520 -102 -110 -257 57 227 -67 86 -465 -79 188 -237
2432 -237 -241 155 144 226 124 -36 180 180 197 35 -138 121 -157 -149 202 255 -277 -167 190 -209 -146 -248 -275 39
2456 39 -215 -382 -16 26 20 -409 -16 0 -84 53 32 150 191 202 367 36 54 28 326 -51 38 59 -4 -65 -322
2481 -322 -30 72 -9 -149 -201 -62 152 -181 -166 -66 -28 -253 -60 383 156 -275 155 120 17 245 248 233 336
2504 336 224 -59 405 -81 -173 207 -4 53 -350 316 -23 -227 -101 -115 10 -135 -63 179 57 -11 20 465
2526 465 69 5 -75 284 16 14 133 -23 96 58 140 66 92 -40 -37 143 50 61 -179 -264 154 -169 -127 -77 -34
2551 -34 -265 -213 -192 -69 -146 213 336 39 -122 87 39 50 -128 93 353 62 -57 150 69 237 -171 -90 42
2574 42 -438 -48 221 -22 15 -105 -254 -241 -18 -253 93 178 -88 57 -152 153 -31 -10 205 229 236 36 59
2597 59 241 -22 70 346 -145 96 -153 132 45 -70 -425 -262 351 43 -340 -166 217 -286 -364 -56 365
2618 365 -223 -42 58 294 -242 -246 244 332 108 5 323 123 -120 51 378 36 -124 -179 246 -215 -396
2639 -396 25 -114 -228 -175 -127 -237 166 -78 -185 -130 215 -29 -115 -224 100 62 -201 30 294 179 101 26
2661 26 465 -73 -139 246 -22 -130 51 219 -26 -131 -215 157 248 -377 -147 41 73 4 -93 -99 -158 -211 315 172
2685 172 -76 -129 244 161 -43 -13 305 -60 -93 74 29 78 191 256 151 -5 68 -275 -77 -371 -21 -137 -260
2708 -260 -226 -71 -184 -165 113 140 128 -350 232 286 -171 -85 296 204 -285 -40 126 163 -52 311 479 -151 -112
2731 -112 163 219 -301 -26 45 -7 -236 -302 -139 -53 -206 -22 42 -88 -14 148 -50 16 31 434 -68 -39 160
2754 160 190 67 165 253 57 93 142 166 92 -98 153 125 -296 -139 -29 -147 -309 -89 162 67 -226 -3 -57
2777 -57 -72 -264 394 349 -28 -97 274 181 -15 -52 -77 2 -280 23 175 2 -450 114 94 -325 -195 -4 -208
2800 -208 -123 -402 52 -41 23 0 -154 -70 -250 -17 154 -320 93 459 245 -57 343 263 102 -101 333 -130
2822 -130 0 -115 161 -192 -184 -210 138 -110 -60 8 -91 -154 -15 61 -32 -113 -43 72 -3 -270 106 140 314 100
2846 100 -121 144 -137 63 53 8 -6 51 166 77 -153 -23 -244 -238 -267 -179 -147 -106 198 113 -213 16 16 174 -418
2871 -418 26 205 -84 -6 2 228 137 -143 -40 235 50 -72 256 301 107 -5 252 -199 -301 50 255 -54
2893 -54 -279 -336 -166 -298 -339 -44 -265 -296 65 243 -311 -52 144 136 -45 64 122 107 -130 247 237 65 -55
2916 -55 43 77 -216 -76 142 -40 -316 -108 92 6 -130 58 -218 -39 -262 261 301 -53 70 -22 164 -53
2938 -53 25 254 -7 -44 102 153 -21 11 -85 265 76 -52 7 37 293 -239 -164 123 3 -106 -206 64 -166
2961 -166 179 -150 4 -189 22 -103 -15 191 -24 50 23 111 -128 -55 300 -16 47 -123 125 96 -194 99
2983 99 176 73 -51 -202 223 40 211 -198 107 -126 -300 -244 173 73 -161 244 6 14 52 301 122 618
3005 618 41 26 425 205 207 -25 50 166 23 -71 -163 -164 -64 -118 -44 129 27 -205 35 -98 -23 -162 -15 -142
3029 -142 -79 -151 158 34 -46 -157 230 -14 -175 252 62 111 380 60 49 99 -224 36 195 58 -38 -212
3051 -212 111 51 2 42 -17 -121 -143 -6 -46 37 221 6 146 133 121 86 229 278 100 132 159 -104 -5 255 136
3076 136 -5 -202 12 259 10 45 104 -143 89 -40 -57 3 -100 -217 -119 -226 148 -113 62 213 182 -10
3098 -10 -58 25 18 185 41 36 128 68 138 336 127 49 -51 -21 165 -178 -70 251 -225 -414 69 -14 -296 -166
3122 -166 78 177 -35 14 264 208 255 -53 199 338 -51 77 275 171 -125 -167 180 -260 -66 17 -102 212
3144 212 -21 -123 -49 -33 -123 -182 63 29 -23 -77 -6 174 120 -32 174 212 -59 -76 -150 -55 40 -80 193 232 -71
3169 -71 -122 200 165 -161 7 98 -37 -63 -31 11 -54 -308 -17 93 -168 -284 93 174 297 12 90 76 179 260
3193 260 167 264 112 -43 -35 294 120 33 175 57 35 120 -196 -120 -137 174 17 114 -76 -49 -89 26 -93 -236
3217 -236 21 77 76 -187 -89 4 45 -180 -20 192 -125 106 7 279 154 243 -29 177 -25 -151 -52 -157 -154 -63
3241 -63 36 -58 -1 -353 72 74 -289 -116 128 185 2 4 54 94 -120 -3 318 -2 129 34 77 18 -28 254 -42
3266 -42 226 -279 -109 -43 309 -73 101 -74 95 171 -117 -21 16 -37 -182 90 -273 -60 -211 -181 220 -164
3288 -164 38 130 170 -26 -116 320 164 90 -275 112 11 -32 134 -39 79 -176 -11 10 84 -173 -40 -278
3310 -278 -60 -283 -127 -183 104 68 35 50 76 180 56 92 175 163 190 -133 -84 75 -65 85 -230 252 54
3333 54 -133 69 -194 -223 -65 -24 -284 -105 137 -49 -75 -186 -1 -261 -151 181 121 -29 91 0 60 138 244
3356 244 -29 233 -51 -103 -9 -1 -173 -157 -110 -42 -8 -172 -275 -280 -249 -121 -140 -77 -163 -10 -136 109 15 -122 46
3381 46 198 125 -97 -98 15 122 -74 -9 356 177 -33 55 196 52 -74 -159 114 9 -266 -192 -130 -204 82
3404 82 72 -128 -30 44 -74 183 151 -40 46 196 -26 87 -142 103 -18 6 145 352 -166 176 20 -61 -214
3427 -214 81 -233 244 198 63 -16 25 59 62 -27 -229 -30 251 -94 186 -41 -328 136 339 184 -47 108
3449 108 115 69 146 21 -36 300 -72 -79 126 72 -324 -110 83 -86 -110 -64 4 -30 86 30 -134 17 20 -172 -100
3474 -100 98 -116 90 -50 378 248 -30 102 52 280 -11 -46 -108 -84 -309 49 60 57 54 -221 -15 -137 65
3497 65 64 -46 78 16 104 -181 30 -61 75 154 61 213 75 193 -67 -15 245 -156 200 -59 50 -44 308
3520 308 77 -72 52 -315 -291 71 -185 -316 -63 132 -57 -93 -22 -173 -325 -95 -77 94 73 -95 -136 -58
3542 -58 278 4 -54 186 38 -145 74 53 -86 -51 -61 -90 -125 -200 -45 -15 -187 -273 -376 117 135 104 -76 141
3566 141 -65 16 47 186 7 137 -11 162 17 -141 5 92 -61 -25 -8 -64 23 -70 -98 4 128 -68 -196
3589 -196 109 -2 -52 144 28 17 -75 26 -81 399 48 -87 98 -208 295 128 382 86 219 -216 120
3610 120 9 -146 -23 -158 51 44 -10 116 -134 -187 13 -231 -432 -135 -90 -59 -252 -107 78 4 -57 62 -46
3633 -46 87 40 -195 189 74 2 256 -102 -122 -162 114 -283 -34 63 -132 129 -241 -353 -119 -40 -143 -109 -186
3656 -186 -55 -65 -185 -256 46 92 264 176 201 -49 48 -79 235 59 1 107 301 257 -121 -5 285 -108 -108
3679 -108 -7 162 -13 -118 -334 211 132 -330 136 -55 163 149 181 143 32 -87 261 168 18 -51 136 410
3701 410 347 228 -56 167 14 -50 11 -119 -358 -205 -146 -29 0 -191 -235 16 -24 -162 91 -56 -39 -39 -176
3724 -176 -2 100 -171 108 334 -95 -42 363 99 197 -7 38 59 -207 41 221 57 -91 -13 -43 76 -102
3746 -102 -31 -1 -115 132 -175 120 -44 171 -183 -94 97 -263 30 89 -79 4 93 42 30 70 166 68 142 -109
3770 -109 80 -59 -5 58 182 34 -76 44 -131 -163 94 50 -27 9 -7 126 22 -130 228 176 -41 -14 -2
3793 -2 -93 136 -33 -52 -60 5 -4 -166 -74 20 92 -124 34 -192 -5 -189 9 -69 -113 -54 -64 71 74 -18 -59 106 143
3820 143 -188 52 379 146 223 -55 -48 63 -119 16 -110 -96 -10 45 -55 27 -239 -247 -23 228 16 11 -388 85
3844 85 138 -122 -106 -44 185 -14 149 110 -66 -50 52 -52 109 -53 56 29 -71 -26 -105 -13 208 33 -123
3867 -123 -21 -57 -104 -133 -158 -13 -47 -5 -136 19 -153 -47 -29 -245 379 173 -118 62 142 -127 120 40 -14
3890 -14 -76 40 357 -87 52 4 -180 164 59 55 95 -170 160 208 64 -139 82 -86 -50 61 42 -15 -68 76
3914 76 -107 238 118 89 -101 -237 -12 -89 168 -142 92 227 106 30 -53 -77 -110 -56 -6 221 -84 -16 107
3937 107 -22 -173 -142 -294 -94 147 44 9 -58 -19 -5 123 304 -9 -233 202 62 124 247 136 184 54
3959 54 -5 -254 -139 -13 -54 242 -86 97 -99 19 -6 -278 143 -14 333 -145 -181 -31 -52 96 -52 152
3981 152 56 -431 133 179 -149 -195 33 -43 46 64 28 109 66 -70 77 -153 -176 -157 -96 -53 -30 31 144 -67 -149
4006 -149 -50 34 -23 -51 16 103 -244 1 62 221 216 34 -5 146 23 -11 -270 -165 -3 -65 124 -4 -149 -107
4030 -107 -182 -75 -60 167 -134 -37 9 -46 -171 -53 -111 -129 184 248 -16 203 185 234 -35 -87 139 -63 -17 -66
4054 -66 371 51 -199 -96 -148 -76 -21 -137 -69 62 72 -5 253 -153 -116 -133 23 20 -8 -31 -234 7 73 87 385
4079 385 170 62 -132 -28 104 -151 146 -75 -184 44 92 48 -7 -361 43 -207 -21 -139 -227 76 -149
4100 -149 -46 -260 -103 89 186 -17 -59 169 -41 140 -77 299 -61 59 -77 43 79 178 73 -62 -69 -293
4122 -293 60 83 -97 -40 20 2 -37 -165 -95 13 72 52 317 26 206 -13 33 -120 19 -145 23 134 49
4145 49 101 56 -33 -4 -19 -34 25 -24 9 -138 233 -325 -240 -19 -36 -56 -119 24 107 62 -40 -117 60 71 -65 248
4171 248 -35 118 -79 246 70 29 -111 247 63 -17 88 -192 51 78 -136 -22 -58 -43 -56 -91 -96 32 101
4194 101 265 -58 -124 70 -169 -95 107 -273 32 149 120 -10 61 186 -44 -101 73 -98 -154 -22 -224 99
4216 99 6 223 156 -100 389 197 -42 9 -79 178 -154 188 56 -61 85 -12 37 -60 -190 102 -122 80 -130
4239 -130 111 33 -147 68 66 -113 -2 -183 -171 17 8 -57 159 -55 -1 -75 -91 -159 -22 -247 -27 -164 38 337
4263 337 -79 119 -76 -15 -32 -68 133 173 51 142 -44 47 -128 -44 -148 8 109 -24 18 -89 139 -140 -133
4286 -133 -111 -27 30 -236 141 202 185 -110 65 224 73 25 9 16 -99 -103 40 -102 26 133 233 -59 303 -14
4310 -14 -218 81 -100 -30 -48 -10 7 -6 31 147 34 156 -119 272 -236 -142 -49 29 -188 -35 67 28 211 233
4334 233 218 20 -21 63 320 94 -56 83 42 -218 -120 -58 52 -127 44 -200 139 75 -52 178 200 96 132
4357 132 -53 67 -141 -146 20 -18 79 61 101 28 -95 -118 -10 -138 -124 -14 58 -43 89 -38 155 37 209
4380 209 -1 -191 -148 -224 -218 131 -162 -91 -14 -192 28 9 -180 40 90 59 89 208 -87 117 41 -65 -66 9 18
4405 18 41 -90 -164 -61 215 -216 68 30 -22 -43 -50 4 -194 20 101 25 96 108 11 -242 -102 413 -66 36 121
4430 121 -193 157 -96 97 96 88 -121 -72 231 -159 -230 -117 25 -135 -66 100 260 -49 197 -21 -103 -411 -231
4453 -231 89 -2 77 79 168 117 -97 -321 -140 -56 -140 -21 246 35 -83 39 99 -67 -122 58 175 67 3 -229
4477 -229 -268 -199 -197 54 -141 103 43 -225 177 197 7 -24 -134 341 -100 139 -52 -33 230 -163 -20 10 -269
4500 -269 0 -87 -280 -194 -190 -102 -199 84 25 -25 102 -12 146 246 133 72 -156 174 25 -86 0 -30 -98 -139
4524 -139 -94 106 -24 -279 71 -124 121 -47 -207 102 -269 -153 31 -79 -162 -75 -6 209 -88 45 -135
4545 -135 92 143 108 -28 123 289 -23 -100 -48 112 75 177 83 182 -41 -101 34 -168 202 19 156 108 -276
4568 -276 -325 262 283 18 73 -93 125 -179 242 39 178 -80 -215 -170 -145 -38 53 3 213 -29 38 262 133
4591 133 -85 -125 267 -81 -94 109 -101 -91 47 14 65 -190 63 -282 -34 -68 -28 99 155 257 -34 -65 11
4614 11 -20 45 154 249 95 -23 -47 -33 100 -65 130 349 195 99 60 1 -36 -179 196 182 -23 35 -122 -120 -118
4639 -118 6 84 -80 -11 -71 71 -71 247 -56 86 272 119 152 -8 171 -215 -87 -42 85 -16 -133 259
4661 259 -151 101 -91 -158 128 79 153 26 -58 376 19 -103 -81 -81 266 -93 24 -142 13 226 201 -56 62
4684 62 234 62 -113 -97 -34 -10 -13 -18 -258 -76 -19 -118 -122 -44 100 209 -47 68 20 -61 -108 -242 241 111 182 49
4710 49 -4 85 -24 56 -74 -116 162 -30 148 24 -322 13 -71 122 77 -46 28 -107 -39 126 -32 -108 -76 -142
4734 -142 121 -133 -103 -88 42 25 9 -196 23 -15 32 -240 -4 -180 217 95 28 -44 -5 -123 89 -136 139
4757 139 -15 -39 151 -8 100 -118 23 110 32 88 -350 -95 164 -236 -220 -122 127 -102 -95 -72 247 116 -42
4780 -42 -28 -60 -266 -57 43 -177 55 16 71 133 -251 100 -207 29 -199 21 -97 -231 -27 156 127 -113
4802 -113 -69 -159 -93 256 -35 -48 -41 11 -69 -39 -74 56 105 13 -105 -247 344 -196 105 240 -143 -115 78 136 -374
4827 -374 -142 58 -177 -13 -204 163 96 -212 111 -132 -284 12 251 70 -87 -219 137 -109 -48 -273 -98
4848 -98 -65 5 -82 -97 64 -134 50 95 -64 299 33 -18 68 -100 -177 245 9 -12 -13 -248 -52 196 237 -207
4872 -207 45 137 -57 128 269 -174 109 -195 10 16 -63 -29 -130 89 25 -154 -172 167 195 43 226 51 97
4895 97 -153 19 104 -217 49 39 -90 39 224 63 46 -101 -116 113 223 46 110 -103 13 68 94 -145 -75
4918 -75 -83 133 -54 -92 -177 86 -134 -50 80 70 -173 17 49 -72 -8 -179 -1 182 -102 -52 -167 -21 -173
4941 -173 -151 -136 -223 46 182 -54 -62 8 92 6 -47 115 36 -101 -21 210 -3 -43 34 101 -34 108 18 218 9
4966 9 -181 88 185 40 -61 41 15 121 -4 83 -77 75 61 -12 161 -105 -166 -29 -153 130 9 -35 64
4989 64 -183 41 198 89 119 -194 26 194 27 71 -211 27 -94 -157 -191 238 -135 -343 104 -249 -221 -82
5011 -82 -75 -310 -58 132 164 63 -103 323 -48 53 2 -2 -268 -145 13 -42 34 115 -142 -42 71 36 -304 -288
5035 -288 92 19 -5 -59 -91 -9 -176 84 -265 -200 108 22 2 43 -28 -68 16 11 87 59 -353 -48 10 251 -120 -413
5061 -413 73 58 163 58 176 45 -75 -27 65 -198 -78 -22 -143 -234 229 178 45 -35 67 -57 194 47
5083 47 -134 -219 59 46 17 48 108 -2 -205 55 190 -33 200 -233 65 39 42 -56 -180 126 112 -47 118 -90
5107 -90 -71 25 -160 -252 -8 -71 20 40 79 -10 -20 38 172 193 -53 -26 -335 68 -127 20 -111 202 21 -280
5131 -280 -195 66 44 36 -41 62 143 -198 105 47 229 -1 -145 -34 20 -173 54 120 159 -197 -83 23 -233
5154 -233 -72 251 198 -69 -27 -104 58 203 220 -7 -102 -236 -55 -163 119 70 -220 -192 -78 155 -194 72
5176 72 9 -119 38 64 -180 -154 -170 260 -84 -108 -233 111 187 -137 86 -118 116 145 -24 -154 -96 -45 197
5199 197 111 5 31 155 133 -13 -119 94 23 -64 270 13 21 242 61 -60 213 68 -127 61 20 -60 117
5222 117 -152 70 92 167 66 -108 -111 -263 47 112 111 263 -95 -61 -79 -74 -143 -4 132 -37 -119 -182 224 128 -240
5247 -240 129 -64 -7 -15 225 -50 28 -201 -52 -119 -51 245 98 -117 -164 -4 -137 55 2 71 -59 108 28
5270 28 -16 -174 -80 -14 3 31 -55 198 -78 68 -112 271 77 5 51 60 113 -55 56 -168 -34 -53 -205 -32
5294 -32 -15 218 90 -70 -157 45 -127 46 -37 28 125 -414 65 37 -61 -6 -129 217 130 23 51 106 98 -95 140
5319 140 144 -45 -46 99 0 -12 215 159 57 -44 26 -37 20 -296 60 -78 -189 -42 161 39 35 141 -83 145
5343 145 81 -105 150 121 88 25 185 -60 21 -53 39 107 3 105 81 -10 -107 -77 -50 49 -9 149 -348 -58 96
5368 96 152 -108 -60 -131 76 -27 -127 136 -136 -18 -226 -50 -109 -1 213 83 92 67 26 141 -2 95 213
5391 213 -25 145 -58 59 38 222 259 -13 -8 -21 -104 58 -64 -121 -229 88 -216 89 321 31 254 315 -193
5414 -193 251 -38 -162 119 54 -102 -170 40 -9 -66 59 -38 101 262 -81 -24 -49 40 -69 32 -65 -19 51 -98
5438 -98 -8 89 9 -111 98 -88 -73 44 109 -39 199 -227 -204 139 74 153 21 -67 -230 93 -38 -269 -75
5461 -75 23 149 134 132 -97 -63 -62 245 -10 8 127 160 58 47 -224 121 53 -86 -184 -7 -34 -32 -74 51 117 345
5487 345 -131 53 43 156 7 -101 52 -8 24 40 114 -214 130 156 113 129 -168 7 89 -55 25 122 121 96 -115
5512 -115 -223 152 -167 -40 150 2 0 -84 204 -231 134 54 76 146 176 -180 -103 -287 -49 -148 29 62 -206
5535 -206 -141 -52 -271 -204 103 169 -78 105 -55 96 83 -22 -387 -103 17 -6 -70 35 155 12 329 -2
5557 -2 -24 -213 -91 -82 -65 -55 300 -140 263 -50 -36 -48 89 -93 -162 -34 -225 -125 29 -77 -192 20 21 -204
5581 -204 -143 93 175 -72 -95 -69 107 -111 15 7 -188 36 -28 167 10 114 -168 9 27 -198 -172 124 -81
5604 -81 8 143 35 -85 89 -149 -184 -26 14 94 -46 -41 -16 -70 -78 87 -62 199 -55 27 95 76 -102 47 -59
5629 -59 -123 119 282 -85 28 -15 -91 -4 -126 -127 -19 12 -83 -1 -184 -77 -54 156 -204 -7 -197 105 -31 -8
5653 -8 42 -206 -204 4 12 25 119 -42 64 -97 114 -221 180 96 112 28 -18 -48 62 14 -157 4 116 -81 34
5678 34 -124 -40 -48 -33 130 -91 39 45 122 137 -41 -120 174 -133 -21 -28 268 -137 194 -208 -191 -55 -22 156 -6
5703 -6 114 -210 -168 206 119 -182 71 105 -154 -8 11 60 -86 -155 94 -122 83 -158 -257 -44 176 40 -126
5726 -126 -116 58 -92 -145 -177 116 -89 191 -59 -226 14 92 126 -136 49 2 -200 222 41 77 -116 -33 171
5749 171 -99 -137 276 -15 31 43 -94 132 -282 141 146 -246 -117 36 -51 94 -6 251 -125 -116 -68 379 -72
5772 -72 -74 92 -62 158 -159 16 -53 -146 -87 -50 -59 -128 -129 -128 46 12 134 -21 40 149 1 -61 -23 232 -11 -218
5798 -218 307 68 178 -182 82 -28 315 -79 43 16 -139 -178 146 112 -120 -107 -74 -178 12 -308 -109 102
5820 102 77 56 -59 43 -88 -34 152 -74 -24 71 -34 18 -136 18 -95 10 -159 78 35 66 229 29 -108
5843 -108 157 -135 77 -264 90 -21 -161 6 -211 9 -120 46 50 -120 -332 -62 47 -86 118 -126 81
5864 81 103 -257 98 46 369 -122 -34 32 120 -28 -150 -168 195 21 -129 -9 -136 -97 13 5 139 -134 2
5887 2 27 -186 213 -119 278 -89 34 108 0 -202 59 -150 99 199 -7 -160 -10 -159 153 63 48 -80
5909 -80 147 91 -204 -82 -84 -201 -196 -65 -75 -50 135 160 -93 -8 48 -174 -80 -169 125 133 31 -55 67 95 -128 -103
5935 -103 -62 -54 35 -88 -245 -179 -46 21 44 -29 -40 2 -39 60 -234 29 172 -189 107 101 -10 -195 -13 144 61
5960 61 51 -18 39 -158 163 -63 101 -134 -33 129 73 78 -166 51 -164 186 -8 -100 18 43 304 102 -252
5983 -252 -92 160 27 52 8 -62 109 -36 229 174 294 134 42 60 23 -127 -105 -139 -186 -15 267 -207 378
6006 378 99 43 103 159 -246 -342 -49 -186 -18 -158 -250 74 -77 -58 15 136 1 184 198 79 -57 34 265
6029 265 69 -111 -63 22 -202 -350 -120 -163 -125 25 19 -38 -168 71 254 -26 -112 -77 -87 -51 -53 -204 37 49 -8
6054 -8 -73 59 -217 106 265 74 -88 -127 168 152 64 63 75 -129 -13 125 51 -128 58 -95 6 89 9 -104
6078 -104 -142 139 -15 -106 15 179 72 24 -25 49 -14 -53 -9 156 -50 -14 114 -121 -29 44 252 177 48 -102
6102 -102 -69 -92 149 -198 13 240 208 17 -195 142 -120 116 -191 -148 -135 247 198 106 -197 -23 106 24 -76
6125 -76 -47 126 68 -99 14 -157 165 -48 -230 175 11 266 150 18 211 -150 -55 -6 -103 -225 -3 0 -147
6148 -147 -39 70 -118 -87 204 -92 81 -59 320 -1 -137 121 162 -54 287 -180 -27 -25 51 -105 -40 -16
6170 -16 -148 96 -28 0 -91 -26 -64 -198 52 276 -9 -139 28 -147 -63 147 -67 130 -140 127 188 19
6192 19 126 65 21 -51 66 6 -167 117 -152 222 85 -180 66 -65 -3 -17 -74 244 -120 61 46 28 73 67
6216 67 -60 -247 19 -84 47 -1 -44 15 -85 -268 108 -38 63 107 -284 107 184 -222 22 -79 -176 -84 -46
6239 -46 -48 -138 -75 -258 -164 196 -117 -69 -17 -88 -129 -193 78 -197 178 9 72 44 -146 -124 -195 -4 53 -110 -17 380
6265 380 -13 112 -76 -26 -221 -35 126 250 -9 -138 194 21 77 76 -35 -100 220 -25 89 -42 30 156
6287 156 -112 -251 -277 -144 167 161 -165 -105 10 14 14 -34 199 -112 -160 128 -75 -79 -9 76 169 66 -2 219 -28
6312 -28 51 -23 226 -67 94 1 -39 -26 78 175 -209 151 -146 -147 197 101 6 149 -41 -54 31 -23 -301 -120 -16
6337 -16 -40 -21 81 -30 43 -54 -101 65 -65 142 -83 -63 -149 -27 -182 9 4 -16 3 116 -72 -26 3 183 32
6362 32 -59 -39 119 83 -94 -50 98 79 115 -26 7 -73 -99 7 -26 -50 -17 191 14 -160 -89 103 -203 110 296
6387 296 109 -77 -203 -67 -194 -9 18 -309 87 1 -129 22 -82 -143 -238 -10 88 -129 150 -87 295 -64
6409 -64 -235 -289 42 156 27 -136 120 -280 -27 -127 83 67 -55 -160 -44 -119 83 17 39 -70 -143 227
6431 227 80 -51 82 165 32 -113 6 2 56 48 -270 -306 -23 230 2 17 189 -78 97 -1 103 59 194
6454 194 32 -87 405 1 -3 173 59 76 -82 -175 58 -135 159 86 -157 93 -15 -77 -24 349 7 -129
6476 -129 -30 -98 36 271 -58 243 0 -138 -99 77 -30 -8 89 46 186 55 51 -2 21 47 -53 -127 1 -20
6500 -20 -120 -164 -267 -59 281 -6 117 1 -56 109 92 -128 -92 -89 54 13 -99 -49 -95 -76 -98 84 167 194 3
6525 3 100 -156 232 -18 127 49 26 142 137 -323 80 -30 276 -47 11 27 -190 24 187 130 -151 270 84
6548 84 139 -68 -25 -99 96 -58 -68 177 -109 -83 -30 6 231 -22 -111 207 42 -13 121 106 29 87 153 -65 -74
6573 -74 -3 98 22 83 98 -73 289 253 -10 -276 217 107 210 -59 78 22 -58 -71 53 -57 218 197 -101
6596 -101 90 50 130 5 174 82 20 -71 -51 48 -53 -152 362 -64 -77 93 27 96 46 3 130 149 47 -73 -169
6621 -169 -218 22 374 49 11 46 -52 66 26 -85 63 -68 23 209 183 -129 187 102 122 12 -63 76 -22 -52
6645 -52 210 -61 -7 16 4 -81 -42 20 -2 12 182 54 -212 -227 -45 78 -37 39 66 -7 -18 -13 97 1 180 -144
6671 -144 123 17 -77 -12 1 50 -97 -265 -191 -38 -110 -118 -256 -185 -1 -52 122 50 55 27 -140 80 -85 125 109
6696 109 86 -67 102 -118 52 -1 151 -102 22 -37 203 -202 -357 -177 38 -53 152 -217 96 235 -283
6717 -283 126 35 111 -151 -350 -56 -8 -62 -128 45 -81 -71 -330 17 136 43 258 -66 -10 58 156 11 43 -75
6741 -75 -162 -185 120 111 -76 -88 150 -66 70 178 -37 -262 25 29 55 -175 73 -129 -201 -10 29 -90 139 -1
6765 -1 -155 258 -190 -21 -391 -7 -57 -173 98 -33 17 -2 -74 100 236 259 56 -37 -134 -94 4 199 -162 -45
6789 -45 -166 -161 -85 -294 -6 272 88 -139 -53 97 184 14 -210 117 135 -148 195 35 -194 212 9 -200
6811 -200 -62 50 -67 -60 -13 425 178 151 -117 -141 32 164 -118 63 20 -4 -48 177 -320 -236 -163 -53 -149 -6
6835 -6 -88 10 106 -97 -44 -16 -144 -97 53 -103 -278 17 24 41 317 -268 84 -51 165 130 -111 151 -110 -20
6859 -20 -29 -145 191 -133 -53 31 248 49 215 126 64 93 80 72 105 -158 173 101 153 -59 153 6 -99 54 -154
6884 -154 17 130 109 123 -150 -247 174 -65 17 133 19 -113 -73 -138 -174 -123 -167 48 80 -115 -89 46 -16 -47
6908 -47 -66 -131 -27 -137 91 162 335 129 20 58 100 80 27 -47 -50 190 165 -44 -62 83 -4 176 7 -156 -173
6933 -173 -35 -100 -108 -96 161 147 140 -59 -116 196 -45 -159 69 -62 -168 -182 -5 -180 11 6 25 -21 -118 -124 266
6958 266 26 183 65 -220 -366 23 -32 8 6 -230 -131 -12 12 -213 223 -65 217 153 8 193 -23 222
6980 222 -11 -86 81 -35 16 -1 198 88 203 -296 -245 12 127 -18 -2 17 -210 -91 -225 41 35 110 31
7003 31 139 130 166 -146 41 -200 277 -131 -41 74 -301 54 20 -254 73 51 137 -49 74 102 -128 -44 -183
7026 -183 193 200 -79 23 -163 130 -35 -24 77 -27 32 420 -54 -63 -86 -14 -187 157 55 19 90 -142 -51 -273
7050 -273 -232 59 -233 -257 215 -14 -57 -90 -194 219 183 -105 203 87 228 216 132 14 121 88 -198 170 108
7073 108 -115 -81 -16 -32 231 -118 77 117 199 -90 229 -28 -72 103 14 41 -23 182 25 -65 -21 -63 -162 210
7097 210 -41 38 78 -71 111 243 -102 -59 94 34 -167 -21 -115 -203 -92 -144 -7 -104 -39 130 221 -112 -111 7
7121 7 -75 -99 -59 -153 -110 -96 203 -15 -217 105 3 152 -115 125 -96 161 63 -35 9 26 -112 11 256 -30
7145 -30 -248 106 14 -33 9 -84 6 19 90 70 150 115 32 -146 -137 -149 212 -2 201 -62 106 17 5 -196 -97 2
7171 2 -337 -78 -74 -143 -27 78 2 -139 -69 -19 62 -118 -40 -17 5 157 -241 -77 -189 -92 118 -24 -53 173 36
7196 36 199 -5 37 357 33 -4 -97 -95 69 -110 -172 -33 -94 198 -124 -2 144 -215 13 -107 75 155 -56
7219 -56 -191 157 -203 -175 -5 115 148 170 -52 -93 -48 -6 -71 -144 58 -51 -19 -44 -156 73 -29 -185 -89 27
7243 27 -8 -24 117 -59 26 37 -57 39 -93 112 110 229 221 -119 212 -139 12 29 -179 -312 86 77 -169 120 159
7268 159 18 73 -8 58 24 -58 28 82 96 71 157 -15 -97 104 -91 121 49 17 187 -66 -199 46 12 212 -138
7293 -138 286 -39 -276 -22 -2 210 53 287 75 86 199 91 -129 -32 -87 -62 80 71 -23 235 87 -2 25
7316 25 24 112 114 -7 -95 226 56 134 -97 25 19 -259 243 115 -4 -66 -50 -178 -9 67 21 103 -144 181 -168
7341 -168 -3 -23 -86 52 -62 87 -30 81 -136 31 -43 86 -1 10 -68 -92 132 141 106 175 412 126 -197 -63
7365 -63 197 -131 -8 54 -201 171 276 -184 -102 -70 -12 23 39 224 -144 -39 171 -47 269 -237 -71 55
7387 55 66 170 174 5 -47 -96 43 -143 131 131 -265 -146 36 -111 -75 186 59 -34 26 -67 197 127 -56 33 241
7412 241 41 -59 -80 287 -40 33 17 -19 9 4 196 12 61 57 -158 125 -71 -145 246 63 30 24 -394 60 34
7437 34 4 -57 201 -102 -127 -58 58 -10 -31 -15 168 249 -106 105 -83 -93 -41 -148 19 -231 -308 -9 -371 -90
7461 -90 28 -97 -13 207 197 -90 -160 41 -57 18 149 1 285 68 99 23 -158 -104 139 249 19 177 -153
7484 -153 27 -21 159 152 29 115 0 -199 78 -228 -41 -61 -51 8 -79 -123 36 -322 -19 -75 161 -39 -33 -289
7508 -289 56 249 83 -135 70 -16 12 -60 -59 96 -180 -99 41 -173 150 42 64 -281 -227 -84 20 84 32
7531 32 -31 3 134 -95 -227 351 41 297 -26 -137 27 -99 34 -71 113 134 36 -71 31 -54 242 -4
7553 -4 -8 17 17 39 -37 -238 -52 -114 -521 63 -176 266 140 105 -245 -7 7 -59 227 66 6 36 -81 -170 105
7578 105 -99 -2 30 132 94 -143 53 196 -5 177 -2 -97 175 -176 -77 -18 -67 -9 86 44 4 44 -80 -64
7602 -64 -126 44 -25 -62 -21 -130 221 28 -30 40 103 -4 -44 56 -100 -138 28 30 -129 -41 -127 -57 -47 105 76 -182
7628 -182 -15 302 141 -77 75 -150 97 263 -50 -224 122 -28 65 193 177 104 32 75 -125 -75 -206 -115
7650 -115 42 -157 210 44 103 36 -5 44 84 -33 -103 352 -39 55 -211 43 49 -26 -175 123 85 -156 -112 94
7674 94 8 -136 34 -45 58 154 121 -161 -58 -208 -78 -215 -125 -69 5 -22 41 -231 55 161 -25 -57 -19 18
7698 18 -88 210 -179 106 144 19 64 94 21 -44 -15 38 -196 -154 -56 35 97 -194 -65 -42 130 -87 5 237 -113
7723 -113 58 -64 151 272 40 52 -288 99 149 48 40 -203 -17 -48 -98 -13 161 -168 206 22 -17 -64 -200
7746 -200 106 -4 -31 -49 -30 131 64 95 104 -84 146 85 -8 214 61 -24 189 -157 -53 -55 -2 91 82 59 -102 -17
7772 -17 58 -67 102 135 96 85 52 85 25 -74 -130 226 2 -45 -83 -151 60 -41 100 42 20 -15 90 47 221 96
7798 96 38 -258 77 115 -61 11 -26 -129 61 -166 223 4 -41 -206 -168 222 116 -93 294 -103 -209 -37
7820 -37 192 -82 19 -34 125 69 0 86 -148 28 -151 77 17 13 -101 -6 33 -215 -62 127 35 -44 -94 87
7844 87 25 36 -25 -63 136 -113 38 293 4 69 -147 103 61 241 163 -24 -28 -123 182 17 18 130 6 -244
7868 -244 -4 -62 -41 -28 86 -78 91 -36 50 -201 125 39 -45 169 -99 101 -31 82 -146 -27 -13 -115
7890 -115 312 78 144 -4 53 215 100 137 -34 52 159 -177 -333 154 -155 -208 -155 7 -177 -10 -76 283
7912 283 175 9 -5 -18 112 -39 246 -167 177 48 28 38 195 148 -35 14 -168 8 133 -84 -203 216
7934 216 -28 3 -37 65 256 -98 68 1 -97 -143 -210 -57 232 -20 164 -252 -127 105 83 -220 85 211
7956 211 236 -61 -10 36 108 223 -190 99 68 -54 7 109 -94 -179 -129 2 -141 -225 -82 111 -125 43 -84
7979 -84 -77 126 37 -107 -219 42 43 -12 -5 91 -10 -34 -102 108 -96 69 97 -102 -46 103 -219 -58 -134 -274 -116
8004 -116 -213 -13 -30 43 -13 95 108 203 51 27 37 75 -96 29 251 73 23 -102 28 -103 -79 45 -61 -110
8028 -110 67 -67 119 -9 -8 -25 17 213 -121 -306 -65 164 92 -32 -93 122 -179 179 -142 106 -48 -107
8050 -107 -42 80 76 -86 55 -72 -104 18 -44 4 58 42 -9 300 -107 -23 -170 -167 -211 -144 -66 34 116 -143 74
8075 74 -166 64 14 76 -30 -96 90 24 156 196 -110 -49 -129 87 93 -92 156 31 42 28 188 -134 56 47 -7
8100 -7 7 -132 70 72 -45 161 252 73 186 81 212 -186 -133 87 124 -59 -57 -133 144 -14 47 74 111 140 147 -195
8126 -195 73 -68 132 -78 6 163 -1 332 131 -79 64 -71 -4 184 34 -16 164 36 -25 30 49 148
8148 148 181 -94 143 -190 -57 -24 -34 222 52 -86 50 -51 -232 -155 3 -196 -78 -39 -188 -44 181 -87
8170 -87 -95 17 -229 29 76 96 205 8 15 361 42 165 -199 -90 -74 -79 -42 74 -191 -42 -103
8191a03
$$ Imaginary data points
##PAGE= N=2
##DATA TABLE= (X++(I..I)), XYDATA
0 0 0 0 0 0 0 0 0 0 0 0 0 0 0 0 8 -8 8 -8 8 -16 16 -16 23 -24 30 -32 40 -45 49 -57 65 -73 85 -96 107 -120
36 -120 136 -152 168 -189 209 -233 258 -286 316 -348 383 -423 465 -512 564 -622 686 -758 839
55 839 -930 1035 -1157 1300 -1472 1680 -1942 2278 -2729 3368 -4339 5985 -9284 18401 -95357
70 -95357 -286762 52008 239257 6604 -172872 -28894 93303 46995 -6907 -22496 -61377
81 -61377 -7242 111696 65212 -123603 -109259 111075 142295 -77483 -143299 28990 112346
92 112346 6826 -70739 -36348 15229 34131 26282 -33142 -69351 14292 88163 2703 -87459
104 -87459 -15365 68182 14789 -34190 7609 6911 -27120 24636 57301 -30965 -70937 33879
116 33879 82788 -26504 -79207 23725 66392 -23218 -46871 23723 14035 -44268 7361 62999
128 62999 -29084 -89610 29542 96556 -28364 -99433 18540 90805 -9926 -70323 8556
139 8556 45588 -4580 -9367 15633 -12829 -21837 36375 39798 -40126 -45780 38448 47235 -28349
152 -28349 -41497 16421 28035 -11908 -16412 2405 -7574 -3780 21022 -640 -36564 -4930 37997
165 37997 3633 -36782 148 31327 -6121 -20609 18712 18875 -22354 -12395 33689 14243 -32992
178 -32992 -6650 34862 4044 -27040 1692 17100 -11208 -9105 21792 -914 -39321 -1215
190 -1215 44795 147 -52658 -9389 48539 11001 -42647 -13132 28510 12174 -8783 -5482
202 -5482 -5645 -1013 21894 18469 -24409 -27179 27542 38426 -18195 -37731 10859 35271 -2857
215 -2857 -26550 -4299 9454 5002 4594 -8619 -22757 -566 28513 5094 -36021 -14769 32615
228 32615 16922 -27044 -16896 19825 15754 -9507 -6362 5863 962 4031 12345 -3917 -15352
241 -15352 6559 21526 -2233 -21263 1383 18892 -3553 -17137 2277 9872 -7102 -9039
253 -9039 5986 854 -12964 991 11676 -6416 -12129 6082 9981 -5147 -5996 8277 5374
266 5374 -6609 1280 10812 -496 -7112 5760 10388 -4643 -8763 7981 8673 -8601 -7114 5959
280 5959 2431 -7578 -2591 4641 -4249 -8225 4259 4212 -9944 -5005 9954 3364 -11356 -3011
294 -3011 12534 3593 -8247 303 7417 1942 -936 1740 2099 -878 2592 5223 -3517 -6611 5453
309 5453 7387 -6170 -10491 2849 8017 -5403 -9164 1804 2835 -3536 -2785 80 -1297 -1351 3967
324 3967 2034 -6196 -1117 9884 3436 -6588 -1089 8218 4371 -4535 -729 5628 1686 -2070 77
339 77 729 -1238 -958 1329 -1720 -5957 -8 3810 -3880 -6484 983 3322 -2521 -5695 1208 3516
355 3516 -1021 -1503 473 1206 2435 2302 979 -932 1078 5319 2223 -3601 -143 4730 2159 -2879
371 -2879 -2934 1320 1028 -1724 -1299 -2778 -3298 350 2269 -2133 -6413 -1264 5409 630 -5924 -2129
387 -2129 3357 3897 123 -2264 -558 2989 5165 2024 -3478 -1660 5002 6023 121 -5716 -2355
402 -2355 5923 4225 -3950 -7075 -1340 5189 2972 -6647 -8258 383 7080 1316 -8725 -5883 4398
417 4398 6424 148 -5904 -3437 4576 7471 2091 -5678 -4544 7482 10921 -1536 -10609 -1666 11509
432 11509 7617 -8133 -9937 2874 8870 860 -9029 -6481 2069 5092 1843 -6606 -9222 1422
446 1422 9305 2345 -10029 -8424 7291 13350 -1499 -12668 -2530 12751 9294 -6638 -8380
459 -8380 3551 9383 3527 -4452 -5720 494 5761 4456 -3353 -9622 -2215 8520 5501 -8942
473 -8942 -13241 2405 13553 4 -14521 -5184 9630 6170 -5508 -5213 1201 2755 4737 4347
487 4347 -3340 -7258 2699 12884 4497 -12629 -7940 12996 13676 -8138 -16347 2262 14620 1516
501 1516 -11301 -5714 2218 4098 1611 -3856 -8543 -3887 9320 9492 -8431 -14567 3400 17081
515 17081 4693 -15608 -9777 13721 16514 -5304 -15138 1155 14813 4648 -7202 -5122 936
528 936 4743 5300 -1396 -9799 -6373 7423 11103 -6062 -17420 -1060 16548 4644 -17134 -10979
542 -10979 12263 12242 -6287 -9732 1528 6025 2389 1405 179 -5886 -716 13238 6905 -12683
556 -12683 -10818 11710 15990 -6246 -16955 281 14366 4568 -11734 -9628 4238 6761 -392
569 -392 -5372 -6400 -1720 6754 6535 -5502 -11840 1146 15383 5668 -13057 -9467 10436 15800
583 15800 -3053 -14897 -745 14682 7456 -8863 -8951 4133 8021 354 -4389 -4745 -2078 4480
597 4480 5504 -4986 -12039 -557 12840 3541 -13547 -8231 9529 9775 -5746 -9936 2486 8809
611 8809 1422 -3193 -1346 1187 2258 3978 2470 -4132 -4040 5954 7253 -4126 -8298 792 7105
626 7105 1092 -6420 -4016 1971 2741 -1035 -4280 -2265 848 1595 1307 -1229 -3429 -81 4366 2796
642 2796 -2639 -3722 2725 7065 1851 -4574 -2589 4869 5626 -1904 -4653 725 3871 1132 -2514
657 -2514 -2482 -819 180 2111 -675 -5881 -2466 4323 2420 -4406 -4769 1928 4654 -18 -3423 -1417
673 -1417 3170 3854 -258 -1983 798 2342 2928 870 -2155 -694 2775 2696 -1509 -2721 489 1912
689 1912 -345 -2102 -2261 -1032 870 -148 -1832 -2484 -353 1507 -400 -1820 -308 613 917 1064
705 1064 29 -417 766 2103 1598 -138 98 999 1952 1204 -1118 -1489 1348 1092 -1155 -1618 -1194 323
723 323 562 -1295 -2194 -1337 578 656 -1747 -1782 467 1380 533 -1121 -894 1354 2115 968 -480 -522 2391
742 2391 2262 -827 -1082 638 1967 847 -1509 -1118 907 1001 -1003 -2232 -514 435 -695 -1520 -1232
759 -1232 -524 568 -76 -1381 -627 355 833 339 -827 710 1820 953 36 -109 1363 1697 220 -251
777 -251 497 905 863 -944 -753 323 -140 -440 -860 -1187 -222 -437 -1065 -861 -788 -329 65 -745 -593 239
797 239 744 794 -252 609 1235 703 655 249 671 1568 445 -413 637 510 -210 -130 -204 -221 -743 -210 -696
818 -696 -1280 -959 -196 -522 -617 -786 -351 500 -635 -451 175 359 646 516 -131 657 1216 1021 450 -16
838 -16 794 881 576 -6 -453 21 486 -516 -361 -942 -1180 382 -88 -1477 -1470 207 524 -830 -1413 -98
858 -98 610 399 -30 -305 372 977 922 842 -546 -55 2342 1709 -1045 -699 768 1763 47 -1538 -493
877 -493 248 277 -374 -2067 -1440 443 1144 -970 -2653 -866 1411 140 -1276 -735 -47 1359 1109 217
895 217 -792 108 2476 2458 -1037 -1758 1715 3265 81 -2541 -126 2066 -312 -1530 -503 -633 -751
912 -751 268 670 -2008 -2892 1164 2460 -1613 -3546 113 2712 572 -2243 -815 2016 1477 377
928 377 -221 -401 791 1908 1481 -485 -1528 791 2502 380 -1971 -1679 1098 1920 -699 -3330 -1914
945 -1914 1776 2002 -2670 -3517 826 2413 -651 -2145 -382 865 114 887 1390 -1415 -1519 3314 3670
962 3670 -1915 -3809 2492 5370 -1105 -4763 724 3811 31 -2893 -744 1029 -1278 -952 1172
977 1172 -1168 -3040 167 2921 -570 -4783 -593 4135 850 -3452 -1267 2212 2382 -759 -1018 739
993 739 947 1384 937 -534 -222 520 1057 753 -1090 -1398 -193 1862 753 -3416 -3121 2688 2435 -2903
1011 -2903 -3829 979 3354 -1241 -3082 707 1953 -553 -134 1780 -92 -2432 1228 4429 -601
1026 -601 -4014 1778 5182 -489 -4763 128 4885 -140 -3760 63 1713 -1173 -1325 726 -437
1041 -437 -2875 -284 2282 -563 -3253 -243 2583 836 -2371 -1305 1807 1738 211 -270 -224 964
1057 964 1559 211 -959 63 1448 928 -732 -299 -201 -836 257 1033 -961 -2750 65 2470 -1150
1074 -1150 -4466 -59 3374 -556 -2869 66 1934 -487 -1137 1121 879 -1052 435 3186 445
1089 445 -2669 437 4109 32 -3448 314 3058 -105 -1825 -72 582 -702 -979 818 -947 -1801
1105 -1801 665 1385 -1328 -2394 409 1858 -666 -1345 791 448 53 856 282 -314 156 1813 1605
1122 1605 -964 -812 1797 758 -1389 -380 1134 60 -1408 432 385 -2221 -988 1500 -391 -2476
1138 -2476 -466 1584 -321 -2148 -85 1468 -595 -797 1302 829 -795 67 1939 61 -1514 1050
1154 1050 2271 -477 -954 508 1472 -717 -1342 667 692 -1573 -722 773 -979 -1912 207 1481 -1579
1171 -1579 -2136 1202 1227 -1477 -723 1423 661 -864 234 1810 -90 -670 1373 1430 -547 -402 1532
1188 1532 834 -1278 -360 1298 -387 -901 29 -5 -727 -825 331 345 -1251 -873 958 -382 -1541 427
1206 427 1091 -456 -744 1117 972 -925 287 1770 182 -996 847 1590 -413 -1016 972 1183 -1192
1223 -1192 -726 1342 136 -1563 -471 758 -580 -1822 46 803 -996 -1143 393 578 -786 -848
1239 -848 1303 558 -992 177 1495 139 -392 736 1312 -230 -222 1221 380 -813 -3 1023 -190
1256 -190 -828 132 332 -1207 -854 588 -169 -1381 -162 558 -134 -1014 59 448 -520 -312 807 870
1274 870 -154 23 1304 823 -742 617 1343 -142 -590 712 548 -462 -417 455 171 -881 -641 640
1292 640 -461 -1334 -119 90 -631 -1136 443 375 -865 -309 714 52 -275 495 892 395 -259 672 1055
1311 1055 -341 117 593 477 -133 -365 225 -323 -320 287 -85 -922 -149 -128 -269 -648 -500 56 -237 -727
1331 -727 -107 329 -37 20 549 259 -266 295 997 320 -262 431 658 641 -263 117 464 96 -214 271 -20
1352 -20 -515 -71 7 -524 -901 -61 -13 -234 -815 -253 -33 -50 -195 -290 120 244 308 314 -196 427 480 372 173
1375 173 283 212 501 106 -60 -48 -334 194 72 -438 -860 -414 132 -327 -980 -381 140 -210 -384 -374 142
1396 142 240 -100 184 538 81 378 651 539 -56 79 838 613 -148 -292 105 410 -86 -817 -272 227
1416 227 -19 -545 -449 62 -411 -542 -238 -80 -710 -43 368 161 -489 -98 612 617 -382 -78 817 967 250
1437 250 -174 397 566 294 -62 34 -250 -323 -333 396 -164 -811 -203 383 31 -768 -693 440 536 -720 -632
1458 -632 357 647 -130 -133 387 818 -107 -5 781 293 -262 243 1288 26 -847 -66 1196 306 -1308
1477 -1308 -364 1007 47 -1283 -665 306 -62 -736 -189 -51 -254 -597 453 572 -698 -367 915 1118
1495 1118 -28 -563 483 1157 169 -408 335 775 247 82 10 238 -227 -113 61 -100 -485 -573 261 276
1515 276 -800 -877 -52 568 -446 -888 39 911 -64 -703 358 674 188 -279 489 622 120 175 838 344
1535 344 -595 -64 996 654 -824 -1072 824 159 -1099 -464 226 -15 -837 -299 270 -559 -403 539 329
1554 329 -411 -226 517 627 -375 -376 487 490 86 190 14 409 429 9 -125 -90 -27 229 -268 -95 -223 -279
1576 -279 -233 -203 -262 -240 -316 241 12 -641 -190 579 255 -298 -38 798 370 -320 524 813 130 -136 424 315
1598 315 -339 -329 903 272 -778 -196 461 -177 -787 -277 136 -465 -629 -23 10 -435 -246 325 190 -538
1618 -538 -7 1046 264 -276 474 469 645 -38 452 517 -121 201 621 167 -257 -24 191 53 -386 -235 243
1639 243 -407 -630 -3 -398 -593 -76 291 -280 4 486 224 -608 0 541 56 -163 473 721 229 -69
1659 -69 704 414 -319 98 674 34 -523 -194 267 -218 -753 -58 216 -302 -758 -10 287 -445 -601 661
1679 661 93 -544 -84 916 155 -371 -82 497 189 63 676 529 -130 -38 429 38 -250 16 178 -214
1699 -214 -499 17 -181 -462 -9 14 -206 -351 -114 227 -333 -465 502 199 -272 -98 556 332 -237 274
1719 274 722 -235 -98 489 514 -118 -142 425 530 -701 137 506 -298 -768 -301 137 -98 -659 113 125 -647
1740 -647 -181 338 -75 -90 -251 596 330 -201 349 567 55 80 594 312 -63 80 526 -6 -336 313 18
1761 18 -516 -263 -181 33 -390 -370 120 -218 -527 -104 85 -492 -262 415 383 -189 304 641 123 -204 478
1782 478 364 193 -66 410 705 -222 -86 622 31 -247 -76 336 -34 -423 -23 46 -710 -619 -14 -271 -453
1803 -453 -441 168 135 -665 107 412 -94 -99 377 337 -74 257 637 512 -31 168 488 -13 -433 493 487 -60
1825 -60 -463 38 89 -374 -306 70 -414 -584 -136 167 -381 -505 307 361 -339 -236 336 337 -65 -44 754 427
1847 427 -133 355 315 -312 27 503 318 -215 -202 218 -10 -564 -293 -182 -469 -256 24 103 -656 -153 415
1868 415 -229 -341 104 124 269 -383 57 214 240 194 456 76 81 390 391 88 -210 140 111 -301 -162 303 -83
1891 -83 -292 -614 11 -391 -547 -351 351 -188 -448 240 299 -222 -32 415 115 -207 201 407 0 64 324
1912 324 213 130 -284 379 445 -299 -386 322 30 -277 -397 -65 -82 -194 -423 -358 -244 -1 -332 -146 42 -249
1934 -249 202 95 374 125 257 -46 417 192 -64 156 617 449 -335 -44 392 -25 -174 54 23 -109
1954 -109 -314 -416 127 -419 -432 119 -175 -375 -172 129 269 -91 -376 180 475 260 -110 -24 374 200 54
1975 54 437 248 -71 85 250 77 -265 -324 272 -196 -599 -458 -9 5 -602 -336 105 -27 -261 -254 11 -35
1997 -35 -265 101 377 46 -94 168 534 94 -183 287 553 -39 -427 -22 87 49 -28 -143 42 -234 -233 -88
2019 -88 -488 -267 -387 -99 -50 -68 -36 -48 50 0 -235 31 504 373 -114 67 287 110 69 251 262 121 -350
2042 -350 359 223 -268 -304 -104 329 -441 -572 -9 117 -301 -486 72 224 -664 -126 163 30 -280 216
2062 216 571 141 -48 302 451 188 -324 332 235 -58 -335 148 97 -83 183 100 -68 -269 79 -10 -170
2083 -170 -236 -242 -216 -149 -206 -118 -25 94 86 -66 -148 298 339 -49 -72 473 147 -219 156 231 201 -44 -38 440 -195 -527
2109 -527 -131 269 -320 -542 224 238 -590 -439 446 -153 -569 -24 126 58 -136 156 566 162 -28 296 13
2130 13 64 -32 86 328 -11 -228 186 -127 -155 -181 -82 -275 -311 34 -134 -130 -271 -182 -329 -228 135 -127 -491
2153 -491 -56 58 -236 -187 520 407 2 14 438 308 -118 -129 566 417 -321 -20 413 88 -160 -184 130
2174 130 -159 -600 -155 134 -651 -388 346 -46 -292 -231 179 97 -325 80 117 59 17 153 253 59 -61 187
2196 187 86 6 221 178 -66 -214 1 -139 -233 -197 -21 -109 -310 16 -22 -115 -120 121 28 -243 -71 251 -195
2219 -195 -123 19 256 105 -290 227 410 219 80 407 104 -33 -6 241 52 -100 -11 73 -111 -306 22
2240 22 -47 -215 -559 43 53 -293 -88 208 20 52 162 56 176 -100 476 217 -235 -26 223 -6 193
2261 193 3 23 -93 -209 239 104 -197 -209 33 -45 -398 -143 251 -426 -397 22 -164 -151 -253 24 449 -234
2283 -234 63 311 34 -71 333 222 -34 -120 158 78 -125 -5 224 -179 -183 99 -86 -299 -114 -125 10 -197
2305 -197 -340 179 -200 26 -39 -21 -93 43 241 0 -17 -35 307 241 -29 27 310 271 -202 281 147 4 -91
2328 -91 302 36 -403 -356 24 -168 -229 -33 -92 -143 -138 123 -83 -96 -71 73 72 -47 143 161 -15 192 32 301
2352 301 -97 -13 339 145 -217 207 -5 -1 -55 89 140 -31 -173 164 -186 -242 -4 -85 -107 -95 49 73 -93
2375 -93 25 160 -45 326 324 62 277 33 66 76 130 -29 -125 172 228 56 54 83 32 -307 88 -268 -182 -31
2399 -31 -302 -122 -153 98 -132 -271 102 475 -257 167 45 258 235 -275 232 208 102 42 218 16 62 216
2421 216 256 13 43 -66 93 -320 -373 -245 32 -489 -449 -88 34 -192 202 -148 -10 246 -41 57 -50 41
2443 41 114 13 218 288 -76 231 228 163 -203 -4 -2 264 -222 -265 51 2 -93 -237 -86 -179 -402 -415 122 115 -155
2468 -155 19 -2 -88 218 40 197 35 80 188 28 225 -101 -22 131 -26 59 171 178 -3 -179 -4 91 -238
2491 -238 -260 -112 -134 98 -299 -17 114 -245 -91 140 18 120 -136 73 383 2 -14 404 215 -38 27
2512 27 -105 264 -119 -199 184 48 -63 -289 111 84 -283 -68 -119 -298 -256 -238 163 -193 107 -24 146 -161
2534 -161 -46 222 -83 136 -58 188 41 199 191 94 179 146 74 -104 427 118 -249 -104 -65 -58 -357 -252 -49
2557 -49 -47 -587 -35 -91 -16 -131 -142 170 -296 -335 96 511 90 159 177 189 -120 72 385 264 -75 -153 -118 -42
2581 -42 44 15 -30 -264 -61 85 -184 228 58 -45 -196 -171 -155 -34 -249 65 53 -46 -42 275 365 40 -4 198
2605 198 295 -191 146 -89 -80 -208 54 351 -298 -311 161 23 -346 -296 -115 -192 -448 -383 41 -54 -165 97 196
2628 196 7 243 -66 285 192 122 67 225 210 101 115 116 69 60 118 169 107 122 16 -244 -72 106 -61 -326 22
2653 22 42 -384 -464 -152 1 -133 116 321 -181 184 151 194 -144 86 368 77 -55 73 231 362 -110 -37
2675 -37 527 13 -329 -356 307 44 -180 -73 -74 -398 -236 97 37 69 -103 110 -26 48 87 224 -222 -111 70
2698 70 155 23 121 147 239 -6 94 117 -11 100 -10 90 37 -243 116 -185 -381 -24 111 -44 -472 111
2720 111 -49 -363 -54 -82 96 -2 201 489 176 145 135 130 -48 12 403 294 -347 -76 -231 -1 108 -82
2742 -82 -24 -95 -217 107 134 -104 142 -157 -1 -136 222 116 -150 -76 -13 244 -137 207 302 -112 140 215 250
2765 250 -74 148 321 -59 -112 94 187 -302 -446 -192 186 -337 -387 -200 136 11 -306 -80 214 -263 48
2786 48 221 163 17 -17 202 49 107 165 498 112 27 100 73 70 -134 23 12 -180 11 -231 -378 -349 -1 -44
2810 -44 -80 53 81 -183 -87 53 217 -118 -31 60 19 -318 2 373 0 -20 -139 315 -124 -393 3 289 -259
2833 -259 -279 129 -147 -203 -30 -141 224 -312 -341 -1 -213 -8 -182 -147 -14 -47 192 44 -310 159 -14 143
2855 143 122 231 144 240 107 -78 178 -64 -129 297 -269 -364 16 -23 -305 -473 375 -12 -39 -238 -55 -81 -173
2878 -173 -409 -71 28 -101 234 87 57 -100 669 49 -193 248 457 87 69 -23 176 -619 -85 -126 -160 -54
2900 -54 -147 -190 -115 78 -261 -67 -53 94 -81 -232 -122 -10 196 -76 295 61 16 96 -34 -12 68 -87 138
2923 138 378 -9 109 17 35 -205 -240 111 -76 -133 -313 14 -44 -165 31 -70 -71 -7 -20 -23 154 -39 -16 199
2947 199 -14 227 58 -10 212 41 362 12 177 36 238 -84 152 207 -71 -44 260 -48 -222 -60 119
2968 119 5 -198 30 202 5 -134 106 40 176 -97 165 269 -188 -53 282 -112 109 -96 -12 267 107
2989 107 -105 94 -217 184 54 98 -129 -197 106 -120 -217 -55 166 -44 186 -271 125 50 -33 181 214 203
3011 203 132 58 308 114 154 -144 116 79 420 -121 75 256 88 -218 -169 -42 -90 147 -45 -128 -181 -17 -237
3034 -237 -188 98 -115 -86 148 71 -77 246 371 167 142 109 18 30 11 231 415 -188 85 -200 73 -206 -18
3057 -18 -99 -81 -166 -224 -19 -195 -96 -39 -157 -39 15 -183 -204 253 -17 -170 192 156 301 125 -15 250 28
3080 28 135 223 69 -119 20 -136 268 -40 14 142 -20 -195 -401 14 -31 109 -364 283 72 152 158 -74
3102 -74 12 -25 -27 46 167 80 36 156 -28 -130 68 27 -61 28 -1 351 13 -151 -191 6 86 -178 -215 16 -89
3127 -89 -41 -98 -81 168 102 -7 91 355 -50 179 213 87 95 -9 254 243 -23 150 -43 108 -69 46 97 -159
3151 -159 -18 -111 -123 -118 -34 -288 94 -78 -7 -137 3 1 -110 -254 74 325 -109 141 191 31 173 49 158
3174 158 -194 -233 237 -43 90 -82 -279 -47 2 -385 65 -64 -26 18 -6 50 -115 12 -173 7 -160 -67
3196 -67 19 108 211 -119 -145 97 45 77 337 -20 43 -256 -144 82 52 -6 11 -298 -249 -222 -168 -112 -67 -282 -202
3221 -202 237 -71 -231 64 -197 -107 -252 175 207 -51 153 100 208 -62 -18 44 202 160 10 207 233 64
3243 64 -125 -69 -59 -88 2 -43 -198 -378 -168 -161 -8 -67 -71 -68 30 -21 -203 -75 -23 -9 110 156 142 230 -98 -114 130
3270 130 337 29 10 43 94 -181 -103 -43 -188 -308 -101 -261 -311 102 278 -34 -315 -311 -67 203 -82 -86 104
3293 104 -134 97 213 319 308 -103 175 221 333 -18 -1 -97 112 -106 87 -126 -118 214 -226 -257 5 -57 -66
3316 -66 -110 -55 16 90 74 -19 13 -129 -106 -33 61 -133 259 9 -40 -77 62 177 68 56 -22 126 -97 -129 -9
3341 -9 59 15 -154 -187 80 -205 -19 -121 -13 -99 -116 19 111 -77 46 -55 -7 70 46 102 40 -122 -178 -221 -164
3366 -164 -82 -93 -113 75 -163 -48 -74 85 -93 -140 -186 -130 -395 -64 -111 -167 -77 81 110 42 -69 43 168 73
3390 73 -109 26 126 -48 299 -141 204 -86 68 88 150 -121 -81 -131 267 -98 -2 13 -87 -107 -414 -3 -163
3413 -163 31 -64 -48 192 -19 -17 88 140 414 155 -64 -30 -12 -100 181 -185 -12 -85 -168 26 -76 207 -7
3436 -7 103 -152 -88 -67 29 -196 -326 13 -185 110 180 -85 162 -34 -31 59 197 -140 47 277 -88 -147 151
3459 151 147 60 140 -78 -86 -102 -113 90 -5 298 180 77 -4 96 136 -236 73 25 -118 -88 -54 -5 19 -191 79
3484 79 -54 -118 39 229 272 -128 -45 -37 54 -103 -185 160 -143 -69 -96 25 2 -92 -288 -462 -150 -147 29 -1 22
3509 22 84 -84 -169 142 157 24 39 159 -40 246 20 -9 14 -228 53 273 144 149 -217 -10 6 -113 -63 -57
3533 -57 -225 54 -24 -40 59 -284 53 150 31 203 186 -103 87 -65 124 -198 10 210 4 -76 -79 -379 31
3556 31 87 274 -271 -431 -144 32 38 -46 -106 -204 -226 9 58 78 60 -103 -72 43 -298 -32 205 227 -57 127
3580 127 -122 149 153 -75 3 -6 65 -105 161 -97 -4 -76 -62 199 175 -97 -129 -146 -328 -299 99 -47 -175 -122 51
3605 51 -301 -29 219 -26 197 34 29 361 100 42 113 199 -45 53 337 -83 73 -14 -174 -55 17 188 -144
3628 -144 210 -234 -161 -43 57 -8 -1 -106 54 -10 -7 -53 50 -51 120 -175 249 92 -22 -196 -43 61 -87
3651 -87 28 -66 13 -141 61 2 -185 -378 22 -81 -183 36 -34 8 26 13 43 121 -124 64 140 63 -72 -136
3675 -136 163 28 -136 31 -149 -52 -74 101 -26 -13 -275 -44 -218 -410 -3 -251 -56 -263 -199 -218 188 17
3697 17 -67 54 56 58 -39 -35 337 -32 -143 78 116 -219 19 -28 -299 -112 -120 162 64 -131 -274 -194 -82 -168 -172 -14
3723 -14 -23 -116 -95 79 73 1 -72 -166 134 -56 -129 59 162 70 -139 328 94 66 -95 29 317 -77 -185 -51
3747 -51 -61 0 64 -99 56 -24 13 -98 -140 61 -152 -41 -7 243 47 82 183 -102 -248 12 69 248 96
3770 96 197 -76 122 -296 59 117 -45 4 -110 226 194 185 -80 -232 -30 6 -130 -44 -99 21 -65 -218 91
3793 91 -34 247 68 -89 84 0 4 -32 108 201 257 94 44 191 175 -28 -94 181 -70 -356 27 4 -126 148
3817 148 61 -70 118 35 -171 -300 -144 59 -104 84 -137 115 3 201 280 -45 -408 147 -13 198 -267
3838 -267 235 154 28 -106 90 83 240 85 314 -71 -62 -124 -166 -143 -417 -196 -132 293 82 155 -128 91 38 -6
3862 -6 -125 66 128 133 -205 -60 227 124 -131 212 114 -186 -62 299 -50 21 -60 -225 226 -4 -2 201 -134
3885 -134 -203 38 191 174 -26 -43 -67 120 155 -36 100 -207 -48 84 -155 203 -104 18 -255 -17 98 -100
3907 -100 65 -192 -94 -192 18 104 57 -182 -54 -86 -16 -98 111 -57 -68 -96 80 345 -16 128 41 19 203 23
3931 23 231 -80 56 290 -58 -176 -68 46 8 -291 112 -131 -178 -274 82 -26 -9 -72 -38 3 105 -78 -345
3954 -345 -172 50 -202 -11 -61 49 12 262 181 75 20 1 143 177 -171 -11 72 -128 66 -152 -158 222 -5
3977 -5 -52 -142 72 269 175 306 -53 45 -70 206 -2 -67 79 17 -24 -159 -29 35 199 48 -68 -258 262
4000 262 -36 2 -125 -57 -8 -71 -82 135 -148 55 252 190 219 -46 -166 -73 -47 -99 31 257 25 130 111 91
4024 91 -13 47 74 104 -63 284 44 18 -121 -78 98 31 -16 -23 41 94 -168 -13 66 -189 -97 270 -145 -159 -20
4049 -20 -7 107 108 -48 -210 130 73 -102 173 183 149 190 20 81 107 139 -230 -67 194 151 154 95 -119 75 -11
4074 -11 27 112 -255 -44 18 71 51 -9 -82 187 -82 144 244 -117 -108 17 65 -78 -231 5 -139 135 162 18
4098 18 25 260 -25 -134 418 27 -147 -65 -106 -42 -112 -105 -17 43 72 -82 -94 96 154 229 43 -15 -184 -66 -223
4123 -223 154 -85 -47 148 29 -230 153 97 65 -18 -126 -205 -35 31 -57 7 -229 -12 -62 -152 236 -14 92
4146 92 1 -219 104 95 -4 -11 53 48 87 49 -70 -12 -78 168 60 46 154 82 232 75 106 -54 246 143 13 -70
4172 -70 -27 -154 118 39 -154 96 -138 -107 147 -211 32 248 -190 -1 -30 41 -31 -163 -142 45 188 -145 31
4195 31 -7 -192 54 -189 -115 57 -92 -36 92 -172 -58 109 89 118 -87 4 22 5 -91 -2 99 74 28 276
4219 276 -32 -45 -151 -75 -4 107 236 90 -322 15 38 -61 -85 -200 -126 59 -68 -99 15 15 154 185 23 99
4243 99 -173 -177 15 100 147 131 -46 -33 110 -74 152 -15 34 114 102 0 185 -178 -55 -81 -22 -103 -79 -74 74
4268 74 8 59 6 -15 112 64 165 144 145 -8 135 8 -107 -188 32 -209 84 -106 -361 7 -257 121 115 -32
4292 -32 -196 -142 19 74 -81 -54 48 15 36 16 61 -23 322 49 -44 -7 40 245 -65 -152 -136 109 10 221 -72
4317 -72 -10 -46 -51 -70 -42 -50 -219 -11 -170 193 -34 -148 70 20 -20 -68 -96 31 -132 -248 141 -27 -160 -301
4341 -301 313 150 -319 26 -42 157 70 -167 233 28 -32 -292 -24 -20 227 -46 221 111 213 -15 115 -26
4363 -26 151 87 82 176 70 193 -25 163 123 21 64 216 -109 175 53 -103 -34 -248 151 -203 -75 -142 216
4386 216 -253 -71 -145 -204 121 -93 -14 10 -172 -166 -38 -56 126 -89 242 -25 220 -35 58 -195 62 25 -39
4409 -39 32 -167 50 196 80 107 -2 -97 -9 -190 24 64 -293 -91 0 225 -70 -226 -131 -88 185 79 -155
4432 -155 102 255 3 -19 138 6 24 -65 225 210 -126 68 -89 148 -13 70 -54 -73 -71 100 113 -47 -115
4455 -115 88 -100 149 39 -60 -114 1 -129 132 -148 59 186 94 -4 -49 60 -89 -2 -105 23 -128 -60
4477 -60 37 -137 -41 42 -1 -204 137 16 22 159 38 92 93 177 -208 59 -31 -44 10 68 24 75 98 -14 376 37
4503 37 259 143 125 89 83 -320 -248 -6 66 -11 -120 37 166 52 69 84 100 -11 -118 -185 -105 -139 465 154 -108
4528 -108 181 15 9 -246 73 44 96 335 -56 -36 -15 -129 -320 147 -163 -295 -77 36 152 -65 1 -132
4550 -132 -77 28 104 149 -57 182 149 -16 261 10 -149 -108 163 -255 -19 -130 22 60 -21 -22 134 -110 -199
4573 -199 259 -93 96 -156 129 -202 15 -196 -39 163 1 21 50 -92 32 127 -133 -66 -179 215 -13
4594 -13 69 143 105 10 49 65 167 24 -112 -41 85 225 -106 255 -54 92 56 172 -9 -255 -68 51 19
4617 19 -28 -44 -79 -325 -152 77 58 235 -95 58 -243 144 89 -22 -226 231 -24 191 -205 211 -163 94
4639 94 -193 6 -163 7 -8 90 138 -17 69 -87 109 15 318 -209 152 184 154 4 -7 -20 74 61 9 -198
4663 -198 62 81 132 91 -202 141 81 75 78 -59 9 61 -49 -102 -187 -172 221 -33 130 -182 -2 55 -25 -145 308
4688 308 45 -8 -51 -19 149 62 50 -177 71 87 224 55 81 -33 -46 66 -82 255 -3 -43 202 7 -159
4711 -159 66 -242 86 -102 -89 130 94 41 -5 7 162 -265 160 170 111 -77 -131 27 246 61 -224 -301 -206
4734 -206 -174 -192 -186 -69 49 -266 -177 -114 13 99 -186 -6 -42 29 -4 2 38 131 43 96 -19 160 215 -25 -85 -52
4760 -52 -6 -88 3 -176 54 -304 13 -117 -135 -79 -130 -55 160 113 -71 -101 46 115 -17 -235 56 -189 -261 -30
4784 -30 272 37 3 23 75 -133 -67 72 -13 192 -157 74 -16 -217 16 -46 69 59 -211 25 70 110 249 219
4808 219 274 132 40 24 10 120 97 -13 35 90 -6 -125 132 -32 -51 -200 -180 21 89 30 86 -49 88 -107
4832 -107 100 -49 3 -70 61 -234 -81 -158 -112 224 -40 142 -102 27 49 7 3 -12 261 3 -51 -145 -20 103
4856 103 -220 -121 -101 -77 187 97 62 130 -81 -24 247 -85 -65 52 -13 75 247 -93 181 179 88 -138 -275 273
4880 273 133 73 -7 -216 -80 -227 -26 57 -199 24 28 174 -4 -166 -3 -73 -81 287 -26 227 -114 69 45
4903 45 -116 0 78 -96 96 -65 -33 81 21 -4 113 169 143 95 -241 46 -136 112 -164 -27 -78 -125 51
4926 51 -116 -137 -8 -116 135 23 112 -72 -46 93 107 26 100 -98 -219 189 -121 150 -66 -49 0 43 -23 43
4950 43 -259 -14 23 26 -70 37 50 30 7 -99 -136 14 -134 80 112 -22 -171 -30 216 -147 165 113 -142 111
4974 111 114 105 86 14 232 -6 28 -7 -12 44 -144 -32 -133 94 -89 227 137 -63 -127 -210 -117 163 188 388 83
4999 83 104 -23 32 69 110 49 85 316 167 -53 101 -138 134 -151 -42 -154 -53 20 113 24 -168 144 -4
5022 -4 -235 -10 79 -73 226 -2 -106 76 -68 -205 -175 -98 -161 77 145 50 176 -228 -14 179 256 -60 -120
5045 -120 74 63 133 30 -321 -47 56 42 261 -31 -162 -46 131 -109 48 -23 -12 -143 -57 112 124 15
5067 15 -23 163 -256 130 107 56 80 215 192 12 35 160 19 54 -106 -143 147 -41 276 -97 -130 -140 -24 -122
5091 -122 86 -85 31 15 52 114 -187 224 -12 83 -61 18 71 173 -166 123 103 -94 43 265 10 -70 27
5114 27 -225 -15 61 -32 -135 -167 71 -126 190 -41 -118 -66 -98 -119 -126 32 -79 154 -97 -56 -173 11 157 -204
5138 -204 16 6 118 89 -97 26 249 23 -52 -178 -19 127 -101 -53 63 49 -12 1 80 153 40 -320 24
5161 24 62 -84 33 193 -123 -194 94 89 39 -184 -99 -150 -59 -65 -118 -141 -50 40 81 77 -10 -75 83 151 17 21 -217 57
5189 57 -222 176 165 147 57 -112 56 20 -198 -77 141 7 120 -63 -91 -3 -80 98 102 117 356 -1 32 -27
5213 -27 131 162 325 -291 -73 -56 17 -71 208 1 185 60 117 173 26 235 63 81 -56 -8 -46 49 -40 30
5237 30 113 -28 173 115 100 -184 101 -225 35 132 87 98 35 9 96 92 -98 -217 110 104 16 350 -294 -20 -124
5262 -124 -73 -74 48 -104 193 41 -69 -49 -184 -74 -134 -115 48 61 -65 -61 -73 12 -117 4 -22 106 125 -64
5286 -64 -47 167 196 4 198 103 -147 -321 -86 -105 163 168 -308 -105 -116 26 -57 16 51 105 106 147 24 122 -54
5311 -54 41 121 -30 -5 27 -21 -56 214 33 148 -23 64 -441 -242 187 48 74 -111 -165 -44 -134 -64 107 -59
5335 -59 10 -73 -191 -153 -109 -47 111 41 192 171 -51 161 -61 -108 41 -10 29 -97 93 50 -57 -71 193 19
5359 19 -30 87 13 -74 49 285 121 44 268 244 -3 39 12 71 264 49 -361 -191 -17 -40 -210 55 307
5382 307 -89 22 -97 -221 -72 -98 102 209 136 35 3 131 122 -68 -117 100 39 180 -105 -285 227 -58
5404 -58 -22 -40 40 -80 -125 133 -57 -25 -41 -9 -65 -80 42 -88 167 3 81 -72 101 104 -186 87 -225 -47
5428 -47 -202 -250 -16 198 31 29 11 -17 -177 69 5 1 27 -46 -106 56 -37 233 -15 52 43 -95 -114 -103 -30 -171
5454 -171 44 -174 28 -82 -159 -267 -67 -66 -152 -61 38 -45 -70 101 -55 239 371 -235 122 10 -516 -140 141
5477 141 -68 54 -78 32 -34 102 41 -51 -80 134 -231 -141 22 28 -58 104 -54 151 -52 68 31 74 -78
5500 -78 -82 -179 194 -157 115 311 -68 223 -200 195 -35 -50 -41 64 -73 -103 -238 -51 -100 85 83 -36 -85 -75
5524 -75 -18 -106 128 -67 -46 47 -141 -184 -19 -350 -96 -19 3 204 108 63 71 -151 -21 -48 62 -69 188 -75
5548 -75 -151 -19 -203 115 -333 109 34 -13 -78 -85 69 -84 192 117 23 3 -12 -121 -374 124 29 -172 3 172
5572 172 4 141 -41 -50 62 -231 -99 -83 -49 -221 85 -136 33 61 -157 107 105 -158 32 1 219 1 -192
5595 -192 -108 -188 28 98 40 -108 147 -136 -37 394 336 -228 10 55 -85 -113 244 66 -9 192 17 -120 -233
5618 -233 311 -167 72 53 -28 27 231 -102 -42 -194 39 13 66 -96 186 -77 -144 38 138 -144 -176 -48 -85
5641 -85 149 175 135 -118 164 90 41 -181 160 -82 -214 17 60 -83 277 50 -340 76 48 23 148 -23 174
5664 174 -187 -34 -80 -183 -101 49 42 -97 -146 -5 39 91 89 207 105 -27 174 143 -224 -8 -50 151 236 -237
5688 -237 -159 270 81 120 32 -64 55 160 23 -110 -3 -74 254 -92 21 -116 89 12 -81 96 236 100
5710 100 -39 62 85 7 144 -42 50 -84 -86 -69 44 7 157 156 121 -71 23 44 -39 155 -186 2 1 184 -36
5735 -36 198 21 -136 -100 -115 41 172 -40 -146 44 163 -7 76 34 -24 87 42 131 85 242 173 13 -52 -112
5759 -112 41 -19 -94 142 75 -36 -169 -31 -53 124 244 194 44 18 179 -5 93 15 37 -74 26 93 112 -95
5783 -95 -195 -5 -257 101 97 28 89 386 71 -172 239 1 0 135 193 -233 148 100 -67 -29 -56 -112 -187 221
5807 221 124 268 -38 -296 82 -28 11 26 62 -62 -41 237 84 -23 58 -221 38 -163 -27 111 -22 -89
5829 -89 90 183 82 -102 -147 -343 -47 27 48 -102 96 30 -5 30 48 146 -97 -32 -92 -171 -202 -276 26 129 -116
5854 -116 -6 -81 37 107 159 107 163 -177 -68 -229 29 -147 -53 12 192 -35 -261 137 -2 109 -13 -84 26
5877 26 126 62 79 103 203 -126 -129 96 -45 -182 -33 -340 -33 85 -212 -267 -2 81 -63 81 -68 -90 33
5900 33 221 -25 -68 -170 -32 -9 -29 99 14 -160 -80 -145 -3 293 158 42 133 222 -123 -149 -113 -65 -88 -82 22
5925 22 40 142 15 -261 69 137 144 135 -204 -57 71 -62 285 -74 -100 -144 28 -3 108 40 -49 120 -142 -56
5949 -56 15 -135 42 -13 116 78 -218 -157 101 71 -246 -84 326 -129 -158 117 16 -13 -135 159 217 161 -95
5972 -95 106 -64 52 151 33 -103 -170 0 119 133 -52 -32 -237 -329 -146 -173 245 -210 34 159 68 68 -138
5995 -138 38 36 -139 216 86 -147 18 -28 -87 181 288 -19 -281 113 13 213 -9 -23 101 23 20 -32 -180
6018 -180 -181 -87 25 126 -144 -85 74 -176 -84 -132 48 -100 -232 49 -27 226 -145 -143 -43 290 141 10 -6
6041 -6 -11 19 -97 -59 -44 -142 -68 110 60 60 33 -319 -43 27 69 226 -40 -154 -26 -166 116 14 178 43 -71
6066 -71 -236 -65 247 -111 200 -22 -186 169 -64 14 24 -127 124 45 -4 -52 120 -146 -41 142 77 -106
6088 -106 -70 71 12 -40 -175 -179 46 -3 -57 -3 -132 -39 -86 -60 22 -189 -78 -154 -53 -50 96 63 -365 -86 64
6113 64 -75 72 -28 96 74 16 -82 100 131 -73 67 123 0 -75 55 -18 -127 218 70 -35 -146 -80 126
6136 126 -70 165 145 -134 -132 -77 5 34 -139 42 4 178 -115 -133 -74 -93 181 67 54 -19 102 -41 -222 -167
6160 -167 -61 -58 -14 -23 -118 -145 63 -75 100 121 -18 190 74 166 85 85 107 -82 -7 -69 123 -120 -31 -71 220 -68
6186 -68 -50 -87 43 -124 73 277 47 -87 113 -102 -30 -45 -167 -157 172 12 -13 64 81 22 -191 -136 83 -179
6210 -179 77 -266 82 -153 -172 154 -91 -3 69 301 -119 -54 -14 -57 144 5 -176 -104 -11 -96 -45 171 -95
6233 -95 241 -152 -76 22 -68 -45 -186 165 194 -121 207 -27 22 -131 190 52 -251 -15 -24 109 -263 -33 -141
6256 -141 237 48 64 76 17 -66 22 94 -225 47 38 182 3 -238 -454 81 49 -136 -33 100 -92 126 114
6279 114 140 77 113 -148 188 250 195 -222 -96 -93 80 -116 227 8 -84 126 -319 262 58 143 -63 -17 164
6302 164 -4 105 -219 -65 18 22 32 -179 255 2 -109 12 -91 -203 -54 -129 -111 36 50 129 305 -10 77
6325 77 253 170 -153 -257 -32 243 101 -224 -103 -173 -95 -128 -332 122 140 -294 -86 -44 -229 163 -122 65
6347 65 -9 -22 13 -157 -41 132 -87 43 17 -45 -7 -31 71 -81 -83 -155 -157 152 10 16 -101 -70 -88 63 -48 -35
6373 -35 19 56 1 -113 -169 8 -354 148 -90 -113 -225 105 259 29 -195 -111 133 -97 -106 167 154 124 101 -267
6397 -267 -169 36 -123 -48 -20 53 149 -229 -4 10 66 -183 195 47 40 -496 130 99 -33 -25 -3 -59 -157 -84 68
6422 68 -3 130 76 73 -63 65 -59 -67 84 153 76 134 -39 -46 152 30 117 232 -23 56 46 90 115 -31 -10 -93
6448 -93 -33 -23 162 -172 -94 79 -111 -282 -80 3 -132 28 247 85 311 224 -274 -188 8 307 -87 25
6470 25 2 -124 32 222 95 83 -3 -57 108 -121 247 155 136 143 121 -96 51 -104 178 -35 84 32 172 -55
6494 -55 84 -35 140 -60 -31 44 -15 -47 78 175 -63 104 -86 49 -12 -5 0 -91 -130 114 216 -210 -197 -62 -31
6519 -31 103 -140 -6 5 -6 -80 -92 -13 137 -99 212 -108 -188 145 1 15 -27 267 213 2 -105 -52 53 99
6543 99 76 -108 -133 -96 81 -121 70 -14 87 -40 110 -123 -138 50 -93 -204 -87 -95 83 -150 -118 159 50
6566 50 144 17 -7 62 143 -149 -56 -109 -211 152 -7 -4 -106 -101 -170 -349 28 -318 160 288 -171 3 -177 147
6590 147 -84 -75 -147 -95 52 122 5 -57 33 -35 -5 110 277 176 225 -196 -33 -6 31 93 5 -46 34 -31 64 45
6616 45 -81 -99 -63 36 -13 170 -152 -51 20 -231 105 -79 -135 -24 -31 194 274 161 91 -20 -75 80 -203 -33
6640 -33 171 -45 -12 -113 1 -125 -78 -4 -229 70 -41 248 -132 49 -1 -133 50 -185 144 95 145 11
6662 11 182 -261 -156 -14 168 354 20 84 15 -169 -16 108 256 -194 -73 10 -145 -102 -13 -94 -29 -76 -197
6685 -197 105 -182 82 -106 66 -108 117 -181 -101 -67 -55 357 108 53 81 -31 -259 -154 -155 88 -31 193
6707 193 -70 -105 54 50 131 -180 -57 -173 11 235 -58 236 119 -15 122 239 -161 60 -98 88 -141
6728 -141 -105 18 -119 20 -4 24 81 34 -13 17 -107 -80 26 -101 -121 97 2 156 149 -9 18 200 -19 2 214
6753 214 13 177 -111 226 -3 41 117 215 -12 81 39 250 59 -147 18 108 -55 -60 11 -192 -109 4 -9 3
6777 3 -81 -207 -331 -140 -113 -78 -213 62 -273 -46 -38 247 -206 -156 16 16 56 -94 18 -181 207 -177 166 -221
6801 -221 74 33 76 88 -238 69 -141 -145 -90 118 -252 25 -38 110 -244 -238 242 120 164 105 -196 -21 81 33
6825 33 160 -21 71 -143 68 56 -96 104 -18 -3 71 -112 68 30 -273 -116 92 -161 46 199 101 18 115
6848 115 128 -188 99 -68 445 6 -109 -135 -101 -95 -88 48 -40 138 314 67 -4 34 9 -101 -114 -146 -151 -134 -163 14
6874 14 -87 -61 150 222 -29 68 62 -63 81 71 52 124 -57 41 -45 -128 124 -91 123 89 -137 165 -47 34 100
6899 100 -58 31 -99 -255 68 -8 96 139 31 258 -233 -160 50 156 156 195 -195 94 -141 -117 -105 257 -15
6922 -15 299 92 48 236 89 -157 -317 28 12 13 13 -1 79 -60 78 60 17 -1 83 64 133 32 -236 -110 107
6947 107 33 -189 -154 150 -232 -152 -297 -134 -130 10 57 168 23 -135 139 130 -131 -48 97 56 67 -68 -34 55
6971 55 190 -151 77 -108 12 -10 102 -80 -46 101 222 128 -66 152 112 60 78 8 104 -39 72 -249 66
6994 66 -44 -69 14 14 -99 -176 23 -127 -221 100 66 -28 188 184 74 -103 80 60 88 -10 156 -107 -68 57 54 75
7020 75 21 -55 170 -33 -120 137 -80 182 97 38 -175 89 -238 194 4 90 228 110 -74 2 63 -90 24
7043 24 -76 -37 3 4 -38 58 15 61 110 119 27 33 -76 -19 -187 -121 -203 -133 95 -150 -366 -89 -12 -8 66 -124 -68 109
7071 109 -206 -257 240 -91 63 -183 136 -75 -106 151 -72 164 -176 87 -12 211 49 -42 47 -6 -8 -102 -148
7094 -148 107 28 125 30 -46 25 -27 -10 -75 20 192 247 -35 186 63 53 90 37 139 -161 35 133 -77 -54 127
7119 127 -4 233 -177 -192 -7 232 -84 -148 -21 -157 -58 -125 140 -170 -46 -127 69 -206 147 -34 -70 74
7141 74 -124 5 -87 23 -49 175 37 23 126 258 -54 85 -66 51 -187 -61 -185 240 -7 -47 97 -77
7163 -77 -122 83 161 40 160 -17 -12 106 186 -193 -71 -40 59 29 194 167 -121 -57 -107 -253 302 -289 20 48
7187 48 189 88 -64 -50 194 -52 18 118 -63 384 9 283 34 112 68 86 55 -44 38 -119 1 23 63 153
7211 153 -167 401 -86 -16 -88 81 -26 -46 35 123 243 139 222 52 247 -101 -146 -63 -165 -204 69 0 -92 273
7235 273 -64 158 51 -246 -215 128 -111 -9 -80 68 80 137 -29 -121 98 115 64 149 99 -271 211 -48 38
7258 38 71 19 140 -56 35 -67 -218 41 179 153 346 175 -24 -165 -40 -10 83 -127 19 146 -160 22
7280 22 37 25 84 -40 -88 -45 -42 -216 -103 -222 -85 224 -76 -79 -23 -15 138 -50 103 244 -36 -42 -5 -100 38 -11
7306 -11 41 -103 83 -57 163 -120 78 34 87 -95 122 -221 -134 79 -29 -110 -161 -209 -5 -36 130 -35 18
7329 18 -242 -182 77 138 -47 -204 -25 79 -68 -70 258 -56 172 -111 -7 5 -91 -173 8 14 -92 41 302
7352 302 19 172 63 285 128 161 42 81 135 -155 91 119 197 -61 14 -98 124 216 -176 -109 -2 -89 -21
7375 -21 -65 -193 -46 71 52 -20 179 124 -10 68 -94 91 -47 49 -226 -132 205 102 -238 -99 215 -25 114
7398 114 -113 143 114 -158 -76 -82 8 -66 71 54 1 -158 118 146 2 74 -87 -244 40 26 -41 -27 146 69 112
7423 112 64 101 117 -38 31 -284 -22 -110 79 -64 116 9 339 -218 86 -172 -192 -184 45 146 -122 113 211
7446 211 69 243 21 -37 109 -184 -104 59 -59 93 11 28 -27 63 -86 -40 -313 101 192 4 -40 -43 -26 10
7470 10 -84 -7 -73 -30 -24 -42 67 -226 -90 -49 144 -82 64 -56 -13 -19 79 82 56 23 57 157 2 74 213 51
7496 51 110 -304 -154 20 -48 -253 54 272 -203 230 -61 141 90 -166 309 83 108 14 -92 -18 -124 8
7518 8 -98 194 138 77 241 -132 212 -113 93 -103 7 -99 63 154 -216 179 46 105 -300 -156 -279 61
7540 61 141 249 2 -86 259 -177 -232 21 47 -149 -36 385 83 -139 288 -37 0 15 48 -21 83 -251 161
7563 161 -43 216 -92 -138 -262 171 157 53 53 -105 -49 -127 76 -55 148 41 232 51 -176 -287 33 -245
7585 -245 280 -5 114 89 23 93 21 -78 -7 -37 -285 8 165 -23 -177 -104 -149 -138 197 -74 -78 -11 -93 51 -136
7610 -136 -35 24 87 -185 48 -43 91 -205 180 -22 -169 -69 91 -165 54 17 209 30 -15 -74 -55 275
7632 275 -166 160 227 -270 -95 -66 -86 -8 113 -27 65 -46 -82 22 122 56 110 -43 -51 94 150 -110 -16 -120
7656 -120 162 87 -36 -35 -257 103 -174 102 279 -126 -58 -39 299 -87 26 138 7 85 60 0 -85 46 207
7679 207 -57 116 37 14 236 -20 13 -160 263 234 153 273 133 -96 149 -172 70 164 139 39 102 111 -1
7702 -1 259 -40 39 24 366 -46 114 179 -125 217 -27 -323 -18 -31 155 59 9 84 64 -227 -170 18 -124 57
7726 57 -15 72 57 -82 -36 -124 7 -123 86 -138 48 -72 40 200 -66 178 -58 -41 113 47 258 -81 -181
7749 -181 48 -117 22 359 51 -181 -53 -105 81 122 100 264 -59 -11 125 17 -7 17 -56 44 -45 -27 3
7772 3 35 -136 80 182 148 -134 -168 -43 -288 33 75 150 -230 -84 -20 10 -128 236 48 2 55 105 118 -209
7796 -209 -63 -114 111 95 -171 105 12 -6 -20 89 -82 -91 87 105 -9 91 -26 -112 -2 13 36 -45 -134 -2
7820 -2 -32 138 18 -141 -116 -144 41 249 -134 -221 184 -143 191 -128 -74 126 133 6 144 -117 -57 -14 -147 198
7844 198 -138 -101 5 -99 -127 190 74 34 51 14 -41 -61 -62 250 34 307 -277 45 35 6 225 -47 145 29
7868 29 95 178 -113 198 41 -102 -91 -84 28 85 227 53 -170 -132 -18 209 61 -93 -123 -172 -180 2 34 278
7892 278 -39 -236 -200 -95 -212 -38 -237 73 222 -201 -128 68 236 239 131 5 -138 -14 -90 -20 -136 -49
7914 -49 -16 -176 -82 -80 -10 2 -145 -8 27 133 83 -243 -136 50 175 -86 208 207 -11 -21 7 221 161 50 168
7939 168 47 -1 151 57 -75 20 -98 71 -86 195 -230 -25 131 -119 130 169 77 62 153 -4 -25 101 67
7962 67 178 -80 131 -10 2 3 -30 -12 10 -193 48 -21 -58 122 -14 81 -65 258 -74 27 159 60 -88 108
7986 108 235 116 37 -25 -44 -74 -185 -40 125 -233 -21 117 129 -40 -19 44 -17 -133 -147 17 -117 177 -304
8009 -304 -73 -27 42 108 68 100 -72 270 -170 105 -217 -3 214 187 -11 -120 -20 4 437 56 -14 128 -117
8032 -117 -111 -72 11 89 56 194 -58 93 59 -34 24 -33 -112 -65 13 64 160 75 -3 190 -213 -119 -109 228 72 -70
8058 -70 -101 249 148 -43 -52 61 6 -267 -87 -110 104 -131 82 65 -41 -155 -34 -231 -15 59 19 -150 -34
8081 -34 99 198 82 111 53 39 -186 102 -66 -66 97 118 98 88 36 76 -241 66 -134 -453 97 -147 136 -169
8105 -169 49 79 6 -132 -180 37 4 -162 174 128 -38 -227 -121 116 -9 22 190 -134 -11 216 154 -141
8127 -141 -227 -98 -268 -74 -166 87 11 290 -115 77 -162 231 72 245 240 9 33 -48 -75 222 30 162 142
8150 142 10 -49 261 170 74 97 80 243 -202 -82 -69 -64 -253 -24 -105 -224 -157 -77 -120 -103 151 113 -119 166 105
8175 105 156 9 35 -131 -95 -5 -11 -38 30 53 44 21 24 108 45 -199
8191a99
##END NTUPLES=NMR FID
##END=
