##TITLE=1H_Pr 5037-b
 CDCl3,8 sc, 
 5.04.2021
##JCAMPDX= 6.0         $$ Bruker NMR JCAMP-DX V2.0
##DATA TYPE= NMR FID
##DATA CLASS= NTUPLES
##ORIGIN= UXNMR, Bruker Analytische Messtechnik GmbH
##OWNER= root
$$ XWIN-NMR		Version 3.5
$$ Mon Apr  5 13:52:27 2021 Russian Standard Time (UT+4h)  she@DPX200
##.OBSERVE FREQUENCY= 200.131506
##.OBSERVE NUCLEUS= ^1H
##.DELAY= (6, 6)
##.ACQUISITION MODE= SIMULTANEOUS
##.ACQUISITION SCHEME= undefined
##.AVERAGES= 8
##.DIGITISER RES= 18
##SPECTROMETER/DATA SYSTEM= spect
##.PULSE SEQUENCE= zg30
##.SOLVENT NAME= CD3CN
##.SHIFT REFERENCE= (INTERNAL, CD3CN, 0, 15.7039)
##AUDIT TRAIL= $$ (NUMBER, WHEN, WHO, WHERE, WHAT)
$$ ##TITLE= Audit trail, XWIN-NMR		Version 3.5
$$ ##JCAMPDX= 5.01
$$ ##ORIGIN= Bruker BioSpin GmbH
$$ ##OWNER= she
$$ F:/spectra/data/she/nmr/H-F/1/audita.txt
$$ ##AUDIT TRAIL=  $$ (NUMBER, WHEN, WHO, WHERE, WHAT)
(   1,<2021-04-05 13:51:09.10 +0400>,<she>,<DPX200>,
      <created by zg, POWCHK disabled, PULCHK disabled
       configuration hash MD5:
       00 E9 B6 7A A2 85 ED C7 34 08 36 98 17 FE 4E 26
       data hash MD5: 16K
       7A 28 56 3E E8 6E B7 D0 F0 95 19 F3 43 BD 25 A5>)
$$ ##END=
$$ 
$$ hash MD5
$$ F6 E2 F6 34 E9 80 7D A8 4D B0 38 79 22 C0 8A F6
##$RELAX= 
##$RELAX= 
##$RELAX= 
##$RELAX= 
##$RELAX= 
##$RELAX= 
$$ Bruker specific parameters
$$ --------------------------
##$DU= <F:/spectra>
##$EXPNO= 1
##$NAME= <H-F>
##$PROCNO= 1
##$TYPE= <nmr>
##$USER= <she>
##$AMP= (0..31)
100 100 100 100 100 100 100 100 100 100 100 100 100 100 100 100 100 100 
100 100 100 100 100 100 100 100 100 100 100 100 100 100 
##$AQSEQ= 0
##$AQ_mod= 1
##$AUNM= <au_zg>
##$AUTOPOS= <>
##$BF1= 200.13
##$BF2= 200.13
##$BF3= 200.13
##$BF4= 200.13
##$BF5= 200.13
##$BF6= 200.13
##$BF7= 200.13
##$BF8= 200.13
##$BYTORDA= 1
##$CFDGTYP= 0
##$CFRGTYP= 5
##$CHEMSTR= <none>
##$CNST= (0..31)
1 1 145 1 1 1 1 1 1 1 1 1 1 1 1 1 1 1 1 1 1 1 1 1 1 1 1 1 1 1 1 1 
##$CPDPRG= <>
##$CPDPRG1= <>
##$CPDPRG2= <>
##$CPDPRG3= <>
##$CPDPRG4= <mlev>
##$CPDPRG5= <mlev>
##$CPDPRG6= <mlev>
##$CPDPRG7= <mlev>
##$CPDPRG8= <mlev>
##$CPDPRGB= <>
##$CPDPRGT= <>
##$D= (0..31)
0 1.2 0 0 0 0 0 0 0 0.06 0 0.03 0 0 0 0 0.0002 0 0 0 0 0 0 0 0 0 0 0 0 
0 0 0 
##$DATE= 1617616268
##$DBL= (0..7)
120 120 120 120 120 120 120 120 
##$DBP= (0..7)
150 150 150 150 150 150 150 150 
##$DBP07= 0
##$DBPNAM0= <>
##$DBPNAM1= <>
##$DBPNAM2= <>
##$DBPNAM3= <>
##$DBPNAM4= <>
##$DBPNAM5= <>
##$DBPNAM6= <>
##$DBPNAM7= <>
##$DBPOAL= (0..7)
0.5 0.5 0.5 0.5 0.5 0.5 0.5 0.5 
##$DBPOFFS= (0..7)
0 0 0 0 0 0 0 0 
##$DE= 6
##$DECBNUC= <off>
##$DECIM= 32
##$DECNUC= <off>
##$DECSTAT= 4
##$DIGMOD= 1
##$DIGTYP= 9
##$DL= (0..7)
0 120 120 120 120 120 120 120 
##$DP= (0..7)
150 150 150 150 150 150 150 150 
##$DP07= 0
##$DPNAME0= <>
##$DPNAME1= <>
##$DPNAME2= <>
##$DPNAME3= <>
##$DPNAME4= <>
##$DPNAME5= <>
##$DPNAME6= <>
##$DPNAME7= <>
##$DPOAL= (0..7)
0.5 0.5 0.5 0.5 0.5 0.5 0.5 0.5 
##$DPOFFS= (0..7)
0 0 0 0 0 0 0 0 
##$DQDMODE= 0
##$DR= 18
##$DS= 0
##$DSLIST= <SSSSSSSSSSSSSSS>
$$ [...]
##$SUBNAM2= <"">
##$SUBNAM3= <"">
##$SUBNAM4= <"">
##$SUBNAM5= <"">
##$SUBNAM6= <"">
##$SUBNAM7= <"">
##$SUBNAM8= <"">
##$SUBNAM9= <"">
##$SW= 16.9725357007746
##$SWIBOX= (0..15)
0 0 2 0 0 0 0 0 0 0 0 0 0 0 0 0 
##$SW_h= 3396.73913043478
##$TD= 16384
##$TD0= 1
##$TE= 0
##$TE2= 300
##$TE3= 300
##$TEG= 300
##$TL= (0..7)
0 120 120 120 120 120 120 120 
##$TP= (0..7)
150 150 150 150 150 150 150 150 
##$TP07= 0
##$TPNAME0= <>
##$TPNAME1= <>
##$TPNAME2= <>
##$TPNAME3= <>
##$TPNAME4= <>
##$TPNAME5= <>
##$TPNAME6= <>
##$TPNAME7= <>
##$TPOAL= (0..7)
0.5 0.5 0.5 0.5 0.5 0.5 0.5 0.5 
##$TPOFFS= (0..7)
0 0 0 0 0 0 0 0 
##$TUNHIN= 0
##$TUNHOUT= 0
##$TUNXOUT= 0
##$USERA1= <user>
##$USERA2= <user>
##$USERA3= <user>
##$USERA4= <user>
##$USERA5= <user>
##$V9= 5
##$VALIST= <valist>
##$VCLIST= <CCCCCCCCCCCCCCC>
##$VD= 0
##$VDLIST= <DDDDDDDDDDDDDDD>
##$VPLIST= <PPPPPPPPPPPPPPP>
##$VTLIST= <TTTTTTTTTTTTTTT>
##$WBST= 1024
##$WBSW= 4
##$XGAIN= (0..3)
0 0 0 0 
##$XL= 0
##$YL= 0
##$YMAX_a= 129884
##$YMIN_a= -167061
##$ZGOPTNS= <>
##$ZL1= 120
##$ZL2= 120
##$ZL3= 120
##$ZL4= 120
##$ABSF1= 10
##$ABSF2= 0
##$ABSG= 5
##$ABSL= 3
##$ALPHA= 0
##$AQORDER= 0
##$ASSFAC= 0
##$ASSFACI= 0
##$ASSFACX= 0
##$ASSWID= 0
##$AUNMP= <proc_1d>
##$AZFE= 0.1
##$AZFW= 0.1
##$BCFW= 1
##$BC_mod= 2
##$BYTORDP= 1
##$COROFFS= 0
##$CY= 11.3945322036743
##$DATMOD= 1
##$DC= 2
##$DFILT= <>
##$DTYPP= 0
##$F1P= 15.9154993809931
##$F2P= -4.1035820241983
##$FCOR= 0.5
##$FTSIZE= 0
##$FT_mod= 4
##$GAMMA= 1
##$GB= 0.15
##$INTBC= 1
##$INTSCL= 1
##$ISEN= 128
##$LB= 0.24
##$LEV0= 0
##$LPBIN= 0
##$MAXI= 10000
##$MC2= 0
##$MEAN= 0
##$ME_mod= 0
##$MI= 1.114404
##$NCOEF= 0
##$NC_proc= 0
##$NLEV= 6
##$NOISF1= 3.799351
##$NOISF2= 2.8
##$NSP= 1
##$NTH_PI= 0
##$NZP= 0
##$OFFSET= 15.70392
##$PC= 1
##$PHC0= -11032.87
##$PHC1= 13.80092
##$PH_mod= 1
##$PKNL= yes
##$PPARMOD= 0
##$PSCAL= 0
##$PSIGN= 0
##$REVERSE= no
##$SF= 200.130013532006
##$SI= 16384
##$SIGF1= 3
##$SIGF2= 2
##$SINO= 400
##$SIOLD= 16384
##$SREGLST= <1H.CDCl3>
##$SSB= 0
##$STSI= 0
##$STSR= 0
##$SW_p= 3612.71676300578
##$SYMM= 0
##$S_DEV= 0
##$TDeff= 0
##$TDoff= 0
##$TI= <>
##$TILT= no
##$TM1= 0
##$TM2= 0
##$TOPLEV= 0
##$USERP1= <user>
##$USERP2= <user>
##$USERP3= <user>
##$USERP4= <user>
##$USERP5= <user>
##$WDW= 1
##$XDIM= 8192
##$YMAX_p= 0
##$YMIN_p= 0
$$ End of Bruker specific parameters
$$ ---------------------------------
##NTUPLES= NMR FID
##VAR_NAME=  TIME,          FID/REAL,        FID/IMAG
##SYMBOL=    X,             R,               I
##VAR_TYPE=  INDEPENDENT,   DEPENDENT,       DEPENDENT
##VAR_FORM=  AFFN,          ASDF,            ASDF
##VAR_DIM=   8192,          8192,            8192
##UNITS=     SECONDS,       ARBITRARY UNITS, ARBITRARY UNITS
##FACTOR=    0.0002944,     1,               1
##FIRST=     0,             0,               0
##LAST=      2.4114304,     0,               0
##MIN=       0,             -167061,         0
##MAX=       2.4114304,     129884,          0
$$ Real data points
##PAGE= N=1
##DATA TABLE= (X++(R..R)), XYDATA
$$ [...]
272H914j8779M122J8181j3946n497J2480p914j082J1277r126n321R298q65j014
286G28k79n825O026M643p936J282K160m202O556N39r525M621M465m162K836k737
302h10m837R648J71r323N213J615m872O700r47q804O058M755n208j81k77k26M532
319C207k256l429K731q20J037L278n959j478P078j716l024K054k555J405M748
334D301n013k399M640j101j80J948m550K54N552k408k739J506o06J653J602l975
350a515n67L143k6m44j221j243K536P82j888M99j343k84M767j892n809M197L743
367C435m690j87K839k589l71L768q87m339R63N147j102n518K174M212l380r71
383a496L466k648j900M670M7m220N00K523P58j250k489J287L164k269j583K614
$$ y = [8914, -9865, -5743, 12438, -1508, -7005, 5475, -2439, -3521, 7756, -1370, -6691, 2607, 1742, 728, 449, -5376, 650, 5293, -2643, -1361, 799, -3403, 3153, 3692, -5833, -1212, 3253, -909, 1927, -810, -5647, 4001, 4172, -5151, 62, 1677, -3195, 3505, 2558, -6246, -188, 4567, -641, -822, -1099, -1325, 3207, 951, -2478, 253, -567, 470, 3748, -2211, -3689, 3389, 1673, -1351, 703, -1852, -447, 4301, -712, -3111, 1529, 428, 248, 2196, -2354, -2100, 3452, 1044, -1695, -189, -795, 858, 2460, -1515, -2082, 1061, 1035, 591, -630, -1873, 663, 1445, -443, 56, -1287, -1571, 3196, 1304, -4505, -308, 3435, -1255, -1442, 1397, -1192, -1563, 2205, 1318, -3021, -2058, 3089, 1987, -3531, -1357, 2855, -525, -1496, 1970, -678, -2578, 2092, 2139, -2081, -1581, 942, 1700, 450, -2039, -752, 2412, 143, -1440, 1174]
399A174j167j640L452P5m245J073L400o72k325q14K018K049k633j970L702j08
415A369m081L552K898o965j57Q742l275q015N786N355o620k194O151l66n576K175
431a221N898m330o697P557O344j1533l131J4199l278j2877J0251P051j4686J397
445e056J4104q671r223J1581L184r864P16O004j421l348M66L617p74n520L952
460b53O165q709l262J1794k426j0173P528M395q706K318N447n810k58M537k792
475b05j54J637l604K835L785p192j49Q019m363m916O672K0n536L146K527k861
491c39j024M20K811Q73o952J614R778p825p713J4165k33j5955J0799J0555j8023
506g049k76J7836r188j0914J2883K205j0070K766M988k459k646k7M962o3r110
$$ y = [1174, 7, -1633, 1819, 1894, -2351, -1278, 2122, 1450, -875, -1689, 329, 2378, -255, -2225, 1477, 1369, -2712, 840, 3738, -3227, -3384, 5358, 2083, -5932, -146, 5209, -1411, -3605, 2546, 2180, -3396, -1221, 4677, 347, -6350, 1207, 7551, -3982, -7113, 7086, 3808, -9069, 1182, 8233, -6453, -5056, 9048, 377, -8846, 2735, 5919, -3945, -3229, 2775, 1354, -1994, -1528, 2089, 1315, -4205, -253, 5912, -2797, -6059, 5735, 3309, -6864, 664, 5059, -3647, -1329, 4118, -1692, -1950, 2587, -205, -359, 1278, -2326, 509, 4294, -2898, -3047, 4972, 609, -4307, 2365, 2385, -3151, -5, 2522, -339, -1363, -943, 1868, 2741, -4211, -2597, 7181, -644, -8357, 5808, 5575, -10380, 419, 10974, -7049, -7325, 10511, 1323, -9591, 3292, 5497, -4573, -1807, 3181, 722, -1924, -1951, 3011, 2948, -6162]
521f162N017R761j1951m326J5408m835j2075J2083L582j3244M664Q655q262k489
535d174O542j125k587R05L4J182m78k163K627P57m076K326L239m624n26M717k436
552A40j980L657k023j808M965k425m378O641n9p631O218L915j0229L087R113r151
568a948l399J0409k974o768N928J492m584J137J494K08r73k831L982K658p868
583d037J453Q542p068m392R735j997p764O450L048o845P52M479j573k461O62K317
599A301k56l106J613K932l630j033M617j544l698L144J914l377j51K556q74j596
615a188J633M07k026J084J337k115M28J755k383N66K628l279o30M337k301k803
631b550M005k15l196K295J057k214K20J146J91p01j356J892J228l344P01L192
$$ y = [-6162, -1145, 8616, -3335, -7661, 7747, 2912, -9163, 2920, 6502, -6742, -2078, 6577, -1685, -4174, 2368, 1243, -1344, -439, -405, 777, 299, -1864, 763, 1520, -2556, -230, 3009, -1615, -2141, 2576, 140, -1840, 1817, -206, -2014, 2951, 526, -3852, 2789, 2730, -4901, 1317, 5232, -4997, -1910, 7203, -1948, -5347, 5062, 2088, -4680, 1248, 2740, -1844, -707, 787, 995, 22, -2809, 1173, 3831, -4037, -2584, 5958, -1110, -5502, 4233, 2236, -5528, 922, 3970, -2875, -2123, 2356, 783, -1678, -1016, 1301, 1045, -2061, -448, 2484, -1146, -2179, 2438, 894, -2804, 340, 2254, -1123, -1274, 1282, 408, -1188, 445, 852, -1174, -90, 1247, -868, -440, 1315, -1068, -502, 2126, -1153, -1783, 2554, 253, -2550, 1455, 1240, -1956, 339, 1396, -818, -598, 548, 739, 38, -1318, 574, 1802, -1542, -841, 2351]
647B351k921j147L678j406k379K431N44j599l0M27Q15n21j517J805P13k801J238
664c19K271k977m29L072j291j862J772M97j198j00Q80M4j137L50J479j371r79
681a298K206m47j731J595J84j411J154J81j181R05J13p46Q33l50p25J261k29j041
699g27R70J50p77N28J16m75K23J2L05j73q37J030N32j719P14J296j829J70J819
718A328j578p38J951n29j195R50K40n56J37M4J37j96l32P17oj050O86O84j056
737c62M1O79l84j30J67%J15m05R9P30q41m68J410m20j165J247J77j234P47N29
757E32j000J94O12l83j43R0Q0J59l72J82K84n96K92N64q57M5Q61p27j59Q26o40
778a56k05R13n72l48P06k67k47M60l00j11L99k71K7J29l31L79M5n45M84R0o76
$$ y = [2351, -570, -1717, 1961, 555, -1824, 607, 1151, -448, -478, -51, 764, 243, -1274, 531, 1244, -1557, -319, 1952, -1025, -1454, 1618, 327, -1535, 237, 734, -464, -564, 316, 360, -777, -427, 1052, -319, -1298, 908, 461, -1270, 325, 509, -902, 252, 433, -748, 157, 270, -476, 357, 7, -718, 543, 314, -727, 243, 393, -384, 144, 260, -215, 8, 20, 325, 152, -685, 345, 877, -842, -128, 1168, -661, -491, 1328, -250, -988, 963, 434, -761, 189, 429, -127, 10, 54, 191, -5, -337, 380, 374, -676, 10, 694, -362, -321, 358, -26, -156, 11, 11, 126, -279, -180, 550, -291, -759, 651, 231, -934, 313, 490, -744, 3, 532, -468, -274, 338, -45, -188, -98, -18, 141, -231, -49, 235, -361, -69, 495, -362, -317, 544, -183, -342, 484, -156, -361, 552, -20, -368, 338, 71, -176, 284, -16, -127, 272, 1, 28, 157, -174, 205, 250, -295, 189, 279, -397]
799c97O81J45r97O62N57j091K86O57o86O1L83l35R8r5n4N43n65m27J120k86j099
820h39J085L19j188M30P32p26k06M15K72l08o37Q16N08j416L38J366j334m69J637
839G95o61r15J009N0m99J62j57L77J59j024P23Q02j516K91J366j224m01J250m22
858A65m66L61r6L82j87p92J032K60j508Q20J051j446j49J270l33q60K24R14j96
877D46j330Q45J322j930l03K360j303j490K111m6j522Q11L01k27N9q14R92P02
895I84k335J039K148k954j38L242k240j467L030r84j604J945n21p70J254j003
911c74m7J450j682p1K039j678p36K161r49j079J534m26o68Q60m11j97O70o32j13
930c49Q19l85n96N55N10o87o22J297K86k033J069J765k544n6K715j878j170K434
$$ y = [-397, 284, 429, -568, 94, 651, -440, -154, 503, -183, -122, 261, -74, 24, -71, -125, 418, -147, -574, 546, 260, -839, 246, 565, -623, -193, 539, -187, -393, 22, 294, -14, -651, 165, 673, -743, -405, 961, -373, -842, 795, 134, -781, 228, 278, -221, -59, -216, 161, 320, -704, 19, 821, -695, -404, 962, -262, -663, 587, 165, -301, 60, -36, 346, 159, -633, 399, 659, -849, -29, 1022, -424, -573, 697, 364, -496, -272, 642, 446, -884, -39, 1283, -647, -950, 1410, 107, -1383, 728, 682, -840, -29, 272, 45, 104, -710, 282, 984, -1351, -312, 1836, -1118, -1256, 1986, -254, -1721, 1309, 325, -1279, 666, 145, -625, 629, -374, -421, 1029, -653, -724, 1315, -363, -1099, 1062, 113, -966, 568, 142, -526, 334, -77, -274, 396, -236, -349, 470, 85, -511, 44, 554, -133, -755, 542, 828, -1205, -136, 1629, -915, -971, 1744, -134, -1304, 1130]
948A130p94j117J418q32J65R25j934J049J799l406Q31L459l861o09M401k829j939
965b144L922j402k060K750q68j169J854j326j86J964k150j56K674k284q04K896
981A511j549j407K425o58j349J490k59p30Q12l09k19M98k91p6J63kJ32n10L01
1000b7P55j308J13J641j584n41K166j239j044K006q70q26J487j004j47J475j858
1017h05L84K101k753Q2L107k778q79L541k090j529L068j236j368K135j007n49
1033e76J562j546K07J745k302K86K352k457k62K635j980p62K286j179p80J409
1049F38p24k17O91p79M26L67j077Q53L26j273R30L19j233J004O2j078J175k12
1067A98j004J383l96j022J491n34r38J547o67q36J566q43o94J674j091o15J771
$$ y = [1130, 336, -781, 637, -195, -30, 895, -1039, 10, 1809, -1597, -766, 2693, -1168, -1777, 2624, -205, -2144, 1778, 376, -1684, 1066, 198, -971, 883, -443, -629, 1335, -815, -971, 1703, -581, -1385, 1511, -38, -1445, 980, 322, -1027, 463, 204, -526, 286, -23, -242, 256, -35, -111, 52, 50, 182, -328, -27, 728, -580, -467, 1174, -410, -951, 1215, -24, -1068, 938, 68, -758, 729, -275, -422, 1053, -805, -421, 1680, -1073, -991, 2116, -662, -1541, 2000, -90, -1619, 1449, 213, -1155, 980, -27, -576, 986, -560, -353, 1392, -910, -624, 1728, -729, -991, 1644, -336, -1098, 1188, 9, -771, 638, -86, -303, 388, -391, 35, 402, -675, 178, 504, -769, 161, 480, -753, 251, 313, -765, 410, 198, -806, 577, 181, -841, 650, 116, -822, 725, 58, -778, 788, -55, -749, 925, -166, -781, 990]
1084I90j161o30J776j137n76J679j158l74J461j203j09J375j433J28J425j650
1100e97J72J520j656J43J502j639J26J407j441J54J125j306L27Q66j254N49O21
1117F19j239P29M85j340R43L64j336J012L25j342R72L15j193R19J03r80R67p3
1135B50r04J096k90q25J187l83q37J188l56p51J090m27m92R32o07k23R28q38j26
1154c88J119j076q4J188j028j79J129r08j38R83q96N5P96r49K33P15j034L51P83
1173F72j109K96P56r76K40O21q15K76L96p05N14J56q13P44J36r49P71K16r41O83
1193A69K43q73O22J12o73O03n6n22O73k35m91P47k62m85P40k92m28P04l15l44
1213c63O40l76j84O30m78j68O64n37j02O61n51p7N85n02JM71n25J00M58o00J79
$$ y = [990, -171, -801, 975, -162, -738, 941, -217, -591, 870, -333, -442, 933, -500, -372, 1053, -597, -425, 1095, -561, -418, 1084, -555, -429, 978, -463, -309, 816, -490, -163, 703, -551, -2, 619, -620, 109, 594, -746, 197, 561, -775, 237, 562, -780, 192, 507, -686, 233, 336, -644, 323, 250, -654, 442, 152, -673, 514, 131, -706, 482, 126, -625, 465, 38, -454, 478, -129, -352, 576, -262, -388, 731, -345, -429, 759, -269, -448, 681, -227, -365, 618, -278, -223, 573, -376, -143, 572, -462, -111, 672, -437, -141, 615, -361, -121, 500, -315, -39, 357, -348, 166, 322, -491, 253, 389, -560, 211, 427, -514, 169, 412, -461, 161, 273, -400, 203, 147, -375, 298, 63, -428, 319, 57, -428, 312, 20, -408, 296, -19, -363, 277, -99, -283, 347, -131, -299, 365, -172, -274, 387, -164, -241, 344, -158, -157, 314, -211, -111, 347, -253, -74]
1234g4M42o48K29M21o27K18L52n70K77K73n63L33K01o01M44J59o18M86J75o74
1254c65M91J92o57M16K03n53L45J38m30L18O9l42L23l5l19M24j37l12M40j18k93
1275b02L62q6k65L16q5j54K25j56mJ86k64O8K66l55R2K58l81O1L41l75P1K57l63
1298a87J56K16m20K36K27m73J94L18m71J35L19m21J04K68l52J42K02l34J62J41
1318A62l31J88J58l52J53K07l13R8J71j81P1J9p0J04j05m3K05j80n6K61j31j22
1340h7K10j25o4J79j54O0J04k26Q2K14l50R6L19l80oL86l41n8L42k37r6K99k56
1363h9o2L24k63o8L67k82j29L63j81j84K94k4k07J71Kj19Q5J8k7K6k2o4P1N5j15
1388f0L8J26j18j08K20J4k47J66J32l09R7K46k64J4K15j97j2J62j97O2J73l09
$$ y = [-74, 368, -280, -51, 370, -257, -39, 313, -257, 20, 293, -270, 63, 264, -337, 107, 266, -352, 134, 309, -365, 126, 318, -339, 77, 280, -273, 72, 210, -220, 98, 167, -175, 148, 113, -206, 218, 81, -231, 209, 91, -202, 160, 74, -191, 125, 40, -114, 111, -45, -49, 137, -127, -59, 207, -148, -56, 202, -179, -118, 223, -152, -81, 176, -187, -31, 185, -235, 1, 228, -245, -51, 267, -204, -69, 250, -171, -67, 201, -151, -9, 193, -141, 21, 162, -169, 19, 177, -175, -22, 185, -128, -30, 141, -40, 31, 50, -20, 84, -21, -64, 141, -39, -95, 166, 35, -87, 123, -2, -66, 113, -41, 19, 123, -103, -21, 193, -157, -61, 258, -122, -128, 258, -83, -141, 201, -36, -132, 167, -89, -151, 173, -90, -158, 209, -73, -202, 161, -20, -204, 90, 66, -141, 30, 32, -87, -2, 16, -11, 15, -7, -71, 0, 55, -60, -22, 104, -14, -122, 98, 112, -135, 31, 163, -146, -49, 197, -67, -53, 162, -35, -47, 115, -82, -20, 153, -156]
1410a56P3L17l67K5L70l57j00M74k94j67M10j80k32L64j18k34L26q8k07K97o3
1431I3k80L06m4k28K29J4k19J51Q7k14O8R9j29J2J28r8l5J45j03r0J53j7j60J86
1455E4jj91J34J13k31R8J65k46N7K05k24K2J89k14K0J96k34L8K58k94l2L34k53
1478c7j05L53k28j08K69j46j42K90j33j29K54j42j24K28q7j06J73o2j16J86j0
1499G8j47J16qr8J03no1N5Rl1K3olj3j8M0k5j9Q1p8k7R4q1j2R6j05l7J38j22j
1529f4J61j49m6J96j48n4K12j39p0K19j29r3K11j26p0K01j22o8J71r9q2J80j14
1552b2o7J88j13n0J24o7l9J26q3l8J21j10qR2r2K4M6n7L1j3j7K9mn6J01k2o8R7
1580E3k1q3J26m6q5J26m2r8J61r3o9J58q0r3J68o5j17J65m1j34J69l8j06J20n2
$$ y = [-156, -83, 234, -133, -108, 262, -95, -195, 279, -15, -182, 228, 48, -184, 180, 62, -172, 154, 66, -141, 156, 93, -187, 119, 75, -153, 76, 90, -129, 22, 109, -105, -37, 62, -67, -55, 73, -25, -60, 85, -18, -108, 45, 28, -132, 54, 53, -138, -4, 109, -122, -24, 141, -105, -48, 157, -67, -45, 144, -70, -50, 146, -88, -50, 208, -86, -118, 216, -37, -142, 211, -17, -125, 144, -2, -144, 146, 13, -116, 138, -4, -128, 100, 13, -93, 80, 18, -98, 88, 78, -69, 47, 39, -59, 44, 39, -22, 33, 42, 11, 34, 28, 25, 12, -6, 34, 9, -10, 71, -7, -34, 60, -21, -33, 63, -42, -79, 59, -63, -64, 97, -52, -98, 98, -50, -104, 108, -31, -101, 118, -11, -104, 107, -19, -89, 112, -10, -78, 93, -6, -88, 92, -22, -89, 99, -14, -64, 60, -7, -46, 80, -3, -41, 80, -30, -38, 54, -38, -14, 32, -25, 6, -7, -24, 5, 1, -55, 46, 24, -44, 53, 32, -51, 75, 29, -56, 70, 28, -70, 91, -2, -71, 87, 7, -86, 82, 17, -100, 65, 24, -110, 59, 21, -85, 35, -17]
1605a7n6J30p1n7J08l1o9J14l0q4Q3ro6Q5m2lM0k9MM2o2K4K6m7OL4m0L0J5m9N2
1636C1k5k2N4or4J01rj20J21pq1Q3kp0P7J5j11J21k8r3J03J3q5O9rn8P8Pq4P5
1666D4k1l7L7J0l8M0l9mQj0m4P9j3oJ7n0K5Lk9L5nn9K8N9o9M3J4m7L0K6m8L1M3
1699E3j03O3M8q2J4M5n2J3O2q4K7P2r0M4J8o0rM7k8M5j9k2K0m8RJ6noJ5mJ7lo
1732GJ0qj8L4K4n6N5k1n0M3M4q4L1N0q0J4O2j02L7O3j00J7P4o8LO6o1o1J14r5
1762e6J1Q0n3k7N7J8o8O2m3j6M9On9N9j4k7nN8m5K3L2k7k2J1J2l2M0J2m8oM4m1
1794a5mM1o7K5O2o9K1N7q8LJ13j32J1J08q2m6J33j05j7J12m7o9J22m9n5P6oo6
1822c3O5j6n2Q6k3p7P7jn0K9J5l2KNrNJ1k4l0M2Lk0K0mj3NM8o0j3R1n2qN9o1k4
$$ y = [-17, -73, 57, -14, -71, 37, 6, -63, 51, 21, -63, 20, 11, -55, 30, -12, -15, 25, -4, 0, 42, -20, 4, 30, -17, -11, 23, -17, 13, 28, -21, 31, 6, -16, 38, 32, -62, 39, 30, -90, 31, 24, -57, 26, 24, -46, 31, 46, -65, 56, 28, -65, 38, 51, -34, 35, 26, -32, 46, 53, -31, 44, 23, -14, 23, 33, -5, 35, -4, -8, 0, -10, -54, 25, 12, 6, 23, -27, -2, 1, -28, 7, 2, -57, -29, 30, -39, 4, 18, -29, 1, 27, -21, 10, 53, -50, 13, 61, -21, -7, 38, -14, -1, 61, -23, 4, 76, -14, 30, 48, -12, -21, 26, -2, 43, 24, 2, 22, -26, -17, -1, -6, -12, 3, -1, 16, 13, 7, 17, 9, -9, 25, 49, -7, 48, 27, -23, 20, 64, -20, 11, 61, -19, -5, 57, -45, -8, 55, -45, -28, 46, -22, -19, 47, -14, -75, 39, -56, -45, 35, -18, -45, 12, 30, -38, 24, -19, -35, 14, 20, -39, 20, 6, -21, -26, 32, -13, 10, 42, 15, -7, 4, 16, -16, 24, 36, -12, -18, 26, -15, -19, 22, -45, -20, 42, -27, -6, 51, -37, -34, 79, -53, -42, 66, -16, -62, 71, -34, -51, 61, 14, -55, 67, 18, -37, 39, 33, -33, 32, 16, -36, 50, 27, -50, 27, 26, -24, 5, 20, -12, -10, -5, -14, -9, 2, -22, -52, -10, -7, -27, -7, -11, -24, -19, 29, -31, -44, 47, -5, -13, 46, -15, -39]
1857c9Q3l9o4J33o6n7J13l6p7J02n1n3J12l3j10J25j2o1P1J2j08R1j1j06Q7L0
1883C6q2M9J5m5K5J4m8L4j3k5L6L5l7K0K0jm3PJ8kl1P1m6k7M6J1q7P0J5q7R1m5
1915fo3J07j8q8J11n4o9J20Pj15J16l2r4J17Nj05P2J5r6J07J1j03P8rp5Q1J6o1
1943b5N8Jp1O3Lo0Q1m4k4J3J9j3J7m1J5K0j7jK5p0N6K2p2N9K1r7R7j2o1N1M6q2
1975b3K0N6q0P1K5j51J14J4j12O9P1j36R1J1j01O5O1j27N8M8j11O9M5j46J07K7
2001C5q7N4rm9P4Oq5Q3k8l3O0l4j5P4o0qQ3o1k8Q1o5J6M8q9L5N2q0M0L9j13N3
2032a1R7j37M2P0j39N5R3j46Q0O5j46P1Q5j50P9P0j31M5O1j17O4P6j53P0R0j27
2058d4M3N8j11O5L7r6O2L1r1R0m3o0O8j3l5O3k0p3Q6j6n2R4j05L2P6r2k4J38o9
$$ y = [-39, 44, 5, -59, 74, 8, -49, 64, 28, -49, 53, 2, -51, 61, 28, -82, 43, 31, -30, 41, 53, -55, 36, 25, -81, 6, 36, -46, 3, 18, -27, -2, 12, -36, -2, -15, -40, -4, 31, -6, 14, 34, 33, -10, -3, 15, 13, -18, 53, 7, -20, 26, 37, -50, 20, 35, -52, 39, -6, -69, 38, 20, -68, 43, -11, -80, 40, 47, -68, 48, 16, -78, 39, 44, -61, 11, 26, -70, 37, 48, -55, 23, 14, -61, 20, 36, -25, 33, 34, -37, 26, 29, -31, 50, 6, -18, -5, 14, 1, 18, -23, -8, 12, -5, -6, 19, -51, 5, 27, -45, 14, 35, -62, 35, 23, -38, 13, 59, -23, -3, 53, -27, 44, 69, -82, 32, 46, -66, 3, 74, -62, 29, 40, -61, 4, 65, -62, -4, 44, -67, 2, 47, -99, 8, 35, -52, 2, -7, -56, 18, 24, -61, 22, -6, -39, 21, -13, -28, 46, -14, -22, 61, 0, -28, 53, -12, 4, 52, -37, -2, 50, -30, 10, 49, -64, -11, 86, -51, -9, 61, -78, -23, 70, -76, 4, 69, -77, -6, 79, -71, 8, 78, -53, -8, 53, -64, 0, 76, -77, -7, 83, -44, -1, 57, -54, 11, 48, -48, 14, 45, -46, 44, 1, -59, 9, -4, -39, 24, 4, -69, 17, 1, -51, 43, -62, -30, 46, -46, -70, 68, -1]
2087am7Q0r7J6J13j05j5J36j50M0J19j53N4J06j38J4J08j24K2J16j45K0J14j26
2111d3L4Q8j50O7N6q9L4Qo5N3O4r1K8L6q6Q6Nn5M8mq1Q2j3n2J02o2l8Q8n5m4J01
2142E2m8o1J26o8o2J21j01k4J09m5m9J08r0l9J18o1k3J04q9k7J01o1m8R6o7l4
2168f2J16q0k7Q2p1K7P1r4N1K5n1K5N8j01O1qn3O2k8m3O3kn7O6nq1R4j4p5P1j5
2199Em9J03m7p0J28p6p2J29l4o8J18p0l1R3o2n2J37p2m2R1n5m8Q5j1l6L2k5l5
2227c4M8k4k5O5n2QJj8L7Lm1J8J4l4L2oj1K9j4m8R2k9o7P9ol1K4Ko2J08m0o4P8
2260C2mp5R6kp6N8j1n8O9oq2R3l0k0L6K2j14P3J9o6P1k6k7O6j3k0pM7n3J7Jk7
2292a7L4j9mK9j0Nj7NoOQqrqM9n6l8R5l4m7P0k8n1Q1k5m3Q9m6n7O8np7Q8j9p7
$$ y = [-1, -48, 32, -65, -49, 64, -41, -56, 80, -70, -30, 89, -64, -10, 96, -42, -28, 80, -44, -22, 94, -51, -31, 83, -43, -9, 79, -71, -4, 52, -37, -3, 5, -60, -7, 57, -34, -6, 30, -56, 30, 35, -20, 28, 24, -57, 25, 12, -40, 62, 0, -38, 50, -5, -49, 52, 4, -57, 69, 1, -61, 60, -41, -65, 44, -1, -50, 58, -32, -71, 47, -14, -37, 67, -22, -49, 52, -9, -57, 39, -28, -62, 54, -26, -53, 29, -42, -15, 56, -38, 13, 38, -13, 12, 70, -31, 30, 22, -31, 31, 3, -40, 23, 21, -36, 30, 25, -56, 38, 24, -51, 20, 5, -44, 59, 12, -58, 70, -6, -78, 51, 17, -51, 67, -3, -34, 59, -3, -55, 82, 10, -32, 59, 4, -44, 41, 30, -6, 26, 1, -34, 14, -10, -35, 30, -22, -14, -13, -31, 6, 9, -32, -14, 0, -34, -2, -8, -19, 10, -4, -52, 40, 11, -56, 23, 17, -14, 10, 12, -50, 58, 18, -46, 32, 28, -47, 49, 47, -29, 29, 18, -40, 29, 23, -59, 34, 4, -16, 20, 42, -72, 1, 20, -46, 25, -1, -28, 38, 25, 5, -2, 45, -8, 9, 10, -17, 17, -2, -6, 23, 13, 18, 1, 6, 0, 6, 14, 6, -3, -11, 38, -18, -56, 39, 5, -42, 28, 0, -51, 30, 5, -38, 51, 5, -52, 16, 11, -66, 22, 3, -74]
2327g4R0J5q6R0J1o9N1Jn6L0L8p8P2j3l8N2j0q8P5rj5J2Jj7J6rLJ9pl9L5LJ2j9
2361aqJ6Mj1K2%l5M8j0p%Oj9J5qj9K3rpJ6ql0L1l1JL7j1l3K1J3m3M3jm1N2kn4
2398d0M5kk3jJ7j6N3l6l5O7m2k0O2k7k7N4k0rJ6k4KL5l9J2M1n0J6K8m7rK3k0J
2431a5M0k9j7L6j5Kk0J0LP%mRn8P0l3L2Nl6K0jj8K6Om2L1kJl3O9m9kK0m6K6N4
2467D7o9L4On7J6N9o0QK4m6KN9n8JP4m6k3N7n2j3N4k8j9O2j1k6M4j3l8L3j0l0
2499a9M9m2QL9j1k4K0j0rPMNk1K0Jj5kK9o3M1L3q3L7M4p2J9O1q3K6M6n2J6N3q1
2533b9K0O9r4J5P7q2j4Q8r5K2P2p0l2R0p4%Q3n4p7Q9rpL0k9nL3nj9j1MK1RJ7m7
2567a4PK1%J5qj5j6J9J6l6L0J7p4P8J0n4JM6q3J9O7p1J4P5j09M5O1j08J3O9o3
$$ y = [-74, 16, 31, -55, 35, 46, -23, 28, 29, -27, 3, 41, -37, 35, 22, -16, 36, 26, -62, 13, 4, -11, 1, 2, -15, 1, -8, -5, 14, 7, -32, 3, 6, 18, -1, -9, 7, 11, 0, 22, 22, -13, 35, 25, 18, 18, 24, 5, 20, 12, -7, 16, 7, 0, 16, 8, -22, 9, -22, -21, 16, 5, -28, -7, 6, -37, 6, 5, -36, 16, 14, -40, 5, 3, -20, -21, -4, -20, 33, -3, -38, 29, -13, -33, 29, 2, -25, 29, 9, 0, 16, -8, -6, 29, -10, 2, 43, -7, 9, 37, -10, -19, 4, -16, -15, 25, -4, -21, 15, 0, 2, -18, -8, -5, 2, 2, -2, 7, -51, 19, -14, 18, 23, -13, 7, 6, -12, 14, 20, -22, 9, 7, 8, -25, 44, -5, -7, 13, -33, -7, 47, -22, 12, 18, -39, -23, 36, -24, -16, 8, -38, -36, 23, -35, -34, 40, -6, -29, 28, -24, -37, 17, -11, -30, 32, 21, -5, 39, 26, -12, 21, 11, -19, 30, -12, -4, 35, 24, 0, 20, 10, 1, 8, 12, 17, -4, 16, 17, 2, 0, 29, -34, 7, 40, -43, -6, 38, -34, -15, 46, -37, -11, 35, -17, -1, 52, -29, -9, 60, -34, -19, 58, -24, -38, 50, -45, -23, 49, -21, -53, 37, -37, -37, 46, -8, -85, 4, -5, -12, 18, -11, -16, 17, 12, -7, -18, -14, 7, 16, 33, -14, -7, 14, 14, 29, 21, 6, -10, 9, 25, -11, 19, 36, -38, 40, 50, -4, -3, 43, -40, -21, 46, -25, -11, 64, -45, 0, 61, -47, -34, 35, -28]
2598b8KP7p6K7L6n9j4J00p4l8Q4m2k4N8k9l7P2k1l1K6j8j3L2l1MJ9j9oROKrJ2
2631cLk7J7mj7J6L8q1O3M0p6J7Q6p9MO6o6oN6n9QP1o5J1J8l2l1J09j05K1M6m6
2663gj3M6no2P9l7NK2qn7O6k7m2N1j3j2J4Oj3J5J0qk1QK4l0L9Ko0L9j5k3J7O3
2697E3j05O6ol4lM9n5K9O6r5K3L7n2qN5l3j5O7q3J9R1o9l0Q0n6j9P0l8l1Q5k8
2728C0n0N6nm7N5k3m7P6j7l8K1J7m9K0RJNJ7m1j6OL8l4K4kj9M6j5o0N8K5p8M3
2761FJ3m8M7J7n4j2N8m7MQ5j02J9O7j9n1M8p9K3O2n1k9Q0n1k8Q7o1j8N4k6m4O8
2792A8j6m2O5j4k7N2l5j4L5j3j0N1l4k1J1Nl0O9qk7pL0k7Nk7J8l3M2J1l9J5Rp0
2825e8O1L1m1mJ3l7J5M4n7L7L1l8j0K8k9JL0j8j3N0o3PN8m5qO8m7k3J3mj0M4l7
$$ y = [-28, -26, 51, -25, 2, 38, -21, -35, 65, -9, -47, 37, -5, -29, 29, 0, -37, 35, 14, -17, 9, -9, -22, 10, -21, -17, 2, -17, -23, -14, -8, -6, -15, -3, 0, -27, -10, -14, -31, -15, 23, -58, 5, 45, -31, -14, 72, -7, -3, 63, -3, -9, 47, -12, -4, 67, 2, 13, 31, -1, -32, 77, -28, -7, 39, -7, -20, 26, 21, -41, 38, 1, 6, 28, 20, -37, 29, 2, -40, 11, -2, -14, 0, 6, -7, 8, 18, 10, -11, -3, 21, -9, 30, 32, -28, 11, -4, -27, -10, 53, -52, 14, 8, -26, -29, 20, -35, -6, 60, -35, -12, 25, -27, -35, 20, -13, -28, 39, -44, -25, 66, -3, -33, 47, -9, -28, 42, 4, -27, 58, 30, -20, 36, 31, -16, 39, 16, -31, 45, 28, -10, 11, 28, -21, -1, 8, 9, 14, 31, -10, -26, -20, 18, -16, 8, 6, -13, 33, 18, -42, 16, 41, -37, 6, 19, -29, 18, 35, -19, -31, 27, -20, -16, 69, -33, -14, 53, 34, -17, 31, -48, -25, 37, -14, -43, 37, -14, -42, 45, -16, -34, 20, -6, -50, 18, 2, -40, 25, 11, -16, 36, 1, -13, 22, 9, -1, 50, 16, -5, 6, 11, -19, 50, 42, 15, 8, 38, 11, 16, -11, 7, -26, 16, 27, -12, 3, 12, -58, 3, 34, -7, -11, 2, -35, -20, 24, -33, 4, 35, -3, -13, 15, -14, -13, 17, -1, -14, 36, -27, -20, 38, -7, -15, 53, 6, -17, -4, -8, -18, 26, -11]
2858a1mL0l0l3M9nj1Pj2J3M2m3j7L9k6nL3k2J3Lk4K2qrK3K9m4J0Mj0MK8k9L0k7
2893IM0k0m0RK3l7J4J6Rn6N2m5lO5p3K1nJ3pK4pj2K9l5K3K9m2JQk8K7M3o8JN6
2928C4n2mN8k7k6K7l6K4j7RnL3o4J7L6l1QK0J3k9L5l3mJ1J3J8m6M1j5oJ2L8l6
2961A6k5M6j5k0K7l9J9Ql0K3jk5N1Ko4K5L2l3l3N0l8LM3n9L8K9n2j0Q9q0NL6l7
2994a9LK7m2J7K7m2M7k1rK0KnL3m3k1J9QlMj0j3L2Ol9L4j9rL4o4K6K5k5RL2n5
3029c4K7K8k1J0mk8L6K2n1NM6o2L7O4q5K0K7m7J3M8p1M8%m0QL0l6J5K1m2J9On4
3062d5L8L3q3P0ml3J4NJ4Mj0j4L1j5k9O0k9k0L5j4l1K8Mj0M8m8J2pk9K2L6n2%
3095a9N4n6J3J1j3NK1n1N1Jk8NK5m9K6K6p3M6M1m0PL0l0J6J7n3K6J7l5N6%m8J2
$$ y = [-11, -15, 15, -15, -48, 1, -4, -15, -8, -20, -7, 35, -8, -25, 14, -12, -17, 16, -6, 7, 10, -14, 8, 0, -9, 14, 43, -1, 9, 13, 3, 7, 35, 6, 36, 9, 49, 29, -11, -2, 21, -16, -2, 14, 23, -33, 19, -26, -29, 36, -37, -16, -21, -8, -15, 9, 2, -10, 19, -16, 7, 36, -6, -5, 3, -25, 2, 45, -23, -22, 34, -18, -22, 36, 9, -17, 10, -26, -2, -19, -10, -15, 18, -46, -29, 7, -24, -16, 4, 17, -12, 23, -10, -14, -3, 10, 28, -18, 23, 8, 2, 14, 52, 16, -9, 37, 22, 2, 29, -10, 9, 17, -13, 10, 9, -16, 35, 37, -27, -2, 30, -3, -36, 14, -24, -21, 22, -37, 1, 30, -22, -32, 57, -23, -18, 18, -19, -16, 11, -31, -14, 13, -29, 18, -3, -12, 8, 10, 5, 38, -5, -26, -7, 1, -2, 2, -8, -21, 11, 17, -22, 12, -7, -16, 18, -46, -20, 5, -20, -11, 21, -34, -7, 21, 0, 10, 6, -22, 14, 36, -15, -10, 36, -26, 11, 75, -10, 10, 37, -10, 3, 51, -20, 28, 28, -12, -4, 26, -10, 5, 26, -16, 3, 9, -45, -7, 26, -57, 13, 9, -24, -10, -5, 9, 13, 3, -11, 20, 5, -24, 36, 7, -13, 22, 8, -23, 5, 9, -1, 47, -1, 11, 4, -25, -3, 33, -19, -19, 35, -21, -8, 3, -10, -5, 16, -35, 16, 17, -11, -6, 19, -30, -4, 22, -51, -5, 36, -4, 3, 33, 3, 19, 36, -17, 9, 26, -9, 47, 47, -1, 11]
3128A1K9n3M2Ln3L8Pm6%K8J1j4k6KK5k6j4M6m2K4K8n3J6L0j1J5k0m3P3j4o1O6
3160A8J8p1N2%m1J8O8q2%O5n2PL3m6OK6m3K3J4j0Qk3MrL3k3L5j5k3J2Rqj5L3k0
3195Aj2J0K8k8OK8j9k0L6k2j7L0J5l4J8ko5O0Nn0LN2o7K0L5p0M8K6o6M6J8p2N0
3228iK0m6J0M3k7kM9m8lK2l0j1M8k3j8M6m5M7oj8ML2l5j6N0l0j8OK0m8N4j5j0
3261glJ1rk6O6m0nL9Om8L1J3m7N6j9n2N4J2m8M0jl8K8K0m3J5J8l9mL6m6K1K3j5
3295ak1N7q1L9J1j8j6L8Lqj4k4K1J8j7kK4L9n8K1nOk6QMj0L7k0mK5j9oRNk4PJ6
3332A4m2L5K9n5L3k3j1J2K7n5L8J6l8qM7m3K8J8k4mN3o3L0l5jL1ml0L2K6n8L4
3364InMk2L8m8J8KJ3orJ1Ol0pk0K6J7oRk1J0j6JM0k1mJ5l1K4JRj1LkK4ok7OJ1
$$ y = [11, 40, -13, 29, 32, -21, 17, 24, -22, -22, 6, 17, 3, -23, -21, 4, -22, -36, 10, -32, -8, 20, -33, -17, 13, 2, 17, -3, -46, 27, 13, -48, 18, 36, -35, 17, 17, -24, -6, 62, -20, -20, 45, -7, 0, 33, -13, -7, 19, -24, -1, 13, 3, 11, -12, -8, -17, 16, -7, 28, 13, -10, 2, 11, 3, -12, 21, 1, -11, -1, 27, -1, 5, 33, 14, -6, 30, 8, -9, 21, 36, 2, 20, 18, -47, 13, 18, -32, -29, 23, -44, -24, 11, -59, -11, 15, -51, -5, 13, -59, -9, 11, -35, -25, 18, -9, -11, 38, -10, -13, 9, -21, -32, 16, -7, -25, 21, -24, 23, 17, -1, 3, 35, 0, -16, 34, 4, -14, -8, 12, -36, 18, 3, -7, -10, 1, -8, -34, 32, -8, -13, 26, 32, -16, 15, 28, -19, 37, 18, -34, 20, 32, -16, 24, 23, -15, 13, 33, -10, 5, 23, -16, -20, 16, -30, -9, 14, -1, -22, 35, -46, -7, 4, -14, -30, 8, 11, 3, -11, -35, -14, 4, -13, -15, 9, 48, -10, 11, 6, 12, -14, -6, -2, -12, 25, 5, 1, 26, 7, 1, 10, 15, -9, -2, 14, -28, 7, 36, -19, 14, -9, -20, -8, 19, -36, 2, 18, -20, -28, 19, -24, 4, 22, -2, -6, 47, -16, 14, -21, -22, 9, 5, -25, 7, 33, -25, 9, 4, 8, -14, 24, -24, -6, -4, 9, 3, -6, 5, 11, -19, -26, -46, -20, -3, -9, 0, -21, -11, -27, -26, 14, -7, -11, 4, -27, -3, -2, 7, -4, -1, -3, 21, 15, -12, -6, 5]
3403EnJ1j9NoK7l9L9rm4K7j5MNJ5jOK4l1QJ9k9QJ5k6qL8n0oL5J2j8K5j1l2M4j2
3440A1j2K8k0k1J7J8o4M5K1o8M3Nl7L6j6k8L0RQOk3J8k0Rj4QK4ol2J2K1k9PJ4
3474@m%J8l2J4M2k9j9L9k7j1L8o2K7K4k2kJ8j8nK8m0L2j7%oK2k4oOK7j3Nj9J6
3509@J3prKJ7nlk3nL6jK5l1lJ4k1MmK5l1oj0J4j0JLQrL4m0j2K6L6o6M0Rk0j3Q
3548a4J3l0K5j3L0j7rRL4l5K9Jk5k1L1l1K3J8l3j8J0K3K1%m2K8Nj2K2jk9%K6p
3582A1KOj7Ol5K3Mj2K0j7j5L4j8J5j3L3mj7lj1LL6l1j7L3o2N1Ol5rL4l0L0Pk6
3617a8J8K6j8l8L8m6L8qj9jL4klJ2k4J3Mj1RKrK5k4jLRj6K1k2J7k4J7j3Pj5K0
3653Amk5%M9m6j3N6l0j1M1k1J2Jl4QM6k7OJ6n1K7K0oj3J0k1LJ6j0J1K2o1%N0l3
$$ y = [5, 0, 11, -8, -3, -9, 18, -21, 18, 9, -35, -8, -23, -19, -14, 1, 0, 6, 30, -1, 7, 26, -3, 5, 20, -6, -14, 24, -26, -32, 3, 15, -3, 22, 11, -21, 23, 11, -1, 27, 7, -14, 3, 21, -43, 2, 23, -45, -2, 3, -34, 2, -14, -42, -12, -3, 5, 11, -12, 6, -14, -5, -19, -11, 13, 7, -25, -13, 8, -21, -14, 0, -4, -4, 14, -18, -4, 38, 9, -10, 29, 2, -9, 29, -33, -6, 18, -4, -6, 12, -6, -11, 17, -23, 9, -8, -8, -14, 8, -16, -22, -16, 11, -2, 3, -16, 0, 13, 6, -3, -1, 16, 11, 8, -15, -20, 16, 15, 40, 9, 6, 20, -1, 3, -1, 24, -7, -13, -23, -9, -19, -18, -15, -7, -16, 18, -22, -34, -8, 28, -38, 2, 11, -9, -22, -14, -1, -31, -6, -19, 11, -6, -15, -6, 28, -7, 22, 23, -2, -23, 8, -23, 0, 18, -15, -33, -23, 0, 21, 21, -21, 7, 12, 0, 22, 21, -8, -8, 18, 11, 13, 19, 2, 8, -27, -4, 0, -12, 8, -9, -24, 10, -8, 7, -6, 27, 23, 6, 3, -8, -5, 31, 0, -17, 16, -46, 5, 11, -24, -33, 1, -29, 1, 8, -18, 0, 26, 8, -30, 8, -38, 0, -8, -27, -28, 6, 4, 1, 13, -11, 2, 6, -5, 4, 6, -3, 22, -2, -3, 0, 9, -7, 14, -8, 9, -15, 2, -11, -4, -19, 1, -3, -28, -28, 21, -25, -38, 18, -12, -23, 18, -3, 9, 10, -24, -16, 30, 3, 9, 25, -26, 1, 21, 15, 2, 12, -9, -6, 10, 0, 11, 33, -28, -28, 22, -11]
3688a1k3M5rJJ6j3Ml3NJ8j8kLoJ7k1j1N4j4MpJ5l2K2k2QK2L3m2JK7o2K8K5j5l5
3724b8K9j5J8J5j2j4L9j0l4mjKL4m4J1J8k6J2J7Qj2J7lnkK6n3K0MNqJJ0j6K6k
3760B3n2L2pqK2rj9J7qj5J1M1m1K1Km2M6j5k8L3K2k7jK6o0K9L1l3k0M8j2m%j1
3794hJ7Ql4J9K9jl7J0j7K9Pj6pj8J5MK9k4rj4L7k1nkJ7k3J5K7k3kL3k8Mnk4J6
3830bL2k4j5K5j4%J0Nk6M5l7rJ9k1J6J9k8oK4k3qK2l2J7J5l1L3j9j2L2Prj2J3
3864FKrL8n5N2l3k3N1k0K1k0J6k2J8j3k4L5k0Nj3J5jJ4j9k3MOL8j0%l6M0l1Rj
3899cRrK4k1k1J1nJ7lnPK0m2J4K3j4J2j1K0j2oJJ5Jk8LL6k1J0j1j9l3O5n4J5L3
3935A8j9J5j4M4l7mj4K1J6j7j6J8nJ2plj6L6m1J4Nk5L9k9OPK0k9L0k2j2K5j8k
$$ y = [-11, -34, 11, 2, 3, 19, 6, 10, -23, -18, 0, -18, -20, -17, -23, -6, -27, -38, 16, 2, 6, -1, 14, -18, 4, -18, -10, 12, 45, 3, 4, 31, -31, -3, 22, 7, -28, 1, -14, 4, 19, 7, -7, 32, 22, -12, -16, -17, -15, 19, -25, -14, 4, -22, -10, 7, 15, 3, 20, 17, 12, 10, 36, -17, 3, 7, 12, 4, 5, 15, -1, 25, 23, -29, 3, -4, -12, 10, 1, -18, -1, -9, -24, -13, 28, -13, 8, 10, -32, 14, -1, -29, 4, 26, -1, -2, 24, -36, -7, 24, -9, -29, 19, 7, 3, 3, -8, 9, 17, -17, 2, 31, 30, -7, 3, -14, 15, 22, 6, -1, -19, -4, 0, 29, 5, -4, -18, 19, -2, -7, -9, 8, -15, 0, 27, 4, 2, 35, 7, 11, 6, -18, -2, 30, 6, -9, 16, 2, 2, 12, 17, -9, 36, -1, -10, 9, -12, 4, 23, -5, -11, 13, -10, -18, 4, -28, -11, 4, -27, 6, -13, -25, 7, 14, 5, -7, 6, 8, -1, 37, -18, 34, 1, -22, 29, 9, 30, 10, 26, 4, 22, 9, -15, 20, 0, 5, -8, 7, 6, 20, 1, -22, -18, -12, 26, 16, 16, -20, 20, -11, -2, -3, 6, -3, 21, 0, -21, -10, -15, 2, -1, -6, 1, 21, -21, -7, 16, 2, 14, 3, 23, 11, 5, 6, 21, 22, -6, -3, 33, 12, 22, 11, -8, -41, 24, -30, -15, 18, -1, 14, 0, 44, 7, 3, -11, 10, 26, 9, -7, 11, 6, 18, 11, 8, -8, 28, -13, 1, 6, -19, 20, -9, -3, 4, 24, -5, 25, 3, -9, 16, -2, -4]
3969dpJQ%kj1K6l9L2KOk5J1k1M9l5lL0k0NJ9j5J0j7Kj7mM0l3OKKKmj6lMJ9%j3
4009a3NJ9l5PJ3jl5N1l3J5J6j9J7nJ9k3nQoK0k2KK4j2j2J9rlJ2J8k6LnJPk1j1
4046b0K4PkOm6J4L5Jl8L1NpPm6K8J6m0K2K0k7j6K8Jj0k3M1lLlJ6m0nO7o7PK6k4
4083a2J6j8j1K3K3k5l7N3j5rj0K4j3M3m4j3J9%%lj7L8l1J1J1%njL2k5Lj1oO%K1
4119A7l0lK9koj4j3J1Lj0L9k6j2J4KKNk2%J8j5PpK9j7J3%K5k7kOk2qL3j7LJ2l6
4157b1kM0j9KM5n7J5J5l8L1j7k0L1j4Nj3K3J1j1opPNj7J6J4j0NLk8M0j1nk0L0
4192B2m7J2K3j3J6%J9k5j4K5%k1qOk0J8Nj7J5%kj7K0j2j2K5K7k7K7l7K1Rmm5M0
4227IkM9n4J6j8j1lJ0ROj2pJ6j1Oj0JJ7k2QPk7J7Rj1JK6k4qlM3j1Qrm3L7olJ5
$$ y = [-4, -11, -10, -2, -2, -4, -15, 11, -28, 4, 6, 12, -13, -2, -23, 26, -9, -12, 18, -2, 3, 22, 7, 17, 0, 2, -15, -19, 21, -12, -6, -4, -2, 0, -4, -20, -23, -19, 0, 0, -13, -8, 11, -24, -17, -4, -5, -40, 11, -22, -7, 9, -10, 7, 2, 21, -2, -7, 1, -5, 15, -7, -5, 19, 7, -5, 14, 5, 2, 14, 32, 6, 9, 4, 5, 12, -9, -20, 4, 11, 9, 15, -31, -17, 18, 19, -19, 12, 17, 10, 17, -29, -1, 15, -25, -3, 17, -10, -26, 2, 3, -7, -30, 11, 8, 11, 8, 24, -16, -21, 46, -21, -14, 12, -12, 4, -14, -25, -2, 21, -4, -41, 12, -3, -12, -22, 2, -11, 32, -12, -25, -6, -6, -6, -9, -26, 12, -19, -8, 3, 3, -2, -3, 29, 4, 7, -4, -10, -4, -4, 17, -13, -16, 13, 11, 5, -9, -22, -11, -8, -18, 21, -5, -17, -3, -1, 1, 6, -16, -16, 2, -13, -6, -13, 16, -1, 12, 12, 37, 10, 8, 14, -8, -16, 17, 0, 3, 15, -21, -23, 17, -2, 0, 45, -12, 3, 18, -20, 11, -6, -26, 5, -9, -4, -17, 6, 17, 6, 0, -7, 0, 5, -12, 4, 18, 8, 13, 16, -12, 28, 17, 12, -8, 22, -25, -13, 10, -3, 13, 13, 32, 7, -7, 18, 18, -3, -11, -5, -25, -7, -2, -19, -4, -4, -6, -23, -3, -15, -27, -2, 25, -2, 25, -12, 9, 18, 14, -31, 9, 7, 56, 2, 18, 0, -11, -14, -4, 5, 11, -1, -8, 8, -3, 3, -7, -6, 11, -11, -3, 4, -23, -6, 3, -8, -7, 19, -5, -13, -16, 27, 16, 24, 15, -28, 9, 3, 0, 15]
4266A5j8j0K6k0lJ0J0qNkk0J1j2L4l2KK3k5K8k5J2j4K8kq%k8K8j8K0pmJ1MJk6
4302a4QM7l9jJ8Ml0J5njK1k2%j8J3Pk2JK6PLkj4%Mj3K1Qk7K4k7pK0K3m3J0jj2
4340a8OOJ8Ljqrk8M2ok0j1rM0J7k3nj3j0J3J2J6j0j1J9Mj9Rk7RL5m9K5J2j8J4
4376EPj3pj1L6%k1j3M2l2K3j2j0k3RJ4Pj6J5KqmJ2OoLpKK1j7KRj8K3pk7L1k5K0
4415A2L4k3Kl0mRQK1m1K6J4k3%K0J1j8j0k1N6n4J9JMrKKnJ1l7MK5j6J8k2pK3l6
4452c4J9NJ2k1L9j3j2J3pnQjj2Nj1J2Rk6J3j6J6J0k4J2K2Jj9j0QQjk0K1j7J8k5
4488b3OqL7rj3J%M7l2pJ3j8QLPJ0nk3K9j4j0Qj3K4k5j1J6mJ8nk3K2omrQJpOoR
4529bKnoJ9ppj2RNQpQKJ1j6nPl8N3k9LK0l2K8Kk4K0lLjLk0J3%k8J1J8RJ5l4K4
$$ y = [15, -3, -13, 13, -7, -10, 0, 10, 2, 7, 5, -15, -4, -16, 18, -14, -12, 11, -14, 14, -11, 1, -13, 15, 13, 5, 5, -23, 5, -13, 7, 0, -4, 7, 11, 12, -14, -6, 41, 2, 1, 19, 23, -7, 8, 3, 2, 23, 1, 1, -17, -4, 3, -19, -18, 8, 15, 18, 16, 2, 2, 6, -7, 14, 22, -5, 19, -8, -15, 5, 28, -15, -5, -6, -18, -12, -6, 12, 15, 14, 6, -3, -31, 11, 5, -15, -26, -35, 5, 22, -1, -6, -19, -29, -16, -4, 12, 2, -9, 10, 14, -5, 4, -23, -14, 21, -28, -3, 9, -9, 5, 12, -1, -8, -19, 17, 17, -4, -17, 25, -7, 16, 4, -6, -29, -20, -6, 1, -15, 0, 2, -6, -10, 2, 8, 2, 5, -2, 0, 21, 4, 6, 15, -3, 20, 13, -14, 17, -8, 12, 46, 23, 25, -5, -9, 0, 8, 29, -12, 14, 28, 5, 5, 25, 36, 18, 8, -13, 43, -11, 8, 9, 13, 4, 6, 8, 3, 14, -23, -19, 6, -10, 8, -14, -21, 2, -34, -15, -10, 2, -19, 20, 7, -5, 8, 1, -4, 4, 3, -9, -4, -15, -3, 6, -20, -7, -23, -7, 3, -21, -9, 13, 14, -5, -15, -7, 1, 0, -20, 1, -16, 2, -23, -17, -25, 12, 3, -10, -9, -9, 38, 6, -1, 12, -6, 2, 5, 12, 22, 17, -6, 23, 9, -1, 7, -6, 18, -7, -18, -2, -6, 12, 7, -16, 6, 0, -4, -13, -5, -4, -11, -5, -11, -2, 0, -5, -11, 8, 1, -6, -18, -9, -4, 4, -3, 5, 7, 18, 2, -3, 4, -34, 19, -10, -7, 13, -19, 9, 11, -13, 7, 4, 7, 6, 9, -11, 2, 2, -26, -15, 3, 12, 27, -7, 17]
4570A7j7j4RK4%ojk9K2%poK2j1JkJ9k0j2K1mOk3J4j8J8j1oJK7k3nJ4j1J5plqJ4
4609@okJ5j5J8lPJ0k0m%lJJ2lj3J5k0K1KrMj0J7l6J1Rj9L3j2l2J9J0J3Jk0J3m2
4647c8L0M0k7%KjRj3RmmL3m2ORmoLJnj6J6J0qJ9l3L2nPk0k2J0JJQk2QJ3j4j0j
4688b8K5%kPK3m5J2K4n1M9j7J1k0J1K5j4j2RnPOj1j8J5nJ5mk4NJ4Qk8K8k0kpR
4725a0lK7j5j0J6KoLjpJ4mOppKJ1l0K7QMj8oj2K6j1qJ5rlk2J5j1K4Rnpj6jJ9K1
4766B0k3qNJ4j5J4j5J1J9j4k7RKJ2J3j3KL0k1k3nL8j3j5j6mM3l1Mj3NL1m3L8%
4801A1oJ0Nk1JOk0N6l7rkROK1l6J1MOjk5K6Jj8J9j7MJ7k2J9Rk5%J1k2J1LoK6k8
4840cJ3nl8L7noOl2M3j1j4L5j7K6j4j7PPJ5j8lNj1k5N7m5jnK6k1K2mj8PK4l1J
$$ y = [17, 0, -14, -5, 19, 19, 13, 12, -17, 5, 5, -2, -8, 14, 3, 4, 2, 21, 1, -11, 10, 6, 12, -11, 3, -15, 3, -8, -14, -13, 14, -9, -14, 0, -11, 4, -3, -6, -14, 0, -6, -8, 7, -8, 10, 7, 14, 24, 4, 0, 0, -3, -2, 10, 7, -6, 9, -11, 10, 12, 3, 7, -3, 14, -22, -11, -2, -21, 12, 0, -32, -13, -3, 10, 11, -9, 4, -38, -8, 32, 5, 5, 7, 6, 15, 2, 11, 7, 3, 36, -6, 0, 9, 5, -1, 2, 3, -2, -18, -2, 8, 0, 19, -14, 18, 13, 20, 0, -22, -12, -11, -10, -2, -24, -16, -3, -17, -27, -28, -3, -3, -5, 2, 25, -20, -8, 16, -35, 14, -3, 8, -12, -1, 24, 10, -2, 7, 2, 9, 15, 4, -14, 1, -4, 11, 7, -17, -12, 2, 10, -18, 10, -10, -12, -19, -10, -13, 14, -1, -11, 5, 7, 1, 4, 3, -4, 10, 6, 12, 5, -2, 0, 11, -19, 8, 16, 20, 2, -4, -16, 10, -1, -9, 6, -3, -6, -28, -13, -24, 0, 9, 4, -3, -19, -20, -1, 20, -3, -11, -6, 8, -7, 7, -8, 3, 22, 8, -19, -10, -8, 4, 17, 4, 6, 36, 15, -8, -13, 25, 12, -3, -19, -23, 20, -11, -7, -20, -15, 16, -27, 11, 11, 5, 15, 20, -1, 0, 6, -14, 42, 5, -4, -6, 3, 9, 30, -6, 5, 9, 15, 14, -11, 15, 16, -2, 17, 0, 4, 21, -1, 18, 27, 2, 2, 13, -9, 2, 5, -1, 25, -3, 10, 5, -33, 4, -1, -7, -1, -33, 10, -1, -15, 20, 3, 29, 15, -2, 5, 12, 27, 9, 6, 11, 0, -25, 32, -13, -14, -19, 7, -14, 8, 4, -14, -7, 17, -14, -13]
4877a3J2%k1K2j2J7j7J9j2mK2mk0MK9J6k0j2lJ6k9PK2j6j8K6j9J5J9m1J8J6k3
4910dk4K3K7l1J6oJKorJ3qK1Jj4kkoJ9%mJ6qj8rRk4K5J8k7K2j2j3L2k1J5k2Qj3
4949a5J9Oj6Kj1pK0kK0j0nOl8J2L1k9K3Oj2K3j8%j3J1PJ0orlQJ6qk7J7J9k5Lj4
4987iJ8pQj4or%J9QrRj2k2K5jLj9J3jK9oj3K3l2kkJ3J1mj7MKPk7L1j1ppK2l5L7
5028A0j1jk3K3k0j2K6j4nM5j4Rj5j3J5%pk9L8J7l6L3j2K2rmkmpj1KK7Ml0jJ9O
5065A6k0ppK8qJ4k0pkMKNNJqK2J6m5K9k2J2J6j7kj2J9K4k5Mj2J4lj1Llj3%K4l8
5104b4L4j1J3k6jL9Jjm1J6Rj4J1orL3l5kjmK3J6m7J7QJ7Kj0kj3J0j5J6LmK3k6
5141aoRqPnJ7j6mj0qJJ1J4JmJ3qjJ3k6J8k4N6m3j7K9nmKK8n4J8J6k8MJ3J3j1J0
$$ y = [-13, -1, -1, -22, 0, -12, 5, -12, 7, -5, -9, 13, 9, -11, -7, 22, 38, 18, 6, 3, 19, -10, -3, 19, 3, -15, 11, -8, 7, 26, -15, 3, 19, -4, -28, -5, 22, -9, 7, 1, 2, 4, -2, -11, 2, -6, 15, 16, 2, 0, -2, -8, 11, 11, 7, 23, 15, -3, -12, -3, -27, -2, 16, -11, 11, -1, -14, 18, -3, 12, -10, -2, -15, 4, 10, -6, -4, -15, -22, -2, -4, 16, 6, 1, 7, -31, -19, 12, -17, 6, 12, 0, 23, 5, 5, -8, 3, 10, 20, 14, 5, 2, 10, 26, 18, -9, 8, 27, 2, 5, -9, 9, 2, 10, -4, -10, -19, -19, 0, 8, -1, 8, -4, -26, -1, -2, 1, -18, -5, -6, 23, 17, 4, 27, -5, -7, -9, 4, 15, 11, -6, -2, 0, 7, -20, 11, 0, -7, -14, 8, -27, 10, -1, -2, -25, -2, -22, -34, -8, -22, -27, 18, 4, 13, -2, -15, 0, 0, -7, -36, 2, 19, -17, 16, 4, 26, 17, 13, 11, 7, 0, -11, -9, 18, 22, -8, -9, 10, 16, -4, -11, -18, 10, 2, 16, -4, -11, -13, -9, -7, -2, 3, 4, -4, 18, 34, -11, 18, -4, 8, 24, 7, 5, -7, 12, 36, 11, 15, 3, 17, 14, 3, 6, 3, -10, -10, 14, -24, 10, -1, 12, -14, -15, 24, 25, 24, -17, -1, 8, -6, 5, -1, -10, 23, -12, -14, -15, -19, 4, 20, -27, -10, -2, 15, 17, 7, 5, -8, 2, -13, 3, 6, 2, 25, -1, -7, 2, -6, 1, -4, 13, -3, -7, -17, -25, -24, -13, 1, 2, -2, 11, 3, 2, 15, -11, 7, -17, 39, -4, -21, 8, 3, -1, 1, 29, -25, -7, 9, -19, -15, -2, 11, 0, 10]
5180A0m2LK9J4qk7LJ5Qop%JNPopoRPJ7j7lOj2qQJ8mj2j2J2J9k8J8j2lJ1J8Lk9
5221hL4k9J9j5j0NjNk4kJK6J6j7Oj4K0l6K7j7NQj7K5Mj3j0K6j4Nj8K7rPl5J9K
5258bNJ0Jk9M1oj2k4J3Lk0J9mmPK2rqJNj5K5m6K1mJ8Okm0NJ7NK7plj3Jj5JJ7o
5299AJ8l8qK0J1J0jj7jqQjmJ8j6JNMjlkLoMK5j0Rmk4J9Pk2J6qK2l3K5opkj4J3
5341CNQlj6jJ0k3J2lK1k9QJ0KLj3MJ3pk5L5j6M0n0J7J8l1QlJ9k2nJ2rnoK5%Pk
5381A1jj5ROj0pK5k3pK6rrJ9j1k7K8J4k3J0PrKkqJ3LqK2ml0lLJ3j7J5k5L3mj7
5420a0J0j0PMk2K3jQqmLNQMqK2k6ROj7J3joJnmqJ9mLlk3N6m5LOroRJ3J7nj3Qj2
5465G%k2L3k2LNooK6lj7qk0M5k3Pnj2RK3k0M0mm1L6nj0j4rnK1RJ0j0j1j3M0k4
$$ y = [10, -32, -29, 0, 14, 6, -21, -18, -3, 5, -1, -8, -8, -7, -2, 5, -1, -8, -14, -5, 2, 19, 2, -1, 5, -7, -15, -7, 11, 7, -5, -17, -5, 14, -14, 4, -8, -11, 0, 18, 21, -8, 26, -3, 16, 1, -9, -4, -5, 0, -24, -26, -25, 1, 17, 0, 6, -8, 12, -24, 3, -14, -9, -1, -18, 7, 11, -2, -12, 14, 0, 5, -13, 14, 5, 12, -23, -4, -2, 3, 13, 14, -15, 26, 20, 8, -16, -3, 0, -20, -1, -5, -9, -2, 20, 11, 3, 4, 9, -6, 19, -27, -6, -10, 8, 14, 12, -28, -23, -6, -1, 26, 19, 16, 3, 4, -11, -10, 7, 1, 19, -19, -27, -7, 4, 14, 13, -4, -5, -13, -5, -6, -10, 8, -8, -7, -2, 2, 1, -2, -4, -1, -7, -3, 22, 12, 21, 17, -7, 12, 19, -3, 13, 5, 27, -6, 19, 13, 6, 4, -10, 3, 8, 16, 13, -3, -4, 6, -17, -5, -8, 13, -16, -8, 2, 4, 7, -6, -2, 11, 4, -21, 14, -2, 38, -12, 5, 23, -8, 0, -3, 16, -6, -11, 1, -8, -13, -19, 6, 6, 13, 11, 10, -5, 4, 10, 0, -7, 18, -5, -12, 14, 5, -4, 15, 4, -23, 5, 19, -4, 6, 13, 4, 6, 4, -4, 9, 12, 4, 26, 22, -8, -11, -8, 5, -12, 3, -22, 11, 7, -10, 0, -10, -3, 1, -21, 2, 1, 9, 1, -3, 0, 5, 13, 17, 9, 31, 5, 14, 20, 3, 16, 15, 9, 10, 5, 1, -7, 12, 8, 11, 8, -15, 41, -4, -1, 5, -4, -10, -1, 12, 29, 24, 11, 19, 7, 7, -15, 18, -4, -1, 4, -2, -8, 18, 15, -2, -10, -30, 15, -8, -1, -6, -18, -9, 14, -6, 34, 30, -11, 25, 20, 10, -4, -13, -18, 3, 12, 22, 12, 1, -12, 28, 4]
5503DMl5M6k9KJ5p%j7KL5l6K2j9j3K5j4PkJ2J2J2k0J2k9K6kj8k5L2Rk4K5j8Kk3
5539b7L6Mk9M6m4nL1k9J8Nj6j7K9j4LL6k2mjqK5m3L5qJkNk3L6j9%J7j9Rl2M4l0
5576a2M4j7j6k6NK1LpkJ5j2NnJNOk3NPl7K4K4mk1J8MPj9K6k1Pmj0K6k9lL6l0r
5615a8J8LPpj4J0QoJ7l5M2k2J1k7rL1j1jj%K3rk6J2NK2l3K3j4K7k5NPj7J8l6L9
5652A7m9N0Ok7Pj9k0K6qK3kJ1k7L1j7j3J0j3K1j0LjMJ9l6K0j5K6j3Pj7j3M7k6
5686Bk3K5K7l2Mj6K4j0jj8J9J8m3L0J0j9k0K7J2l0K0j2J5k0oMJJ2k0L1j3k1K8
5719EQj8Pl1K3PMkj2K1j1j4L2k5j%OJ1ONl7L0j2Nj2K2m6J6K1k1j9J3K8lKrJ4j0
5757Ck2RRmMj7K7Ql5J5NJ3k9K5K7k8k6J7J7l8K2j8L4j5Ok4K1nlj7L6k2l5N1k0
$$ y = [4, 8, -27, 19, -10, -8, 7, 0, 0, -17, -15, 20, -16, 6, -13, -26, -1, -15, -8, -10, 2, 14, 26, 6, 18, -11, 15, 13, -5, -30, 2, 11, -13, 12, -6, -4, -27, 9, 13, -16, 30, -14, -19, 12, -17, 1, 6, -10, -27, 2, -12, -9, 27, 5, 1, 0, -8, 17, -26, 9, 1, 2, 0, 5, -18, 18, -1, -1, 16, -3, 6, -26, 18, -12, 32, 15, -1, -27, -22, -1, 2, -5, -7, 8, -4, 1, -4, -3, 2, 8, -15, -10, -3, -40, -16, 8, 4, -17, 1, 5, 12, -7, 19, -2, 5, 1, -9, 17, -12, -15, 21, -9, -18, 0, 3, 10, 3, -11, -1, 7, 1, 18, -17, 25, 3, 14, -13, -22, 9, -2, -3, -4, -4, 19, 10, -16, -4, 1, 23, -10, 13, -1, 26, 1, 6, 13, -4, 14, -22, 17, -32, 18, 24, -3, 4, -15, -35, -9, -17, 6, 4, 15, -12, 19, 2, -11, -1, -14, 7, -3, 0, -1, 3, 22, -14, 6, -9, 17, 4, 11, -6, -19, 28, 2, -21, 4, 31, -1, 3, -13, 11, 1, 0, -18, 1, 19, -24, 6, 16, -3, -23, 4, 16, -14, 6, -6, 9, -11, -17, -13, -12, 0, -20, 11, -2, -23, 5, 13, -5, 2, -29, -6, 1, 5, 3, -9, 12, 1, -13, 19, -6, -7, -7, -1, 10, 16, 21, -16, 14, 2, 7, -5, 17, -29, -13, 8, -13, -32, -19, 9, 6, 8, -1, 13, 3, -19, -10, -1, -5, -1, -18, 9, 17, -18, -3, 2, 15, -14, 11, 38, 10, -16, 1, 18, -20, 2, -16, 18, 3, 9, -15, 6, 1, -2, -19, 17, -5, -40, 11, -9]
5792iJJ6J1j6QJRj6j4J6j0J7ll5N4m7J1K7j0j8M9l8k7J2lJ4RJl0L2k6PkL6n6M1
5828A2kOj8NPk7Jj4L2k8J3nJ9k0K8j3OoJ6j1lMk6K6j6K2k7J1J2j3K9j1m8M0j4
5863a3k2J4J9rJ4Km0K5J6pk8MJ0pJ3K8l5J4K1jk6j2K7k0PqMj4J6J5pj2K4Kj4J
5899Aj5L0ml6L2J9rj2k8J6J7j9J8J4qk3Oj6M5k0K5rk0rJ3r%J1k2K9k8J7Nl8L1
5934DPj4k5L8k0kOJ1j9kPJ6j4pL7k3j6L4m2OJ4J7l5K0J5JJ8l5J1KKk9L2Pl2J7
5970G%j7L2l4K4j4j9L2k4K4k1OLp%qK6Pj6K1J3l8J0P%oolJ3j7K3j6Nj6Mj3K4j
6008EJ1mk8Pj1J9J0Jk6J7k1J9j1ONpPkK0l1LJ5j8K2Kj1nK7j0k6J8lJ4j3j6J1j8
6045b2RL6k0J6n1N6k2mJk6J3Kj7M1mQj0nNJ6k6kjJ5lOLkJ1j4Knj4L3nj3l0M0j5
$$ y = [-9, -8, 8, 19, 3, 11, 12, 21, 5, -9, 7, -3, 14, 11, -24, 30, -17, -6, 21, 11, -7, 42, 4, -23, -11, -14, 0, 9, 10, -20, 12, -14, -7, -9, 27, -29, 12, 10, 16, -2, 3, 10, -17, -16, -30, 2, -26, -13, -18, 1, -19, 9, -4, 2, -4, 12, 1, -2, 2, -24, 2, -14, 8, -19, -8, 4, -9, 20, 9, -39, 1, -13, -35, -21, -2, -11, 3, 5, -35, -10, 6, -1, -29, -25, -15, -22, -9, 19, -16, -2, 19, 18, -8, -20, 7, -13, -6, -14, -10, -24, -8, 7, 0, -12, 12, 14, 0, 1, -14, 16, 12, -24, 8, 27, 18, 6, -22, -6, 11, -8, 10, 24, 16, -7, -1, -17, 28, 8, 33, 24, 4, -5, 8, -1, -1, 10, -12, 17, -11, 6, 11, -27, 4, 11, -3, -28, 10, -10, -12, -6, 5, -14, -16, -9, 7, -7, -14, 23, 0, -16, 18, -24, -18, -4, 13, -22, -2, 13, 14, 32, -3, 8, 10, 12, -17, 15, 22, -10, 7, 7, -10, 22, -12, 12, -2, -21, 11, -13, 11, -10, -4, -1, -8, -8, -16, 10, 17, 1, 22, 35, -3, 7, 14, 14, 8, 2, -1, 12, -5, 18, 2, 7, -9, -5, -18, 6, 5, 16, 12, -16, -9, -20, -1, 9, 10, -16, 1, -20, -1, -12, -6, -1, -8, -1, -3, 17, -14, -11, 4, -14, 8, 10, -1, -6, 21, 11, -15, 3, 0, 14, 1, -15, -4, -22, -13, 23, 3, 19, -32, 24, 2, -2, -1, -27, -14, -12, -29, 12, 8, 16, 6, 1, 6, 22, -4, -6, -7, 8, 5, 11, 14, 12, 23, 9, 11, 6, -8, 25, 20, 7, -23, 17, 2]
6084Bk0K8j0Lj7K6k7JJ2lJ5lj8J7j6K5m7K9Nk8K5%Kj5roL6Ql0J5oK9k5pK1k2J8
6121HNoj7L0j5j8KJ3Pl3J7jQmq%KJ0J8j5ojJ2j5j4J9j4K2pJ4k4J2jj6K3k2J0l
6159hQoj4L6qj1J9l1J2Qj7Qj4J0J5rmKMk8J9J9j8POOl8Nj0J2RJ9pmKLJ2j3Oj3
6199fK0Oj0jj6J4Kk4J3Rk0Mlj2KnL2j8K6l5J5J5k2ROPLk0MmJ9lj0MJNk5J4J6o
6239Fj7jL6m3L4rj3J5k0J4Lj4j0K2j2j6K2Lj3J8oj1J0j2pJ8j1K0j0MMJ0j1L%k3
6275a7L4Ol4jJ4l0J4QQolOQk7klJ2K5Kl0L0j5J8l2J3J5Nl1PMPPj1Mj0J8j3j0L0
6314B0Oj0Oj6%j5j7K4oMk5QkK1PJk1j0K8j3LJ4j3mJ4kqJ5j7%j6J1K4jk9L3J7n2
6352b1jN2l9L4l7J4rmkK0k9K7jRJ3m9K6mmL%k0M5j9qj4J8K9j9j7K2qjj0J1Kj9
$$ y = [2, -18, 10, 0, 3, -14, 12, -15, -14, -2, -5, 10, 7, -11, 6, -10, 15, -32, -3, 2, -26, -1, -1, 1, -14, -23, -29, 7, 15, -15, 0, -6, 23, -2, -9, 12, -10, 8, 13, 7, -10, 20, 5, -13, -11, 2, 9, -24, -7, -8, 0, -4, -12, -12, -10, 0, 18, 3, -3, -4, 8, -7, -21, -2, -16, 6, -1, 13, -11, 1, 0, -16, 7, -15, -5, -8, 0, -6, -20, 16, 8, -3, 16, -15, -3, 5, -12, -4, -18, -8, 7, -2, -6, -4, 0, -28, -9, 10, -8, -1, 5, 11, -27, -22, -32, -20, -11, 8, 1, -3, -1, 2, 14, 1, 7, -6, 14, 20, 10, 9, -7, 7, 9, -15, -2, 7, -13, -9, -12, -24, -22, -27, 5, -13, 13, -22, -7, 8, -14, -5, 1, 8, 11, -9, -5, -9, 10, 7, -3, 1, 2, 7, -18, -4, 12, 6, -11, -12, 24, -19, 15, 6, -7, 8, -12, 2, 5, -9, -19, 3, -9, -25, -3, 0, -13, 5, -1, -12, -2, -14, -21, -3, -14, 6, -4, 0, 4, 14, 3, 6, 6, -17, 17, 23, -11, -12, 2, -28, -14, -6, 2, -4, -7, -1, 7, -20, -22, -25, -13, 12, 14, -16, 14, -1, 17, -15, -2, 13, 18, -13, -6, -2, 5, 12, 1, 5, -5, 13, 0, -10, 20, 26, 16, 22, 6, 6, -9, -26, -2, -8, -4, -29, -21, -23, -2, 5, 6, -15, -25, 3, -10, -7, 7, -6, -10, 4, 2, -6, 9, -8, -8, -24, -13, 11, 10, -19, 14, 31, -21, -22, 30, -9, 25, -12, 2, -7, -11, -13, 7, -22, 5, 4, 13, 26, -23, 3, -1, -5, -2, -2, -22, 23, 4, -4, -18, 0, 29, 10, -7, 15, 7, 6, -4, 7, 9, -10]
6389a0L1m2J8j8J2K4j5K1k4J6Jj0j7MRLl2L0j7K4j6Lj3KJ7j3J0J8%k9Ok4L3K7
6423B9m1J3J3Nj7K4mj8J9j3kkpL1n1JK3Oj7npK3J1l0K7k8L4l8N0j7%J1k8NJ2M
6459A6k5J0mJ5K1ok7J3%nqopnK9J4Km1NrK9kLj1lK5k7LoJ5NLJ4l9J7j1j9J5LJ6
6499A2pJ3j8J6j7moJ8lj9J7Ok9K5K9j3oj3j3J7MPm4L0lOj5J0j1KJ6Qj1qKOK2k1
6537Ek8ooK8OOJ4pRj2J6rj1Ok4j0J6nJ6oK6m6NJ1K2Pk9j4K6jNrj4J1njj2L8j9
6576ak0K5j3L3k7O%JJ0j0j8J4%nJ5OqJjk0qL5J5Oqk6nNJ4j1Pk3qK7j0jJ9l3K0
6615COj5jKOnJ9k6OjOL0m1RJ6j2oJ7%j8K0j6nL2k9J4rj3J6jKk1kK0Pk4nK9nk0
6655a5J5nK0j3QNk4K5l5L7J1k1Jr%%%j5J9l4K1L1j3l0MJ5j6J8j3llK8j4pk0K9
$$ y = [-10, 21, -21, -3, -21, -9, 15, 0, 21, -3, 13, 14, 4, -13, -9, 0, 3, -29, 1, -16, 8, -8, -5, -18, -16, 1, -12, -2, 16, 16, -13, -7, -31, 2, 29, -12, 1, 14, 19, 2, 26, 22, 4, 23, 10, 8, 6, -1, 30, -21, -20, 3, 9, -8, -13, -20, 3, 14, -16, 11, -17, 17, -21, 29, 12, 12, 23, -5, 0, 12, 16, -9, 1, -3, 12, 33, 27, 0, 13, 13, 8, 0, -6, -13, -18, 11, 25, 27, -14, -9, -18, 11, 9, 12, 1, -2, 23, -4, -1, -7, 8, 13, 16, 30, -9, 8, -3, -22, -7, -4, 12, 5, 18, 0, 16, -1, -5, -11, 7, 4, -15, 2, 8, -21, 4, 33, 20, 14, 1, -12, 5, 9, 16, -28, 2, -1, 5, -10, 0, -11, -9, 7, 15, 4, -4, -2, 4, 26, 5, -23, -29, -35, -7, -1, 5, 19, 12, 21, 9, 25, 16, 5, 11, -13, -23, -7, -12, 4, -2, 24, -22, -17, -6, 16, 23, -6, -20, 6, 5, 10, 1, -13, -2, -7, -8, -20, 18, -1, -21, 4, -9, 24, -3, 3, 3, 4, 14, 4, -14, 0, 0, -5, 10, 16, 8, 9, 8, -12, -20, 15, 30, 36, 28, 2, -3, 2, 16, 5, 12, -11, -19, 8, -2, -3, 16, -17, 3, 9, -6, -7, -5, 1, -4, 15, -11, -5, -6, 0, 30, -11, -2, 14, 2, -4, 13, 13, -5, 15, -1, -6, 26, -3, 11, 2, -11, 5, 4, 6, -15, -17, 3, 10, -14, -19, 10, 5, -15, 0, -5, 15, 2, 10, 15, -9, 16, -19, 18, 29, 8, 9, 0, 0, 0, 0, -15, 4, -30, -9, 22, 9, -21, -17, -2, -18, 0, -13, -16, -19, 9, -5, -12, -32, -3]
6691coj1J7J5k8J5j9K7Mj5K9k2rL1m8M8ok3MPKk2K6k2J0J9j6kJ0k8K3k1%Ol6N3
6727Ij3j5J6nL0l7J1NJ7k4POj0LK8j4KmqOKk1K6j7j5MlK3l6K0kj7L7j5J3oj3J4
6765Dk6K3j4j5L9j8L0j9qjj1oJ6LjJj7O4n6K9j8J3k1K8j5k1L5jj6J2k2J2lJ2M
6800A6Kk1KK4l5k2N0k6KoJ3J3nNrL3k9j4J6j2mLK9n1J9K7j1k5K4Jj0j5J1m0K8
6835a7J5j1L7j1k2L3l2%J2k6JOPrJ9j4J7j4K2k4K0k9K5j1PmJ0k0PJ8rpK9l9L1
6870A7%rRj6J6jj8J1j5mJK4l1L0j3klj6mJ2J6L0m7K5J1j4lrpJ6pOJ5qj3J9k9J3
6908BplNJ5k6NMRoMl8J5kJ0K5rj2LR%k5J5L9k6Kk3qJ8J2kj7J3j0L6j6j7PK2k3
6947@j8J4j1lJ6J5J6k7lJ7j7lj0Oj4MQoK5j2K3jl0J6LK6k8J3k0J1rKJ0mk4OJ4
$$ y = [-3, -9, -20, -3, 12, -16, -1, -20, 7, 11, -4, 25, 3, -6, 25, -23, 25, 19, -4, 0, 7, 9, -13, 13, -9, 1, 20, 4, 2, 12, -16, 7, -14, -14, -8, -44, 9, -4, -19, -3, -8, 22, -15, -4, 1, 18, -6, 1, 7, -3, 0, 28, 14, 16, 12, 4, 10, 12, -9, 17, 0, -15, -11, -14, 9, -27, -7, -9, -26, 11, -4, 9, 3, -10, 4, -22, 1, -13, -28, 11, -7, 23, 4, -4, -5, -16, -22, -6, -3, -4, -3, -20, 44, -12, 17, -1, 12, -9, 19, 4, -17, 18, 17, 1, 13, -9, 3, 0, 12, 16, 18, -3, -1, 23, -12, -34, 16, -10, -8, -14, -1, 12, 7, 12, 3, 36, 7, -7, 9, -3, -7, -4, 25, -26, -7, 20, 9, -16, 8, 9, -1, -16, -5, -45, -17, -2, -13, 24, 13, -9, 24, -8, -8, 4, -22, -21, -15, -8, -17, 2, -12, 5, -9, 13, -11, 9, -20, 5, -6, 1, -3, 7, -13, -6, 12, 3, -4, 25, -14, 17, 17, 8, 17, 1, 17, 16, -2, 9, -6, -10, -9, 15, -16, 14, 1, -1, -4, -20, -24, -12, 4, 34, -13, 12, 23, 9, 6, -3, -10, 6, -1, 5, 20, 12, -1, 18, -11, 2, -5, -8, -3, 12, -14, -9, -5, 4, -2, 2, -36, -21, -23, -13, 12, 3, -9, -6, 3, 3, -22, -7, 32, 6, 8, -15, -23, -5, 7, 5, -12, 1, -9, 27, 11, -6, 1, 23, 0, -18, -4, -15, -18, -2, 13, 29, 2, -1, 16, -1, -4, -14, -8, -22, -18, -10, -16, 9, -3, 20, 19, -11, 5, 8, 34, 6, 19, -1, 10, 1, 3, 13, 9, -15, -9, 5]
6984EK7m0pJ9j1J3Lj8QOQj7j1K2J1n1L3pPm3O2lOpl4L0k4L2l3lRKk1K6OJ4j1j
7022GqK4k8qmjL4k8J9pj7JJ8j6LJ7qj3K6j9KOj8L3j0J6m0j3K3M2l1k0M0j2Rj9
7058@qmPJ2pl0K7L0Kk9nj6K5MMl3J5K6m1M0k0Oj4j5K6j2Ml3L1Kj4K0JL5m4J7o
7095Cj5JJ0p%J6qjnK7Jk5rlRL5m1RKqK4k0%j7MJ1OmJ1pJJj6L2j7J3j6Rj3J2k2
7136a7K1nl%kKOJ5j2K1Jk9mPK1k8KLj3J0%NpJ3j4k5Rj7L3JJ8J4k2RJ4l0rKL2m6
7176b4K2qM0m1J3kmjJ8pj4KQlj2rK3J9j4k5%NJ9j5J9j3%L7m0J0pJ6qJ9l9M7l0
7213Aj2LJK4l5K0rJ1Lnmj0J9Kk0j2L7KQl9L4m4J3L2k0lknKRKj6L3n2L5k2lL8k6
7252a0K9jqqJ2j1mQMPj5MJj5J0j3oM5k6Nk1l4M3mj2J5L6m0mkNJ3l0K7J6k0j0L2
$$ y = [5, 32, -8, -15, 4, -7, 6, 9, -9, -1, 5, 13, -4, -15, 7, 18, -33, 0, -7, 0, -43, 19, 16, 22, 15, -19, 11, -13, 19, -14, -17, -8, -6, -27, -1, 5, 19, 8, 7, -1, 23, -5, -13, -17, -18, 16, -12, 7, 0, -17, -16, 2, -14, -11, 6, -2, -15, 11, -8, -6, 0, -18, 15, 5, 21, -19, -32, -9, 33, 2, -18, 22, 10, 19, 0, -8, -12, -5, 7, 0, -30, -3, 27, 29, 0, -5, -21, 4, 8, 12, -21, -6, 20, -21, 19, -1, 5, -9, -24, 2, -10, -6, -39, -8, -6, -20, 0, 1, 36, -8, 9, 3, -12, -11, -1, -8, -8, 8, 0, -1, -6, 21, 22, -3, -12, -15, -6, 29, -12, -3, -1, -9, 15, -5, -5, -22, -18, -7, -1, -5, 6, -1, 0, 1, -15, 17, 0, 13, -3, 6, -7, 5, -17, 4, -1, -4, -4, -6, -4, 2, 17, 5, 26, 27, -2, -6, 1, 22, -6, -4, -1, -14, -4, -4, 1, -6, 7, -7, -32, -23, -40, -7, -6, 12, 26, 4, 13, 27, -3, -12, -10, 22, -24, -2, -10, 30, -11, 2, 0, -4, -5, 13, 6, -8, -6, 2, -1, -13, -22, 1, 20, 6, -19, -19, -14, 5, -10, 9, -4, -4, 33, -7, 3, -4, 12, 4, 23, -16, 31, 1, -11, -8, -7, 17, -18, 2, -7, 4, 7, 2, -2, -12, 7, 9, -11, -23, 14, 16, 24, -15, 19, -25, -12, 20, 0, -3, -5, -10, -8, 1, 3, -13, 20, -32, 3, -19, -22, 16, -10, 19, 18, 10, 2, 14, 3, -1, 7, 11, 18, 3, 7, 8, -7, 3, -10, -16, 29, 3, 8, -13, -47, -4, -8, -20, -5, 31, -9, -13, -15, -10, 3, -27, 0, 16, -4, -14, 18]
7290A8k2NL9k6j2JjK4l1Ll7L7L3k0j6k%mJ9j1Qj8PJ3rJ3j7k1K9lK8k6JqJ1K2k8
7327aLj2J5Kj7K4j2J5j1J5j2J2k6Qk5L0j3K4j2k2J1oj4K1%K5j7j6kL9j8j4J5j4
7361eL0j2j4j2J2K0k2mnM1m0J8k5J5LoqK9j7oj2j4N0j5MJ9k6QlNjj7KlOqQPj3
7400a1Mj3LJ9mlJ2l8K4j4K9Nj5j9L3j1j2lL0rj4nj3J5L2j6k2J5kQqRj7J2lj0J0
7437bJ4l1oL0nqmJ7qLmJk6L0Pk0KL9l0K1Kk7j4K6k7JK6OOnl3OJ4Mmj4LJ4k5J5
7477froL0j4K1qLk0j8N2k7j1J7j6N%J4pj6K9qj3j3lL3k5Mj8K8%k5NK7k2J0lNK0
7515A5j8J3k1kL9m3J7qJ5nJj2JQJ1lMk4NqJ5Oj1nJ0j2j2J9j8L8Kk4j9N1k5lMj8
7553a7L8j8j0J7rmMj6K2j0J0m%JQpk5L1KNOm1nK9Jk5K3qQjkj4J5nJ9Qj9j7J2k3
$$ y = [18, -4, 1, 40, 14, 2, 3, 2, 26, -5, -2, -39, -2, 31, 11, -5, -7, -7, -11, 8, -3, 5, -13, -6, 7, -2, 11, -6, -27, 2, -1, 27, 1, 2, -6, 5, 27, -1, 2, -10, 5, 7, -10, 14, 2, 17, 6, 21, 9, 21, -5, 3, -22, 8, -5, 19, 7, -15, -4, -10, -24, -3, -3, 22, 5, -11, -13, 26, 8, -6, 9, -5, 25, 13, -1, -13, -1, 19, -3, -7, -12, 29, -11, 7, -18, -3, 0, -6, -14, 15, -2, -8, -20, -34, 16, 1, 5, 24, -2, 6, 3, 8, 7, -10, -8, -11, -5, -13, -5, 2, -11, -7, -20, -17, 2, -2, -5, 7, -31, -7, -21, 8, 13, -2, -21, 12, 1, -11, -14, 16, 7, -7, -12, -25, -10, 22, 6, -16, -1, -3, 5, -3, 6, -11, 1, -2, -12, -2, 12, -19, -25, 5, 0, -8, -12, 5, -3, 0, -4, -3, -29, 1, 8, -12, -10, 29, -1, 20, 22, -5, -19, 7, -20, -19, 7, 13, 19, 14, -19, -13, 1, 5, 1, -13, -10, 4, -21, -6, -15, -21, 9, -5, 16, 8, 11, -9, -27, 25, -2, -13, 4, -12, -7, -7, 7, 0, -16, 13, 5, -8, -21, -24, 9, -16, -12, -30, -2, -2, -27, -22, 5, -17, -7, -10, -5, 15, -3, 10, -11, -13, 26, -17, 0, -8, 7, 2, 3, -9, -8, 0, 11, 8, 12, -12, -7, -15, 0, 6, -5, -10, 0, -12, -24, -5, -23, 15, 17, -7, -26, 25, 0, -3, 1, -17, 21, 3, -7, 10, 1, -3, 1, -15, 7, -3, 7, 3, 3, 4, 12, 5, -20, 11, 13, 18, 24, -17, -22, 7, 8, -17, 6, -2, 6, 5, 3, -11, 4, -1, 18, 26, 7, -10, 2, -21]
7593b1K5qrPJ1j6J6j7K0jk3K3Jk7o%K5%j7K8j7J4NJ4k0jk3j3K5J0k5K8j4mK1k8
7629a7L5m0J7nJ6j2j5L2j3J3Rk3nK2rQmpMqJ7Qk5NJjK1l6MJj0RKK5l0L0l4pJ4
7668hKJ3j0Nqk2M8qj2l0L0mnRoJJ7jk5K0J7k4%j8J2JlkK9rLoJ0m1J6nQRK1n2M1
7709A3oQm0LK7j3K5k2K2k4QjJ7j6l3M6Qm9L6k3NJ1k1lL1k4K3k5J7j9j4M2l0k3
7743d4K8j7J0L8pk4K%K0j7lLL8l9RJ9k4k2L5J1j8M2l6JjqMK0k2J1Jk1J1%LQj9
7780hJ6j7J0Pl0K3nk0L9l6j1K3kJ2qKjJ0qNJ4mjj5K3%l3J2JJ1mqj0RJ1k0mK2j6
7819a1RrK4k0J0OMl3K8nl8K8J0Kj0J6mk0PK3k3Pk5L1Qk3RQj5K2J1k3j8K4Jokk
7857AnJ3l6K1L0j9pJ8n1L1l%l2J9QJ4j1j4L7mK2k3jkjpj1mMJ5mj3K3J3rj6oJ0
$$ y = [-21, 4, -4, -13, -6, 5, -11, 5, -12, 8, 7, -16, 7, 8, -19, -25, -25, 0, 0, -17, 11, -6, 8, 13, 27, 7, 6, -17, -30, -5, 5, -20, 8, -6, -10, 11, -17, 18, -22, -5, -10, 6, -6, -21, 11, -2, 11, 20, -3, -8, 14, 5, 13, 9, 2, 6, -2, 15, 23, -2, 3, 4, 3, 24, -12, -8, -7, -17, -8, -6, 19, -11, 19, -15, -22, -8, -6, 7, -3, 2, -6, -28, 20, 12, 0, -30, 0, -4, -9, 0, -6, -5, 12, 11, -14, 6, 23, -1, -1, -19, -7, -6, -9, -11, 18, 9, 12, 6, 16, -25, -9, -14, -6, 3, 24, -28, 13, 7, 15, -25, -22, 5, -8, 17, -5, 17, -7, 1, 0, 17, 1, -32, 14, 22, -27, 9, -14, -9, 2, -19, -22, 9, -15, 8, -17, 0, -19, -33, 9, -21, -44, -16, -33, -23, 15, 8, -16, -14, -14, 6, -11, -14, -11, 27, -12, -3, 16, -8, -30, 5, 16, -2, 40, 4, 5, 4, -4, 0, 20, -2, 9, 10, -11, 0, 0, 3, 11, -8, 8, -9, 1, 8, -22, 1, -4, -24, 15, -21, -32, -9, -11, 1, -7, -5, -6, 4, -4, 1, 15, 11, 10, -5, 18, 18, -15, -3, -2, 9, 5, -3, -13, -4, 7, -13, -17, 5, -11, -2, -11, 13, -7, 3, 9, 13, -20, 8, 3, -35, -7, 3, 5, -5, 11, 7, -13, -6, 17, -6, 1, -24, 7, 15, -8, 1, 9, -6, 16, 27, 4, -14, 10, 11, 5, 3, 1, -4, 9, -27, -6, 24, 5, -2, 16, -35, -4, -7, -7, -39, -20, -12, 2, -9, -23, 14, 10, 32, 9, 8, 6, 5, -2, -13, -17, -13, 2, -2, -15, 8, 21, 12, -4, -10, 0]
7895@j2Oj6K5rK9l6K6j8lMpJ3j1L0k5j9J3Oj2K5J3k4J0Rl1qK3pK1k8K0m%jj4M3
7932C1l9k0N7l8JK1k8NL6l3K0qJrNJ5k1J2j0Mk6L2j9JK3nk4J0J4oJ2mLLj9kkK8
7970B1m2J3MJ8%j1OJ2k9J3k7J1J1Loj0J8j1l%J4jj7kRj2K9qPj7K5k5MPoK6k5m
8008eM8m9kJ6pRj8J3j2K0qpNk1MRJ3rmk0MK8oJ8oj7J9kj7pL9j3k3LPPj4j2L2j0
8048EqJ1k2K8j9j4J7KJoJ0qjrLJ9k4K4j9K3Lj3Jk4K5Qqj5OLJ9j1K2oj5mpL1j2
8087A6rmJ0Kj2J6j1J5j0kl0K6K4l2Qk3RJ6j4LrJ5J8m0J3KjJJ2j4Jk2J2mJ2%K0
8124A4J4rm4K5lmPQJ5o1M4k3J7mkj0J2Nm3N5J7l3j3RK1qNJk3%K5j7k1K2Mpjj2
8162a8L0k1J2J9l2L3l4J5J8J4m8K9Pj0qk8J9j8Q%ljL0l2J1OmOJ8
$$ y = [0, -12, -6, -22, 3, -6, 23, -13, 13, -5, -8, -4, -11, 2, -9, 21, -4, -23, -10, -4, -16, 9, 22, -2, 8, 17, -14, -22, 1, -6, 15, -13, 7, 3, 3, 2, -12, 31, -8, -28, 29, -9, -8, 13, -15, -10, 26, -7, 13, 5, 6, -3, 2, 17, -4, 8, -2, 2, -24, 8, -11, -10, 13, 8, -16, -6, 8, 2, 14, 10, 13, 16, -3, -5, -7, 21, -21, -8, -4, 14, 14, 3, 9, 21, -8, 5, -22, -11, 0, 3, -3, -13, 5, -6, -9, -9, 5, 4, -13, -15, -6, -18, 11, 3, 10, -7, 18, -7, -3, 4, -2, 24, -1, -5, 43, -6, -8, 8, 1, 10, -8, 5, -7, 13, 5, -2, 3, -18, -14, -5, 8, -1, -5, -25, -21, 7, 1, 19, 13, -4, 15, 13, -4, -11, 28, 15, -8, -5, 2, 9, -5, -17, 15, 5, -3, 8, -14, 14, -5, -19, -2, 0, 1, -5, 5, -3, -4, -13, -10, 9, -15, 9, -10, 13, 16, 3, 4, -20, 5, 13, 5, -10, -4, -1, 18, 7, 29, 23, 8, 4, -3, 28, 16, 7, 3, 13, 15, 3, 19, 8, 23, 13, 11, -19, 7, 31, -1, 7, -16, -7, 9, -5, -2, -11, 4, 22, -18, -5, -3, -4, -3, 9, -5, -4, -26, -14, -18, -6, -6, 14, 28, 19, -25, 0, -3, -7, 0, 8, 23, -38, 6, -17, 0, -4, -6, -16, -4, 1, -42, 13, 30, -3, -16, -7, 14, 6, 11, 12, -11, -11, 14, -3, -24, -2, 2, -5, -6, -18, 12, -9, 3, 22, -10, 23, -11, 4, 22, 36, -12, 17, 24, 14, 6, -22, -3, -21, -13, -13, -16, -17, 13, -19, -8, -2, -6, 0, 18]
8191A8
$$ Imaginary data points
##PAGE= N=2
##DATA TABLE= (X++(I..I)), XYDATA
0@%%%%%%%%%%%%%Qj6J6j6J6k4L2l2M0m8N6o5P3q8J04j20J36j53J77k02K26k56
35a36K88l24L64m05M50n02N58o18O85p58Q37r24J019j122J237j363J500j653J825
54I58k017K232k480K765l094L485l954M529n259O211p508R387j2355J7731l0285
69a9654J07182L6162k90751J69173J06216j76437M8793R5881j16475O097O0928
80B7115k288j2356o1380K2795J10712q9422o8115J14531j9820o8249P9634j6260
92A6897o3552N1204K1343j9808j3524l3189N7896L6162r6029J3804P5037o3358
104a7117r77N9569o0861j5380O4194j3112k5627p779M406M6108k4925m6116N3305
117A5688o353l6116O0845k8741n6867Q1299o150o0685O2559k5848m7746J02408
$$ y = [0, 0, 0, 0, 0, 0, 0, 0, 0, 0, 0, 0, 0, 0, 8, -8, 8, -8, 8, -16, 16, -16, 24, -24, 32, -33, 40, -48, 56, -64, 72, -81, 96, -106, 120, -136, 152, -172, 192, -213, 237, -265, 293, -325, 360, -398, 439, -485, 534, -588, 649, -714, 786, -867, 958, -1059, 1173, -1307, 1458, -1636, 1849, -2105, 2424, -2835, 3376, -4132, 5255, -7100, 10631, -19654, 87528, 123690, -167061, 2112, 108328, -68109, -19316, 76565, -39910, -33813, 27115, 24827, 12471, -48909, -26114, 84598, -4824, -72939, 41592, 21772, -46477, 33157, 16897, -46655, 4549, 25892, 6084, -7440, -40629, 17267, 53429, -42600, -28796, 46241, -17117, -18094, 41475, -19386, -34766, 29428, 16316, -9311, -17090, -12684, 33424, 8499, -37617, 15688, 9335, -26781, 34064, 5323, -51544, 29755, 23605, -37080, 25479, -369, -48115, 54293]
129E4293l2158r8313J02861J8025r7957O5684K3491q6151N1542M4544o7170Q60
141b0449K9233k938P465k7243k163M0099k9942p123M2185m6127j1705O9797l4084
154G005m2717M8913n013j8429K6988k3976r739L5087j6455p466J5308k5522J4051
167a965K9250l8731n052L0629j5707J149R971k3049R971J5514j3893M934r658
180f637p052L6525j7792l3236M2993n412l5472M7370p249n5230N1620K3483o0610
193b6699J6758L0679l1307P389J6672k1739J173J0449J974J848k1486M952L1749
206B2412k3748j6491L0636j2886j2764K9320j5093j9697K6202j469j0619R224
218E027j4545M971K3426k4313q235K6037j3742o574K1472j6075j1206K2150r36
$$ y = [54293, 22135, -76178, 26683, 44708, -53249, 12435, 35926, -50225, 1317, 45861, -21309, -20449, 8784, 5846, 13311, -13932, -16095, 24004, -5938, -13061, 29124, -17003, -28708, 41089, 7005, -35712, 13201, 8188, -10241, 16747, -7229, -16968, 18119, 1664, -5802, 9506, -16016, -1965, 27285, -11446, -16498, 14131, -1576, -427, 9544, -13505, -3534, 11980, -1913, 3021, -6637, -13689, 22836, 5044, -28192, 14801, 9389, -26083, 21287, 14038, -41192, 10428, 33911, -26699, -9941, 20738, -10569, -3180, 13492, -8247, -7074, 3375, 5349, 7197, -14289, -9337, 22412, -1336, -17827, 12809, -77, -12841, 16479, 1386, -18311, 7891, 6422, -4197, 5027, -9518, -4547, 18879, -5434, -13669, 12368, -1374, -7948, 13524, -2551, -13757, 8393, 7457]
231G457j0904l14m58J1421j081j6269J1663M385j5006J5635K820k5176J4856J5885
245A4914k0666K089P953j0754J1097L056j8180R613P911j2013P965Q23j4406J2225
259A627Q090j4111J63M870k79L977o273l027Q737n251Q0Q963j3974j932K0315
274A1975r956j2839J4900j959p413J1077m908q981J0634J626n638J315l274L136
288c05O284p879j773N889l526K399L072r128K391P776n339n46J213m719O734L054
304E597j0628K946O104n949L009K290q667M024P284o490k120K701o09K994r92
319A494m676L018J445j377K578l727k800P214k77n561K407Q5o71M249l487m008
335d094N413N22k760J984k490j055N637j594m487K382Q60m0J450l109j206L927
$$ y = [7457, -3447, -3761, -4219, 7202, 6121, -10148, 1515, 5900, -9106, 6529, 9349, -15827, -971, 14914, -5752, -3663, 4290, -6464, 4633, 7689, -10491, -878, 7033, -4980, 2985, 3808, -10598, 1627, 9717, -4394, -4231, 639, 360, 4337, -1936, -4963, 3774, -1477, -1397, 7566, -6408, -8340, 11975, 2019, -10820, 4080, 2121, -5292, 5785, 877, -8104, 2530, 4156, -1482, -167, -3441, -305, 5979, -1900, -3673, 2216, -1310, 1089, 4161, -4967, -2576, 5200, -139, -685, 528, -4191, 2543, 5597, -5031, -2085, 4019, -1930, 1079, 3369, -5298, -1274, 6010, -480, -2600, 101, -508, 2486, 1494, -3182, -164, 1281, -96, 2482, -1245, -4045, 3169, 2892, -2669, -262, -177, -848, 3401, -86, -4094, 1319, 1841, -919, 1065, -1425, -2480, 3157, 1563, -2924, -542, 318, 278, 1728, -1381, -2587, 1340]
351A340R9j892m18o40K019J226k567m6N04p08L233n84n711L204N090m746j985
368b582M000j404j513L344m25m079J032M739r42n406J498N161k867k744L639r38
384E13k784L941R06m710M57L385Qj780j686J140L037j791k632K621K23k284K470
401A034Q43m080O59L941j105k833JK067J484k214k214L137J177m059J738L695
417C271n367j686Q131j580q660M724O791o392l750O493P64n805J349N558l097
432G44o319N788O750r539n148J3202K08j4121O923J0439j2947k957J5063n440
446B646j2012J0775O099j1155q42Q036j477m327R99L144k94m552K052O222o305
461i91n200J0720N70j1606N324P650q722r30P555m677k841N757j755k513K805
$$ y = [1340, 1439, -453, -871, -1511, 508, 1734, -833, -879, -375, -1083, 2150, 1566, -4145, -941, 4149, -597, -2582, 1418, 14, -1499, 1845, 1420, -2659, -1627, 3112, 2170, -3236, -1738, 3423, 556, -2188, 1451, 513, -2271, 1670, 2576, -2134, -1677, 1708, 1716, -64, -1750, -610, 2427, 636, -1996, 625, 848, -1436, 1034, 1877, -2203, -1544, 2397, 1292, -1541, -1540, 527, 2011, -203, -2417, 720, 1897, -2162, -424, 3271, -2096, -3782, 4349, 2769, -5891, -1167, 5624, -768, -4518, 1975, 2739, -3066, -1717, 3841, 744, -5575, 213, 6963, -2576, -7724, 5478, 5686, -8435, -1512, 8927, -4020, -6977, 8086, 2646, -9366, 1409, 7508, -3647, -4489, 3547, 2070, -2257, -1258, 1886, 1592, -2960, -908, 5314, -991, -6191, 4529, 5099, -6507, -1183, 6467, -2255, -3185, 4370, -307, -3148, 2609, 854, -1659, 1146]
476A146k117L75M251n325k299Q112k247o843N897K478o498J937M051l466j442
491a990J796J453N65m717k40Q820m412r545J1318M359j5843N523J4114j5135n682
506i616J8913m931j4944J1909O399j2123R64P482l185l244J175L313N43p182K038
521b489J0147q557p804J4372r8j4581R043Q162j3490R07J1459p170n485P966K02
536B584m604J444R82J21J36j996J518J779l577P41L983l707k029N085j119l628
552b287L394j2l109L796j77n201M763K569p736L163O296q738o13J0393o575o679
568f753J0514k4r071N016M086n760L26K953q89p36j627K131L275o094j038Q794
584E103m327o930Q918J223r235M663N509p126q29N818j504l253J190K167k61k696
$$ y = [1146, -971, -596, 3655, -1670, -3969, 4143, 1896, -4947, 950, 3428, -3070, -1133, 2918, -548, -1990, -194, 1259, 1824, -2893, -3133, 5687, 1275, -8270, 3048, 7407, -8436, -2913, 11201, -3934, -9616, 9297, 4366, -10578, 1331, 7730, -4393, -3429, 4053, 868, -2376, -1201, 2112, 2655, -4527, -2489, 7658, -899, -8703, 5669, 5571, -9010, 33, 8195, -5295, -4388, 7071, -99, -5584, 2382, 2584, -2020, -576, 406, 527, 663, -1333, 185, 1964, -1613, -872, 3111, -596, -2625, 2460, 1341, -2287, 1107, 1095, -2014, 1782, 1605, -3596, 1167, 3736, -4000, -837, 5459, -3279, -3892, 6501, -74, -6753, 3761, 3737, -5334, -318, 3768, -1992, -1666, 1287, 398, -338, -1965, 166, 3441, -2653, -3691, 5103, 776, -6154, 2764, 3987, -5248, -585, 4924, -2202, -3031, 2787, 1283, -1970, -780, 1387, 1126, -1570]
600a570P31L245k657k130M295k82m309K522K839l451r72L039m50k084J278J062
616A106j905L39J792j717n42K168j494p75K810k036j864M161q72l898L436J377
632B086l886J442K200k519k36J678j60p60q01J129J529k725m44L517j914k342
648b206L557k06l240K155J393k171r7R63L24l29j268J077J342k482K49K733k225
665d31j467L239n19k567J699J140j561k13J025Q8r43O1J370q14j395J933L45k145
683a155J141J016j694O07Q94j370M87P38j009M80K39r22R13K83j293O79O26r71
701c11K88M49o00J26K30l5J9o17N34P98j464K8J649j349o58J991r40j378J940
720G00J6j679Q62O55q18N4K59l1n9k98M62K22r78L85R34r74k93R21k68m25L54
$$ y = [-1570, -839, 2406, -251, -2381, 1914, 1632, -2677, -155, 2684, -767, -1739, 1300, 850, -1234, 44, 1106, -799, -460, 1332, -385, -927, 1241, -253, -1028, 1782, -254, -2118, 2043, 1171, -2727, 709, 2086, -1800, -358, 1842, -677, -913, 765, 605, -155, -956, 173, 1702, -1023, -1467, 2050, 136, -2206, 1351, 1145, -2095, 60, 1453, -718, -815, 148, 472, 143, -1125, -48, 1294, -1188, -939, 1794, -431, -1898, 1341, 822, -1745, -46, 1094, -467, -680, 345, 433, -510, -449, 921, 107, -1288, 645, 990, -1155, -14, 1002, -692, -85, 809, -561, -74, 664, -345, 135, 374, -548, 365, 648, -645, 34, 660, -311, -23, 426, -174, -48, 182, 147, 166, -451, 83, 881, -583, -555, 1094, -255, -913, 1078, 138, -1240, 700, 716, -963, -101, 554, -264, -210, 49, 18, -41, -339, 123, 345, -633, -248, 686, -288, -581, 340, 72, -353, 1]
741Ak5K8j79q2O90m72p28J202P7j405R01P30j349L83R14r66q7Q16l70l24K82P2
763A09N5k30NL46l64j01O76n59l53R62m14n79Q86l21n41Q54k05p09P58Jn01M09
785A84r3l06M10q1k47K44k16J21K26n25K07M16o83K85N07r52K96Q51r96r3R42
806D97n93l32O73l14r9J86j84L41j66n90Q45J72j243P44P57j222J26R86o49m30
826d95O08J91l49m23N02O54j161j36J528q81j027J620j26j341R48M74q33J57J30
845D0N5K73p75K41J033j187l15J577q08r56J372j00r11N16P1RO5o56N86O03j352
866f19K44J359j215n64J429k09j035L22P84j33j109M04J434j398r28K277n14k056
884a527J832P35j972N90R13o41%l33L49R68j749K0K520k082j352L395j121k546
$$ y = [1, -24, 4, -175, -257, 433, -39, -767, 435, 512, -893, 8, 738, -611, -228, 686, -280, -367, 449, 79, -245, 37, 109, 164, -66, -61, 285, -79, -180, 496, -63, -416, 546, 132, -447, 439, 118, -423, 431, 226, -483, 275, 276, -225, 184, 91, -215, 195, 114, -133, 111, -105, 16, 242, -283, -76, 340, -343, -58, 449, -503, -207, 644, -352, -445, 497, -96, -428, 245, -69, -168, 18, -166, 175, 9, -581, 264, 436, -807, -63, 694, -528, -402, 584, -65, -495, 113, 304, -45, -468, 34, 688, -473, -609, 919, 38, -989, 631, 505, -836, 112, 586, -247, -90, 40, 95, 368, -407, -166, 867, -320, -635, 942, 134, -822, 550, 450, -461, 55, 126, 135, 200, -456, 130, 733, -619, -375, 984, -231, -795, 634, 425, -610, -288, 496, 363, -746, -342, 1092, -306, -1234, 1043, 529, -1527, 305, 1040, -932, -342, 571, -70, -70, -403, -54, 914, -835, -815, 1705, -377, -1729, 1666, 545, -2001]
902b001K899J39k509J749M40j550J182j87q18J482r00r60K153q84j542K106j42
919F57j780J462K33j200P86R0n94O57k65m35Q12j81p14M89N31n75n77R01O01j710
939h12K89K073j881j084K882r65k162K404J39j973J349P6q27J155j199j39K230
956A555k372p14L800k477k285M507j244l444L795J68l341K479N27k211J710j78
972B75j281J976j055j266K704j133j984K945m61k364K254L02k035J337M50j253
988e89P15J51n57M89r9k94L05o2L1k39m3P71p74m70J632q93j258K098l73j867
1008a326J920L7j627J464j97r94J538r52p91K350j672j253L303j565k285L557
1024A507p03k806K926P7k464J976R2j555J628o71q61J999j422r11K624j517j476
$$ y = [-2001, 898, 1037, -1472, 277, 717, -833, 349, 162, -656, 826, -74, -1034, 1119, 235, -1307, 799, 657, -1123, 339, 572, -628, 158, 248, -346, 311, 46, -389, 423, 242, -472, 17, 548, -27, -604, 297, 898, -812, -523, 1550, -331, -1415, 1467, 502, -1660, 744, 883, -1090, 259, 335, -492, 663, -536, -675, 1555, -817, -1531, 2269, -208, -2493, 2014, 770, -2674, 1121, 1289, -2052, 427, 954, -1257, 453, 275, -1006, 970, -85, -1351, 1353, 220, -1764, 1181, 720, -1644, 610, 912, -1123, 214, 664, -589, 126, 277, -280, 209, 110, -184, 121, 59, 90, -149, -192, 579, -195, -665, 967, 74, -1184, 914, 541, -1326, 594, 631, -996, 468, 271, -723, 815, -137, -928, 1422, -250, -1503, 1800, 235, -2050, 1507, 804, -2002, 924, 1001, -1463, 513, 605, -950, 678, 7, -854, 1145, -277, -1188, 1436, -81, -1557]
1041a557K857r95j869K403l29j661J563j27r04R64m41k00P93r57K54Q84j250L67
1059b05R13j278M59P46j258O89M85j290R53L94j429J134K81j449J230J88j401
1076h38J307k5j305J453j95j377J654k87j403J702l12j350J644l61j201J569m99
1093A76r50J551p83p92J697r93p21J792j096p60J878j081q10J772r35o71J493
1110G67q68m88J262q93j97J085j076J17R96j238K67J021j353L40J026j386L83
1127b35R38j278M01P51j119N18N37j103P30L63j187R04K69j197R22K69j121Q68
1145B30J51r14Q18o1p29R43l31o62J150n57p00J313n16p99J275m88p05J119m80
1164E7n30J021o36l23J042p83k43J083q42k78J075p84k61R21o33j49O92o49Q8
$$ y = [-1557, 1300, 305, -1564, 839, 510, -1151, 412, 285, -619, 345, -96, -296, 497, -460, -206, 678, -572, -205, 708, -570, -111, 635, -623, 66, 551, -739, 214, 608, -821, 313, 594, -855, 375, 563, -838, 469, 444, -861, 592, 397, -980, 674, 387, -1016, 686, 374, -976, 668, 307, -894, 675, 176, -774, 777, -6, -798, 899, -94, -815, 977, -119, -879, 999, -82, -892, 880, -55, -726, 767, -101, -589, 673, -220, -417, 668, -408, -291, 705, -533, -266, 755, -598, -258, 768, -618, -235, 703, -575, -174, 577, -542, -24, 513, -590, 140, 503, -684, 220, 489, -708, 214, 483, -638, 230, 381, -533, 285, 224, -505, 438, 107, -555, 595, 38, -662, 651, 135, -664, 611, 123, -582, 537, 57, -473, 548, -88, -411, 631, -152, -395, 688, -154, -432, 643, -141, -402, 519, -114, -263, 429, -220, -132]
1183a32N25p55K86N71r41L39O43r62K65O46q63K57N10p66L40L30o62M33J86o92
1203d42N70J25p21N78R2o42N86O7o28O12o9m84O08j59m77O82k21m60O92k25m05
1224c21O37k53l00N25l07k03N66m25j65O47m95j29O05m88j05N50m60m4M91m78
1244a52NM83n43Q9M69o03J70M59o61K01M65o48J66M35n54J16L86m66J29K77m27
1265b04J91J69l79K44J34m08K96R8m04K88J01l39K37N4k68K19k2j33K29j70p4
1286a41L26k54j04L87l02j16M26l09q8L96k82n3L39l25j8L86l56k5M03l79p7M48
1308B82l20j35M07k61r4L01k63J2K68k98L0K83l11K0K73k51j3K07j51o3J33p0
1330a4M6j9r0J54m9j44J99J5k42J92lj38J49m4r4J72j58m0K62k34q7L66k64j64
$$ y = [-132, 393, -362, -76, 495, -446, -107, 536, -426, -161, 485, -378, -121, 389, -377, -37, 293, -369, 64, 250, -442, 128, 253, -468, 110, 202, -440, 146, 213, -415, 197, 128, -356, 252, 93, -384, 298, 77, -383, 309, 84, -321, 316, 63, -237, 288, -19, -222, 344, -81, -246, 401, -94, -223, 382, -106, -211, 339, -121, -165, 326, -152, -147, 336, -207, -118, 351, -252, -82, 377, -284, -83, 382, -266, -100, 335, -219, -103, 283, -183, -54, 223, -204, -13, 156, -223, 21, 155, -253, 43, 141, -263, 25, 126, -213, 24, 78, -190, 29, 7, -126, 103, -67, -141, 185, -69, -173, 214, -88, -204, 222, -87, -175, 221, -61, -114, 225, -100, -118, 268, -88, -113, 290, -89, -166, 282, -38, -173, 234, -27, -121, 180, -83, -71, 197, -101, -71, 212, -99, -79, 194, -57, -70, 137, -14, -77, 56, -14, 32, 13, -77, 77, 28, -116, 83, 98, -144, 48, 45, -93, 56, 12, -82, 90, -68, -108, 154, -80, -167, 199, -65, -229]
1354b29M06j60k48L79j13k42L26j02k19L38j41k14L53q0k80L40Ql29K59O4k33
1375a17J10J24j83N8Q6r7M9J0o6N6L9j04J5J03n7j04J33O1k32Q1K22k88j3K99
1399A85k23j07K56j00j03K15j49n2K13j68r6L15k11j52M00k21k61M54j03l46M00
1420A46j5l83L26P0l65L05K6l03K28O8k77J97J02l10J38J87k68N9J99j85k5J48
1442F8r8l0J28r4n0J17l5r0J08L4j38J08R4k13O8J77j78m3K11j60p7K33j36q8
1466h4J92r5q8K02j20j28K90j66j74L40j26k28L14n5k71L20l0k67K49Rk61K65
1488H8pk16K01K0k12J78L6k04J60N4k05J45Rj29Q7L7q5M5J5n1J5J3Ljk2J9j4m9
1516g0R3l3o6R6J0j11J17l9q3J60o4r0J40l1j25J74m4j61K24n4j32J73j7j74J64
$$ y = [-229, 177, 17, -231, 148, 35, -207, 119, 17, -202, 136, -5, -219, 134, 54, -226, 114, 122, -207, 52, 116, -117, -7, 117, -66, -8, 78, -19, 30, 40, -26, 30, 69, -35, -20, 83, 26, -78, 55, 116, -116, -35, 187, -101, -114, 185, -38, -145, 111, 11, -92, 123, -26, -78, 135, -33, -129, 186, -25, -177, 223, 2, -259, 195, 92, -254, 146, 131, -252, 74, 144, -221, 84, 110, -193, 35, 103, -174, 23, 125, -185, -47, 140, -128, -69, 130, -55, -80, 68, -30, -60, 68, -26, -76, 41, 6, -84, 24, 58, -80, 28, 122, -91, -23, 154, -24, -67, 144, -16, -93, 140, 4, -84, 108, 13, -75, 127, 7, -121, 169, 3, -171, 169, 43, -185, 129, 74, -197, 123, 93, -174, 75, 84, -177, 88, 81, -135, 66, 86, -126, 52, 88, -116, 44, 98, -107, 38, 47, -82, 5, 42, -43, 2, 17, -34, -19, -6, -3, -4, -26, -7, -21, -70, 23, -10, -76, 20, 30, -81, 36, -3, -86, 74, 10, -80, 60, 29, -96, 78, 34, -127, 97, 43, -89, 84, 67, -107, 57]
1541E7K5j82J88m0j65J85j8j34J61m6j13J30L1j62J35oj20J19j3r3J02l6q5J47
1565F7q8k6Q3k9l8O1n3pN3o3L5M0q5P2Mj05J07L0j28O7O2j39R9K4j56J27K5j17
1593g8R7L8j60J19M1j39P7O4j39J01Or7P7N7j46J05L3j32Q3L8r7P0K2o8N6Om3
1620iJ7L1n7N1j5l5P7n5k2O5o5K4L5q0N1J0n9M0N0j14P4K9j03P8L2j04Q2J8q2
1649c6M8L6r5P1L3r2L3Q7j55O6N6o9K6L1p1L7K4o0L5Pn5M7Pp0O8j3l5L1J3k5L1
1680A1l3L2qm7L0M8o7M0K1m1qO7o0PM5l0j8L9m5%P7o5j1O2o7K1M1j8l1N9l7l0
1712a6P8n4j4K3k9RK0j4k0K4j0kJ5j4RpmJ8k9K0Rm3RL2qj3O1q1K1N4q8J7Q3n9
1746cl6Q5n1p1J33q0l6J25r6l6J20m5p4J06o6n0J03j8o2P6jn4N9J5n7J6L8o1K5
$$ y = [57, 82, -100, 88, 48, -117, 68, 50, -84, 77, 31, -82, 48, 79, -83, 52, 46, -74, 45, 32, -61, 41, 5, -80, 67, -21, -47, 36, 7, -31, 30, -23, -30, 23, -40, -5, 35, -50, 22, 26, -79, 28, 58, -70, -3, 59, -80, 19, 43, -113, 14, 39, -78, 19, 57, -103, 16, 57, -82, -5, 59, -80, 21, 27, -70, 7, 64, -82, 23, 56, -76, 7, 45, -52, 18, 40, -28, 28, 34, -9, 8, 39, -18, 33, 18, -17, 60, 5, -17, 48, -17, 7, 42, -38, 13, 23, -36, 4, 54, -60, 14, 43, -60, 18, 50, -54, 28, 46, -36, 12, 48, -47, 24, 57, -35, -2, 85, -70, -4, 52, -17, 9, 40, -31, 6, 30, -30, 5, 12, -43, 4, 11, -59, 9, -4, -39, -8, 5, -20, 11, -22, 10, 2, -45, -15, 33, -34, 6, 27, -14, -22, 45, -15, -8, 37, 7, -11, 28, -17, -17, 60, -5, -16, 46, -21, 0, 41, 23, -8, 51, 14, -16, 62, 8, -6, 17, -12, -3, 17, 3, -17, 7, -3, -5, 10, -4, 5, -2, -6, 12, -17, 3, 12, -31, -22, 10, 2, -11, 50, -31, -10, 44, -44, -27, 56, -3, -39, 46, -5, -76, 57, -23, -59, 66, -30, -66, 54, 9, -65, 41, -25, -75, 28, 10, -52, 24, 23, -31, 28, 43, -14, 2, 40, -21, 4]
1775DN1l6mM1m6lRrl4K0K9k4K7Jm2J6L7n0nN5o0kP2m2o6J12m9o5J39o6o7J11l3
1808B1q3J05j0p8R2J2j37J05Rq8R0Lj01P5L8r2L5N0j09M0L5l6LL2o0L0M8o0nK3
1838a3Pk1N0K2o5J2L6m1J5K2l5k7Q4k8n2R4j6p1O3j3o9Q1Kq7Q8%q4O1L8j24Q1
1869A0M2j17O7P6j54M1J02j51P3Q1j19K4O5q0M2M9q4J4O0n6J1L3k1J9J4l0Poo
1898FL0l7QQq3N6Nl1N3k6j6M5k6n7O1J7q4Q5M0j21Q0K8r2M4N9j06N8L2j19J00
1928A7N3j37O3Q6j27N8M2r3M5O4p9nN4n4QO3p6PM3k6nL4o0K8K5m9J0Nk4N1l0l1
1960d0M6Ll6M2m6K7O1r8J7O6p5lR7r1KQ1j22N7O8j09J0J18j25K3Q4j14K5J08j23
1989d7j9J21r1LP2r0%R0j01M3P8j05O7J7o6JN7o9L3N6o1K4J6p0O4ml8O6j8n1O9
$$ y = [4, 55, 19, 15, 56, 10, 7, 16, 7, -27, -7, 22, -2, 25, 26, -16, 0, 37, -13, -18, 37, -23, -25, 47, 5, -61, 51, 2, -63, 76, 10, -57, 54, 21, -62, 43, 33, -45, 47, 59, -78, 27, 36, -52, 38, 41, -60, 15, 53, -39, -4, 46, -63, -23, 12, -24, -21, 11, -49, -19, 29, -31, -36, -13, -6, -27, 23, 45, -20, -8, 28, -13, 2, 24, -11, -38, 46, 18, -34, 60, 44, -27, 36, 23, -46, 35, 37, -50, 38, 38, -46, 15, 53, -71, 10, 52, -65, 2, 78, -76, -35, 67, -84, -11, 70, -49, -25, 40, -40, 2, 51, -33, -19, 41, -15, -4, 29, 8, 27, 41, 11, 18, 12, 6, 36, -1, 7, 15, -68, -12, -7, -38, 15, -11, -27, 18, -8, -65, -4, 13, -71, 14, 54, -67, 13, 41, -51, -7, 52, -54, 4, 36, -83, 17, 70, -67, -4, 82, -45, 13, 55, -38, 7, 71, -8, -13, 41, -13, -5, 58, -18, -11, 32, 6, 1, 35, -25, 3, 28, -21, -11, -6, -30, 21, -9, -40, 6, 9, -27, 15, -31, -4, 57, -41, -24, 42, -33, -36, 61, -30, -28, 53, -69, -12, 56, -53, -43, 75, -50, -27, 57, -57, -32, 76, -47, -66, 55, -36, -33, 39, -51, -51, 39, -62, -19, 59, -46, 21, 38, -28, -27, 30, -39, -6, 50, -11, 13, 29, -41, 23, 19, -19, 47, 29, -22, 47]
2020D7l1n2P9l9l6Q1n2m3J21q4l1J02r2k3J32r3m9J32r7l1J31j07k0J29j05j0
2046d1J38j39J2J08j00k3J23j15jJ03p7%Q6j11MO4r0L9O2q4K7M5p0M9J1q1O9j
2074Gn5N1K6q5Q8n0l9Q6k3p0J41p9o5J07l7m8J33o8n1J24r9n3J41q1n4J31r3j4
2102b9R2p7n9J59j16OQ6r3m3J47r2l1J25p7j1O5n8k2J01r5J9O4q9K4O5q4J9M7
2130D3j18P6K2p0N0j7l3R4j5p9P1kp4O4Mj11J28l7q2J38l8j00J21l5q1J36m3j02
2158i0J49n4n5J25n9q6J03j6o1J09o6k1O5l4n5R4n9k6R9o8nL7k8j4O2q2N7K4j23
2187g8P2N7j09O9Mo9M8K2q5O9K0n0M0K5q6Q3Kj10J18Lj07Q8L1j04P4L2j28Q5K
2216A8n4O4j2o6M3M7j03Q5j6m3K5J6m6N1j5m5O4j5J0oK4k7K3m6L5j1l7M4K3m1
$$ y = [47, 16, -36, 43, 4, -32, 49, -3, -46, 75, -9, -40, 62, -30, -53, 79, -14, -63, 69, -28, -59, 72, -35, -55, 74, -31, -41, 97, -42, -30, 78, -22, -45, 78, -37, -38, 65, -12, -12, 74, -37, -33, 31, -59, -20, 42, -42, -15, 30, -40, 9, 20, -61, 8, 7, -48, 3, 29, -56, 32, -18, -57, 29, 6, -64, 77, -2, -67, 40, 3, -45, 88, 20, -31, 93, -6, -59, 82, 1, -53, 78, -15, -29, 63, -14, -73, 86, -30, -24, 62, -31, -74, 73, -19, -50, 75, -2, -13, 52, -6, -28, 73, -22, -3, 61, -28, -4, 61, -23, -4, 43, -75, 1, 23, -47, 3, -14, -47, 47, 32, -47, 24, 22, -52, 12, 16, -95, 33, -4, -86, 52, 14, -86, 35, 0, -81, 55, 12, -90, 59, 5, -50, 75, 16, -70, 33, 17, -44, 65, -1, -22, 43, 9, -46, 48, -11, -37, 62, -6, -11, 26, -2, -16, 46, -36, 21, 45, -78, -6, 51, -58, 11, 15, -54, -6, 16, -69, 0, 20, -30, 10, 35, -51, 32, 34, -76, 42, 45, -62, 26, 57, -47, 27, 59, -69, 16, 18, -36, 28, 16, -50, -7, 40, -63, 22, 6, -37, -12, 4, -42, 9, -6, -51, 13, -2, 8, 2, 26, -1, 22, -24, 11, 0, -37, 7, 30, -11]
2246a1L0J6o6N5L3p3N9j3o6K8N8r1O0J5j01P8L5r8N3J4o5N1M5j16O3Q2j30Q1J8
2275D4r9O8L1q7K9M9n8L9K7n4rM3l3M0kl8K1pJ2j6Lknj8jL1j1k1Rl2K6K6n2N3
2309Fj9j3K9kj7RL4m3RM6o3M4K8j06Q1K8p9N3M7p7L8J9p0L7L1o8L8L6q5K8M4m6
2341cj2M5o6K6L1l9K3J6n5J8K7k0jK1j6nLj4K3Rj4K7n1J5K9kjMl2J2K9k9nM3n3
2376a7K4Kn0L8L0n1M1j5n1L7K2m3N7ko6O5Lp0N9L4o0J6M1p1M8Qn9N2M1p3L0J0
2408C0n9M7K6o1L3K0o3O5l4m9N7lk6L9k8m1N4l2MJ9K0p2Q3l0j7K9J2l7L0m1pK4
2440hKJ4J6Nj4Nm0M3l6LK0LkrQk0J3K1m7M2l1l9M7qm1N0k7qP8o7j3P7l5n6P6j
2476B1n5Q1n1j1O3m1k7N0j4l4Q4n5m0P3j5m9O0k0n5M6K2l3J4Ql1J3Mj5K4k1K3
$$ y = [-11, 19, 35, -31, 24, 57, -16, 43, 30, -36, -8, 50, -41, 19, 34, -67, 11, 46, -52, 1, 15, -50, 1, 46, -70, -7, 75, -55, 26, 44, -55, 13, 44, -43, -14, 35, -23, 16, 43, -11, -20, 23, -10, 30, 28, -10, 11, 4, 16, 0, 3, 1, -4, -22, -23, 8, -3, -24, -15, -47, -21, 5, -47, 6, -13, -26, 3, 1, -16, -7, 27, -16, -7, 39, -24, 20, 48, -58, 23, 51, -28, 25, 72, -5, 33, 52, -18, 19, 50, -18, 20, 56, -29, -1, 43, -3, -15, 30, -36, -10, 21, -18, 5, 21, -34, -16, 11, -9, -10, 11, -5, -10, -7, -21, 2, 11, -3, 24, -27, -12, 17, 15, 14, 18, -14, -2, 27, -2, -7, 36, -17, 7, 9, -41, -3, 27, -24, 17, 2, -49, -12, 10, -33, 24, 22, -44, 21, 24, -46, 13, 47, -13, 3, 44, -27, 21, 29, -30, 22, 63, -10, 20, 30, -29, 18, 44, -17, 16, 36, -27, 38, 4, -45, 12, 9, -17, 22, -6, -47, 7, -25, -21, -2, 18, -54, 29, -1, -18, 11, 23, -14, 16, -25, -32, -8, -6, 8, 24, 29, 15, 20, -20, 23, -13, -10, 10, 13, 11, 2, 10, -10, 3, 24, -23, 19, -12, -51, -4, -12, -53, -3, -30, -38, 40, -27, -40, 37, 2, -54, 22, 21, -34, 47, -4, -15, 48, 7, -20, 30, 16, -18, 66, 11, -29, 44, 29, -20, 40, 20, -35, 11, 33, 0, 14, 22, -9, 4, 8, -7, 17, -4, 19]
2507A9k9J0J5j7%Kl1J1L8k0J3Ln9K0Q5n8k3L2pj7P4n9j7N8o4k6O8j1m9P9n0k5
2539c5P9r1k0R1k0m3M9k1l6P4%r0P6kl1K7J1l2J4K5m2N8j6m2N6k6rK4qj4qL4R
2572D1k5j2J4l2K5Lm3rN4m8ON2l4k5O0l8l3P8m5j1O1o1j5R3l5q0J01k6q7J12j8
2603B3p4R6m5n6Q9k2o6R2qq0O9j2l6J3J7l4K9rj3%J1MmJ1Rk3J8j1qL0Ll6M2J6
2637C5m7j8Q8k6k3K9k9j5L4j3k4M4l5l2Q6l0o4R9o4n1R2l5l8Q5m9n6Q4k9o9Q5
2667A4mp1Q4ro1N6Qj9KK0o6M6k2K9j7J8Jl4M2Ok6pM3m9QK6k9mL2l3k2Q3m7k9L8
2702Gk6j5M1k0J6J7pm3O5m4pO0k9l8M5K6o4P8n9l0R5mq0O6rp4N4Qk5K1J3o3M2
2735A7ll4OM3l4j5N0k7m6N8J0j5j7pj2L2qk6M1Nl9K3L1k8k3O9p9K9M3l1l2N4k6
$$ y = [19, -10, 0, 15, -2, -2, 0, -31, -20, 18, -2, 11, 14, -45, -25, 60, 2, -21, 11, 4, -13, 61, 2, -15, 43, -21, -47, 21, 10, -39, 40, -10, -35, 44, -47, -67, 24, 4, -39, 10, -11, -47, 27, 27, -63, 13, 11, -20, 7, 18, -14, 0, 25, -17, 41, 25, -17, 39, 13, 4, 28, 20, 6, -2, 32, 41, 16, 4, 18, -14, 11, 14, -29, -38, 16, -32, -26, 26, -8, -33, 27, -11, -44, 34, -11, -22, 39, -22, -37, 56, 21, -59, 42, 16, -71, 41, 23, -51, 45, 0, -56, 33, 11, -55, 37, 29, -51, 18, 6, -30, -17, 0, -34, -5, -14, -27, -27, -16, -12, -16, -5, 4, -19, -1, -12, -20, 10, 13, -23, 19, 35, -12, -30, 58, 32, 9, 38, 9, -6, 28, 15, -9, 35, 0, -32, 54, 24, -40, 59, -5, -56, 36, 1, -37, 48, -1, -57, 27, -2, -71, 14, 10, -61, 23, 14, -47, 9, 17, -2, 0, 20, -46, 0, -22, 7, -10, 8, 9, -25, 17, 23, -3, -10, 33, -16, -8, 18, -11, -15, 17, -16, -38, 45, -2, -31, 7, -19, -34, 7, -13, 3, 20, 13, -30, 35, -9, -16, 44, 15, -23, 22, 48, -16, 62, 3, -27, 68, 64, -16, 50, 41, -33, 21, 29, 4, 25, 38, -25, 17, 14, -20, -14, 29, -5, -20, 30, 3, -43, 15, 25, 10, -7, -14, -26, 6, -2, -28, 13, 18, -21, 2, 33, 5, -18, 51, -28, 1, 44, 13, -19, 35, 9]
2768Ik3N8l0o8O4Ql7N7m3l9P8m7m5Q1j8n2N3J7q4J08j0o4M2L6r3Q1Lp2P3j6m6
2799a9L1K9p0L3Ql5N8l5j6K6j%nKk8%L6ok2%J8j5k6L8m2J4O3l5K1j3pj5J2nj2
2834a8K8j6j6N3j6m1N0ml9L0jm7N8k8l0N1%l5J0J6m6N5Pn6O8l2l0L9k0PK6Ol7
2867hK5J2o2M0Qj0mK1k0J5k1K3L2ok9k8K0JJ1orqJ5j2rk2J9MQk1K3j7j8K0m1O8
2903A4m0LJ5jpM0k6j6L4j0njRj0J2k7L4kk3j4Q4l2o1M7k0nJ8j4l2P0n6jK4kj3
2938a4mNJ1J3j5oK4j8j8M9j8PkK7m5LJ8nKlJ0kl1N2j9m3P2n7nJ5jj3M6m7j5M9
2974B2n7L4J6l0l9R8n8l7P6m5j7N2k5k3N9j4j6N1l9k5L3Rk7J9j5KK7j6pL0k6k6
3006a4L1Nk1J4j9jljKOM1o1J6J0jRj9J1j7LJ9qj9N4m7MN5l9OJ4rqJ3k8J1L3o3
$$ y = [9, -14, 44, 14, -54, 10, 18, -19, 38, -5, -44, 34, -13, -58, 23, 5, -47, 6, 23, -61, 47, 37, -27, 15, 51, -42, 39, 42, -30, 43, 27, -19, 12, 41, -29, 4, 12, -23, 35, 0, -16, 10, 9, 9, 4, 6, -22, -22, 14, 8, -14, -14, 4, -11, -37, 1, -41, -27, 36, 1, 22, 9, 2, -13, -1, -6, -18, 10, -6, -22, 31, 15, -26, 24, 20, -19, 11, 10, -37, 21, -7, -37, 14, 14, -21, -11, 5, -41, 14, 21, -35, 33, 1, -29, 10, -10, -3, 23, 29, -8, 17, 29, -33, 7, 15, 5, 1, 22, 2, 17, -4, 19, 51, 45, 16, -12, 8, 9, 20, 14, 5, -3, 12, 0, -9, -31, -12, -8, 0, -21, 2, -15, -33, -13, -54, 14, -26, -23, -8, -9, -16, 24, -2, -18, 16, 6, 1, 0, 9, -1, 11, -16, 18, 16, -7, -21, 63, 31, -30, 17, -3, -8, 10, -4, -36, 34, -22, -23, 1, -1, -14, -18, -13, -2, 11, -4, -10, 14, -4, -22, 27, 9, 16, 14, 41, -4, -1, 17, 12, 14, 11, 21, 19, -12, 40, 21, -22, 50, -7, -12, 3, 2, -11, 35, -12, -27, 22, -35, -1, 15, -15, -54, 44, -14, -51, 25, -20, -37, 15, -10, -33, 26, 12, -4, 47, 8, -17, 16, 25, -2, 17, 2, 4, 31, 15, 8, 38, 12, -14, 17, 22, 1, 15, -4, -5, -8, -9, -7, -1, 40, -21, -5, 5, 4, 13, -6, 5, -12, -9, 10, 2, -17, 37, -10, -6, 49, 10, 16, 30, 21, 13, 26, -2, 9, 42, -21]
3043b1%Q0q0QP1o8m4P7l9KJ2k2J5ljOK8m3PK3j2qN2q6L9J9j8mPKJ8l1nL5ll1L6
3080A8J4l5M1l0m2N3k3k4P4n8J9K4m8qO2n1j0L9l6J8K2j2k6N5m3%L8l8pM6pj4
3112A1L6m6JM2m3QK0j9JJ1l6PJ4k6K6%j3lL3o1L0J9k6j7L7k8J8kOKj1lM8k1l5
3147b0RKQK9j5mK2j4k0M1m5J1L8m4jN7p9K1N3l5l5O7n4k8N3k1lM8l3k8K5j6j4
3180b5N8n2J4M1k1j9J8MmPj7J7j3L4j3ol0L4j5oRl1M5k0k5K7J2j7J0J7n7K8J1
3213A5j9k5O9o3j1M6m5K0L4k7mN5n4JL4k5j6N9n6J1L7k6j9O4k8l5L3pk8K5Lk8
3245a0K4j1NpNj0J9Ml6N5j4rj9J2jj1L2Jm9J9J8m7N6J0o3M4Mj2p%MlJ8j9l5J05
3281G2p6RK4k9mK6k4l1O3l7j0L4j7j3L4l2j8N7n4J2j8M3j4K3j8J9mpmnK7%mK5
$$ y = [-21, -21, 59, -21, -13, 58, -10, -54, 23, -16, -14, -2, -24, -9, -12, -13, -7, 21, -22, -15, 8, -4, -12, 40, -46, -7, 12, -6, -10, -3, -1, 17, -14, -19, 16, 13, -18, 18, 32, -3, 38, 8, -34, 19, -4, -28, 46, -12, 7, 31, -17, -25, 37, -14, -24, 15, -21, -3, 19, 7, -19, 36, -7, -7, 31, -7, -14, 32, 25, 11, 47, 1, 2, 44, 1, 9, 29, 10, 11, 22, -14, -7, 7, -19, 7, 7, -6, -9, 24, -37, -7, 12, -14, -31, 6, -22, -4, -6, 0, 2, -9, -12, 36, 15, -20, -11, -9, -1, 28, 13, 9, 31, 17, -3, 38, -7, 4, 42, -2, -3, 54, -25, -4, 49, 14, -21, 46, -8, -36, 17, -4, -7, 41, 8, -20, 5, -11, -25, 33, -19, -5, 36, 15, -4, 14, 18, 14, 21, 4, 21, 8, 42, 29, 23, -7, 27, 12, 6, 15, -16, 29, 9, -16, 11, 23, 6, 16, 33, -24, 4, 15, -4, -29, 40, -23, -34, 12, -33, -13, 21, -6, -10, 45, -9, -8, 26, 1, -15, 44, -12, -1, 36, 10, -9, 55, 27, -8, 25, 18, -10, 15, 18, -10, 14, 3, 8, 1, 6, -4, 15, 19, -17, 38, 24, 15, -4, 8, 7, -4, 28, 29, -20, -1, 17, -30, 26, 36, -27, 17, 21, 9, 2, 2, 6, 3, 21, 2, -33, 72, -4, 5, 29, 0, -4, 22, -2, -33, 30, -7, -17, 17, 0, -13, 21, -11, -29, 28, -26, -14, -32, 11, -3, 20, 2, 21, 17, 10, 6, 1, 28, 28, 24, 49]
3315D9k5j0L4Jj0j6kjlj3j3J8J3l4M8k9m3K9K3jnPo8O4lk0LM4n8J1M2m3lM8l9
3350enPmPJ7k1%K8j5j8%L3m5L1J4m6L5k5j5L0j2k2K4RroL4j9k4K5kj6J6J4mj1
3386@J8%KKk2K8rj4PM%j8K7j8PJ3j3j2J9j5j8M7o4MK7L%nnl0L3qkK5k0%l%k2N6
3426B4m2KN0l5j3M3j9j9OQl2RLl3L9lj5M3Ro3K0K8m4N5pk9j3J0KJ1pK4k8PJ7l
3462Ej4Nl5L5J0j3L2On0M0J1k8K1k5kJ5K4l8J3J0pj9L0m4PPRk3K8j8j6K6qj4M6
3497B6l8kK8j6lL6k6j3L7m1J0K5j7j0MJ5j6J4kN%k4j6J3J4K9j3l7K3j4K8m4K2
3530cKJ2j3Nj6J8j4K4l2j4K8rK2J9l5rN4l5PK2j4k7QK5l3L4k0j5J1K1k9Rj1k0
3564b8M0j6l3L3kpK1l0L9j8j8M1l3J1Pj2j2L0%j4J1NmmL2k5j7J0J4j2j8J4J0l7
$$ y = [49, 24, 14, 48, 49, 39, 23, 21, 20, 17, 4, -9, 9, 22, -12, 36, 7, -36, -7, 16, 15, 10, 17, -51, 13, 10, -10, -7, 37, -21, -10, 32, -11, -14, 34, -5, -10, -3, -7, 0, 17, -4, -4, 24, 9, -9, -9, 24, -21, 10, 24, -22, 13, -12, -27, 3, -9, -31, -7, 2, -7, -13, 21, 2, -22, 3, 1, -15, 1, 15, 11, 0, 18, 18, 20, 22, 0, 28, 19, 5, 12, 16, 16, -2, 25, 7, 14, 27, 14, 2, 21, 6, -12, 35, -29, -25, 2, 5, 5, 0, -5, -35, -2, -10, -12, 13, -7, -7, -10, -10, -32, 24, -18, -16, 34, -1, -14, 29, 10, -9, -3, 5, -27, -18, -15, -48, -9, -12, -27, 16, 25, -38, -18, 10, -34, 21, 14, -15, -28, -18, -16, -5, -12, 12, -16, -9, 8, 5, -9, -4, -39, -4, 6, -7, 25, 31, -19, 21, 32, 4, 25, 0, -2, 13, 37, -1, 12, 22, 15, -4, 26, -18, -11, -4, 5, -18, 10, -8, -24, 2, -6, -20, 26, -12, -14, 14, -2, -5, 31, 5, -8, 29, -12, -2, 23, 6, -4, 0, 15, -1, 13, 11, 16, 16, -8, -24, -11, 3, 32, 19, -18, 5, -9, 19, -25, -3, -1, 11, -2, 3, -13, 5, -9, 15, -17, -31, -3, -12, 10, 29, -6, -15, 39, 4, 11, 33, 19, -8, 0, 25, -8, 26, 6, -9, 2, 23, -6, 3, -8, -28, 12, -4, -37, -4, -6, -13, 8, -22, 17, -1, -19, 22, -11, 0, 7, -5, -17, 13, 13, -1, 10, 15, 11, 7, 39, 14, -3, 7, 21, 9, -9, 5, 15, -22]
3598b2L4k1J6j9J3K3l5Rj1RK6k7rK1j2J4Rl1P%rM1k9L5l5K8j4mK5qkLqQpJ4j0
3635B2rj5NK8k1j5K2Jqjk3J8jRNk2j3J1k1K4kK1Pk4k2K7K8k6qL6p0K6J9J3k6Q
3671Cmk5L8kk4O0n8%L5n1J9J7j3j2J5L4m2K1k6J7Pl5K2JjnK9l5L4k4K5%j1jK2
3706C0k3J7J4rjOlk4Qm3L2J6k0j8M4k3Mj2j2jJ8Kk1K1kO%j4nRJ0nK9m6K5k8J5
3743dK0jNmkPqk3PJ7Mk4k0K3%KQk0K5l5QK2j5k1K5J1j3J4k6K6kk7L5Pl0j0P7p1
3781a3L5kj8j2J4L6j9J7m6K1J4j9J0K8l9kollk3L1Jj4J1mK2k0l6M1j2Oj1Rj8L2
3816HK3%l5mK4l1K4J3j1kRk1j0K2J7l1J3j6J2j2J1MMj9kQk7J0J6k6kK2j5K5J2
3851A3k2QJ3nJJ0j7OJ1j2K6j7rQM2l8L%nj4K5mkNl0K1pMrmlkOlpKqmL8k0j7K8
$$ y = [-22, 12, -9, 7, -12, 1, 24, -11, -2, -13, -4, 22, -5, -14, 7, -5, 9, 18, -13, -6, -6, -15, 26, -3, 32, -3, 25, 11, 7, 32, 24, 22, 25, 17, 25, 18, 32, 22, 13, -2, 3, 31, 10, -5, 17, 18, 10, 9, -14, 4, 3, 12, 17, -5, -18, -7, -28, -4, -6, 15, 22, -2, -24, 3, 31, 5, -3, 33, -37, -11, 8, 21, -5, 3, -1, -26, 12, 10, -14, 46, -12, -12, 23, -28, -9, 8, -5, -17, -2, 32, -10, 11, -15, 2, 9, -26, -4, -3, -4, -9, 20, -15, 19, -5, 20, 20, 9, 8, 30, 7, 24, 38, 29, 28, 34, 31, 7, 15, -28, 4, 20, 0, -18, 26, 3, 7, -5, -17, -18, 0, 2, -19, 2, 0, 6, 6, -8, -13, -4, 6, 1, 30, -16, 9, -19, -4, 16, 15, 20, 16, 14, 21, 13, -10, -3, 14, 18, -6, -26, -3, -3, -1, 7, -13, 12, -23, -15, 7, -8, -29, -4, 7, -6, 8, -18, 8, 6, -21, 14, 21, -9, -19, 58, -13, 22, 20, 2, -10, 4, 40, 21, 38, -8, 13, 27, 8, 18, 46, 7, 5, -1, -4, -7, -30, 1, 2, -12, -1, -5, 17, -3, -39, 2, -10, -4, -15, -6, -24, 8, 31, 31, -4, -8, 16, -15, 9, 22, 11, 9, 18, -3, -13, 9, 26, -5, 8, -8, 4, -8, 3, 7, 11, -8, -10, -2, -29, -19, -3, -29, -31, -9, -24, 1, 13, -9, -1, 12, 7, 8, 18, 1, 7, 18, 6, 32, 15, 6, 14, 56, 18, 21, 21, 16, 2, 27, 23, 21, 26, -4, 17, 10, 14, 5, 1, -2, -4, 2, -1, -8, -6, -14, -18, 20, 0, -17, 11]
3893A1qj4NJ5J2j7Mk2J0jkM3l7J0lk0J8l3N7j5pnK7n2L2ml2OMLJ3j0j1J8NMl0
3930b6L5j0OOroJ4l8K3L1k0J2nk5K0J4mMk5J3j1J3l6K4Ok0L4l1rK3Jm1J0J9mP
3966enQj9QKjk2L3j9K5Lj4QJ0j2k4L4j0nJ7J6l9LRrK7j4%j3koJ4krK4oj8J4j4
4005a3PJ4j4qK2K0l4J9j0KOj0jj8K9j9NJ4J1Nl3QMj1lRj1nJ4jnK7l0j7M5j7j6
4042a5QpMJ0l1J2K1NLj3j2OJ3ppK4j1J5mk8kJ7Lq%mK3j4J1Lqj9J1jROk4Jj0J4
4082fj1J4Kj4J7J9k8J2mj1K6l2PJ3JNJ3k9LK0NLl1K5Rlj1j6J6qpJJ1oj7%J6j4
4120a0j5J2nlJ5K7l7L6m9J7J1NMkJK1%j8j1K4J2k9J0oOK4k6j7jK2j4Ok0K6j3j2
4156iJ4J4l4OrJ6pM0j6JJ5l4OJ1k1JM5l2k4K3J5j1Lj7K9k1J7m6L8oK9om5K0j8
$$ y = [11, 3, -11, -6, 9, 21, 4, 8, -14, -4, -5, -7, 36, -1, 9, 6, -14, 4, -29, 28, 13, 6, 1, 28, -24, 8, 4, -28, -22, -18, -15, -2, -12, -23, -5, 0, 4, -26, 9, -1, 5, 11, 2, -4, 10, -28, -5, 26, 6, 18, 13, -12, 8, 22, 18, 22, -3, 10, -1, 12, -24, 0, 6, -14, 20, -11, -20, 3, 4, -37, -27, -8, -12, -5, -10, -2, -21, -13, -11, -12, -34, -1, -20, 5, 8, -6, 2, 12, 0, -24, 10, 0, -5, 12, 28, -11, -8, 1, -8, 19, 5, 5, -8, -10, -16, -2, -4, -13, 11, 5, -13, 1, -13, -6, 8, -6, -14, 8, 28, -6, 13, 3, 5, 11, 1, 0, -18, 11, -8, -3, 11, 22, 27, -6, 2, 6, -5, -8, 1, -10, -15, -1, -2, -7, 20, -10, -27, 18, 1, -15, -7, -14, -10, 0, -31, -19, 2, 7, 10, -3, -15, -9, 4, -3, -10, 14, 3, 18, 14, -14, -16, 1, 4, -4, -4, -8, 15, 1, 12, 15, 7, -12, -1, -2, 7, 13, -11, -10, -20, -6, -17, -3, -1, -15, 2, 21, -7, 5, 1, -10, 16, -16, -9, 4, 5, 10, 23, -6, -3, 17, 22, 25, -6, 19, 28, 25, 14, -2, 14, 6, -1, 0, 11, 5, -12, -12, 4, -10, -25, -13, -18, -21, -6, 21, -16, 20, -29, -12, -1, 4, 8, 6, 7, 28, 28, 10, -1, 23, 35, 6, 16, 10, 16, 40, 14, -3, -4, 18, 4, 10, -10, 16, 3, -9, 5, 19, -15, -9, -18, -2, -9, 31, 15, 16, 31, -3, 3, 14, -7, -6, 39, 7, -17, 6, 21, 10, 13, -4, 25, 4, 21, -25, 13, 7, 36, 30, -15, 5, -13]
4191a3L5mj8rrK9%k2KNoKJ2j5mlK7l8NPK0j4%OL2k6J1PMk9L0Mj4J6j5J8k5Rk5
4230hJ6j9Qj0L2k7loJ5nJ5j4jLK5l5J0j0L9k8j3M6l7J6K0l8J1K6j4k6L0k6KJ8
4264A2NRj9qK9j8jj1j2OnpL7qnnKLrl6L8j7J3J9ll1L8j4PNljPj9JJ7k4PJ2pJ6
4305B0J2k6pPk3J9j5mQJ7nmroJ5J9k3qRj4J3J7rJ2j5j0J9LjK1k5K4k4lJ1jJ1j4
4343A1%J3k3OoL0rqj4NqJ0Pj3j2n%LJ3k0j1N1n0J2K7j9J2j6K3oj3J3lK2j0k7N8
4380D3l0Pj4J8j2J0k4OK4k4Mj3jj9NK0nJ6kj6jrJ5j4KQl6P1k3k1L4kkk4J2KRK3
4418C7m0J7j5J3mmRk7J5k0J6Rm%j0J8ol1J3j5L5k2LK1k7Q%PJ5j0jQrPokoJ9J0
4457B1k1J8j0j0J5j8OQ%j3oM9m9J7k3K2pJ0qQk1nRj5JlL5k4j0M0jJ4m3J9J8lJ5
$$ y = [-13, 22, 18, 0, -9, -18, 11, 11, -11, -9, -4, -10, -8, 4, -11, -15, -18, 9, -29, -24, -17, 3, -11, -11, -5, 27, 1, 12, 19, 23, -6, 24, 28, 14, 30, 15, 33, 8, 17, -8, 8, -11, -3, -13, 19, -8, -11, -17, -2, -7, 8, -6, -7, -4, 21, -14, -4, -14, 25, -3, -16, 30, -7, 9, 29, -9, 2, 28, 14, -12, 18, -8, -6, 12, 17, 26, 7, -1, 28, 10, 9, -2, -14, -8, -13, -20, 17, 9, 4, -1, 1, 4, -5, -41, -3, -20, -7, 12, 9, -22, 16, 2, 9, 14, 11, 10, 17, -2, -1, 16, -8, -1, 11, 4, 20, 32, 6, -1, 6, -17, 2, -13, -17, -9, 8, 3, -1, -10, -16, -1, 18, -5, -13, -4, -18, -5, 12, 3, 15, 0, -10, 9, 12, 11, 32, 7, 31, 7, 4, 15, 14, 25, 11, 11, 24, 1, 7, 1, 31, 22, 14, 0, 5, -3, 7, 14, 1, -11, -16, -16, -13, 0, -20, -31, 20, -30, -18, 9, -10, 2, -14, 9, 3, -10, 3, 0, 22, 12, -15, 43, 13, 20, 6, 24, 12, 22, -2, 4, 28, 4, 8, -5, -6, -25, -20, 0, -5, 11, 9, -7, -8, -17, -2, -16, -14, -6, -42, 29, 6, -15, 19, 17, 15, -9, 3, 5, 14, 37, -3, 14, -1, 12, 8, 4, 13, -14, 1, -19, -3, 6, 2, 2, -8, 10, 4, -27, -14, -29, 6, -16, -13, 8, -19, -11, -11, -4, 11, 1, 0, 8, -1, 6, 0, -2, -8, 11, 21, 0, 18, 8, -2, 13, -5, 1, 9, 9, -4, -10, 39, -10, 7, -16, 6, -1, 9, 1, 9, -12, -17, -8, -23, -22, -25, 10, -14, -24, 16, 15, 29, -14, 5, 23, 20, 35]
4494C5Kk0J2j0k3J9K2j7j5KMk5K5k4lK0j8J5k8K1j0PJ1kj1Nj8P%%kK0m%Kj0K6
4531A5k6J1k0L4j3J8j3pL0mm3K3%OJ4l4jjlQOJ2l5K2jMk1K7j3J3j3J1Kj4K6ok
4568A2%Mk5K6k8K4qo%J6j7K3Jm0L3prmJ7k6QrKj0lK3J5J1j7jl4K4JJ2j8K3Lj8
4606bL6k3j4J4j1L4j0pk6KQJ1Qlj7J2j9K0jk3MKj4L6k3%K7k7%j6J7qJ0J8l7M3
4642B1j6rnJ7j1J3k3JK3J0njkJ5l0L7mj1J0k5oj8K3Jlnj3J1k6J3o%OnJ1jL4j8
4680CpORj3J3J1k9LkOJ8j0jQK4j9NKPk6LK4k0j3k1K1Rj6%oJ5kOj6j2L4k7J2Lj9
4720a7pK7mj1PK1J0n1L6j5L9pj6L2m2Jk2L3Lj0j4K0PK8n0Rj1LnJ5kMj1k3mL6j9
4757a0J2oRMKk9QJ3LLmj1J4J1J5k5qJ7k3PQJ1pJ0j9j1qJ3jK5l3k0J9KJ0k5KJO
$$ y = [35, 37, 17, 29, 19, -4, 15, 37, 20, 5, 7, 11, -14, 11, -13, -16, 4, -14, 1, -27, -6, -16, -9, 2, 0, -11, -6, -24, -17, -17, -17, -19, 1, -3, -3, -1, -11, 15, -11, 0, -20, 14, 1, 19, 6, -1, 29, 25, -18, 5, 5, 11, 25, -9, -10, -11, -14, -6, 0, 12, -23, -1, -2, 2, -19, 8, -5, 8, -5, 6, 8, -6, 20, 14, 12, 12, 16, -9, 17, -11, 13, 5, -1, -1, 15, -2, 21, 22, -18, 15, 8, -1, -5, 12, -14, -6, -15, -13, -23, -26, -3, 12, 23, 6, 5, -29, -5, -4, 8, -10, 13, 16, -2, 34, 11, -3, 11, 0, 34, 24, 17, -9, -7, 1, 12, 20, 17, 0, 12, -7, 13, 12, -11, -7, -5, -19, 17, -6, -6, 21, -6, -6, -22, -5, -13, -3, 15, -22, 21, 5, -4, -9, 8, -3, 10, -13, -12, 11, 21, 16, 15, 13, 28, -2, 35, 31, 20, 30, 5, -1, -19, 4, 5, 2, -3, -16, -5, -31, -18, -24, -24, -18, -23, -12, -13, 21, 3, -4, 2, 11, -2, 11, 22, -7, -4, -6, 0, 18, 8, 7, 15, 39, 20, 25, 27, 34, 8, 11, 35, 15, 2, -19, 2, 11, -5, -5, -11, 4, 2, 8, -8, -20, 14, -13, -1, 2, -17, -24, 3, -1, -12, -5, 16, 26, -25, 11, -4, 35, 28, 12, 44, 2, 3, -19, 14, 17, 7, -7, 13, 20, 48, -2, 7, -4, -1, -6, 9, 7, 11, 0, -23, -27, 9, -10, 2, -4, 5, 9, 11, -18, -10, 3, 6, 9, 5, -6, 8, 19, 34, 9, 1, 18, -5, 2, 10, 21, 14, 24, 5, -6, -14, -1, -2, 23, -10, -30, -11, -9, 1, -24, -22, -21, -15]
4796a5j4OL4n5O9n6J9kJ4Ok2N1o1J1L2pJ0%lqk0K5qmP%Pj4j2J2mJ0k4ROj9L2l4
4834b2kK5j2J9%Kk1J7l0J4jK4j9L0Mk1oOj1J9K5m7K0ooPj3nnJ8OqJ2j0LJ0j3Q
4872A1k7J4nloJ2K6m2J3KKj2K7J3j4j3k1PK4K2j9KmJ2JJ1j3j6J0k4j0J3K3Lk3
4907dQkj7L7m6PJ1NJ1k3mJ9nJ4l6M9rRk0QJkLnqNPOj1NLqk1J9j5J9O%j0m2L4j5
4949a7RKj6RmM3n4L4jrPk3NK4J6k9L0j3j1J3Nnl3O2l4j6L8l2KJ2mj4J0j9K9k1
4985eK6m3K1j3J4rK3J0m0J5J3k3rK4j2K9mjj4j0NK7l1NJ3NkJ7j0Pj6j6j2K7qM
5021Gj2j5J7mj0J7j7jjL3k4J1J7k4j3J5j1J5J4j6L0n0L9Nj2m4M2j5K9qK6m9K9
5054B0oj1k9J3L4k6J8m1J6K4qmj1kjJ5qL0k7rlL9k7RNRj8j4K1KlL2m2pL5npj9
$$ y = [-15, -29, -23, 11, -44, 25, -31, -12, -14, 0, 6, -16, 35, -26, -15, 17, 10, 20, 20, 17, 9, -11, 14, 6, 2, 9, 9, 16, 2, -10, 2, -2, 8, -16, -7, -1, -20, 12, -22, -24, 1, -11, 8, 8, 10, -11, 6, -24, -10, -11, 13, -6, 24, 28, 7, 1, 7, -4, 15, 40, -7, 13, 7, 1, 8, -5, -10, -15, 3, 9, 1, 13, 3, 6, 16, 3, 11, -16, -2, -7, -10, -16, -4, 22, -20, -7, -5, -3, -15, 12, 25, 11, -2, -23, -16, 8, 30, 11, 13, 9, 21, 22, 33, 20, 4, 14, -10, -20, -7, 16, 19, -4, 4, 2, -15, 22, -24, -17, -6, -1, 10, -13, -17, 2, -3, 11, -25, 24, 15, 24, 4, 12, 13, 11, 14, 9, 1, 6, 13, 19, 8, 13, 16, 8, -13, 6, -9, 10, 16, 16, 6, -36, -2, -17, -8, -6, -22, -13, -17, 26, -28, 6, 5, -4, 3, -20, -15, 9, 25, -4, 26, 13, 2, 15, 20, 15, -18, 44, 10, -6, 32, 0, 2, 14, 10, -4, 6, -13, 16, -5, 21, -22, -1, -14, 0, -9, 14, 24, -16, -1, 12, -11, -20, 4, -8, 21, 17, 16, 2, -8, -3, 24, -7, -2, 11, 16, 14, 31, 21, 28, 12, -4, -16, 11, 3, 7, -5, -20, -3, -7, -17, 0, -17, -18, -19, 14, -10, 1, 18, -6, -19, -4, -15, 0, 14, -2, 28, -22, 17, 22, 10, -34, 8, -7, 22, 14, 40, -9, 20, 14, 3, -26, -13, 21, -5, 13, -28, -12, 12, 4, 0, -11, -13, -14, 1, -7, 23, -4, -13, -16, 23, -4, 5, 10, 19, 1, -13, 8, 10, 7, 39, -3, -10, 25, 20, 13, -6]
5092fJ2J1j9Q%QqJOj5nk%pM1l8Oj3L4k5QJ4pJ9k8Jkj3M2lj4J1Qok2K4j2jOnj4
5133eJ5j8lJ5rK6j6mJ2Jm0Nj2L1JqNLJ9j8J6j6J1j1J6k3%J4j0L3k2kj7K1mK8j6
5170A8qRjk6KK2K3m1Pj7NPJlj5Ql5K0kL8l9L5opJ1rmKJ8k3L6k0oJ1pJ4J1j1mJ1
5210B5pj6lJ3lJ9l5J6K0j8j7j0K3Mk6J6Pj2j0JpNRPj4J4oQK8n2K8l8L9j7QJL9
5247C9j6j3qM1l3j8M4m0J2l2O1l8MMPj3Rk1Ljol%J1KK7l2j2J3L7k2Lj0J2j7K7
5283B1Nk3J4j4qK9Pl3%j5L2k9J5mlOJ2qk8K5Plj8J7PJ2l5%jQmlK0Pj6J3J1k5L
5322AK7rk4mnK6o%K6j3%l5J0J8j6j4K4k2LmJ0J0Nk6K4j5JJ3k0MPqJ9j3jJ0jJ1
5360A3lj1Qk2j4L6mMJqJ1oJnRj6Rj4%J2j3J0nrj0J9pK5k4J5k6L2Nk3K5k7NqJK3
$$ y = [-6, 6, 17, -2, 6, 6, 14, 6, 7, 13, -2, -7, -9, -9, -16, 25, -13, -7, -20, 14, -11, -3, 11, 4, 23, -5, -4, -6, -19, 23, 20, 6, 17, 25, 19, -3, 21, 9, 8, 14, 9, -5, 10, -8, -11, 4, -5, 21, 5, 1, 13, 14, -26, -21, -33, -2, -1, -9, -4, -1, 18, 0, 16, 0, 11, 0, 16, -7, -7, 7, -3, 30, 8, 6, -11, 10, 6, 34, 18, 10, 19, 18, -8, -6, 16, 39, -2, 5, -12, -7, 0, 1, -2, -17, -9, -44, -24, -26, 12, -27, 8, 2, -5, 6, -3, -7, -5, 13, -10, 26, 6, 0, 11, 4, 18, 29, 18, 14, 25, 18, 2, -1, 12, 9, 28, -7, 9, 29, 11, -6, -16, 7, 11, -15, 1, 8, -4, -14, -13, -20, -15, -6, 1, -13, 1, -5, 3, 31, -21, 7, -31, 8, -9, -1, 0, 39, 23, 10, 2, 43, 10, -8, 36, -4, 8, -24, 37, -1, 3, 7, 14, 1, 10, -11, -8, -9, -15, -18, -18, -7, -5, 22, -10, -22, -9, 28, 6, 9, -1, 11, -6, 21, 26, 3, 17, 3, -5, 24, 31, -2, -2, -17, 15, -14, 1, -3, -6, 0, 12, 4, -24, 1, 8, 5, -13, 4, 11, 23, -12, -12, -13, -5, -9, -12, 8, 15, -1, 12, 23, -2, 1, 28, 19, -5, -9, -14, 12, 6, 6, 32, 19, 19, -16, -6, 12, -4, -18, 6, -16, -13, -17, -7, 3, 8, -18, 6, -9, -8, 5, -15, -11, -4, -12, 7, -6, -7, 3, 2, 13, 10, -1, 7, -15, -29, 7, 3, 7, 8, 0, 11, 5, 6, 1, 10, -6, 3, -11, -11, 1, -12, -2, -7, -16, -26, -7, -14, 11, -13, 2, -24, 8, 13, -10, 15, -12, -7, -15, -14, 9]
5400IJ4k0j6M6j8rkJ9l6L2r%J7k1J4m6L1J6j0j5j0MmL2j2l3J7Pk0J0NK0j3%JJ2
5436A2kj9K4qL%jRRk3NJ6k5J0J4j9oRJ5j4k1lnK7Lk0pNnQJ4mk7PJ3J6l2K9qKj0
5477iK1KK1k5m0M8Mj3pPokJ2k3N5l3Ml6RlMJ5l0K1Kk4L6l5L1k2K2j3K4nk0pLJ1
5515aj3NJ3J0p%lJ0Rk7j4K4Jj2j5K7Jpj8J1j3K2Nj2jj5J1L5l4j0J9J0qj2K4j7
5551bj3OJ3j8L1k3PJ2j0K6Jj7Kj4J9Ql5j9K5J6nj1j1J7Mjj8PJ4k5rJ4LK0j0k1
5587a7QOk5J9klJ4NjK1oKj0NnJ2j1moOjj1L7l0j7K5Nj4J4l0j7K0Lj2J3j3Rk0M8
5626A7k3Pj2OJ6LjrpNPNj1lj0K5k0J5K0j5pj2MPJ9l2RJ4Lk3K1l8J1j6J4LPJ5j5
5665aJj9K4J0%jnJ7k5K8m9L1j1mj7J5K5Nj1Kjj4L3k3Qk2K0jk5KJK3l6L3pk9J7
$$ y = [9, 23, 3, -13, 33, 15, 6, 4, 23, -13, 19, 10, 10, 27, 6, 20, -26, 5, 21, 11, -4, -14, -10, -14, 18, 6, -27, -10, -3, -23, -13, -8, 12, -1, -1, 0, 12, 10, -9, 15, 7, 10, 10, 9, 18, 27, 4, 9, 25, 0, 10, 24, 5, -1, 8, 23, 9, -12, -15, -20, 7, 10, -10, -17, -12, -17, -9, 5, 1, -26, -19, -6, 10, -22, 7, -1, 1, -9, 12, 14, 35, 10, -30, 18, 22, 9, 2, 9, 3, 1, 13, -10, 45, 12, 16, -20, -11, -14, -10, 5, -25, -4, -2, -26, 10, -25, 6, -16, 6, -7, 17, 12, -8, -15, -12, -1, -14, -9, 4, 14, 7, 7, 4, 14, 23, -4, -18, 6, 7, -5, -20, 7, 8, 1, -17, -6, -19, 3, 8, -4, -5, -20, -9, 26, -8, -18, 1, 11, 3, -9, 15, -2, -15, -9, 4, -14, 17, -6, 1, 13, 3, 29, 30, 13, 15, 1, 20, 28, -7, -26, -1, 15, 10, -1, -12, 5, 9, 8, -10, -3, 11, -14, -23, -9, -6, 14, 4, -17, -9, -3, -28, -9, -11, -14, 0, 5, 4, 25, 19, 21, 11, 16, 11, 23, 12, 8, 2, 8, 7, -4, 33, 3, -14, 11, 16, 2, 16, -14, -31, -11, -8, -20, -7, -20, -11, -31, 17, -6, 1, -11, -5, 11, 14, 13, 4, -3, 2, 9, 14, 3, 0, -10, 15, -5, 10, 30, 15, 8, -4, 0, 7, 26, -6, 3, 17, 20, -3, 18, -20, -9, -25, -11, -8, -1, 14, -1, 0, -19, 5, 15, 15, 14, 9, 26, 1, 29, -20, 11, 0, -4, -21, -6, 19, 24, 13, 15, 14, 0, 33, 10, 18, -4, 16, 15, -10, -8, -7, 16, -20, 13, 6, -23, -6]
5702fJ0lj5J7j2kK6qk0N2k2lRl7K1J0J7k1j1Mj1L2Mk2k0K9qjj5K0j4j4J9ok5K9
5738Cj5RQj7oJ1rM2m7M2l8J1j2NK2j8J0j4K2j2NOnOOk2J9L3m1J6j1Pn1M8rjj2
5775iM0m1K7m5J6L3m0L1k0K2jk8LK2j0J1OQlk1KpoJ0Ok9J7K3J0Pj1pk2J0kJ2k7
5812a3NJ4rKqJ6kj7j7K9l0MK4j4M9k0k2L8qkj2j9K7LnK3n9L3mk3K5l2K6PoJJ7
5849B1Ql6Pk%J6Jj3k9LQOK1kk6qK3oQj4J5jL0j4k1j2L1k2qM0l1Rl%PPmJ1j4J6
5889B2l6QjKJ2k5K2k5J7oQJ9j2ok1K8l1J9mJ0J7j5QqJ8j9J9Pl8M2l8K2j0K2Jk7
5925ALqRlj7Lj2O%jJ3Lj5L0j2j3J6Kj2J3j0K3l8J3kJ0J7LJ2j9qrQjPj1L4k4O%
5965A7j0j6RopQJ3l%k0J8QMk2oL8k7kqL7l0NJ5j1pjK5k8K4RrPk5Jl3M3jRk3JJ7
$$ y = [-6, 4, 1, -14, 3, -9, -11, 15, 7, -13, 39, 17, 14, 23, -14, 7, 17, 34, 13, 2, 6, -5, 27, 31, 9, -11, 18, 10, 9, -6, 14, 0, -14, 5, -1, -26, 3, -12, -3, 5, -12, -18, -7, -16, 26, -21, 21, -17, -6, -18, -13, 9, -9, 1, -13, 9, -3, 2, 8, 3, 9, 15, -7, 12, 45, 4, 20, 9, 16, -35, 13, 4, 3, -9, 31, -10, 17, -28, -12, 21, -19, 12, -8, 14, 13, -15, -12, 10, 0, 11, 17, 25, 22, 1, 3, -4, -10, 0, 6, -23, -6, 17, 27, 34, 23, 16, -6, 4, 2, 14, -13, -8, 6, -3, -1, -9, 7, 5, -12, -29, 0, -30, -26, -2, -16, 33, 13, -9, 29, 21, 19, 7, -12, 15, 18, 13, 36, -23, 10, 6, -17, 8, -24, 2, 9, 3, 4, 21, 29, -7, 0, -2, -2, 14, 15, 2, -27, -24, -16, -10, 11, 9, -17, -25, -2, -8, 0, -14, 1, 0, 30, 16, -5, -17, 14, -8, -16, 24, -7, 2, -1, -1, 6, 13, 9, 20, 6, 22, -14, -6, -7, -5, 7, -18, 4, -21, -4, -10, -2, 17, 5, -1, -22, 6, -25, -6, -10, 0, 17, 2, 10, 2, 20, 1, 20, 27, -11, 31, -7, 15, 5, 27, 28, 1, 4, -4, 5, 2, -15, -12, -24, -18, -18, -19, -6, -3, -18, 12, 0, -13, 3, 5, -7, 6, -4, 19, -19, -6, -8, 2, 19, 22, 34, 15, 7, -2, 6, 5, 12, 1, 35, 11, 17, 17, 7, -9, 0, -6, -13, -5, 8, 5, 5, -15, 3, 11, 15, -7, -13, 25, -2, -4, -12, 25, -5, 0, 15, 4, -3, -4, 21, -7, 17, 26, 17, 24, -1, 0, -33, 10, 9, 18, -5, -4, 13]
6006A3k0K1k5K8Mk8K0mj3l7K1ppj6L5OJ0pJ3j5Pj3MpJ5oK0mlNjk0J3K7l6K6ql
6044Hj5qmL5l2J4mK3j0mj4J8Jok2K7j0k2K1mK8j9Pj5rJ6JjknJ8j6J6j3j0NKJ6
6082A1Moj8J1mmJ1j2%K7l7Nl0K0RJ7j8%J0ll1K2LOK2kqk8L4rJ1K0j9jk9L5pMO
6121B2oJ0j6j0J0RrKj2J7k5kj7K0j7jOL4j9J3j3j1L3kl4K4rJ4j3K3jl3K9jOnp
6158IRkj6PmljrLj4PM7l5Qk5J8j1j0Rk2K8oJ6j3j1L1mj2Kj7M0l1J7K8l6K2K1k5
6196A5jj7L3j4KrnoJ6Lk2J4Rk8K0j8onJ7k0J3nJ0J2Rk3LOj4J1J3qj3K5j5Kj3J8
6234IJ6Lk3KKMJllJ9l3J9Rk9K9l8LOJ1m3L4PoMjKj5K2Rk7J9L0l3j0PlrK1rQNJ8
6276C4k8oJ2kkk6K9J0qqj1QMj2j3mJ2j1KL8j8pLK9l1lJ1J2Qpj7QK0j2j8J0KNj3
$$ y = [13, -7, 14, -11, 17, 21, -7, 13, 9, -4, -41, -20, -27, -34, -50, -15, -9, 1, -6, 7, -8, -1, -14, -10, -17, -2, -8, 12, 8, 5, 10, 9, -11, 2, 29, -7, 19, 11, 8, -7, -15, -19, 16, -16, -2, -6, 17, 7, 3, -11, 7, 8, 2, -20, 7, -3, -25, -4, -8, 20, 1, 8, -7, -16, 0, 1, 0, -2, -7, 11, -5, 11, -2, -12, -7, -5, 11, 15, 9, -9, 2, -2, -6, 5, -7, -7, 20, -17, -12, -42, -22, -13, 4, -14, -14, -4, -7, -38, -16, -13, -7, 15, 13, 5, -23, 11, 2, 13, 33, 14, 13, -16, 19, 12, 16, 22, 16, 26, 10, 0, 10, 19, 10, 12, 0, 17, -8, -10, -27, -7, -24, -25, -19, 15, -4, 9, -4, -15, 18, 16, -18, 6, -3, 11, -2, 21, 20, -13, 16, 15, 21, 16, 9, 18, 16, 0, 7, 3, 0, -1, -10, -7, -21, -14, 33, -2, 6, -19, -1, -12, -22, -13, -35, -7, -13, 3, -10, -21, 10, 6, -6, -4, -21, 19, -12, 5, 33, -3, 19, 40, 15, 14, -3, 30, 16, 18, 9, 4, -2, 14, 17, -5, 9, 18, -10, 10, -8, -14, -19, -2, -22, -9, -14, -4, 8, 17, -6, -3, 3, -11, 0, 13, 5, -8, 17, 2, 4, -9, 9, 25, 28, 5, 7, 9, 13, 14, 11, 8, 27, -6, 13, 22, -7, 22, -16, -13, -7, 4, -39, -5, 2, -4, 0, -1, 1, -14, 8, 17, -10, 9, 39, 6, -4, 3, 0, -9, 12, 3, 11, 16, 34, 6, 0, 12, 10, 8, -18, 11, 21, 13, 5, -6, 2, 6, -6, -19, -23, -11, -22, -20, 18, 0, -7, -4, 25, -6, -9, 2, 14, 22, 15, -2, 6, 26, 14, -4, 6, 8, 13, 0]
6315@J0rPJ4j9%J8l2jK4k0L8m4OJJj2lJ1j2QK8k1MKrK6Ll0JM3k6J1J4m2N0k9Q
6353A9j8L0j6pk4J8%NmjJ0j9j1K3Jk6K5JLk9K6kl5J0K0j0J8J2k0j8ML7olNj1K5
6390C2J0j0j1k1OJ8Mk2j7Qk0K4J1rJ1k5j1M8k7nrMjK4k1KjL3l8J3K6j7%J2k0j4
6426a3RK5j3j6K2Pkqj4oK5oqML0o1M0j8Nk2KJ5j1K2k8mnJ0J5LJ2j4Ljj0J0lK1
6464A7j2ORj7J6k0J9j4K2k5PKj4K2k6J0Rm3N9J1l1%rJj8jrM0ppJrQj0k1J3L3j8
6502fK7j1jrQj2K2pj4K7j4oLRk3%KJ3nmJ2j7Mj0nj6KM2m2L1Pj3kJ5j1mrJ6%k2
6542b3K2Jj5K5j2K3j3J%lqlj9L4j5oPJ7J7m9Pj0L9l0j2K4j4J3%jj2J7qlJ6J5j7
6579EROk0J2j1PL0o4N0k7kL2j4J2k0%j1L8k6loJ3l9M6k3J7K1l4pK3j2j1j2rJ9
$$ y = [0, 10, 1, 8, 22, 3, 3, 21, -11, -12, 12, -8, 30, -14, -8, -7, -6, -18, -21, -10, -22, -14, 14, -7, -3, -1, -10, 16, 19, -11, -10, 33, 7, 18, 32, -10, 40, 11, 19, 1, 31, 15, 8, -16, 2, 2, 7, 3, 2, 12, -7, -18, 5, 6, -20, 5, 6, 9, -20, 6, 4, -31, -21, -1, -11, 7, 19, -1, -19, -15, 22, 16, 13, 18, 7, 32, 42, 32, 21, 0, 6, 24, 28, 6, -11, -3, -23, 1, 12, 3, 14, -11, -22, 26, -1, -6, -15, -11, -12, 12, -9, -7, -8, 25, -13, 0, 26, 9, 9, 21, 1, -13, -4, 21, 8, -8, 14, 21, 19, 11, -3, -9, 16, 10, 2, 6, 36, -25, 15, -3, 2, -20, -18, -3, -14, 8, -20, -24, -29, -19, -4, -1, 11, -3, 0, -1, -11, -1, -4, 17, 5, 11, 20, 3, 19, -1, 18, 4, 26, 1, 8, 10, -4, 18, -8, 2, 11, -32, 27, 38, 7, 7, -2, -1, -19, -20, -29, 11, 4, -3, -2, -11, -3, -13, -34, -21, 12, -6, 21, 10, 9, 0, 8, -4, 18, 11, -3, 24, 10, 4, 7, 16, -7, -7, -5, 8, 3, -1, 11, -6, -2, -12, -17, -33, -31, 11, -31, 0, 7, -6, -8, 7, -4, -8, -17, -1, -1, -23, -1, 0, -15, 10, -2, 21, 8, 9, 9, 6, -2, -5, -24, 10, -5, -11, -4, 13, 30, -19, -12, -22, 17, -13, -25, -1, -15, -2, -2, -3, -15, 2, -6, -9, 7, 22, 5, 14, 20, 0, 12, 1, 8, 38, -26, 24, -3, -5, 27, 13, 25, 5, 5, -6, 32, 6, 3, -3, 10, -29, 17, -6, 11, 32, -2, -9, 14, 2, -9, -21, -30, -11]
6614a1J3k1J7MK0k5Pk3QM3k7Nj3KLK3k3Qoj4J4Rj3moJRj1QOj3J9kk2j8K1J4j1
6652ij1K6j4J9oQj0%nJ0K4j4j8jJ6LNk8K1Qk5K7k4Mk6J6OJ4k6Ok4J1J9Ko%K8m2
6690a6J8lj1pK5Jnj6mL4j5K1nMj1oJ5Jk0K2k2JOK0j0j3j8J2J7k9Nj4L1k3J3k1
6726b3K4J2lpk0L9l4J9qLj1qJ4J4J7j6OK7k1lpJ8Nk0J3k6pJ1LOj2Pj5l3LL7mO
6764FmJ1j9JKkmOL2m5L0m1L0j8QJ8J5Mj3j1nK3j5L7m5J2mJ3j4lnK8k6J5jrKj5
6802fJ3j1NKj1Mj0j1K4j8J8NPk8J4J7nMj1j2MK2pRj7QJ1l1K4J2k4lkJ6j3loJ2
6840Bj6jK0rMj3J7j1Mj8K9JJ0Lj9J0j6J8k3%K8l0OJ9mpLjlkoOK8k6K3l4lJ4jk
6880@MKmpl2L3j1J4Ql4MK1j3lK0ok0M0j2Lkj7L1Lj3K5l1J5k6J6oJJ6k2L0j3%l2
$$ y = [-11, 2, -19, -2, 2, 22, -3, 4, -19, -11, 32, 5, 10, -3, -1, 2, 25, 2, 10, 4, -10, 4, 13, 0, -4, -10, -9, 0, -11, -3, 3, -10, 9, 7, -15, -33, -12, 2, -9, -20, 6, -8, 11, 5, 13, 3, 3, -2, 8, 32, 18, 0, -1, 15, 18, 23, -5, 16, 24, -1, 26, 2, 6, -20, -4, 2, 16, -10, -4, -28, -17, 2, 4, -2, -2, 26, -16, 2, -1, -12, -19, 6, 7, 2, -14, -18, 16, 1, 22, 17, 21, 10, 4, 19, 20, 0, 22, 0, 1, 7, 27, 17, 4, -14, -2, 15, -14, -9, -23, 8, -15, -2, -23, 1, 13, 10, 3, -17, 22, -12, 7, -1, 2, -9, -17, -3, 11, 28, 12, 18, 45, 24, 21, 14, 32, 37, 17, 30, 4, -3, 8, 11, 17, 5, 12, -3, -36, -33, 4, 0, 6, 2, 13, -6, -5, -3, -5, -9, -3, 29, -16, 14, -27, 3, -15, -7, 11, 26, 30, 17, 6, 1, 24, 9, 46, 1, 13, 9, 22, 8, 5, 0, 28, 2, 17, 16, 7, 9, -6, 7, -4, 1, 3, -8, -4, -14, -25, -1, -19, -1, 4, 11, -17, -3, 14, 9, 13, 2, -10, -6, 16, 9, 18, 1, 9, 20, -11, 13, 25, 1, -2, -4, 12, -1, -4, -10, 2, -14, -15, 5, -4, 0, -13, 4, -7, -3, -21, 8, 9, 19, 22, 3, 13, -3, 15, -8, -8, 20, -10, -4, 15, 11, 4, 7, 6, 3, 1, -5, 1, 29, 3, 26, -8, -11, 3, 2, 0, 4, 6, 2, -5, -37, -4, -15, -1, 7, -27, -23, -2, -15, -18, 2, -4, -24, 16, 4, 7, 5, -12, 19, 22, 9, 34, 3, 18, -8, 8, 2, 3, 19, -3, 27, 14, 14, -18]
6918a8KJ1J4Mk4JJJ1ok0J1K0j9K0J0j1LL1l5J3J3k6rJ0pJ8k6LL0j1j4L2n1J6O
6953CrJ5l2L0j7jJ0j3j0OOj5K2J8j5lJ8k5jJ6Oj4RJ4m7K0K0K1j8%kPj5Pj8J1J
6990EJ2qNk0nJ8k0K6J7ok4%K0k9K4j1j9L4k6J3mLmK1k9%J3J6j2mK1j3J9j5MK1
7026D3k9J0j5J7oj6K8k4j4J8rj9K8j7L4k9pJ8j6jk3J6K3j6QMJ%j4L0nNj6J8j8
7061GJ4l0ML8j1mk4K5J0j8kJl0J4n%L0l3NK9j8Mok0RqNJ3j4K2mK9m7QJ2J8j3j2
7099bNKK0k1J7j2J0lj9JqK0j8J4LLjj5Nk4LL0rK4j0l2J2J2lJ4l8L9rorJ2Rj7K
7138AK0Rj3Lk3K0j0kPk4K1QNj8j9M4m9K7j5OmQk4K8RJ6l0mK0j0qJ9MrOl2K6ro
7177bJ9j4KMK3k2J9k6Mj4K3onJ9j7l5K8J4k0K2j5KJ4J8l4J3lj9K1MJ3l5mK3Oj6
$$ y = [-18, -16, -5, 9, 13, -11, -10, -9, 2, -4, -24, -13, 7, -12, 8, 18, 7, 10, 41, 6, 19, 32, 6, -3, 7, 0, 18, -8, -5, 25, 14, 0, 32, -19, -3, 3, -6, 9, -23, 7, -10, -11, -1, -14, -24, -18, -12, -27, -5, 13, -2, -5, 13, -12, -13, 3, 9, -5, 4, 18, -29, -9, 11, 32, 14, 14, 12, 19, 4, 11, -7, 4, 5, 17, 9, 14, -6, -11, 7, -13, 13, 30, 24, 0, 0, 20, -9, 15, 4, -15, 19, -7, 6, 2, 5, 1, 22, -7, -7, 6, 22, 10, 6, 27, 14, 33, 18, 22, 43, 14, 24, 9, 26, 20, 4, 32, 8, -6, 12, 3, -16, 12, -5, 29, 0, -7, 11, -5, -6, -29, -13, 10, -6, 2, 6, 7, 7, -7, 23, 18, 23, 7, 25, 7, 21, -9, -5, 33, 22, 18, -6, 19, 29, 11, 9, 10, -20, -6, -11, -11, 19, -14, -9, 20, 2, 6, 0, -20, -11, -19, -14, -1, -15, 7, 3, 32, -15, -7, 5, 23, 10, -2, 3, 5, 25, 4, 21, 9, 19, 16, -3, -2, -10, 10, -8, 6, 9, 12, 11, -4, 1, -23, -20, 10, 1, 25, 15, -17, -5, 7, 4, 18, -20, 19, 10, 4, -5, 7, 16, -1, 1, 21, 30, 17, 20, -3, 17, 7, 5, 12, -12, 9, 17, 22, 4, -15, 29, -20, 7, -8, -2, -6, 2, -22, 6, 15, 31, 1, -3, 17, 7, -1, 18, 22, 13, 19, -13, 13, 4, -2, 17, 3, 5, 9, 32, 10, 29, 3, 7, -7, 16, 10, 5, 24, 7, -28, 0, 14, -6, 16, 1, 3, 17, 35, 1, 14, 11, -8, 13, 17, 30, -5, -9, 14, 20, 4]
7213DOJ3j8K9k9K1%k6K3j0j8L1l6K2j7L3j0j8L1l9L7k3nKrnLnK6l6K4j2j8JK5
7248cM3n0J8qJ2j6J2RK5k5%J8k6QlJ6j3Ql5lK9Ql1K6j4rJ6j7lo%JJ1oJ4j2j4L0
7286A0J4m2K3j6K8j4jkQJk4J0J6j0K0qKPl8K0J4l1%J2J8k2Oj5J7pj2Kj4L4m0N0
7322A6kpnomkJ1pN0m0%J0RJmj1K8l7mNrJ6J3pl3K7rJ7j7qK3Nk2J6k4J5m0J2J7
7361goM3m3J8Qj7L0j9L0m4M0j4Pj1%kj2LKK4k1j6POJ5pk1J2K6l8pJ7%Nj3J6Ll2
7399a8oL5j2j4jL6l7L1j3J7j2J7k1k0K6k8O1l0K7l7Rj0K2%l6N3m1oL0m5N0k9K
7432@j1LPkKKk3K7Kj4%MJ5j4OJ0Ok7J4lJ4Nj5j6J8j3Qj3J5QlplljJ2rK1k8J6%
7473A0Jl1L8k4oj8K5LK3k2qK0J3k5oK6j0oK2k6J3K3LrLk0nJ4j2jLKj1oJ3lLk2
$$ y = [4, 10, 23, 5, 34, 5, 26, 26, 0, 23, 13, -5, 26, -10, 12, -5, 28, 18, 0, 31, -8, 29, 6, 1, 3, -6, -11, -8, -13, 13, -23, 1, -11, -29, -28, -3, 40, -10, 8, 0, 12, -4, 8, 17, 42, 17, 17, 35, 9, 17, 14, 30, 17, 25, -10, -13, 16, 24, -7, 19, 5, -4, 12, -5, -8, -14, -14, -13, -2, -8, 6, -6, -20, 10, 24, -18, 5, -11, 17, 3, 2, 0, 8, 9, -15, -5, 11, 1, 21, 13, 15, 22, -16, 4, 18, -13, -13, -1, 17, -5, 1, -14, 3, -4, -16, -14, -28, 6, -34, 16, 14, 7, 2, -4, -8, -10, 1, -6, 44, 4, 4, 14, 23, 24, 20, 9, 37, 0, -4, 1, -8, 8, 21, 14, -19, 8, -1, 16, -1, -9, 14, 19, -3, 13, -11, 4, -36, -24, -7, -13, 30, -13, 5, 13, -4, 26, 7, 37, -7, 33, 19, 26, 15, 15, 13, 1, 4, 6, 30, 9, -7, 0, 6, 21, 14, -7, 5, 31, -7, -14, 3, 3, 8, -5, 11, 14, -18, -24, 11, -1, -15, -16, 20, -17, 14, 1, 18, 6, 23, 2, -18, 8, -20, 41, 11, 38, 1, 10, 0, 22, 22, -14, 39, -2, -8, 22, -23, 27, -2, 0, -11, -8, -1, -3, -1, 1, -22, 5, 7, -7, -7, -3, 12, -2, 4, 14, 20, -7, 7, 4, 18, 23, 8, -8, 10, -3, 5, -8, 7, 15, 12, 5, 2, -1, -2, 10, 1, 22, -6, 10, 10, 11, -20, 18, -6, -12, -30, -5, -2, 21, -1, -9, 11, 24, -1, -7, 19, 9, 3, 25, -1, 12, 35, 38, 29, 32, 12, 7, 21, 9, 8, 11, 13, 2, -4, 9, 6, 9, -13]
7511a3J2Rl6L6Nl1j2M0kj0K0lj8MK2m2L2j0jjQOj5lJ1lj3K0qJ1NJrk1NNK8j2m3
7550b6%L9Oj9L0j2m4M0j8L7l0rj2lJ9J7k6J6k4RL5o3O2j3%olL4k0qJ0k4POj0J5
7586A2Lk6NL0j6J2k1K0j4j2j0mL7j9Oj7J9Rk0OK2j6L6l7kJ9oj3K0k0Mj7kQ%K0
7622A6Lk3K0j5J7l5RJ4j6oKPk%lmLLj1K4Rj4%J0l2L2J0k0k2N9j2k2LK5l2L0l1
7659dPmK8l3mL4Nj6Lkj5J6k9Rl8L3RJ7J2l2L2moj7K3k3NJ6j0%Rj5KPj3L9n0KJ8
7698A1Noj1RJ1n0L0K6k5J7l6NL8kl0J2rJ7l2L8rj6J6k0J2pRk8L4%j3J5PnKpJ6
7735B4k8J4j5J5rK6Nm5j0L3qJoJ2%nQMk0J5j0J8LnkNj8J7j8K4j4j1JJ7k9J0PJ2
7773A8Mmj0J8l1J0j2pJ6j1J4KJ3j5Nj3J3k4j4J7Rk0ORJQk1L4nj2K5k4J8K4l6j0
$$ y = [-13, -1, 8, -28, 8, 13, -18, -30, 10, 8, -2, 18, 15, -3, 1, 23, -19, 13, 3, 2, 1, 9, 15, 0, -3, 8, 5, -8, 12, 4, 15, 20, 21, 12, -9, -4, 1, 29, 17, -26, -26, 13, 19, 0, 30, 18, -26, 14, -4, 33, 3, -6, -18, -21, -2, 15, -11, 5, -19, -10, 25, -38, 24, 11, 11, 5, 2, 36, 16, 8, 18, -6, 1, 7, -3, 12, 15, -11, -6, 24, 8, 20, -1, 19, 5, -7, -17, -21, 16, -3, 3, -14, 5, 14, -6, 0, 22, 6, 42, 5, 3, 22, 16, 3, 23, 3, 7, -10, -12, -4, -4, 16, 19, -4, 16, 1, 18, -17, -8, 6, -10, -16, -14, -7, -9, -9, -12, -16, -13, -10, -21, 3, 12, -2, -2, 8, -24, 8, 18, -2, -24, 35, 23, 1, 4, 29, -3, 27, -4, 3, -1, 27, -6, -10, 24, 29, 13, 16, 14, -1, 15, -14, -5, -43, -10, -1, 16, 28, -4, 28, 24, 18, 1, 24, 1, 6, 22, 12, 12, 21, 6, 8, 15, 2, 41, -9, -7, 11, 16, 10, -1, 8, 19, -31, -1, 25, 0, 17, -19, -14, 24, 22, -8, 4, -5, 12, -20, 18, 9, -7, 9, -11, 1, -6, 3, -25, 9, 9, -4, 11, 18, 13, 15, 8, 24, -4, 10, -5, 10, 1, 27, 32, -13, -23, 10, 2, 3, -3, 9, 9, 4, 12, 16, -4, 11, 1, 19, 22, 17, 15, 20, 2, 19, 1, 25, 11, 0, 1, 18, -11, -1, 6, 18, 22, 18, 8, 26, -5, 5, -7, -14, 2, -9, 5, 7, 20, 5, 10, -3, 10, -14, -28, -11, -2, -22, -16, -7, -6, 2, -19, 15, 10, -2, 23, -1, 17, 41, 5, -5]
7809eQNK2k7%J1j8N4k5rlnpJ3j3j6K6l5L7k3L6l5rL0n2M3K8l7oK0Mj8K2pJ8k5
7845BM1qm6K3J5jj3o%J4j2Rj7Nl0K6nJ8j9QK2j7j5j2K0k2N0m1OJ2K2m3PqK2K5
7881C2j7pqmQQK0l1K5j7lllL5k2Pk8L3k2L3l2lj1L4NqPj8Lk3K1J3k8%NL2j7k9
7919a3L4k1oQJLJ3j8Pj5LJ5j9M9m9K1K2kj9j4J0jk4K9lj8j1j2J8lJ5Qj0Mj7J5
7955@k1J8J1OPKqj2jJ4qmLM7o5K1K0l2K9l5mJ5pK8om%Kj0Pk0rJ7j8jJ3m3L5L8
7994B5k5Ql3K1J7m5L6QMJ9k3konK4k5orNL6rm5L2j8Qj0J2L1j2kk4K2OQj2k1k6
8031c6J6M4ol2K0JK7k7rKrKOJ6kMqJjRJJ2l9J3j4RJ7l0K3rNmOj9J9j9J7kJJJ0
8072A6k2L2j9Qk8K4Pql9N0l4K7nL5l8qK1oOk9K1j4J7j0J1Ok7K0Qk2kJJ1%k4k0
$$ y = [-5, 3, 8, 30, 3, 3, 14, -4, 50, 25, 16, 13, 8, 1, 14, 1, -15, 11, -24, 13, -10, 26, -9, -18, 12, -40, 3, 31, -6, -12, 8, 12, -6, 16, 9, 27, 2, 43, 35, -11, 12, 27, 26, 13, 7, 7, 21, 9, 18, 1, 6, -24, 2, -3, 15, -4, 4, 26, 9, -6, -18, 2, -20, 30, -11, -5, 7, 29, -14, -7, -15, 7, 32, 15, 8, 0, -4, 4, 12, 32, 1, 26, 9, 6, 3, 0, 35, 13, 20, -8, 25, 3, 36, 4, 1, -10, 24, 29, 21, 28, 10, 13, -10, 11, 24, -4, -4, 1, 33, 16, -13, 21, 0, -6, 2, 3, 6, 19, 1, 8, -7, -4, 11, -8, 41, -8, 13, 35, 33, 14, 0, 10, 9, -15, 14, 11, -7, -18, -30, -12, -15, 0, 8, -2, 2, -15, 0, -21, -3, 8, 14, 21, 23, 15, 3, 2, 16, 8, 4, 7, 54, -11, 10, 30, -2, 27, -8, -12, 3, -4, 24, 18, 14, 14, 16, 6, 13, -7, -16, 1, -17, -18, -5, -48, -13, 25, 0, 8, -25, -4, 13, -32, 4, 12, 16, 35, 12, 10, 4, -1, 23, -2, -8, -17, -12, 24, 15, -30, 2, -16, -8, -18, -6, 25, 13, 11, -13, 9, 15, 23, 11, -10, -36, -20, 24, 18, -14, 6, 7, 34, 7, -2, 0, -9, -7, -1, 15, 13, 17, 9, 10, 9, 18, 19, 31, -8, 5, -9, 0, 17, -13, 10, 1, 6, 2, 8, -11, 8, -11, 6, 4, 5, 6, 16, -6, 26, 7, 15, -13, 11, 18, 10, -29, 21, -13, 14, 9, 44, 6, -2, 19, 13, 19, -10, 11, -3, 14, 4, 15, 21, -6, 14, 22, 0, -2, -1, 10, 10, -14, -34]
8108c4N6k6K6m6J0K1rJ3Jj5j2L8rpJ7j5ppK4j7K0kmJ1k4j2K1MqJ1qpK0Ok2j1k4
8145b7K9j6J2Pl7L8K0j4qJL2l1J0Ml9L5mk7jkK3K2k9K4k5K2kqMrj7J3j5L4k4J7
8181A2qK1k5J8Mk7J2mj6K8
$$ y = [-34, 22, -4, 22, -24, -14, 7, -2, 11, 12, -3, -15, 23, 14, 7, 24, 9, 2, -5, 19, 2, 22, 20, 16, 27, 3, -9, 12, 16, 8, 19, 11, 4, 24, 30, 8, -3, -27, 2, -14, -2, 5, -32, 6, 26, 12, 4, 5, 37, 6, 16, 20, -19, 16, 12, -15, -16, -18, 5, 27, -2, 22, -3, 19, 17, 9, 13, 4, -13, 0, -15, 19, -5, 12, 4, 25, 0, 18, 22, -5, 7, 3, -13, 15]
8191A5
##END NTUPLES=NMR FID
##END=
