##TITLE=1H_Pr 5037-T
 CDCl3,8 sc, 
 7.04.2021
##JCAMPDX= 6.0         $$ Bruker NMR JCAMP-DX V2.0
##DATA TYPE= NMR FID
##DATA CLASS= NTUPLES
##ORIGIN= UXNMR, Bruker Analytische Messtechnik GmbH
##OWNER= root
$$ XWIN-NMR		Version 3.5
$$ Wed Apr  7 11:55:01 2021 Russian Standard Time (UT+4h)  she@DPX200
##.OBSERVE FREQUENCY= 200.131506
##.OBSERVE NUCLEUS= ^1H
##.DELAY= (6, 6)
##.ACQUISITION MODE= SIMULTANEOUS
##.ACQUISITION SCHEME= undefined
##.AVERAGES= 8
##.DIGITISER RES= 18
##SPECTROMETER/DATA SYSTEM= spect
##.PULSE SEQUENCE= zg30
##.SOLVENT NAME= CDCl3
##.SHIFT REFERENCE= (INTERNAL, CDCl3, 0, 15.7039)
##AUDIT TRAIL= $$ (NUMBER, WHEN, WHO, WHERE, WHAT)
$$ ##TITLE= Audit trail, XWIN-NMR		Version 3.5
$$ ##JCAMPDX= 5.01
$$ ##ORIGIN= Bruker BioSpin GmbH
$$ ##OWNER= she
$$ F:/spectra/data/she/nmr/H-F/1/audita.txt
$$ ##AUDIT TRAIL=  $$ (NUMBER, WHEN, WHO, WHERE, WHAT)
(   1,<2021-04-07 11:53:47.64 +0400>,<she>,<DPX200>,
      <created by zg, POWCHK disabled, PULCHK disabled
       configuration hash MD5:
       00 E9 B6 7A A2 85 ED C7 34 08 36 98 17 FE 4E 26
       data hash MD5: 16K
       B8 F4 E6 B3 81 66 5E 5F CF 3F B2 0D 70 2D BE DD>)
$$ ##END=
$$ 
$$ hash MD5
$$ 65 4A 14 B7 DA E9 CF 01 56 24 DD 85 27 57 C6 BA
##$RELAX= 
##$RELAX= 
##$RELAX= 
##$RELAX= 
##$RELAX= 
##$RELAX= 
$$ Bruker specific parameters
$$ --------------------------
##$DU= <F:/spectra>
##$EXPNO= 1
##$NAME= <H-F>
##$PROCNO= 1
##$TYPE= <nmr>
##$USER= <she>
##$AMP= (0..31)
100 100 100 100 100 100 100 100 100 100 100 100 100 100 100 100 100 100 
100 100 100 100 100 100 100 100 100 100 100 100 100 100 
##$AQSEQ= 0
##$AQ_mod= 1
##$AUNM= <au_zg>
##$AUTOPOS= <>
##$BF1= 200.13
##$BF2= 200.13
##$BF3= 200.13
##$BF4= 200.13
##$BF5= 200.13
##$BF6= 200.13
##$BF7= 200.13
##$BF8= 200.13
##$BYTORDA= 1
##$CFDGTYP= 0
##$CFRGTYP= 5
##$CHEMSTR= <none>
##$CNST= (0..31)
1 1 145 1 1 1 1 1 1 1 1 1 1 1 1 1 1 1 1 1 1 1 1 1 1 1 1 1 1 1 1 1 
##$CPDPRG= <>
##$CPDPRG1= <>
##$CPDPRG2= <>
##$CPDPRG3= <>
##$CPDPRG4= <mlev>
##$CPDPRG5= <mlev>
##$CPDPRG6= <mlev>
##$CPDPRG7= <mlev>
##$CPDPRG8= <mlev>
##$CPDPRGB= <>
##$CPDPRGT= <>
##$D= (0..31)
0 1.2 0 0 0 0 0 0 0 0.06 0 0.03 0 0 0 0 0.0002 0 0 0 0 0 0 0 0 0 0 0 0 
0 0 0 
##$DATE= 1617782027
##$DBL= (0..7)
120 120 120 120 120 120 120 120 
##$DBP= (0..7)
150 150 150 150 150 150 150 150 
##$DBP07= 0
##$DBPNAM0= <>
##$DBPNAM1= <>
##$DBPNAM2= <>
##$DBPNAM3= <>
##$DBPNAM4= <>
##$DBPNAM5= <>
##$DBPNAM6= <>
##$DBPNAM7= <>
##$DBPOAL= (0..7)
0.5 0.5 0.5 0.5 0.5 0.5 0.5 0.5 
##$DBPOFFS= (0..7)
0 0 0 0 0 0 0 0 
##$DE= 6
##$DECBNUC= <off>
##$DECIM= 32
##$DECNUC= <off>
##$DECSTAT= 4
##$DIGMOD= 1
##$DIGTYP= 9
##$DL= (0..7)
0 120 120 120 120 120 120 120 
##$DP= (0..7)
150 150 150 150 150 150 150 150 
##$DP07= 0
##$DPNAME0= <>
##$DPNAME1= <>
##$DPNAME2= <>
##$DPNAME3= <>
##$DPNAME4= <>
##$DPNAME5= <>
##$DPNAME6= <>
##$DPNAME7= <>
##$DPOAL= (0..7)
0.5 0.5 0.5 0.5 0.5 0.5 0.5 0.5 
##$DPOFFS= (0..7)
0 0 0 0 0 0 0 0 
##$DQDMODE= 0
##$DR= 18
##$DS= 0
##$DSLIST= <SSSSSSSSSSSSSSS>
$$ [...]
##$SUBNAM2= <"">
##$SUBNAM3= <"">
##$SUBNAM4= <"">
##$SUBNAM5= <"">
##$SUBNAM6= <"">
##$SUBNAM7= <"">
##$SUBNAM8= <"">
##$SUBNAM9= <"">
##$SW= 16.9725357007746
##$SWIBOX= (0..15)
0 0 2 0 0 0 0 0 0 0 0 0 0 0 0 0 
##$SW_h= 3396.73913043478
##$TD= 16384
##$TD0= 1
##$TE= 0
##$TE2= 300
##$TE3= 300
##$TEG= 300
##$TL= (0..7)
0 120 120 120 120 120 120 120 
##$TP= (0..7)
150 150 150 150 150 150 150 150 
##$TP07= 0
##$TPNAME0= <>
##$TPNAME1= <>
##$TPNAME2= <>
##$TPNAME3= <>
##$TPNAME4= <>
##$TPNAME5= <>
##$TPNAME6= <>
##$TPNAME7= <>
##$TPOAL= (0..7)
0.5 0.5 0.5 0.5 0.5 0.5 0.5 0.5 
##$TPOFFS= (0..7)
0 0 0 0 0 0 0 0 
##$TUNHIN= 0
##$TUNHOUT= 0
##$TUNXOUT= 0
##$USERA1= <user>
##$USERA2= <user>
##$USERA3= <user>
##$USERA4= <user>
##$USERA5= <user>
##$V9= 5
##$VALIST= <valist>
##$VCLIST= <CCCCCCCCCCCCCCC>
##$VD= 0
##$VDLIST= <DDDDDDDDDDDDDDD>
##$VPLIST= <PPPPPPPPPPPPPPP>
##$VTLIST= <TTTTTTTTTTTTTTT>
##$WBST= 1024
##$WBSW= 4
##$XGAIN= (0..3)
0 0 0 0 
##$XL= 0
##$YL= 0
##$YMAX_a= 701500
##$YMIN_a= -744975
##$ZGOPTNS= <>
##$ZL1= 120
##$ZL2= 120
##$ZL3= 120
##$ZL4= 120
##$ABSF1= 10
##$ABSF2= 0
##$ABSG= 5
##$ABSL= 3
##$ALPHA= 0
##$AQORDER= 0
##$ASSFAC= 0
##$ASSFACI= 0
##$ASSFACX= 0
##$ASSWID= 0
##$AUNMP= <proc_1d>
##$AZFE= 0.1
##$AZFW= 0.1
##$BCFW= 1
##$BC_mod= 2
##$BYTORDP= 1
##$COROFFS= 0
##$CY= 11.3945322036743
##$DATMOD= 1
##$DC= 2
##$DFILT= <>
##$DTYPP= 0
##$F1P= 15.9154993809931
##$F2P= -4.1035820241983
##$FCOR= 0.5
##$FTSIZE= 0
##$FT_mod= 4
##$GAMMA= 1
##$GB= 0.15
##$INTBC= 1
##$INTSCL= 1
##$ISEN= 128
##$LB= 0.24
##$LEV0= 0
##$LPBIN= 0
##$MAXI= 10000
##$MC2= 0
##$MEAN= 0
##$ME_mod= 0
##$MI= 1.114404
##$NCOEF= 0
##$NC_proc= 0
##$NLEV= 6
##$NOISF1= 3.799351
##$NOISF2= 2.8
##$NSP= 1
##$NTH_PI= 0
##$NZP= 0
##$OFFSET= 15.70392
##$PC= 1
##$PHC0= -11120.4
##$PHC1= 11.80092
##$PH_mod= 1
##$PKNL= yes
##$PPARMOD= 0
##$PSCAL= 0
##$PSIGN= 0
##$REVERSE= no
##$SF= 200.130013532006
##$SI= 16384
##$SIGF1= 3
##$SIGF2= 2
##$SINO= 400
##$SIOLD= 16384
##$SREGLST= <1H.CDCl3>
##$SSB= 0
##$STSI= 0
##$STSR= 0
##$SW_p= 3612.71676300578
##$SYMM= 0
##$S_DEV= 0
##$TDeff= 0
##$TDoff= 0
##$TI= <>
##$TILT= no
##$TM1= 0
##$TM2= 0
##$TOPLEV= 0
##$USERP1= <user>
##$USERP2= <user>
##$USERP3= <user>
##$USERP4= <user>
##$USERP5= <user>
##$WDW= 1
##$XDIM= 8192
##$YMAX_p= 0
##$YMIN_p= 0
$$ End of Bruker specific parameters
$$ ---------------------------------
##NTUPLES= NMR FID
##VAR_NAME=  TIME,          FID/REAL,        FID/IMAG
##SYMBOL=    X,             R,               I
##VAR_TYPE=  INDEPENDENT,   DEPENDENT,       DEPENDENT
##VAR_FORM=  AFFN,          ASDF,            ASDF
##VAR_DIM=   8192,          8192,            8192
##UNITS=     SECONDS,       ARBITRARY UNITS, ARBITRARY UNITS
##FACTOR=    0.0002944,     1,               1
##FIRST=     0,             0,               0
##LAST=      2.4114304,     0,               0
##MIN=       0,             -744975,         0
##MAX=       2.4114304,     701500,          0
$$ Real data points
##PAGE= N=1
##DATA TABLE= (X++(R..R)), XYDATA
0 0 0 0 0 0 0 0 -8 8 -8 8 -8 16 -16 18 -24 32 -40 48 -56 70 -80 96 -112 136 -158 184 -212 244 -280 323
30 323 -366 418 -473 536 -602 675 -758 850 -948 1055 -1171 1301 -1441 1596 -1763 1945
46 1945 -2146 2364 -2602 2866 -3158 3481 -3837 4236 -4685 5197 -5780 6452 -7241 8178
60 8178 -9317 10731 -12540 14941 -18288 23275 -31462 47135 -87279 389209 563264 -744975
72 -744975 -15600 499317 -277156 -118820 324514 -154327 -147621 120752 102229 44311 -203633
83 -203633 -124506 384299 11590 -379740 162998 187134 -218240 78140 110134 -184840 11620
94 11620 126616 1713 -23255 -152509 39963 268589 -160997 -217567 238394 22691 -163418
105 -163418 135612 -9540 -157960 109664 81296 -65288 -62375 -50154 133299 77902 -216630
116 -216630 12541 163562 -129364 25953 111071 -220003 48489 227992 -210861 -37377
126 -37377 183539 -192843 41238 245895 -293238 -89409 357493 -128189 -198528 212687
136 212687 -37856 -123310 162419 -15389 -128412 54055 43350 29433 -29826 -119589 104430
147 104430 106465 -159404 15387 108679 -126903 38515 135457 -155565 -38490 153303 -43903
158 -43903 -38557 35681 -59848 50608 67840 -97591 2329 54699 -44085 47164 17825 -102424
170 -102424 45047 76437 -58255 -7815 4188 -18711 62867 -14362 -62424 50252 -13365
181 -13365 -17918 88534 -83411 -82799 165754 -14599 -149899 113583 25900 -132026 105643
192 105643 52286 -159406 36880 111065 -67133 -42176 23652 10964 16275 -30469 -7717
203 -7717 35524 -49399 5156 86143 -80456 -65611 120798 -992 -89715 46142 9691
214 9691 -32572 48845 -19174 -40835 45717 -10345 -9329 44663 -55748 -24291 94813 -20346
226 -20346 -71230 45411 20733 -22198 14162 -8512 -8310 15466 -2824 19023 -5617 -51690
238 -51690 46876 51874 -75668 -8221 65054 -34610 -8677 44444 -44278 -10718 56402 -20792
250 -20792 -21466 18810 -16983 16627 25709 -46981 -4201 41712 -15574 -10150 9791 -17913 8974
263 8974 18171 -18326 -3507 -2732 -5025 31769 -14030 -45691 37300 21949 -45708 15152 16754
276 16754 -41187 22001 30814 -45843 -8152 32789 -7551 -6597 -2356 -10897 15213 4793 -13786
289 -13786 5239 -6809 -4704 26788 -9872 -28733 21724 12129 -14774 7129 -5615 -9782 25229
302 25229 -613 -22158 13577 2905 -6541 19737 -10243 -21351 26291 10792 -19921 3816
314 3816 3771 -1571 12283 -3852 -10246 7286 3182 3874 3728 -15688 1789 21305 -8020 -11634
328 -11634 9237 -2807 640 12380 -13027 -9767 16583 496 -7822 2955 -7327 773 13280
341 13280 -8978 -10278 6766 640 563 996 -11410 -356 11140 -3633 -7774 -697 -626 3713 891
356 891 -7864 -1423 2266 -380 5028 -4882 -13253 10943 12541 -16665 -6140 14181 -2930 -6801
370 -6801 8107 -146 -10058 3883 13465 -4392 -16787 8090 18979 -11687 -12520 15731 3583
383 3583 -12276 8479 8260 -13637 -521 16391 -772 -11784 1548 10517 4048 -8141 -4210
396 -4210 10699 2333 -8345 5599 5025 -9984 2639 12606 -6100 -10124 6555 8103 -3452
409 -3452 -6170 -1011 6107 3779 -8879 -2767 10267 -4386 -10052 12540 2976 -20802 4496 20771
423 20771 -13322 -19162 15361 11892 -17054 -8402 13791 2564 -16108 -554 18315 -7828 -25567
436 -25567 19000 24649 -36273 -15690 46094 -5240 -45489 26314 29427 -40751 -6496 41913
448 41913 -14176 -32339 25771 19351 -24796 -9844 19805 9352 -15914 -9081 21476 6501
460 6501 -27230 8979 30113 -25437 -18423 39411 1845 -37513 17277 26029 -23771 -6181 20963
473 20963 -6094 -7964 10112 -1386 -1815 3021 -5844 6649 7974 -16489 -957 20997 -9285
486 -9285 -15497 14956 4032 -12764 4852 2781 -6409 5738 -4292 -5702 15554 -9652 -20281
499 -20281 29316 6333 -44400 17748 37658 -42621 -15580 49397 -15455 -39164 34623 14715
511 14715 -38184 3557 25858 -10377 -14846 3119 12557 2317 -22842 3163 29691 -22199
523 -22199 -23944 40330 2238 -45920 23540 33538 -39121 -10908 39339 -8506 -25863 18616
535 18616 10858 -15216 -1088 10578 2207 -6704 -4108 11483 6200 -15854 509 19758 -7752
548 -7752 -14211 16876 5296 -18187 9166 13505 -17382 587 18154 -13042 -5062 18822 -12191
561 -12191 -9186 24241 -9016 -21477 25109 5299 -28934 12979 17539 -23645 -1565 19375
573 19375 -10358 -9961 7946 2218 -1595 -7844 -2987 15422 -6609 -20174 19124 9514 -29442
586 -29442 6402 24701 -22317 -12904 25405 -1547 -21222 7449 12864 -8552 -8665 6650 8007
599 8007 -8461 -7898 13310 3773 -17071 3699 17064 -10700 -11460 14908 5809 -14644 798
612 798 14527 -5663 -10493 12372 5023 -13644 4252 11583 -8464 -2302 8759 -3607 -1005
625 -1005 6145 -4987 -511 8153 -5557 -2517 8902 -3679 -5075 8309 -47 -6143 3484 2399
639 2399 -1219 -1093 -2273 4358 1859 -7919 3140 6367 -8985 -1129 9301 -5695 -5956 6758
653 6758 183 -5528 663 1008 -61 -1263 -3100 2852 1291 -6635 1548 5651 -7062 -3099 7264
668 7264 -2117 -6004 3073 2748 -3119 -2433 2615 1871 -4935 -520 6424 -3603 -5125 7195 1084
683 1084 -7538 4290 4357 -5619 1011 4553 -3070 -610 3563 -508 -234 996 88 2182 -76 -1228
699 -1228 2626 596 -1384 2498 419 -1384 2208 338 -339 1555 -1317 560 3256 -2792 -1540
714 -1540 5035 -1611 -3721 4569 632 -5158 2580 3111 -4519 -855 3092 -627 -2571 -148 1705
729 1705 -774 -2898 1109 1815 -4288 -856 3788 -2552 -3182 2430 316 -2488 -618 451 290 -1430
745 -1430 -1557 1891 -11 -3892 1500 2953 -4316 -1261 4590 -1808 -3261 3151 915 -2461 482
760 482 1976 -398 -1646 853 2698 -1382 -1926 3699 1055 -3382 2444 2769 -3206 733 3695 -1929
776 -1929 -916 3180 77 -1024 1086 805 614 407 -213 1443 -41 -1055 2103 354 -2473 1763
792 1763 1282 -2171 742 773 -1312 1091 -217 -1582 1671 -354 -2191 1933 219 -3250 1340 1369
808 1369 -2869 -402 1141 -1279 -639 -401 -788 654 -1885 -1486 2438 -1804 -3203 2895 369 -3844
824 -3844 911 1472 -1607 -1182 183 1089 -327 -2653 2125 2736 -4536 -168 5554 -3017 -3329 5140
840 5140 737 -3772 2245 2093 -1195 54 192 1712 851 -3146 2269 4199 -4603 -595 6157 -2286
856 -2286 -2835 4337 455 -2255 1656 817 21 407 -1290 1859 1661 -2998 370 3195 -1755 -1402 1672
873 1672 312 -119 -1571 -184 3521 -2875 -3749 6113 -664 -7613 5042 3178 -7636 1252 4222
888 4222 -4055 -580 743 -1190 2110 -3138 -2892 6843 -2941 -8384 9005 1861 -11973 5537 6961
903 6961 -10266 -9 7391 -4997 -1923 3282 -1418 816 -539 -2675 4665 55 -6130 5210
917 5210 3615 -7220 1739 5954 -3971 -2022 4421 155 -2078 946 2169 75 -1755 1700 1692 -1675
933 -1675 1328 1300 -2070 2881 901 -4844 5025 2758 -8186 4364 6521 -9636 954 8788 -7322
948 -7322 -1728 7316 -4642 -670 4101 -5595 2851 3943 -9968 4315 8242 -13512 733 13626
962 13626 -11823 -5692 14411 -5866 -8818 9715 -991 -6116 4055 -1415 -1055 2650 -5392 1499
976 1499 6031 -8028 -1541 9473 -5664 -5908 8422 -175 -6851 3233 3494 -3399 -2022 2861
990 2861 1834 -3383 -626 4878 -1995 -3148 4768 -458 -2978 4001 -1026 -1981 5159 -2794 -2333 7153
1006 7153 -3538 -4214 8893 -2426 -5681 8594 -1479 -5594 7763 -1899 -4958 8399 -2887
1019 -2887 -5760 10086 -2922 -7981 10707 -593 -9719 8828 1567 -8797 5796 1616 -6054
1032 -6054 4420 -536 -4091 5324 -2736 -4673 7613 -2835 -6627 7382 -468 -7546 5039 1584
1046 1584 -5734 1930 1308 -2051 311 -1621 768 1592 -4570 1089 4048 -5735 262 5343 -4981
1061 -4981 -691 4738 -3826 -302 3482 -3574 1172 2538 -4442 2508 2988 -5732 3062 4027 -6240
1076 -6240 2890 4347 -6112 2397 4401 -5797 2316 4030 -5362 2483 3674 -5486 3119 3274 -5509
1091 -5509 3495 3099 -5918 3582 3036 -6316 3558 3101 -5978 3021 2761 -5453 2663 2366 -4883 2717
1107 2717 1405 -4648 2885 809 -4521 3375 391 -4425 3656 5 -4403 3749 -261 -4141 3731
1122 3731 -612 -4020 4021 -611 -3980 3774 -782 -3798 3535 -922 -3192 3441 -1170 -2205 3366
1137 3366 -1894 -1766 3874 -2442 -1750 4244 -2457 -1832 4546 -2219 -1664 4008 -2376 -1004 4064 -2713
1153 -2713 -437 4270 -3086 -331 4580 -3109 -643 4540 -2616 -749 3856 -2444 -420 3293 -2373
1168 -2373 422 2936 -2964 608 3105 -3275 428 3499 -3273 138 3089 -2917 317 2459 -2722
1183 -2722 501 1844 -3161 1269 1707 -3607 1318 1723 -3510 904 1855 -3137 781 1326 -2609 961
1199 961 430 -2421 1432 73 -2846 2106 139 -3257 2257 400 -3134 1916 595 -2770 1751
1214 1751 445 -2332 1787 -130 -1928 2046 -247 -1872 2345 -231 -1705 2445 -401 -1435 2480
1229 2480 -411 -1577 2386 -419 -1169 2423 -730 -1195 2688 -748 -933 2595 -561 -1043 2705 -855
1245 -855 -998 2573 -854 -1064 2443 -924 -872 2191 -1075 -920 1839 -1104 -803 1686 -987 -581 1555
1262 1555 -1269 -672 1353 -1347 -511 1147 -1322 -321 980 -1650 -294 856 -1579 -169 791 -1451
1278 -1451 32 554 -1156 155 301 -1275 554 98 -1561 991 302 -1933 1049 765 -2131 1049
1294 1049 966 -1615 822 1014 -1488 771 757 -1402 1074 805 -1415 1263 1043 -1614 1054 1160 -1373
1311 -1373 466 1157 -787 416 805 -541 391 514 -383 779 199 -607 823 333 -531 426 219 -351
1329 -351 446 -281 -11 799 -644 -11 810 -835 -193 1182 -828 -660 751 -491 -634 557 -604
1346 -604 -255 671 -943 -397 1088 -1182 -764 1262 -1140 -1265 1458 -488 -1481 852 179 -1376 518
1363 518 166 -842 322 39 -684 420 22 -670 519 379 -772 263 712 -565 -312 806 14
1380 14 -521 458 395 -412 165 909 -34 232 596 -204 92 763 -239 60 1131 -492 -291 1409 -236
1399 -236 -909 1603 244 -1116 1233 572 -978 799 428 -944 639 246 -1163 733 397 -1341
1415 -1341 669 761 -1540 33 1086 -1470 -452 1328 -762 -970 1055 -475 -785 705 -386 -714
1431 -714 436 -262 -914 377 -95 -1126 668 38 -1015 379 533 -1093 -131 724 -783 -172 815
1448 815 -343 -540 791 -27 -541 939 186 -662 760 382 -848 799 655 -885 693 927 -624
1465 -624 425 963 -728 361 1150 -568 215 1144 -521 -108 1381 -425 -303 1271 -393 -456 1060
1482 1060 -39 -658 952 102 -625 515 104 -353 261 -52 -700 239 205 -664 76 199 -609 55 241
1501 241 -595 -251 349 -290 -344 65 -200 -580 60 154 -594 -43 15 -596 -149 172 -659 -187 370 -431 -111
1522 -111 514 -324 -179 666 -261 -460 573 23 -173 801 -197 -477 744 212 -286 716 66 -238 451
1541 451 327 -322 477 311 -144 553 234 12 338 327 124 183 322 -99 294 386 80 146 145 -97 -153 -20
1563 -20 28 14 -189 101 -139 -211 -7 -199 -399 43 -138 -441 -3 -18 -530 183 -31 -558 130 -89 -565 -137
1585 -137 44 -472 -12 18 -502 114 151 -420 94 314 -469 -5 209 -373 16 252 -202 -146 112 -145 32
1606 32 294 34 -32 166 -26 99 285 155 20 211 99 168 25 178 198 60 225 181 -122 315 343 -79
1628 -79 227 329 -176 183 168 -114 166 132 -174 -48 146 -214 -110 390 -269 -81 221 -215 -124 104 -240
1649 -240 -314 117 -273 -129 134 -184 -222 2 -82 -352 49 -170 -163 -44 -277 -244 -173 69 -109 -233 -89 -33 -289
1672 -289 -32 51 -164 -56 217 -120 -26 136 -51 -24 169 131 -149 430 41 -51 345 0 -12 218 226 -79 238
1695 238 131 33 309 224 -136 349 100 2 154 217 84 20 253 -98 -26 119 -1 -8 139 70 28 111 34 54
1719 54 -51 41 -169 -257 -26 -47 -191 54 31 -136 -92 230 -537 -177 47 -619 2 65 -334 -191 304 -318
1741 -318 -157 179 -210 -310 247 -316 -293 197 -196 -239 249 -243 -310 252 24 -286 311 27 -339 228 146
1762 146 -171 169 167 -141 76 185 39 33 137 159 -15 19 207 45 -51 172 106 101 381 51 -10 246 -73 -40
1786 -40 480 -15 -280 378 -52 -326 247 187 -341 168 222 -351 190 48 -258 57 195 -428 5 103 -293
1807 -293 -244 185 -435 -133 214 -530 -136 56 -348 -246 -3 -111 -86 -16 -99 -186 91 5 -60 -58 -40 -154 -19
1830 -19 -92 -65 -332 115 50 -159 120 123 -127 67 207 -256 262 356 -160 196 396 -184 59 514 45 13 440
1853 440 -6 -17 426 -158 -12 404 46 -61 356 42 -352 524 -44 -223 307 83 -384 224 128 -363 251
1874 251 94 -430 226 37 -221 26 -42 -175 -46 87 -202 -102 -87 23 -185 70 -84 -244 -280 122 -48
1895 -48 -22 25 -215 -170 42 14 -359 53 -5 -266 163 18 -412 225 -54 -407 182 256 -326 298 206 -328 102
1918 102 338 -163 159 325 -136 194 192 -121 167 300 -159 175 327 -10 11 158 60 30 266 -30 -85 241
1940 241 -142 6 239 62 -5 71 -52 -17 -53 -96 100 7 -47 -221 -135 -28 89 -225 -68 173 -134 -147 -99
1963 -99 -269 -153 123 -186 -270 116 -287 -260 277 -169 -370 424 -173 -319 152 -197 -268 267 -206 -58 247
1984 247 -141 -271 264 86 -131 188 14 -86 256 -136 78 136 -73 33 158 111 243 268 37 158 195
2005 195 -16 48 195 -89 13 139 -207 80 3 -37 245 127 -165 82 171 -90 235 131 -205 129 131 -396
2027 -396 242 44 -365 98 49 -245 23 55 -355 230 142 -436 -99 138 -232 -5 102 -473 63 154 -385
2048 -385 58 106 -238 -99 -80 -85 100 -81 -233 54 136 -99 120 0 -6 119 -11 35 235 4 -112 263 -16
2071 -16 -29 262 5 -1 407 -70 7 313 -165 -26 344 44 -89 226 -201 -13 310 -42 -63 332 -134 -84
2093 -84 302 -206 -74 377 -152 -280 313 -73 -295 142 -154 -370 85 46 -31 113 -107 -65 55 -149 -101 76
2115 76 -88 -168 16 -240 -260 -107 -279 -1 -70 -191 -61 -13 -335 -155 8 -190 47 105 -170 28 23 -242 -5
2138 -5 162 -122 145 48 -171 31 81 -55 93 256 -78 68 105 -96 248 193 -205 272 225 -33 246 144
2160 144 -44 91 107 -73 319 202 -6 93 32 -133 345 174 37 17 56 -78 170 -187 -125 220 -78 -126
2182 -126 12 -155 -301 74 -125 -56 94 -141 -158 208 -205 -203 23 -261 -181 102 -117 -176 -44 -95 -208 122
2204 122 122 -99 50 14 -59 98 -47 -12 -37 -44 -170 209 112 -89 109 6 -39 83 78 69 76 51 77 14 120 206 99
2231 99 -36 255 9 -29 79 286 -69 -22 115 -95 72 38 -27 103 79 -82 145 150 -28 180 -30 -256 244
2254 244 67 -155 -46 246 -67 -74 111 -102 -43 -18 -280 4 -46 -165 -42 -172 -67 7 83 -104 -273 -124
2276 -124 -141 0 -95 -43 -117 -61 -103 5 72 51 -194 -133 -76 83 -55 15 92 -66 14 60 -207 1 209 -72 -16
2301 -16 264 86 56 210 -6 23 314 -46 72 284 -38 -20 172 -114 86 256 54 -36 165 96 -104 283
2323 283 133 -236 49 -170 -159 -8 -56 -145 90 42 -145 -17 116 -103 -41 -57 -108 -146 -7 5 -155 -32 -198
2346 -198 6 -69 -64 -62 -91 -9 -30 -26 178 69 -144 -78 -59 -49 36 -59 -74 210 -170 -59 204 217 -77 103 -44 -120
2372 -120 11 -108 -36 66 -19 -6 376 12 37 222 -21 -64 59 238 98 117 76 -8 207 71 -210 -68 110
2395 110 80 88 -79 47 84 -70 -34 35 54 -151 -26 -220 -52 32 59 -31 -41 -189 -21 93 4 9 2 -38 -66 -197
2421 -197 93 -106 -42 84 -104 -64 -193 130 -137 -11 -103 -81 -127 87 -3 46 -5 -11 -83 14 -118 -32 -43 -61 -123
2446 -123 39 55 121 -11 6 94 80 92 -133 196 61 -62 131 184 85 143 41 -93 137 230 83 -43 161
2469 161 4 165 84 19 170 38 -121 -36 -15 -16 -46 84 -59 -151 45 -71 -109 -28 -3 42 -14 -56 -56 51 -124
2494 -124 -15 -33 61 -170 -209 15 0 5 -24 157 -95 -65 -135 -115 -12 62 -153 -121 -54 -216 2 112 -160 -63 157
2519 157 -187 159 148 -51 -4 187 40 -104 -31 47 30 88 -60 -71 246 46 -197 1 78 -202 222 67 -34
2542 -34 81 182 -225 35 205 -90 137 30 -27 -46 -84 8 -68 129 -53 64 87 -71 -96 56 43 -94 1
2565 1 34 -169 -46 89 12 -233 -29 -14 -9 78 -54 -132 67 -28 -158 26 -50 -126 82 89 -203 -80 58 -213 -97
2590 -97 -73 -83 -36 -34 -104 3 -47 -223 66 -26 7 -4 89 -16 112 164 21 88 108 43 74 8 100 -7 270 -3
2616 -3 -15 235 12 -10 134 124 -95 100 233 21 97 45 -7 -21 211 -62 -12 142 -52 -83 -14 28 -187 -30
2640 -30 85 -93 144 131 -151 -83 90 -201 -17 84 -140 -80 -30 -39 -159 4 -45 -52 -31 -21 -279 -143 84 -149
2664 -149 57 -27 -105 48 -5 -211 -43 45 -46 -50 95 -24 -188 27 76 -19 61 6 -53 22 136 4 25 29 9 65
2690 65 138 36 -41 147 2 -54 221 7 -28 130 -156 147 198 -143 -72 66 -94 -243 101 129 -161 96 16
2713 16 41 -61 -101 -61 10 -20 -276 52 114 -110 34 81 -53 31 -68 -69 -132 -40 -59 -185 -40 -16 -159 63 63 -90
2739 -90 -36 -62 -184 28 -53 28 -2 46 49 77 131 -93 -76 38 -12 -67 95 127 -78 177 78 -86 48 192 -244
2764 -244 74 206 14 80 130 -118 104 113 -113 104 296 120 17 54 -62 -47 201 27 -85 251 27 -80
2786 -80 168 32 -94 45 30 -13 2 -27 30 -4 -14 -52 -51 89 -164 -209 137 -62 -33 34 -128 -148 -12 127 -47
2811 -47 -24 -17 -129 23 74 -158 45 17 -83 118 205 85 -4 70 -113 22 -91 87 -11 282 51 157 224 73
2835 73 -64 23 -95 55 271 -30 -32 58 39 -161 54 188 -26 108 -53 -109 109 111 53 151 156 243 7 -3 57
2860 57 26 40 -180 111 34 20 -21 92 178 -79 32 -182 -56 -3 -67 -103 -10 83 95 -147 6 -108 -60 29 -56
2885 -56 -89 3 44 0 79 -222 70 132 70 -27 63 -188 -4 -8 -1 -37 -33 77 -119 103 8 191 -39 175 -6 -1 126
2912 126 -137 238 139 -31 16 70 193 29 142 -46 -17 15 30 81 -93 -165 64 -28 198 30 -17 43 49 -34 -115
2937 -115 209 -30 -1 -53 -121 93 -68 39 15 -55 -21 -14 -93 -74 158 -80 -117 31 94 -32 -56 -121 -165 221 -83
2962 -83 -91 -125 -156 -206 -1 -26 -211 46 -61 -173 34 18 -259 79 70 -94 103 62 -79 -10 81 -3 74 -75 127
2987 127 -32 123 127 -36 10 65 41 184 -53 128 -20 -11 -8 -16 85 -7 39 77 114 16 295 76 -58 -16 12 63
3013 63 78 107 -53 66 -136 63 38 73 -193 -87 181 -124 -104 177 -46 -83 101 -154 -61 46 -114 -55 53
3036 53 -176 -140 93 -58 -54 70 -46 -6 201 -31 147 -11 5 34 222 -59 4 74 -73 -80 64 -150 8 101
3060 101 161 80 203 -51 104 60 96 86 -90 76 57 17 33 174 44 75 243 -22 -135 144 -32 -154 235
3083 235 -66 -212 182 -123 -104 218 -140 -127 8 -112 -140 130 61 -15 182 54 -113 61 -59 -158 90 -251
3105 -251 -233 130 28 -110 -9 -70 -17 65 -56 -69 22 -61 -44 20 100 30 -98 -49 -36 25 59 3 203 -94 -32 -45
3131 -45 44 -58 74 -75 56 102 -14 114 121 -221 53 134 -192 95 -64 -132 169 246 34 27 78 -40 25 87
3155 87 -200 105 -22 -163 -29 31 -75 134 109 -231 -89 206 30 33 -48 -49 -49 -125 -22 -65 -12 -24 35 0 -27 -138
3181 -138 71 -122 -19 -18 44 -24 -166 -93 -111 -69 -297 199 21 -126 130 -40 -34 12 -107 -41 151 -227 -60 62
3205 62 -18 111 125 -143 12 188 -135 -125 130 -76 -92 149 23 -22 87 37 -103 304 -122 45 197 69
3227 69 -112 184 73 -25 -40 -23 -36 78 -11 72 56 -97 104 42 106 -62 -147 11 70 6 20 -50 -201 -20 173
3252 173 -199 -45 169 -236 -31 288 44 -111 40 -178 -178 30 -25 -196 162 -5 -426 29 22 -143 30 -37
3274 -37 -44 75 -15 -226 39 150 -84 -30 -24 -195 1 -53 -124 78 11 55 117 -9 92 86 -9 -213 -30 219 44
3299 44 -5 -21 -58 72 -15 68 8 156 225 -60 109 297 0 -17 184 81 -79 -29 34 220 23 46 -193 -55
3323 -55 -19 -80 118 -26 -14 37 160 -26 134 22 -26 99 29 -78 -62 25 -170 36 155 34 -167 194 -132
3346 -132 -88 1 -9 4 -149 -64 89 -61 -47 -206 -15 118 -81 76 -73 -35 112 -53 19 -105 97 -33 -41
3369 -41 -18 85 -36 -170 -97 107 98 -34 -24 77 6 104 113 21 6 90 -49 -74 69 25 6 -27 -50 -103 -56 30 -89
3396 -89 188 178 -23 -4 29 -38 48 52 -2 -2 52 -92 -45 166 -9 21 107 47 -8 -43 88 -101 -55 -87 -111 77 71 5
3424 5 -52 120 -79 55 -38 -112 42 -137 28 -203 8 -196 8 182 -36 -107 -29 -59 -109 -1 -13 -101 51 31
3448 31 132 0 -12 39 -49 -8 -35 11 184 -55 -5 -26 18 -94 23 64 -190 270 188 -9 75 125 99 20 206
3473 206 37 -39 47 -32 0 29 -45 70 128 34 -93 84 -26 -41 51 -211 -126 137 19 -17 -63 -18 -165 189 -80
3498 -80 67 48 32 -86 -127 59 -103 48 118 -126 -108 -89 -46 47 81 -140 2 -53 1 -71 -54 21 -104 22 -17
3523 -17 -86 69 107 56 29 -44 -91 96 113 125 -52 93 -72 5 137 -77 94 116 78 42 89 124 66 85 -2 -30
3549 -30 30 23 -9 -9 -11 36 -104 -176 84 120 -19 86 -30 -21 -34 -159 -12 -173 -43 48 -103 85 68 123 -53 40
3575 40 -103 6 32 68 -7 -110 180 -60 -56 -38 -74 -95 -56 67 -77 33 -145 -5 103 -20 26 -11 -183 -95
3599 -95 8 -56 34 -181 -77 2 119 47 10 -207 -27 -30 22 65 -112 65 85 -123 156 13 32 -18 -1 -68 -61 27
3625 27 -42 -93 186 11 -7 -7 -146 26 103 11 -12 -18 138 36 66 35 -201 -76 115 -126 -26 95 -9 -67 58
3650 58 -43 -5 -59 -150 -45 49 144 -9 25 4 24 63 134 79 32 -101 -51 134 -2 121 -128 -57 -116 -49 167 -113
3676 -113 55 125 66 -157 -30 190 12 69 92 -118 75 94 -93 -82 235 -27 -136 90 33 -129 203 107 -301
3699 -301 42 114 0 83 -36 -81 63 121 172 79 29 -12 39 -94 13 -56 -22 -93 -107 6 -144 60 -106 -124 16
3724 16 -87 57 -134 -1 51 -122 17 184 -56 -104 59 -89 -56 -62 -58 -100 -30 1 -10 108 -60 -147 162 33
3748 33 -3 37 44 -143 -52 163 14 115 233 47 -48 -2 105 -6 96 8 -35 -10 8 71 100 284 -16 119 30
3773 30 152 104 36 -72 35 23 -89 -51 -14 48 -79 -178 -64 15 -4 26 -44 -60 -10 -50 -43 -25 -84 -120 -41 37 -152
3800 -152 -34 -102 -99 -127 -46 -135 140 -5 -149 47 11 -73 -60 -54 17 -18 -115 58 103 -206 64 84 53 -104 39 35
3826 35 84 40 209 -60 12 50 -139 -4 -99 59 103 23 9 -56 200 -29 -48 111 -63 -157 -36 55 130 -56 -27
3851 -27 -106 138 -43 7 -61 25 49 124 -143 -174 4 82 9 159 43 83 -20 107 128 -186 121 -1 -85 -8 -18
3876 -18 23 82 -85 6 -96 -34 -98 144 18 -64 50 33 1 -25 26 7 -83 44 -39 36 29 -94 166 169 69 49 -67
3903 -67 8 111 -7 -92 -17 65 13 -52 83 30 8 23 116 -25 168 -180 -41 161 -32 53 48 -18 -89 -103 136 -81
3929 -81 58 80 -141 -67 86 -52 -67 0 -214 21 86 -151 -29 -2 -80 -214 -19 -20 -32 -157 85 -44 -81 -86 -119
3954 -119 104 -39 -5 -146 148 -79 122 126 -84 48 -190 18 -155 169 51 -161 21 101 -193 111 -95
3975 -95 16 49 -133 33 -39 17 -72 -79 24 32 37 -43 -83 83 -11 -104 119 -5 -125 94 40 40 184 -49 -59 68
4001 68 16 -132 -121 86 33 -49 3 35 190 49 84 101 147 -69 -9 -32 19 16 -15 -27 -39 98 33 -13 29 -8 43 -17
4029 -17 83 -26 66 51 8 77 -30 -56 -26 20 -90 -95 1 -83 30 48 -88 -60 13 -40 -36 55 38 -167 36 51 16
4056 16 147 21 -63 -115 68 -31 96 -74 95 45 -60 31 -46 74 -64 21 120 -34 -86 -14 190 33 -70 82
4080 82 63 -8 -180 -52 -31 -157 65 2 55 -19 70 -77 52 -24 -15 -74 -38 -38 -1 26 -67 -55 39 -130 1 -22 -32
4107 -32 0 -25 -153 -7 -119 -122 127 -36 -195 18 158 -77 -92 -69 -225 112 33 88 -24 -100 -54 139 -136 -25
4131 -25 73 -116 -73 -72 -108 3 15 -47 -8 27 -41 1 -54 -26 -36 44 68 93 11 69 108 -43 3 -37 57 -33 -75 107 -125
4160 -125 6 -79 -47 -21 -66 -15 -94 -31 -9 106 -143 95 95 -44 27 -54 -39 -88 3 -99 6 8 -8 -81 17 -90 -133
4187 -133 88 -110 -37 50 -123 53 230 -135 40 44 -29 13 72 -13 -9 50 -62 -13 -17 -295 12 20 120 -184 -110 51
4213 51 -3 67 -52 22 7 74 -21 18 -176 -58 -50 167 54 137 162 79 -11 76 65 84 75 -122 -95 127 61 -111 167
4240 167 40 -105 12 -73 -171 -3 184 -40 -24 4 39 -137 43 208 -61 87 17 -182 109 -24 58 -14 -4
4263 -4 -126 202 -67 -125 117 -67 -48 92 5 -46 106 -17 38 66 -95 -188 89 -96 3 -61 4 25 -136 61
4287 61 46 200 92 5 -61 70 -129 -67 101 -12 -103 -53 -43 -49 -125 28 18 34 -126 112 174 52 20 -131 43
4312 43 10 -149 -36 22 60 -147 -77 81 34 45 -79 -32 18 89 -12 -31 -105 -50 -27 119 111 -29 -35 40 20 -59 118
4339 118 -13 74 183 -27 117 138 -19 -118 9 -9 -118 -28 -8 23 174 -73 -203 -85 91 -53 109 141 -90
4362 -90 66 81 -200 -54 23 172 -40 101 111 -166 29 39 -76 84 -76 -54 -12 23 38 82 -4 -35 9 46 -105
4387 -105 46 114 -85 -57 94 -107 -89 179 -115 83 -27 -21 41 88 -177 -122 137 16 -120 -225 57 13 -24
4410 -24 25 21 -113 -109 -99 -41 -34 -77 68 -72 -174 23 27 -28 29 94 -10 -66 -2 24 -52 -12 43 77 -10 56 -158 -130 38
4439 38 -93 78 -77 -62 117 220 -28 43 100 -41 70 82 -103 -56 71 -78 106 -142 121 273 8 51
4461 51 17 139 -69 0 -246 78 -16 29 -266 84 58 -84 -61 173 15 -82 -88 -99 -1 -60 6 -48 -10 -20 51 -8
4487 -8 163 74 -81 -133 66 -111 -91 30 62 24 62 -148 78 28 -30 -26 -10 -45 47 -56 -35 28 -163 -35 -35 -17 -83
4514 -83 36 52 34 -123 70 -123 17 -67 121 214 35 107 20 21 -66 -1 52 119 6 -83 -120 -28 164 -36 -82 40
4540 40 229 76 31 -13 69 28 191 -26 115 42 157 45 -13 277 142 -107 -39 90 -21 -109 14 -106 -48
4563 -48 -17 -19 -56 -12 58 63 91 -63 -33 -18 -59 47 12 18 -91 -2 130 -139 -79 113 110 -6 -27 110 51 36 50 -107
4591 -107 40 31 -192 -65 -132 4 -78 65 36 -71 48 180 -38 112 146 -82 107 -145 -21 -59 57 22 -21
4614 -21 -65 13 150 88 96 -66 42 -1 156 5 -26 15 -78 -110 120 19 91 100 75 109 -6 151 20 -135 -27
4639 -27 -14 -140 -119 -1 39 28 75 -36 120 97 15 32 99 -22 132 96 28 -70 29 -61 48 15 -53 2 162 12
4665 12 -3 -27 -65 1 59 141 -186 -10 29 107 6 181 -77 73 51 74 -14 -12 85 -3 21 -13 12 -38 -59 -54 65 -137
4693 -137 -40 9 56 106 35 -81 11 -37 -88 -171 -118 71 72 82 -175 -91 -44 62 -36 -36 37 -3 97 -116 -113 134 36 142
4721 142 -2 74 -176 -52 -83 -96 -49 59 93 3 -64 -33 42 -27 -56 -54 65 177 -1 128 -36 96 -37 5 -111
4746 -111 -67 46 60 -33 74 -111 69 -80 115 99 -93 -44 99 5 95 -64 126 89 -98 -25 -51 -21 -87 -9
4770 -9 -147 93 -13 -82 -53 106 -161 74 -2 -93 166 100 103 22 6 6 -28 37 38 -91 211 73 1 -62 -11 78 95
4797 95 33 -20 60 42 -5 -42 58 84 127 7 -42 44 -48 -75 17 68 142 -34 -58 94 12 91 55 -40 -20 63 212 33
4825 33 147 9 12 9 -73 55 5 124 40 32 4 -18 28 -130 105 -37 60 -159 -19 -28 13 43 -171 -109 80 8 -89
4852 -89 147 125 -35 -8 49 -56 137 1 -80 40 128 -42 206 -150 97 106 15 -139 -14 -2 -63 -30 -27 -59 94
4877 94 158 93 6 80 11 -64 2 241 -137 127 46 -77 194 12 64 -12 51 -2 -56 0 7 -169 18 -58 -19 87
4903 87 75 72 -36 -43 -39 58 111 90 117 221 -84 -71 -77 -111 -66 132 -73 -24 -110 -68 25 62 82 -29 -16 72 66 -27 -39 27
4933 27 -158 -46 -90 110 -83 -197 -85 -80 -19 -109 23 -72 58 -22 9 201 88 -97 -26 -10 108 80 -13 -64 -164
4958 -164 -15 223 72 -223 -82 16 -106 -139 17 -71 88 60 -139 1 117 -16 -9 -31 -186 0 93 63 -107
4981 -107 -18 -32 137 -28 -42 -28 -35 -37 10 38 -120 -16 -26 -83 -212 39 -79 -91 -14 39 -36 126 24 20 -115 70
5007 70 18 63 -84 73 -27 20 -70 -29 -85 -78 9 36 18 -176 84 -16 -3 -87 12 -36 187 160 -76 34 61 -38
5033 -38 23 158 63 112 -114 -58 64 195 -48 -169 -54 -48 -78 53 49 85 2 -49 71 206 33 94 29 -1 134
5058 134 -128 -2 59 86 -20 53 -93 99 17 -38 163 2 -46 -142 -126 28 -118 -9 23 -121 72 -31 -121
5081 -121 -13 33 -117 -81 -49 89 59 -164 -64 209 -42 -114 279 -83 37 2 -47 -11 39 49 147 -19 67 -104
5105 -104 138 -95 -95 -162 -43 67 -81 61 115 81 -54 -14 140 42 -114 -19 88 -126 132 -73 211 71 91
5128 91 -74 41 -105 -12 93 -125 106 -67 2 -49 35 -86 -83 -32 -96 -21 168 124 50 18 211 22 -54 18 38
5153 38 196 -92 -43 42 15 -110 -81 -1 -72 37 -144 42 54 -25 50 82 7 -157 -33 -96 59 9 12 215 46
5178 46 -25 -74 52 39 -28 -4 -115 126 -101 -164 70 57 -157 -89 -40 28 -59 -14 -39 -93 95 145 75 123 51 -77
5204 -77 -30 125 -12 65 -30 23 -31 -8 -69 -90 28 32 86 47 150 -9 36 -109 -132 -52 133 -90 148 -108 -181 180
5230 180 49 40 25 -69 -129 -11 35 53 -29 56 -57 15 45 23 36 -81 139 170 70 -14 20 37 175 -72 71 3
5256 3 -56 -67 136 -46 -99 106 -160 -35 111 -32 -161 42 37 -58 114 88 -17 -92 -129 45 -2 136 40 62 73
5281 73 58 -25 48 -6 89 92 -86 -45 37 -11 60 -17 -61 32 3 -5 1 111 17 -75 38 55 -26 -49 46 -72 -154 -24 -93
5310 -93 14 163 52 -47 -1 34 -52 -56 124 48 -74 -32 -118 -66 23 -47 0 173 -88 -49 -44 10 -75 37 31 -72 29
5337 29 -123 -102 155 -45 -34 -103 -41 60 68 53 36 171 39 28 44 -19 2 2 72 -88 -100 -48 113 -42 49 40 -66
5364 -66 19 108 -104 19 82 -4 124 -44 -2 -79 43 -8 16 -52 -145 -135 -88 83 59 -3 32 -47 -17 118 14 44
5390 44 19 -138 135 -61 -52 -72 82 92 -97 88 13 -67 -3 40 20 -67 15 118 61 -20 -20 -118 15 -177 5 -9
5416 -9 43 -128 45 31 6 -232 -55 40 27 111 -49 111 185 65 -41 61 -66 75 -39 16 26 -12 2 -36 -64
5441 -64 88 -6 69 -82 -98 54 180 -45 63 -34 -14 166 -200 -2 -23 4 15 -75 -13 170 -80 -155 155 -128
5465 -128 165 -164 -22 -12 -66 -42 129 -151 30 43 -89 -11 30 10 43 105 -81 35 -132 -86 -80 -8 -160 -55
5489 -55 -171 -38 -68 29 53 130 -68 -23 -58 -43 20 -54 36 -51 -60 -195 59 -89 14 12 98 -48 -94 5 -8 89 79
5516 79 -190 89 16 -82 -266 -94 46 33 44 87 30 -200 54 85 256 14 -44 -145 11 67 36 9 -122 -13
5540 -13 39 -112 -143 0 15 112 43 -75 -29 22 -68 78 -180 -39 54 16 16 24 7 -6 -47 45 -19 -108 -73 -68 60 -6
5568 -6 -129 -2 178 -95 80 -22 5 -84 10 -62 126 52 151 32 -24 71 27 20 94 142 42 -70 139 -70 37
5593 37 -67 -110 -191 8 -39 -75 -3 106 2 60 0 32 27 -11 28 -83 114 45 37 110 51 102 126 -70 22 45 85 84
5621 84 -17 -145 -40 -100 -16 181 5 249 -29 7 -214 133 -136 -20 74 -2 6 16 28 21 -94 3 21 -115 -4
5646 -4 -34 126 -64 30 -174 -3 59 8 21 166 -86 -47 -146 -17 48 14 85 -39 127 161 51 -121 31 112 14
5671 14 189 16 -90 -6 1 -15 25 21 -24 -50 38 59 -63 59 20 40 -1 77 -85 86 -108 -71 -73 -68 16 -129 8
5698 8 -18 150 -21 -38 -31 21 -26 -3 -49 189 -54 88 150 -63 -6 109 -206 -20 -16 33 20 -154 97 21 62 64 60
5725 60 83 -23 138 59 58 -81 -35 -11 -81 -38 222 -81 236 -41 -137 -110 -31 -115 -57 42 -33 -141 -158 -61 -10 104
5751 104 12 -62 156 -6 -60 -115 103 -52 8 69 16 90 122 -87 43 -80 -99 93 33 -24 24 -14 -55 58 0
5776 0 -11 -11 -89 -72 -15 -77 70 -30 172 59 -19 27 53 24 83 -162 16 -111 -3 -108 66 -16 -124 -31 -139
5801 -139 -26 -17 -139 54 -127 65 89 -66 -56 79 -11 -132 12 70 -31 -34 51 -193 33 -43 -111 83 172 152
5825 152 -65 85 -90 -25 29 -60 -142 144 -28 -32 -30 101 -52 125 4 -94 -18 25 -5 86 101 -16 24 -165 -100
5850 -100 160 62 19 -45 -5 22 50 -55 20 -49 -45 -32 -215 -58 -14 118 -120 101 -52 -110 60 -77 67 20 -60
5875 -60 95 35 53 -18 55 122 -23 61 17 6 76 -60 -27 -74 -6 -113 42 -42 62 1 15 -75 -151 -79 -104 113 -96
5902 -96 -128 32 143 7 -65 53 114 -41 -54 90 84 18 -46 137 32 17 85 2 -6 91 -17 -71 38 2 -9 -161
5928 -161 28 17 21 -85 45 -21 2 -11 -65 -23 -3 -45 -191 -92 28 96 144 -91 106 45 54 119 -21 -62 17 -82 1
5955 1 -10 48 22 56 -3 -11 120 -135 146 30 146 -135 -15 99 164 37 -100 184 -15 47 -42 91 -108 19
5979 19 -19 -32 -11 61 11 -21 44 -10 109 -30 -101 -25 -7 140 71 179 53 -16 -105 97 219 -29 -85 -48 -35 164
6005 164 76 4 -50 -17 -69 159 -41 -99 -30 58 185 -68 76 -77 62 -3 -191 16 75 48 -78 42 17 -156
6029 -156 -35 -94 39 115 64 -25 187 -117 -91 171 7 -17 -111 -14 -31 46 -107 5 -20 192 -117 59 0 -134
6053 -134 -116 7 91 -85 109 -82 -4 -37 59 48 22 -85 184 29 -60 -8 121 -23 17 -55 -31 103 2 1 -60
6078 -60 84 132 132 -75 24 206 10 -28 -31 -26 -136 111 -131 -57 10 22 135 -55 28 92 -197 -2 -67 58 -29 81
6104 81 73 -42 93 29 158 -8 59 68 52 -15 68 6 -13 136 207 -6 -2 15 -56 86 -52 111 138 76 -70 15 54
6131 54 6 98 96 66 66 10 73 -33 93 -69 30 163 146 72 -39 36 53 121 -113 40 -173 54 48 1 38 83 109
6158 109 54 56 123 -72 -144 -32 -97 135 52 -16 -5 -133 30 -21 99 -86 -36 -210 -94 -69 -87 25 -51 -26 -24 34
6184 34 -63 58 -9 55 25 20 21 -121 17 192 136 18 -53 -17 115 196 123 -119 3 82 -64 12 79 43 -41 -129 72
6211 72 57 15 -55 32 -158 -74 -3 25 -82 -49 86 52 52 37 -146 23 -45 -83 -13 66 142 -99 127 -11 -37 66
6237 66 -82 191 53 -108 20 -5 63 83 91 -15 -134 -58 -11 -127 -54 40 5 -1 -53 -89 -102 -19 -122 -227 -66 -28
6263 -28 -55 66 60 -75 -28 79 -28 123 -106 -109 53 6 83 86 -84 -115 -20 39 -31 -36 126 -88 79 35 -74 32
6289 32 -35 -26 17 -120 -10 116 -21 -79 31 35 -39 219 -124 41 -65 102 -107 -61 20 -129 -35 37 53 82 5
6314 5 -195 76 -25 8 -38 -103 -137 -60 43 -113 -119 -55 -13 75 76 -61 -143 11 -104 -112 -38 66 42 -9 -36 -32 103 -15
6342 -15 17 42 123 -5 -5 -84 -16 -88 -233 -109 13 43 44 56 -40 -10 -8 85 31 125 -14 97 -89 -136 -28 7 35 34
6370 34 -42 54 -66 -152 -2 -119 -39 -40 -192 158 -70 118 -23 111 124 27 -27 -52 9 -24 -29 37 61 -49 59 -63
6396 -63 -111 89 -57 58 35 -14 24 45 153 -184 -213 63 -18 8 -39 -152 45 -37 -150 -89 -87 10 -80 -61 30 154
6422 154 -7 -180 -56 -64 -42 106 14 23 -179 3 -57 153 122 -22 78 104 144 43 -62 52 172 2 175
6445 175 62 7 126 142 -29 36 10 -140 -132 51 67 -48 50 -62 -54 147 -14 26 21 -145 -104 -54 71 -19 19 -33
6471 -33 6 225 54 -114 -75 -23 101 71 102 -33 12 -151 -91 3 64 35 34 135 -66 -82 7 48 -45 58 192 -33
6497 -33 -175 8 -137 -21 108 -30 -148 9 -38 -7 120 6 53 -170 35 -122 -16 -23 68 22 -132 -73 -197
6520 -197 8 -12 10 106 97 -136 -127 -2 162 -58 -115 29 -125 -40 -55 154 -122 141 31 -41 -106 -17 83 7 -189
6545 -189 55 17 -87 89 15 36 73 -121 18 -73 -200 91 42 50 -193 -68 -125 -30 40 -24 34 72 37 -72 -18
6570 -18 44 -67 114 6 -104 -13 -195 -44 -40 -2 -15 -148 101 56 -29 66 -17 1 241 32 -118 20 3 11 -42
6595 -42 174 30 140 41 23 -32 -30 -89 -44 -52 12 52 248 3 -37 -35 17 -14 -38 -88 -4 -1 -101 -64 -16 -16 50 -152 -61
6624 -61 -140 162 14 14 40 -91 141 -69 28 -48 -16 53 122 -33 75 8 210 -107 42 29 46 89 -52 117 -114
6649 -114 -67 56 -76 48 57 52 136 -168 86 -80 -157 -32 177 45 23 75 67 42 -47 -64 44 -52 -41 181 -20
6674 -20 75 -15 -77 196 -11 -43 -133 27 56 -45 16 -55 17 21 32 169 -11 62 -158 -125 44 62 47 -4 -67 -42 -34
6701 -34 -45 -36 3 -42 8 -76 -40 96 132 -137 45 52 86 -21 56 11 -78 23 85 60 -100 -82 -61 -33 13 -30 -15 66
6729 66 -18 -43 -24 94 -30 -58 -105 108 164 -120 -59 -32 56 -32 44 -26 -32 99 117 62 101 -57 34 57 110 40 7 61
6757 61 81 84 52 -41 -41 1 36 -10 151 -46 15 15 45 19 14 27 -68 -96 -248 68 120 -43 -98 71 -12 90 -128 -79
6785 -79 -86 15 82 101 -37 128 140 269 -51 68 -46 -85 -76 134 1 133 31 116 93 36 32 -36 -25 -99 -55 -3
6811 -3 -22 51 182 -20 -77 152 187 22 5 -38 77 -13 162 83 93 77 -163 161 -13 25 -72 247 -36 27 8
6836 8 16 218 3 -130 52 28 115 -4 -29 67 20 63 69 86 104 -35 -136 -102 1 -62 115 25 69 35 22 98 97 92
6864 92 -72 2 97 55 -54 72 -5 -146 -31 166 -138 -20 -45 -35 -42 116 39 -4 -2 -11 36 7 -54 64 -35 -200
6890 -200 -134 -103 -17 -12 49 -73 -13 -95 -101 38 -76 -12 -13 59 -49 22 31 -13 46 61 47 -52 40 -93 -140 63 -75 -33
6918 -33 77 6 -231 -54 -129 145 -91 -46 40 -72 43 -1 77 -6 30 -20 83 -21 -91 49 -72 31 65 7
6942 7 29 13 24 -11 -91 -223 21 30 -66 57 -68 -67 -182 120 -32 -87 -13 -152 -219 -99 -24 25 -86 -118 -46 -61 -17
6969 -17 -25 -9 23 67 -157 41 32 -18 -36 -43 -216 -21 69 4 -88 -32 21 47 35 80 -43 35 -55 -132 -38 -153 23 0
6997 0 39 -251 62 -79 156 -35 97 -25 -71 -3 -118 22 -41 -99 87 158 47 -185 48 -59 15 -89 -67
7020 -67 79 19 -13 -137 124 10 50 103 16 40 -71 -40 -112 139 -170 -132 29 -88 43 35 43 -45 7 -69 28 -66
7046 -66 -33 132 147 -154 145 -16 56 -47 -128 31 24 172 105 -5 177 41 -100 7 104 -22 49 -11 -158 91
7070 91 17 -55 -131 196 58 -77 -5 1 16 -66 -126 93 195 105 -51 135 -112 -24 83 -103 51 -19 -6 -82 -45
7095 -45 79 -16 92 -137 33 -3 97 103 88 -122 31 -152 15 -43 -33 35 68 2 -72 -49 -83 20 -58 -13 -24 41
7121 41 -13 160 115 9 122 33 -18 -87 88 -113 -18 4 176 -83 47 -23 3 37 66 39 8 -94 -97 21 73 -11
7147 -11 8 -3 45 68 -21 -133 -91 17 -80 -40 48 -104 -87 -65 95 -59 80 -155 -125 -62 -174 -138 -92 56 -120
7172 -120 16 -95 6 -47 113 75 -67 76 -25 -170 4 48 -93 -59 -74 2 21 53 -32 -28 104 29 -63 76
7196 76 -34 -94 -125 -68 -120 -201 -111 19 124 -122 72 -98 140 -36 -13 -104 201 40 65 15 32 -40 -83 -77 -30 110
7222 110 -197 109 -78 -143 -13 36 35 4 -40 -66 -3 29 -68 -23 -97 -166 -57 -93 -29 -42 128 -41 -3 48 68 31 -52
7249 -52 -47 82 175 -205 -3 55 -97 152 -72 -11 -14 -108 -22 -41 -34 -214 -164 69 -83 -18 97 -108 14 74 57 -83
7275 -83 54 -67 -182 8 156 -75 70 58 -20 37 9 9 2 -36 26 3 65 -40 -176 -27 24 -10 27 22 -67 -19 124
7302 124 106 60 50 -24 -54 -37 181 -21 -61 -55 73 8 23 50 130 100 -55 72 -33 118 82 -38 -116 -20 56 -42
7328 -42 121 85 -26 263 56 -21 -68 -128 45 -62 -86 62 -88 -120 -109 -47 -120 -104 62 -13 -71 15 -33 36 13 3
7354 3 21 -128 -18 -52 29 116 35 10 33 29 72 231 38 -41 88 120 126 60 -103 44 4 20 63 137 72 -66 -80 -133
7382 -133 93 123 -98 77 113 -2 35 -139 -100 10 70 5 61 207 -127 115 56 133 138 80 5 -66 -27 -84 18
7407 18 47 -4 -77 -18 -49 -90 -85 5 -72 7 129 163 -115 54 -23 -37 -109 54 76 -73 -48 10 -103 33 -19 -125 14
7434 14 39 -59 -113 133 -82 -54 47 -10 -101 -50 -1 109 45 -27 -114 144 114 -125 94 -48 92 -192 -54 47
7458 47 39 -126 -96 -170 -122 -158 -191 104 3 79 -23 -51 -83 24 -198 130 -59 -55 -115 -19 116 -116 5 -17 154
7483 154 -6 168 -6 -239 65 -23 -54 11 221 -67 -15 84 182 -160 -153 25 137 -84 -86 -45 -97 72 -59 -103
7507 -103 98 -18 -17 5 19 -48 -35 -76 -5 -54 -51 -18 -124 -81 -5 -122 -8 -19 -115 93 5 34 -64 -120 14 -74 18
7534 18 97 17 38 61 -52 31 -21 60 41 -30 79 51 6 42 -51 -104 0 -51 71 -29 -128 -43 121 83 -150 -25
7560 -25 -62 -84 88 -4 -4 15 -20 152 0 48 -133 -180 -27 -55 31 82 -53 80 -18 112 33 -105 -83 -87 -37 47 -64
7587 -64 -18 18 -52 -21 69 10 -14 106 -52 29 -41 58 141 -49 104 44 -17 27 7 29 107 59 93 -18 113 -50 71
7614 71 63 6 -17 -79 42 71 -38 66 -108 -21 -61 -12 -83 28 26 -35 48 61 19 -18 110 188 23 -140 130 -54
7640 -54 71 50 91 113 78 -89 66 -10 -57 99 65 -253 -187 58 -62 40 87 -35 10 -63 -56 128 -95 43 -63
7665 -63 12 52 -51 -90 8 174 -23 -32 36 -58 -95 -64 2 -45 -27 7 -31 -6 -96 118 1 43 -44 59 41 -91 -80
7692 -80 -48 -52 174 -11 19 24 45 12 48 -116 22 83 -52 28 3 78 -76 9 2 78 -45 125 21 -27 101 -41
7718 -41 -69 -4 74 -21 -37 -40 -4 49 104 -9 86 14 31 8 -41 -106 34 23 -27 42 104 -68 38 -85 81 -54 -102
7745 -102 39 -5 24 -18 -95 -6 -35 -154 -40 157 -170 -107 -23 43 248 -67 69 -39 78 -67 -57 84 56 99
7769 99 -46 27 4 -55 60 -120 -40 82 132 -13 -35 85 -87 -225 53 -166 38 -74 57 -8 -134 -22 -31
7792 -31 25 -59 25 55 -128 129 51 -40 115 -61 -39 -24 70 -31 -87 54 -34 -52 130 132 -59 67 -1 -146 -41
7817 -41 90 -32 -19 -173 -1 -82 91 96 -69 -54 176 64 -108 -22 -134 232 -202 -37 45 -138 -95 34 105
7840 105 -92 16 74 17 129 50 81 -32 40 -81 -83 -54 -6 13 26 -93 67 33 -20 52 67 -7 -56 158 -88 -39
7866 -39 116 -94 60 49 -100 9 -89 7 -19 106 -109 -146 101 -76 192 -100 133 119 56 -9 -56 59 -41
7889 -41 23 46 33 13 -88 16 7 -65 -85 25 -17 -93 12 105 80 -206 23 -46 15 -46 -90 97 10 -19 -88 -103 -14
7916 -14 138 -31 -27 -7 67 173 47 -19 151 -23 114 36 11 -120 -50 13 -16 -29 -21 -140 -46 11 -30 84 -21 49
7942 49 -86 -20 148 56 12 -55 40 91 -30 -66 40 -61 -94 -15 66 -104 162 54 34 93 23 -74 83 113 21 23
7968 23 10 -118 -17 29 -68 -81 -20 15 24 -45 -18 194 34 -26 -53 -96 -167 -57 127 -92 24 73 32 -3 -131 -65
7994 -65 -80 -18 3 70 -59 114 -18 24 -165 -71 50 16 -53 -150 -72 -86 -123 58 2 -94 -155 -123 87 6 -103 -60
8020 -60 -112 -89 55 -146 -7 50 52 9 -100 189 -173 -70 -95 25 -33 -132 -138 -80 51 -31 -80 79 -20 48 -61 96
8046 96 -124 96 89 -29 126 -61 -136 181 -95 40 -87 29 -31 81 56 -291 -103 -64 -68 -33 70 44 78 -1
8070 -1 15 56 -105 59 96 47 22 -51 -13 74 -88 -99 35 -83 -133 57 75 -116 230 62 -85 100 75 -114 161
8095 161 119 23 63 17 -73 137 -228 -62 -107 11 126 94 27 23 2 1 5 154 37 41 103 -78 -81 163 -38 -12 -100
8122 -100 116 -86 122 179 85 26 -31 62 97 -49 -20 -63 -93 -22 5 129 35 -48 -21 166 -238 72 135 -60 198
8147 198 -26 -18 143 24 94 139 32 123 21 -25 159 38 -35 2 75 -13 -72 -65 -77 85 1 -85 -64 -105 -63 57
8173 57 170 -111 -59 71 -90 2 17 -67 118 -80 29 -19 -57 78 51 -103 62 80
8191H0
$$ Imaginary data points
##PAGE= N=2
##DATA TABLE= (X++(I..I)), XYDATA
0 0 0 0 0 0 0 0 0 8 -8 8 -8 8 -16 19 -24 32 -40 48 -56 72 -88 104 -121 144 -170 200 -233 269 -310 357
30 357 -410 469 -532 604 -684 771 -866 971 -1088 1214 -1353 1505 -1670 1850 -2049 2265
46 2265 -2499 2758 -3040 3349 -3688 4061 -4478 4936 -5450 6025 -6678 7422 -8283 9287
60 9287 -10475 11918 -13703 15981 -18995 23193 -29476 39973 -61716 201579 -574415 -337435
72 -337435 701500 -191357 -289143 321487 -35775 -251971 181227 92220 -32271 -142292
82 -142292 -101242 294793 92354 -416964 83254 297866 -211946 -52559 178978 -161802
92 -161802 -39030 166936 -27164 -72337 -69034 9337 225280 -98522 -268228 212066 126821
103 126821 -223342 69744 76555 -166158 75350 121053 -105777 -59496 4848 88349 79910
114 79910 -184211 -45146 211620 -78882 -80449 142197 -135406 -42846 253867 -142409 -150301
125 -150301 227709 -87314 -87514 250111 -178294 -186483 357592 -24165 -298841 195811 78288
136 78288 -183303 122962 50460 -159558 53830 84295 -21064 -21868 -81015 62617 130801
147 130801 -140381 -52109 151087 -79155 -39694 147951 -108035 -93170 172741 -11062
157 -11062 -102642 53417 -19570 4330 76952 -84764 -36712 87355 -31973 -5322 38777
168 38777 -86012 13574 97898 -62384 -43040 36146 -15045 32014 6183 -75138 35761
179 35761 29259 -46301 55789 -29469 -99907 131868 40120 -174302 69285 95832 -137327
190 -137327 44942 99596 -146684 -3648 143817 -62531 -74615 50765 19322 1253 -17499
201 -17499 -19141 38507 -17939 -20956 74482 -41543 -83127 109615 35199 -113430 31125 52823
213 52823 -45830 27666 8778 -52262 40726 18111 -33766 34232 -22043 -39780 83048 3030
225 3030 -88951 38906 47129 -37613 1894 5893 -14662 17446 1688 -1142 2859 -38396 24296
238 24296 57545 -65431 -33760 76278 -16393 -40872 44644 -21990 -31543 56215 -8930 -43291
250 -43291 24200 -993 -4211 24986 -36085 -18094 48421 -9131 -28502 14852 -7438 -1610
262 -1610 20797 -17565 -12230 10378 -4126 17070 -2446 -42970 26039 37365 -45743 -3635
274 -3635 34834 -31896 3350 39988 -37595 -19413 43556 -1766 -19260 5618 -4004 10545
286 10545 10648 -16291 2148 5869 -6171 19189 -613 -29571 18555 22873 -19878 -445 6575
299 6575 -9902 17898 6805 -25939 9148 14632 -11798 10485 -720 -22641 20256 17455 -25637
312 -25637 -2262 12387 -4340 5541 -1532 -13420 6446 6574 -3596 627 -10942 -2714 19552
325 19552 -6054 -18946 8886 3404 -6385 7951 -8130 -13605 15546 4062 -14534 1508 -776
338 -776 -2855 11025 -6020 -13675 8619 4714 -4157 778 -6859 -1376 12233 -2145 -10094 2130
352 2130 3625 2459 1464 -6101 -1047 6254 668 1846 -866 -9434 8396 14827 -13518 -9107 17137
367 17137 2244 -10199 6774 3682 -8264 3255 12253 -3353 -14371 6593 19175 -9241
379 -9241 -15742 14641 8900 -14316 3171 10775 -11497 -3857 15676 -567 -14562 1624 10794
392 10794 1024 -9207 -4980 9152 3416 -10453 960 6429 -8875 -1644 11197 -5709 -12384
405 -12384 6058 8266 -6209 -7777 459 5045 1870 -8120 -4599 8897 -988 -11420 7811 6572
419 6572 -17858 145 21093 -9616 -20921 14557 15442 -16628 -9948 15396 5414 -14548 -1580
432 -1580 17172 -2622 -21841 13160 26706 -27262 -20966 43082 6864 -46844 16804 39656
444 39656 -34144 -17540 43590 -3732 -37211 22498 26382 -25907 -12937 23034 9468 -16466
456 -16466 -8903 18304 9526 -24140 312 30479 -17010 -25311 33783 10753 -40459 8376 32924
469 32924 -22311 -16405 23333 -1452 -15344 9277 1981 -7338 2885 -3099 512 7498 -12464
482 -12464 -6073 19220 -4893 -19955 12308 9346 -15506 454 7625 -7584 1500 1504 -7864 9862
496 9862 -982 -20000 19035 14904 -38955 4697 43303 -31430 -28415 48208 -203 -46552 27134
509 27134 27693 -38648 -4174 33551 -8487 -19230 8110 12717 1247 -16577 -1159 28318 -10965
522 -10965 -28397 32946 15107 -44804 11607 42322 -32614 -22237 42032 772 -33038 15728
534 15728 18353 -17474 -4323 13193 1213 -7614 -2929 8746 6023 -13702 -3695 18601 -3853
547 -3853 -17939 12471 10097 -18849 1512 16367 -14783 -7628 18598 -7859 -13363 16778 -4311
560 -4311 -16486 18916 -57 -25596 17633 13751 -29755 3640 24040 -20488 -10176 22302
572 22302 -6096 -15301 10046 4365 -5141 -3978 -2126 11462 -550 -19272 12831 16401 -25362
585 -25362 -1698 28920 -14967 -19145 25633 5563 -23615 5995 17210 -7940 -9562 7909
597 7909 8808 -6427 -7595 11451 6819 -15005 211 18255 -6828 -14247 13879 9244 -14755
610 -14755 -2225 15109 -2917 -12436 9522 8223 -13579 -326 13393 -6964 -7228 9583 -1100
623 -1100 -5565 5548 -2477 -4119 7231 -3232 -6374 7669 -1213 -7862 6240 1971 -8276 1927
637 1927 3607 -3166 -1832 -1318 1708 2283 -6963 -345 7383 -6854 -4692 9527 -3129 -8370 6624
652 6624 2726 -6837 344 3055 -829 -755 -2017 1640 2850 -4773 -308 6665 -4118 -4384 7981
667 7981 482 -6635 3187 4633 -2762 -1803 3270 2642 -3032 -978 6384 -757 -5606 6271 4043
682 4043 -7477 2130 6739 -4927 -1211 5937 -1944 -2351 3983 -6 -1907 1369 77 813 318
697 318 -1944 1458 1128 -2451 1139 932 -2410 1029 514 -1880 817 -839 -1276 2126 -2149 -3366
713 -3366 4028 -492 -5384 2948 1769 -5778 742 3787 -4313 -2424 3504 -472 -3189 81 1420
728 1420 -529 -2632 512 2465 -3049 -1554 4197 -1123 -3614 2558 1747 -2425 -208 1543 520
743 520 -535 -764 1904 1270 -2676 991 4028 -2624 -1787 5162 207 -3792 3113 2596 -2756 493
759 493 2605 -77 -1221 816 2475 -575 -2115 2831 1890 -3573 973 3507 -3028 -1053 3914 -1394
775 -1394 -2389 2915 206 -2250 733 641 -671 -288 -586 128 -65 -1712 850 654 -3203 413 1628
792 1628 -2587 -686 1121 -1863 -258 301 -2203 374 317 -2676 695 1080 -3215 421 2331 -2461
808 -2461 -815 2077 -837 -1098 368 -373 772 -521 -1237 2522 -23 -2874 2832 2088 -3440 743
824 743 3092 -1293 -826 1358 1357 253 -1592 1296 3491 -2942 -1279 5792 -909 -4483 4726 2431
840 2431 -4610 1604 3494 -1818 -461 948 851 951 -2298 459 4028 -3452 -2747 5678 -894 -4770
856 -4770 3523 1377 -3722 716 1248 -1367 -126 -1165 292 1372 -2764 -1120 3105 -1595 -2885
871 -2885 1562 283 -1129 -1090 -780 2151 -1699 -4500 4275 1573 -7836 2907 5661 -7315 -1099
886 -1099 6226 -3293 -2374 2848 -1039 794 -452 -3110 5394 437 -8264 6197 5917 -11040 2182
901 2182 10381 -8229 -3092 9861 -2712 -4385 5258 84 -930 1493 -1921 3013 2186 -5658 2941
916 2941 5700 -6295 -438 7325 -2946 -3660 4757 1064 -3279 610 2288 -163 -1884 796 1860
931 1860 -2005 -265 1854 -2108 588 1866 -4517 1676 4120 -7459 163 7912 -7776 -3523 9876
946 9876 -5091 -6045 7748 -2457 -4810 5117 -3535 -1482 5703 -7273 -751 9933 -9903 -4851
960 -4851 14533 -7097 -10836 14375 -484 -12617 8809 3788 -8721 3631 2281 -3187 3176
973 3176 -2226 -1081 6834 -4734 -4237 9838 -2101 -7932 8143 2997 -7971 2601 5631 -3249
987 -3249 -2117 3365 2102 -2741 -1109 4614 -86 -4064 4050 1742 -4039 2903 1285 -3505 3733
1002 3733 -296 -4477 6006 -569 -6718 6733 1031 -8311 6176 2223 -8204 5426 1796 -7661
1016 -7661 5682 1331 -8537 7067 1654 -10599 7448 3772 -11714 5100 5837 -10118 2645
1029 2645 5278 -7412 1644 2970 -5442 3209 788 -6336 5438 993 -8044 5583 3114 -8297
1043 -8297 3114 4714 -5929 717 3705 -2513 257 492 -60 2211 -2641 -390 5077 -3498 -2082
1058 -2082 6486 -2611 -3183 5945 -1435 -2671 4749 -1734 -1138 4201 -3236 87 4719 -4383 47
1073 47 5691 -4987 -461 6298 -4952 -1139 6219 -4585 -1251 5679 -4478 -946 5297 -4719
1087 -4719 -335 4942 -5143 74 4727 -5742 58 4960 -5916 18 5009 -5879 -66 4833
1101 4833 -5377 -307 4308 -4770 -112 3397 -4548 561 2956 -4580 1264 2593 -4654 1734 2528
1116 2528 -4835 1999 2287 -4591 2079 1986 -4394 2753 1965 -4489 2875 1736 -4056 2687 1761 -3641
1132 -3641 2748 1215 -3008 3088 490 -2943 3681 -13 -2958 4072 -114 -3224 4232 -55 -3191
1147 -3191 3972 -175 -2694 3896 -776 -2611 4086 -1319 -2398 4386 -1698 -2904 4500 -1250 -2943
1162 -2943 3992 -993 -2532 3216 -1338 -1862 2973 -1897 -1454 3406 -2600 -1830 3647 -2458 -1999 3457
1178 3457 -2297 -1796 2797 -2163 -1221 2570 -2395 -680 2602 -3045 -497 2842 -2962 -628 2895
1193 2895 -2434 -728 2450 -2121 -255 1659 -2024 759 1533 -2362 1201 1772 -2908 1381 2209 -2919
1209 -2919 1138 2235 -2644 1068 2086 -2079 1287 1455 -1880 1409 1255 -2008 1681 1002 -2251 1906
1225 1906 1053 -2300 1804 853 -2050 1752 665 -2191 1889 410 -2232 1893 163 -2148 1876
1240 1876 120 -2266 2125 -57 -2360 1971 -168 -2168 1799 -109 -2163 1526 -269 -2005 1405
1255 1405 -357 -1794 1383 -520 -1654 1328 -444 -1457 1269 -806 -1221 1099 -635 -1083 1228
1270 1228 -844 -952 1375 -970 -661 1340 -585 -476 1230 -482 -208 998 -635 207 1172 -1063
1286 -1063 626 1263 -1228 584 1673 -1417 353 1915 -1305 127 1847 -1090 18 1481 -984
1301 -984 465 1381 -1250 414 1448 -1409 222 1674 -1224 -172 1387 -868 -492 924 -666 -158
1317 -158 640 -942 210 292 -743 141 494 -904 -238 208 -688 -281 -70 -507 137 -501 -559 734 -482
1336 -482 -1008 710 -321 -1303 782 28 -914 554 -135 -542 668 -576 -739 1126 -194 -974 1354
1353 1354 -155 -1424 1325 368 -1439 917 818 -1139 304 864 -464 340 768 -330 512 697 -403
1370 -403 454 707 -478 226 946 -140 -272 843 357 -377 481 733 -266 -46 700 -199 -239 497 -109
1389 -109 -332 581 -155 -550 681 -251 -1017 1033 -157 -1380 694 417 -1541 314 776 -1325 197
1406 197 688 -1009 -114 423 -1169 64 648 -1355 -120 1024 -1317 -681 1565 -1120 -1051 1303 -348
1423 -348 -1308 873 293 -974 566 281 -774 367 302 -677 287 498 -767 495 749 -803 197
1440 197 1102 -579 -250 1304 -141 -409 1165 316 -538 855 469 -660 670 576 -579 525 566 -734
1458 -734 508 925 -893 34 979 -677 -256 739 -616 -345 936 -603 -684 975 -624 -535 909 -495
1476 -495 -821 831 -254 -1121 629 137 -1140 239 106 -985 67 283 -841 37 257 -700 -211
1493 -211 252 -688 -22 338 -686 -260 313 -361 -321 357 -106 -326 223 98 -253 58 443 -126 -99 287
1513 287 -249 -169 533 -19 -281 627 -81 -266 689 -59 -174 619 134 -392 753 152 -416 539 424 -382
1533 -382 525 172 -531 499 413 -502 316 324 -464 163 386 -275 77 164 -427 26 117 -376 -81 124 -354
1554 -354 -167 -16 -215 -115 -27 -252 -280 -239 -47 -119 -164 -208 -279 -313 -35 -20 -423 29 20 -404 68 -40 -418 156
1578 156 222 -307 -32 342 -437 51 179 -416 59 537 -309 125 189 -78 33 328 -16 46 437 -123 27
1599 27 408 98 -101 439 168 -67 359 -17 105 144 261 -21 149 237 106 115 121 42 -36 66 -49 -192 140
1622 140 -29 -227 34 204 -186 -166 198 -76 -195 -19 -367 -219 42 -177 -255 47 -406 -330 211 -290 -335
1643 -335 189 -181 -389 63 -171 -164 155 -52 -333 -79 115 -221 -24 7 -58 140 17 -84 -23 182 -82 230
1665 230 13 103 31 14 -48 -148 95 212 46 131 453 277 30 318 214 30 408 236 20 381 183 -29
1687 -29 262 219 -177 99 205 -86 159 259 -188 -54 139 -160 -49 72 -48 -15 102 -77 -258 28 -167
1708 -167 -307 -38 -323 -228 -110 -149 -124 -76 -97 -120 -222 -240 -148 -279 -64 33 -281 -163 68 -172 -301 173 -236
1731 -236 -197 203 -297 -66 181 -217 -207 246 36 -204 463 -230 -277 259 136 -187 280 102 -280 298 74
1752 74 -148 417 403 -189 344 324 -113 240 324 -107 65 427 37 55 213 198 24 213 64 -47 -30 14 -168
1775 -168 -57 26 -137 -287 121 -55 -142 -22 -23 -304 258 70 -500 12 -58 -373 -23 39 -455 -4 91 -343
1797 -343 6 150 -459 83 89 -289 -62 244 -285 -23 291 -433 -231 301 -290 -270 399 83 -98 207 -50
1818 -50 -154 274 30 -129 133 108 -46 55 -13 -162 66 256 247 151 82 282 -110 227 276 65 190 244 -147
1841 -147 -64 345 -118 -86 414 91 -67 240 -214 -208 346 -37 -220 373 -199 -462 289 -95 -377 184 -102
1862 -102 -430 87 96 -519 63 8 -488 -73 140 -487 58 103 -287 97 174 -217 16 19 -263 -262 27 -95 -262
1885 -262 95 -88 -1 85 31 5 127 -47 34 -195 325 30 -169 338 101 19 275 380 52 237 448 -216
1907 -216 186 386 -90 283 383 -22 132 292 -88 165 250 -93 25 185 -186 23 207 -50 -161 197
1927 197 -215 -159 298 -63 -218 251 -90 -176 168 -141 -211 119 -238 -55 92 32 -101 -29 -160 -92 -213 -308
1949 -308 -131 -134 -191 -26 -209 -204 65 -43 43 31 -228 -130 154 -13 -221 264 -5 -378 138 17 -303 344 241
1972 241 -119 468 -50 -117 285 74 -107 394 204 -138 335 95 -128 395 287 -62 313 212 -83 168
1992 168 243 10 253 159 -144 164 87 0 6 -43 -65 90 -67 -34 115 10 -10 175 -182 -6 -94 -92 -210 38
2016 38 -294 -247 157 -304 -158 109 -337 -151 239 -313 96 85 -307 -128 204 -293 37 37 -369 -117 209 -240
2038 -240 -132 164 -379 -253 308 -146 -104 260 -59 10 385 -64 72 183 29 -2 343 -104 -54 39 -45 -30
2060 -30 216 -236 173 217 59 265 291 30 182 159 -128 293 -64 -72 219 -61 14 175 -79 -11 21 122 -86
2083 -86 279 91 -318 107 -43 -297 322 -186 -403 33 18 -446 39 13 -320 229 43 -417 -3 -339 -238
2104 -238 126 -210 -121 179 -215 -296 80 -31 -166 182 -89 -87 212 -97 77 -42 -69 -127 236 -50 -1 169
2126 169 -86 18 220 37 127 225 -205 123 92 -67 47 104 -83 68 405 -12 4 339 -162 7 269 -93
2148 -93 39 167 -315 38 306 -183 -52 145 -231 -126 -29 -121 28 95 -188 24 36 -139 -44 -151 -187 39
2170 39 26 -227 -37 -26 -203 -27 -18 -112 13 -119 -455 133 -117 -284 80 -137 -115 263 -32 -216 221 -112
2192 -112 -254 119 -21 -213 132 68 -134 246 301 -140 226 13 -195 216 290 -227 47 16 -207 168 60
2213 60 -196 36 113 -92 185 154 46 70 133 -114 6 21 86 137 -55 -3 73 -30 132 62 -27 22 -18 -158 -140
2238 -140 204 -173 -68 -13 -213 55 8 -230 -27 94 -240 -210 70 -58 87 95 -267 -27 140 -181 -173 153
2260 153 -70 -91 92 -163 -130 -73 -164 7 25 -184 -119 127 -65 -152 230 4 -25 179 67 2 147 155 -85 20
2284 20 26 66 108 -86 115 15 122 116 -107 91 161 -51 -167 131 -57 16 13 14 -34 198 -57 -265 123 3 -200
2309 -200 180 -92 -188 116 -32 -45 -68 -11 -185 154 -61 -192 49 -87 -190 8 -135 -39 64 -117 -179 126
2331 126 -40 -142 -92 -145 29 -37 105 -23 -42 122 -113 -12 -24 52 -41 77 134 53 -47 29 -28 26 216 -95
2355 -95 -11 121 117 -52 191 202 93 149 -15 25 121 -53 -55 128 -24 -103 212 220 48 111 226 -248 41 237 25
2380 25 118 92 -94 -131 35 -107 -30 -20 39 -124 22 -68 -89 -117 -183 -60 -22 -116 -137 176 39 -6 -129 -107 -12 -263
2406 -263 -24 -42 -99 -226 16 -103 -140 -36 -164 -53 20 82 -51 4 5 28 29 58 89 177 13 32 -70 -77 -80 -30 114
2433 114 84 56 -61 103 166 -50 38 99 8 196 119 -34 148 290 205 297 41 5 105 89 119 39 -7 -91 -14
2458 -14 106 12 -22 2 -43 51 162 -55 -49 128 41 -137 84 -236 -69 92 -67 -235 125 68 -189 -124 -9 -97
2482 -97 -78 35 -274 -16 -129 29 -53 -180 -37 173 27 -179 26 -48 149 -10 194 -63 43 67 79 3
2504 3 88 237 -126 176 15 -4 72 127 36 80 236 -80 140 139 2 -60 228 -59 -36 256 -35 -162 120 95
2528 95 -53 114 128 -117 52 85 -37 15 37 -101 33 -50 -67 102 108 6 -60 -9 44 -157 -3 34 41 219 4
2553 4 -92 -71 -44 -154 -28 1 -6 55 50 -98 -178 -55 -265 18 65 -122 -154 70 -43 7 83 -45 -133 14 -47 29
2579 29 125 42 32 203 109 -79 108 60 76 264 90 -96 161 195 -74 134 152 -122 33 216 -51 -48 144 25
2603 25 -90 130 -104 -46 -17 -76 37 -4 202 -25 -35 -38 -88 -26 113 -177 -63 15 -135 54 65 56 -149 -89 -69
2628 -69 -65 115 25 6 88 27 -177 -162 12 -86 -68 25 -191 -91 14 -4 -124 78 -234 -195 214 -15 -109 95 -45
2653 -45 -67 243 -11 -246 -76 71 -17 -20 159 -50 90 87 -49 61 276 99 16 190 47 9 120 98 19 17
2677 17 -178 121 200 -34 -99 120 -13 126 61 113 10 -39 76 -41 -46 -80 -99 -55 -88 -178 -79 63 36 -288 6
2702 6 8 -172 47 -31 -221 -81 19 -90 -11 -30 33 -96 -47 -120 -50 55 -142 -45 11 -186 -12 91 -133 31
2726 31 16 -24 105 -2 129 -197 52 105 2 33 135 42 -89 217 13 149 240 97 77 130 42 -18 95 -70
2750 -70 -195 19 66 -86 114 9 -44 218 64 -126 59 68 -154 77 -73 -114 -2 196 -136 -227 -17 -59 -277
2773 -277 29 -45 -90 31 -51 12 216 -50 -251 -102 -61 -149 155 -128 -213 43 -14 -55 -50 81 -206 -122 14 -92
2797 -92 -252 53 -185 -259 97 -90 57 -10 137 40 140 -90 -115 5 117 2 97 88 -160 88 7 -182 -20
2820 -20 173 -1 175 152 -16 -7 81 -132 -2 -25 -41 5 6 151 5 30 56 60 3 -10 -196 50 29 88 34 -94
2846 -94 1 44 86 -115 -60 36 -75 15 89 -93 -83 15 -86 -63 19 2 8 -19 47 -139 127 5 -143 30 129 -34
2872 -34 6 85 -43 -58 191 133 26 86 -134 -76 79 1 124 8 36 -71 -85 -35 -82 72 62 -9 155 -67 36
2897 36 187 -152 -116 -24 34 24 -22 54 83 -14 -14 95 107 -24 -49 169 158 -125 -62 50 -133 -18 -52 123 7
2922 7 86 9 133 99 -13 27 -4 -35 56 38 -55 -91 -108 -129 17 -2 63 -144 -6 -55 21 12 -80 28 -108 19 31
2949 31 21 36 -15 -185 -64 137 -177 133 186 -100 71 193 -80 254 66 -78 31 143 -2 98 141 25
2971 25 26 -30 -22 87 140 -42 73 234 -4 106 235 -22 115 -55 26 23 -84 2 40 -100 -146 159 -25 -200
2995 -200 -124 -8 39 -66 60 -50 -13 -133 -224 57 -74 -28 43 -203 57 143 -101 -39 -43 -40 -138 -26 -160 132
3019 132 115 41 -57 -52 -148 13 211 -166 -8 173 9 -135 52 -24 -32 50 -185 -38 31 19 -76 105 27 -89 155
3044 155 -126 62 62 -51 70 123 -10 -119 91 -7 147 221 -33 -42 244 134 24 148 -46 -116 -67 44 65
3067 65 59 -79 9 157 -221 54 66 -34 -19 -4 -121 48 -84 -68 130 -18 -76 -151 -22 -48 131 -126 -170 50
3091 50 -1 -120 10 61 -124 -6 -50 -148 186 53 -132 -4 11 18 -118 -77 78 55 -24 -177 -38 77 13 129
3115 129 65 18 35 3 23 64 -155 -46 79 15 71 72 -32 70 225 -102 157 158 70 -61 32 -103 87 221 41
3140 41 -151 220 43 -91 5 -130 -44 88 -126 76 1 -172 30 183 -128 -33 121 -54 39 35 91 -30 139
3163 139 -132 20 50 158 27 68 -101 -125 7 -51 -41 62 -50 -171 11 109 -70 -63 42 -13 -50 111 -31
3186 -31 3 -14 10 -72 40 -30 -91 -48 279 -140 -134 -17 -55 39 248 -21 -11 242 -50 127 242 -26 -178 161
3210 161 -54 -9 350 62 -40 152 -136 -73 -56 -30 -72 85 118 137 -46 130 -43 118 -76 -164 69 112 -97
3233 -97 -94 -76 -222 -104 -28 -128 -102 -36 -143 36 105 -8 121 -24 119 -49 -147 221 -129 -169 -10 -77 -213 142
3257 142 45 -100 -135 61 -44 -29 134 -67 37 144 -22 -76 22 -1 59 147 -257 -10 264 -160 7 115 -230
3280 -230 40 115 -79 45 326 122 243 178 -33 -92 -16 5 -179 -19 41 -120 32 30 -168 40 -88 -76 -17
3303 -17 -136 -113 132 20 -6 -76 -25 -159 -113 -31 -103 41 -4 -27 -71 138 24 -89 -63 48 -18 89 140 -126 -3
3328 -3 43 -204 -67 -35 97 -119 -71 -9 -240 -26 59 -75 -10 -46 -4 -121 -96 -53 -42 69 23 78 41 3 -32 33
3354 33 -69 84 -51 -133 16 43 -81 130 98 -107 65 44 78 -62 126 4 15 -2 -33 134 -9 -146 -28
3377 -28 95 -20 -63 -38 -111 -57 136 -66 35 -103 -17 -33 -19 -58 26 -23 -8 -81 -74 44 28 -90 59 198 -56
3402 -56 59 59 49 72 15 128 86 30 -70 -91 158 -115 131 50 -191 61 -68 -90 -14 100 38 0 86 25 -1 80
3428 80 21 -9 73 17 -48 54 -30 190 27 32 14 -16 67 36 160 148 11 105 130 8 -39 30 14 18 -103 120 -96
3455 -96 35 -69 -161 -101 41 -195 -55 -90 -82 92 117 64 -182 -40 -90 1 28 -131 100 -72 10 -86 59 -40 -71
3480 -71 45 52 61 -30 28 56 8 109 5 -52 25 -46 79 -117 6 36 -184 61 56 133 -168 94 -120 -79 -23 -21 -39
3507 -39 -116 -110 93 20 211 90 91 -54 105 65 73 105 54 -105 -7 86 -57 -34 57 -14 -32 98 29 -188 -8 -153
3533 -153 125 174 -116 -79 163 19 -28 -109 -175 16 -56 -12 -118 -48 -58 -30 11 -58 145 -96 -112 -174 25 97 16
3558 16 -19 -16 -60 -190 -42 -37 120 -174 26 45 152 42 -53 -84 57 -14 -19 64 -14 -56 -25 53 -70 -13 146 54 -91
3585 -91 143 78 -53 -92 124 -107 -264 154 202 34 11 -23 77 85 70 -120 25 -6 5 56 37 24 7 -22 -63 -77
3611 -77 -17 201 34 38 -41 47 2 -142 -163 119 -24 -54 12 -82 -205 22 89 -140 42 49 -174 -54 98 41 -65
3636 -65 -47 67 13 26 7 14 57 -10 36 62 65 -26 -14 129 -102 86 101 -57 -233 31 20 10 -68 45 -126 -59 47
3663 47 -70 13 59 -52 81 64 82 387 -15 -68 -36 135 -168 -89 -32 -135 -15 104 103 45 113 -72 0 28 97
3688 97 -32 119 95 -16 58 46 -120 -108 37 -152 -83 -59 -124 -169 -13 -122 98 -66 -13 -95 -93 -120 62 86 19
3713 19 -144 -88 -69 -94 -35 -140 -64 94 -27 91 151 -244 -91 12 -7 -1 125 69 7 0 4 81 -237 126 72 -6
3739 -6 160 55 -118 125 11 -111 98 -224 108 -15 -3 -206 -71 140 -107 -45 157 -88 -9 -27 63 -4 -81
3762 -81 47 -100 1 -48 -57 8 -8 25 -6 -17 -175 -35 -74 -148 -6 -37 -121 30 66 6 -168 -56 3 -25 -47 -18
3788 -18 -14 -50 70 -55 -20 63 -106 -18 206 -4 10 176 100 102 119 -57 18 101 36 -76 79 98 -7 92 101 31 -137
3815 -137 105 -8 -50 88 234 90 139 -72 132 165 -64 -16 55 16 3 166 60 2 146 -60 5 2 18 194
3839 194 156 50 9 -28 25 -83 -134 -39 12 -22 -18 -46 -41 13 1 -94 -12 -13 17 -71 21 -34 8 139 -28 15 1 130 -121
3868 -121 20 -134 -25 -44 49 64 -36 15 67 7 -44 33 7 -20 -9 0 90 97 1 -31 56 73 -22 -61 -26 -135 11 9
3896 9 -116 -75 63 120 -73 141 -22 85 184 -34 -67 33 -4 1 85 86 -68 141 -1 -11 154 118 -43 -13 78
3921 78 -251 81 5 -2 1 80 37 9 -111 -7 20 139 -87 -69 42 -21 34 -24 0 72 -145 69 34 107 80 -4 -74
3948 -74 -15 29 -91 59 63 92 109 58 19 -79 104 -112 -105 -118 120 126 63 33 68 70 55 12 44 5 -31 -80 23 136 84
3977 84 -34 -29 -14 -102 89 47 25 -4 34 -91 66 57 89 -19 47 -36 197 115 -131 147 134 68 -120 56 -151 162
4003 162 -96 128 -74 56 -144 -173 -41 -23 21 -134 -145 -20 -77 -19 189 19 7 64 114 -25 32 66 -94 -52
4027 -52 54 -161 103 -157 -103 9 -51 89 20 -138 23 75 -21 -6 219 -8 67 24 -63 15 -52 -107 158 61 1
4052 1 -182 32 -75 51 206 -148 -30 37 -20 11 -94 -15 98 52 -82 -41 20 7 -1 -21 29 65 167 -110 -271
4077 -271 57 -113 -18 153 -89 200 -77 -166 -1 21 -23 46 150 -28 116 -1 10 -27 22 -202 -27 92 -43
4100 -43 118 14 225 64 -106 -96 -50 7 -126 109 -10 -169 146 4 -119 -53 -75 -95 74 31 -50 3 70 -173
4124 -173 84 -164 19 68 -127 71 120 -169 139 51 44 0 -1 50 -33 -55 64 71 57 -115 -9 -7 -24 -12 92 -86
4150 -86 260 94 -174 -45 56 -122 94 78 -173 -65 -119 53 -77 7 24 3 53 -154 -29 -91 17 -76 -17
4173 -17 54 30 51 -23 -56 -73 -60 -25 65 -3 79 -97 -6 -36 -132 -120 86 -98 -18 84 40 27 98 -18 -9 103 78 -47
4201 -47 51 11 0 51 -125 -86 -8 150 98 53 -113 -73 39 83 -140 -25 -7 13 -150 112 -149 -41 -2 -60 58
4226 58 -65 -37 43 105 51 38 23 89 17 -150 -55 6 174 -86 12 -12 -30 48 -87 -11 -45 18 -193 -51 17 30 75
4253 75 33 62 24 0 15 85 57 -11 44 -67 22 176 -59 -93 -5 72 -3 9 -201 42 115 52 -83 94 2 -71 36
4280 36 -163 -49 9 -34 12 -29 -184 137 92 -67 31 -2 -36 127 -18 -117 9 79 54 -4 40 71 49 121 -24 40
4306 40 97 123 -57 -179 -28 66 -3 -110 -42 -76 -162 -43 -30 -50 13 -93 57 -83 -62 -4 -51 -158 128 -131 -92
4331 -92 91 -9 33 75 -85 -197 -67 11 -82 50 43 -73 -52 269 -152 30 17 -42 76 207 -12 -59 -36 -257
4355 -257 -77 132 -150 -41 143 -57 12 73 36 -17 87 -49 22 27 39 -84 55 -77 43 -63 -60 69 77 -24
4379 -24 110 -14 -96 -65 140 98 -42 -137 -31 -67 18 58 -141 -116 -159 -203 12 42 -7 -160 19 -73 34 68 -68
4404 -68 12 98 -77 -72 19 -45 -194 -108 0 12 28 114 10 72 86 -82 -52 -50 62 -2 77 -100 51 -53 34 15 154
4431 154 39 -65 19 111 71 51 174 -78 -24 -229 -120 -7 10 -55 154 -82 -121 117 69 -17 -30 -9 11 -58 84
4456 84 -36 -33 10 115 120 -48 -53 -68 79 -91 94 52 96 -91 112 59 -83 12 32 -89 -28 -114 -33 -109 -140 -144 -128
4483 -128 19 27 71 -144 -54 29 -44 116 266 31 161 -78 125 161 0 26 88 116 51 3 35 -39 -4 28 -99
4508 -99 58 -108 -48 83 -54 -75 139 21 69 114 -6 -50 -1 -28 117 42 -36 104 -63 -73 -56 21 -63 87 75
4533 75 -46 -88 139 -52 -124 -143 2 -63 -6 -11 128 7 4 -99 -20 -1 -36 -100 141 -26 58 53 -111 103 -165 -15
4559 -15 85 24 -35 11 -26 -125 218 -2 -17 4 3 -14 50 -14 68 48 23 55 11 106 33 46 246 141 82 159 81 85 -109
4588 -109 39 -14 39 -56 -17 -24 25 27 -80 5 60 121 45 96 131 81 -122 27 10 35 -19 68 -130 -141 122 75 67 -134
4616 -134 30 9 -9 -43 -65 9 -121 48 -11 -152 87 -4 105 -82 -48 -19 -109 -15 -12 8 -5 -78 106 14 -66 120
4642 120 -31 -61 103 -88 205 168 -40 56 133 -14 -97 89 -131 74 142 -44 -95 162 38 -98 131 23
4664 23 -47 -39 -65 55 136 63 55 46 -72 -26 87 38 45 -107 -8 100 -125 55 54 14 -76 160 -32 102 86 70 -135
4691 -135 13 -91 95 -61 28 44 -71 -140 -21 -155 11 104 9 -14 5 -115 -250 43 -24 -93 209 33 7
4714 7 -18 -167 5 -12 139 -130 -3 -24 85 -39 106 216 8 -111 3 -118 154 -9 -23 -4 13 -19 49
4737 49 209 6 45 -58 61 121 48 -54 9 -37 13 -6 81 -154 78 -41 -96 -187 2 -72 -126 63 -135 -124 103
4762 103 -65 -25 10 270 -49 -23 80 -96 5 -80 -25 -29 12 27 67 5 90 1 104 -139 77 -32 -68 7 42
4787 42 93 124 19 23 -49 25 100 51 -42 -25 -166 26 -74 -107 -43 49 13 72 168 2 16 -16 45 85 89 -60 110 -7
4815 -7 61 102 213 77 9 115 -179 -137 126 133 14 2 -15 -116 -99 101 35 48 40 61 -58 61 5 44 267 29
4841 29 -110 40 -61 -20 100 -173 -49 -131 -69 -252 9 19 80 16 152 77 -50 34 -211 60 -62 -240 -51
4864 -51 175 -74 -81 6 -8 -17 31 -124 -47 237 87 -101 -151 -20 122 -158 -53 28 1 -88 180 102 26 -85 -66
4889 -66 191 154 -141 100 -23 30 -11 -38 -80 -127 -46 79 -109 -71 98 -29 17 44 158 47 -9 9 10 8 -120 -62
4915 -62 -55 74 73 -107 55 22 -80 -96 -76 0 80 -113 29 87 -63 35 -58 -30 44 6 -20 16 -34 130 -9 -49 -117
4942 -117 181 -50 77 42 12 3 -249 42 11 -50 142 -128 -163 72 -69 -28 -15 160 3 67 33 -39 -52 34 10
4967 10 189 -89 17 -32 121 127 181 25 53 144 158 -98 83 -36 -96 110 -73 36 56 128 -15 -62 162 -102
4991 -102 -77 -32 81 1 108 134 -41 -78 -23 -171 3 55 -22 91 -88 -129 63 64 27 41 -67 73 -37 -27 72
5016 72 -78 70 -33 106 74 -78 44 89 39 -83 -6 -113 -79 -23 20 -3 -20 144 71 29 41 -36 -26 -129 55
5041 55 -33 143 15 75 10 -90 185 -6 -89 -28 3 -76 50 159 -120 -66 21 156 54 -81 -18 -114 -58 -216
5065 -216 -106 -81 -62 -3 103 -40 -6 -60 -10 -88 -51 -40 119 3 14 -27 78 41 25 72 -112 -22 -92 74 -37
5090 -37 203 90 44 18 -38 32 26 -7 -43 -31 -98 44 1 27 -134 35 -89 -122 107 -106 42 -54 -97 90 -17
5115 -17 70 -6 57 236 72 156 -73 45 -12 -170 21 -40 88 4 59 -56 17 -25 143 -7 157 65 -7 -59 28
5140 28 -48 -98 9 11 -110 152 -14 -170 25 -47 82 -89 16 -64 185 -11 -25 117 27 22 38 -28 91 145 145
5165 145 159 34 48 76 -11 19 -20 6 52 120 44 -42 104 60 -11 22 -18 21 -34 -5 -77 28 -102 89 -42 -130 62
5192 62 -111 -107 68 -65 -103 104 -150 -122 83 -170 56 -107 88 2 -159 167 -51 -50 152 -124 88 15 20 56
5216 56 -175 -104 -136 -86 -70 102 125 53 14 -68 -72 -59 -34 81 -134 99 35 -196 -138 166 -2 -70 -20 -103 106 135
5242 135 57 -115 1 36 -51 113 3 40 -67 69 -63 6 13 72 -102 52 10 -134 100 47 17 115 66 -163
5266 -163 18 -13 9 48 61 71 2 46 11 61 -1 -106 129 77 -7 74 13 25 57 -20 24 -19 -29 -88 44 49 -38 -74
5294 -74 101 -90 -42 13 32 -136 48 117 -98 -82 -17 -42 -56 -29 -84 -88 -124 -30 -73 124 -28 -50 -71 -5 141 -31
5320 -31 90 -24 1 -47 48 90 26 49 -98 34 5 32 189 -220 -1 -20 -116 60 136 -37 -211 9 187 -107
5344 -107 45 12 -113 -63 62 50 -16 -54 62 106 76 -191 31 172 52 -87 53 114 -23 97 123 -31 -112
5367 -112 -72 -36 122 -5 -62 -139 -15 -12 120 35 31 -151 33 -54 -39 169 -36 -13 108 67 -197 -120 120 -65 121
5392 121 75 -114 -43 -112 33 30 93 12 -66 9 -34 95 143 -60 72 -6 -104 89 3 238 23 43 -63 -59 33 174
5418 174 14 -42 63 -11 -168 84 -30 51 39 -2 -150 -87 97 44 28 23 -21 -16 142 -70 -13 -49 85 79 -63 -74
5444 -74 67 144 10 4 53 2 79 63 -17 -110 73 -56 78 -69 87 -59 -2 61 -67 -131 -23 21 -32 -15 -1 3
5470 3 -44 116 -122 -23 41 13 110 -24 -21 99 -34 138 167 -94 -3 187 43 141 -65 -5 20 111 -50 119 40
5495 40 51 92 -9 5 -131 167 8 -52 -142 -58 -92 -131 63 6 81 114 125 -52 10 26 -26 65 9 44 134 45 138
5522 138 208 -9 124 -136 157 -34 40 59 -77 27 12 -19 -327 29 -38 -2 14 76 -3 18 -188 -34 18 -10
5546 -10 -19 79 -110 99 -40 -41 15 51 87 15 -4 -22 117 25 63 65 123 122 -24 106 -34 29 -109 -68 32 87 -35
5573 -35 -86 81 214 -4 16 77 152 40 -28 82 86 -15 177 134 -9 75 136 54 57 102 -51 107 55 -24 -59 89
5599 89 -73 -82 -6 -67 -53 43 86 82 -39 -41 -109 75 23 -66 -9 -112 -88 50 3 36 -88 -132 128 23 -121 27 72
5626 72 71 -41 284 123 -67 -17 -116 -128 39 17 52 -22 -132 12 31 -58 -90 5 162 -12 64 9 16 1 -21 25 141
5653 141 -9 -33 -86 80 -33 -141 181 -89 83 23 -70 -114 -53 4 22 -56 -118 48 90 145 18 -20 -136 -96 104
5678 104 -51 48 -29 247 -56 -141 37 -43 40 103 86 -123 -54 36 -130 -46 56 59 -190 -17 -181 74 -5 -13 -106
5703 -106 16 -107 44 23 -7 13 -83 -87 -19 98 -47 -164 75 3 23 114 -88 170 -66 -59 40 101 -33 -135 146
5728 146 -119 -61 -87 -15 -84 -9 180 -79 72 14 8 -61 70 8 -134 95 -128 -33 -43 -75 57 -32 -115 -165 -135 -103
5754 -103 -40 -3 -139 -24 276 -31 0 14 106 18 107 163 68 -86 27 44 169 41 -75 8 -78 -10 9 -82 -66
5779 -66 -58 -37 -11 -23 -174 109 -28 -91 119 110 -110 9 -37 -84 -109 75 53 42 115 -56 -52 177 64 -141 67 -77
5805 -77 -88 82 63 -41 -97 -45 86 -83 76 -8 66 27 -143 -97 1 59 46 -65 -51 -134 -68 34 -42 -6 66 -17
5831 -17 35 -176 -98 -67 -89 192 -152 -38 -75 23 39 -6 -19 151 -69 17 37 -18 -50 77 -161 56 -109 167 120
5856 120 10 145 -122 53 49 86 231 -22 45 145 57 -140 -22 -47 -52 -2 127 0 18 12 89 79 167 86 -31
5881 -31 8 48 -14 28 12 68 141 46 156 -26 49 3 107 -53 73 -72 -6 -5 27 -12 81 41 44 82 -91 139 12
5908 12 30 -141 21 -126 80 -58 -142 163 63 -7 36 16 25 52 139 -61 50 9 60 -3 163 -24 -89 -143 -79
5933 -79 14 -8 32 -211 86 -50 67 5 54 -142 -117 22 115 114 34 100 11 -68 44 53 -19 50 -58 62 8 -1 -49
5960 -49 -54 83 -52 -14 -91 -115 -81 -17 114 78 20 145 -29 -23 -99 30 34 84 -24 -39 0 -31 22 -3 167 -47 25
5987 25 52 118 4 15 161 -94 82 -170 -73 95 51 -83 -39 -22 -180 -88 -52 -118 257 -8 -208 -77 70 45
6011 45 -32 -111 -42 63 -51 99 -41 13 -54 78 -18 49 -148 150 112 24 -88 32 -51 -66 -99 -80 100 -56 68
6036 68 -107 33 110 -86 150 5 -77 28 143 102 94 131 43 20 65 8 -63 95 -11 43 76 78 -1 90 105 -69
6062 -69 47 -242 -13 -63 -90 122 128 -108 179 -48 88 1 -70 -154 -17 -89 51 90 88 -71 -150 11 -9 -70 -92
6087 -92 86 -79 -81 -57 -61 -93 -30 -6 -25 -32 132 -54 3 129 -192 69 42 -171 70 129 -91 -26 56 -20 -109 86
6113 86 18 -104 58 11 32 29 78 94 118 20 -33 -90 -141 120 -113 93 -11 -16 -189 -95 -16 84 -21 -120 -53 136
6139 136 54 -75 91 8 47 34 70 -13 217 36 23 128 127 43 50 44 -69 111 229 148 -71 -31 -92 -47 -25 67 -112
6166 -112 -203 13 80 -20 5 -24 -63 52 70 -10 3 -1 167 48 79 -50 -15 19 -52 -90 -16 82 67 114 -68 52
6192 52 -5 39 -40 56 20 86 35 222 -118 -74 57 -65 95 45 -85 0 -73 -150 8 -155 -162 18 -15 -4 -5 62 -29
6219 -29 -69 23 102 34 81 56 -118 -7 19 -71 -111 145 -111 -45 -36 -41 -21 -151 21 -108 101 -12 -57 87 -61 35
6245 35 -7 -47 3 -41 -28 -144 71 89 -45 -17 -46 79 56 73 30 -110 -44 48 99 9 -3 -61 16 109 81 102 9 24
6273 24 -68 60 4 18 -88 27 57 -3 -18 -27 48 78 28 -73 82 68 103 25 179 129 49 83 -186 99 21 116 -112
6300 -112 -52 32 -68 -62 243 37 -50 -73 -67 25 90 -41 74 99 -138 -6 110 -48 -107 -26 64 -36 -109 3 233
6325 233 71 -110 13 -85 -34 55 -48 -122 17 -85 179 -42 136 0 14 71 -78 152 34 -74 55 13
6347 13 -56 -86 -90 26 -34 -64 -8 -10 -50 0 -33 105 -13 -98 2 -222 47 96 2 29 -34 -34 13 130 35 -29 26 69
6375 69 99 151 5 -159 -65 -124 -51 99 78 5 -35 151 -118 69 44 68 27 183 64 66 98 42 -51 64 196 45
6401 45 11 89 -54 -16 -86 -27 5 -2 -32 53 66 -130 233 -44 242 -11 86 -34 138 -53 64 -57 32 43 -111
6426 -111 -90 0 -3 -2 -48 -54 96 90 65 102 -28 11 -110 -48 20 -28 71 106 46 -58 3 11 -82 5 92 50 46 42 -19 -86 -58
6457 -58 34 73 33 28 -5 -33 36 37 -40 -83 -82 40 38 42 148 49 -42 -14 -40 48 -19 14 -25 61 -27 111 -53 -127 -26 -50
6487 -50 2 3 33 -114 -47 -91 -16 107 55 89 -80 63 5 110 -9 -50 -79 -98 -60 -105 42 22 67 -10 71 -29 87
6514 87 61 -107 156 -4 51 -119 131 -178 54 -16 17 119 -67 -103 -73 73 -168 -22 -71 31 -20 31 13 -76
6538 -76 1 -124 168 -77 -55 124 -133 124 -49 22 -83 25 -111 4 -100 22 96 37 -17 2 -117 -119 -38 64
6562 64 60 -152 -63 -22 59 86 61 97 68 15 -155 95 -115 -72 5 144 144 90 -8 38 -48 38 -78 64 -61 -63 -150 -38
6590 -38 89 -94 -55 -85 19 51 101 13 -133 -87 122 42 -77 -81 -36 49 -43 33 28 -21 -8 19 2 -65 -79 -42 81 0
6618 0 48 -117 3 54 56 -51 182 -41 28 -25 -124 63 69 37 33 -86 -11 -71 80 26 3 -162 50 88 110 -60 -214
6645 -214 -130 33 105 9 -59 -18 215 20 -12 94 52 2 52 -53 96 179 109 78 73 110 -69 -143 43 -96 -5 -95
6671 -95 -18 -85 5 92 -28 -10 -55 -48 63 4 91 -17 -79 -26 31 95 -106 -67 74 96 -53 83 65 -8 -23 216 118
6698 118 -55 -66 22 52 100 -178 51 77 9 -31 5 -205 -210 5 -72 -70 -265 53 56 94 104 -58 131 -35 106 42
6724 42 102 31 114 102 100 -2 160 7 -78 -32 -92 75 -26 -7 85 -35 -35 -49 -100 45 -153 -61 -119 -112 66 7 -63
6751 -63 -87 -90 31 83 20 147 122 -134 -143 -60 59 -235 -75 28 -28 69 -25 -15 -21 111 -13 55 -20 105 -54 -24
6777 -24 102 6 -40 103 11 -107 -115 -71 46 69 38 39 75 -37 -102 15 101 -33 -86 -106 -18 207 75 36 82 16 33
6804 33 -68 44 -5 -37 26 -165 50 132 43 11 86 -44 -204 -165 15 216 -51 93 -22 62 173 74 81 -76
6828 -76 67 112 -12 157 -167 -11 -27 31 -45 11 48 -101 56 -120 43 11 23 16 -47 32 54 55 -79 130 76 13
6854 13 -7 -19 63 105 -36 -1 109 106 -5 61 84 7 -157 -65 -179 -14 -65 -21 33 -71 212 53 -71 1 67 13
6880 13 -21 -10 95 -2 -76 223 -114 14 -82 193 65 -179 90 51 32 -78 11 -105 -32 -26 114 106 147 8 -25
6905 -25 94 42 -83 23 13 18 -74 -86 75 -117 134 47 -21 35 14 35 57 26 65 15 -107 -31 143 284 78 92
6931 92 -97 -8 -1 91 -53 -59 -47 137 -2 -9 -127 -150 -136 -53 -1 -62 -85 -157 25 -3 -8 -7 66 -30 62 -40 43 -125 49
6960 49 -54 -25 9 30 -21 -30 102 5 90 -29 -12 29 67 60 42 -155 -45 0 17 6 63 -12 3 -40 -91 -65 -107 103
6988 103 -208 -190 -42 -8 -142 124 -103 135 -106 40 12 -98 -25 266 55 -8 206 -74 0 12 -33 94 38
7011 38 -9 140 1 -60 -59 -108 -132 -6 -101 79 -38 -8 -16 114 26 -140 22 1 -81 129 -120 50 -40 4 60 44
7037 44 -102 -31 -124 -4 55 -144 -30 -145 1 70 -100 -6 193 -167 48 -30 93 -2 -54 -81 -21 -7 38 -54 -120
7062 -120 -17 49 20 -135 8 29 -51 44 21 -115 120 100 -153 57 37 -148 -173 14 -127 -82 93 -13 90
7085 90 64 128 -55 97 33 179 49 4 54 -20 -26 92 -57 125 -7 -155 11 -11 23 -17 -37 94 -113 26
7109 26 93 67 145 43 56 -59 7 150 19 -61 83 -158 -48 -75 122 95 104 34 -58 -33 -50 64 -16 -39 75 1
7135 1 -117 130 -1 51 119 -8 -40 112 -148 -41 -7 -98 -75 26 24 -226 -202 32 12 33 -49 28 -17 14 -147 165
7161 165 -121 176 150 -115 17 -25 -68 -1 87 163 -139 -125 97 -76 -93 66 19 -72 -23 -57 -94 109 -38 29 -43
7186 -43 -14 12 -2 139 49 57 100 94 -59 -24 -102 -103 -56 131 -70 -68 44 146 2 -160 4 -84 31 96 8 -139 -1
7213 -1 43 -72 -141 -51 120 41 77 53 119 -107 -63 31 -16 -152 -76 72 -3 -46 20 -44 -152 -234 13 -55 68 -133
7239 -133 -138 -58 13 -117 87 100 105 -53 -117 -15 59 -20 152 -45 63 7 19 21 0 -49 -51 -27 19 48 71 -11 90 -5
7267 -5 111 3 70 -9 48 -31 109 103 128 -39 -5 -8 16 136 118 108 43 -12 17 -126 86 -39 55 -58 129 44 -17
7294 -17 204 -42 194 9 -57 -9 -143 -139 -14 91 148 -77 -14 -78 48 -83 -76 -7 -45 -12 42 -150 -26 76 -49
7319 -49 -153 -10 -70 49 -37 -98 -15 17 -94 -13 83 -28 57 23 10 -90 -25 132 -4 -91 6 -105 -6 -148 41
7344 41 4 -137 -41 -54 172 92 42 -17 -76 139 74 96 61 -9 -4 9 34 127 73 -53 43 217 -28 1 109 11 172
7371 172 31 -9 -64 -91 33 159 -31 107 18 8 75 156 -35 -138 -126 -57 -19 33 7 71 -106 -65 -18 4 25 137
7397 137 -13 30 -46 -97 77 -28 74 30 -192 -64 64 -33 74 -139 -99 75 68 78 -8 53 -28 44 141 -125 -75
7422 -75 -97 -46 -120 20 58 4 65 -14 -44 29 44 51 52 -132 107 94 88 29 57 18 18 -41 -142 86 128 2 54 -17 -32
7451 -32 -138 74 -61 107 -100 -35 92 -28 -30 1 13 -47 14 -53 15 163 126 198 -135 -18 151 -35 76 -100
7475 -100 150 -62 1 97 12 63 150 -71 39 35 -17 80 -138 111 65 32 71 -53 -159 60 -132 -96 -80 -54 112
7500 112 32 15 -88 -48 15 74 18 63 -90 -92 -10 -42 114 -14 149 21 -158 191 30 39 34 0 39 0 -69 -59 2
7527 2 30 -41 -72 -52 -82 9 75 124 -48 -70 -45 11 -83 -18 -146 42 82 -3 88 81 16 -185 65 71 -117 -70 -65 235 52
7556 52 -94 240 -1 -74 24 -141 -35 80 49 -90 -32 149 -36 -194 -49 263 11 -73 2 67 -23 -13 -46 -51
7580 -51 -13 -128 84 -19 7 44 -39 -73 -27 38 61 -73 -67 -10 -40 -73 -100 10 -15 -14 -151 -42 -77 -92 -28 172 41
7607 41 -97 -79 9 8 16 -111 216 -26 -93 17 77 54 90 45 -60 -128 -65 -39 209 -101 34 108 65 -42 -38 -48 -96
7634 -96 84 11 123 2 90 59 71 2 83 -116 66 -91 141 -158 35 79 237 54 -256 -128 -74 16 70 27
7658 27 -34 13 -44 -116 41 28 -69 30 -72 -24 -67 -175 52 43 107 118 -28 -44 120 -105 37 12 -7 95 -137 -7
7684 -7 -93 59 4 79 -21 -81 -138 -60 -88 80 1 45 -39 -75 112 5 -34 -21 -49 -37 34 -22 115 -88 -2 -108 5
7711 5 43 25 21 135 -114 12 16 146 46 -35 45 82 55 6 58 150 -28 32 58 4 -83 -153 137 138 -30 -174 50
7738 50 -23 93 -74 7 101 1 73 -93 -33 -31 15 47 65 65 13 -71 -30 -118 28 65 -49 -6 -47 97 98 52 -69 83
7766 83 40 -33 -4 -58 -71 49 34 -20 -80 -149 -25 -10 -42 -21 -44 190 -63 -116 -19 99 -94 81 9 164 -159 -95
7792 -95 -71 27 17 -23 -25 -55 2 51 14 -192 82 21 -103 60 60 -71 15 -56 91 21 -136 -58 -99 -98 -23 -57 -50 -80 8
7821 8 -42 14 77 -2 -28 23 140 -98 -212 46 -73 78 -15 135 80 46 155 -63 152 -43 -15 -55 -22 3 140
7846 140 -22 34 60 31 -57 -170 2 -23 15 79 -87 -39 -32 41 -22 28 29 55 -115 12 -71 -132 71 126 -24 -152
7872 -152 4 -23 3 -2 11 116 -68 -4 58 -5 -91 91 126 -115 -99 -63 82 62 95 20 -23 -39 -6 95 -125 9
7898 9 -101 32 54 -32 -53 -14 6 103 34 37 -121 -129 97 -24 16 16 35 -30 -23 -31 132 154 -66 -50 -143 137 13 -39 170
7927 170 -109 117 10 -101 -92 -125 -54 -41 -36 140 26 -73 -148 44 31 50 146 19 34 55 -143 -75 -26 118 56 -1
7953 -1 46 -114 -109 -49 -109 64 90 35 -57 0 33 128 52 207 -106 -21 4 -34 -179 8 -77 9 -95 -78 -63 -112 -36 126
7981 126 -8 22 152 130 271 112 58 63 174 13 52 9 28 -12 -76 254 -25 112 -66 135 67 -143 -31 19
8005 19 -57 -59 -106 -204 -146 -25 -97 -43 -56 -49 98 33 -37 -8 126 80 -25 -1 44 -71 -22 82 -37 81 7 93 30
8032 30 -27 -8 -29 39 105 -69 -92 78 122 93 -5 87 -20 -1 105 -26 61 -46 133 -77 -20 -37 -78 -136 45 127
8058 127 -174 18 -34 124 126 -33 61 2 -2 118 -150 -42 -105 107 -51 -42 -104 -42 38 40 -50 6 -129 -227 64 -35
8084 -35 -100 13 -6 -38 3 -71 61 78 -57 198 94 29 -13 65 18 -90 -68 -1 -20 -40 61 -67 93 -30 -60
8109 -60 -11 21 -35 -42 48 -145 37 -62 1 124 -26 -44 129 18 -56 -12 51 -33 -48 -64 -56 -4 59 -110 -32 19 -13 39
8137 39 159 -110 -211 106 90 -259 -256 -118 -20 -87 80 -46 51 -184 -15 11 -23 11 -205 19 -42 -103 72 34
8161 34 18 -92 67 -94 97 43 38 73 -16 -129 -137 -40 -66 14 142 98 -94 26 -153 -2 77 196 27 -60 14
8186 14 109 -32 122 41 67
8191F7
##END NTUPLES=NMR FID
##END=
