##TITLE=1H_Pr 5037-R2
 200.13MHz,CDCl3,
 8 sc
 
 23.6.2025
##JCAMPDX= 6.0         $$ Bruker NMR JCAMP-DX V2.0
##DATA TYPE= NMR FID
##DATA CLASS= NTUPLES
##ORIGIN= UXNMR, Bruker Analytische Messtechnik GmbH
##OWNER= pz
$$ XWIN-NMR		Version 3.5
$$ Mon Jun 23 14:13:32 2025 Russian Standard Time (UT+4h)  she@DPX200
##.OBSERVE FREQUENCY= 200.1313
##.OBSERVE NUCLEUS= ^1H
##.DELAY= (6, 6)
##.ACQUISITION MODE= SIMULTANEOUS
##.ACQUISITION SCHEME= undefined
##.AVERAGES= 8
##.DIGITISER RES= 18
##SPECTROMETER/DATA SYSTEM= spect
##.PULSE SEQUENCE= zg30
##.SOLVENT NAME= CDCl3
##.SHIFT REFERENCE= (INTERNAL, CDCl3, 0, 14.3821)
##AUDIT TRAIL= $$ (NUMBER, WHEN, WHO, WHERE, WHAT)
$$ ##TITLE= Audit trail, XWIN-NMR		Version 3.5
$$ ##JCAMPDX= 5.01
$$ ##ORIGIN= Bruker BioSpin GmbH
$$ ##OWNER= she
$$ F:/spectra/data/she/nmr/H-C/1/audita.txt
$$ ##AUDIT TRAIL=  $$ (NUMBER, WHEN, WHO, WHERE, WHAT)
(   1,<2025-06-23 14:12:19.79 +0400>,<she>,<DPX200>,
      <created by zg, POWCHK disabled, PULCHK disabled
       configuration hash MD5:
       00 E9 B6 7A A2 85 ED C7 34 08 36 98 17 FE 4E 26
       data hash MD5: 16K
       82 56 59 DC 71 07 6B 2B 53 EE 55 40 9E 21 6F 3B>)
$$ ##END=
$$ 
$$ hash MD5
$$ 84 36 13 F9 DE 1E 11 34 B4 9B F8 01 7F 59 3D AC
##$RELAX= 
##$RELAX= 
##$RELAX= 
##$RELAX= 
##$RELAX= 
##$RELAX= 
$$ Bruker specific parameters
$$ --------------------------
##$DU= <F:/spectra>
##$EXPNO= 1
##$NAME= <H-C>
##$PROCNO= 1
##$TYPE= <nmr>
##$USER= <she>
##$AMP= (0..31)
100 100 100 100 100 100 100 100 100 100 100 100 100 100 100 100 100 100 
100 100 100 100 100 100 100 100 100 100 100 100 100 100 
##$AQSEQ= 0
##$AQ_mod= 1
##$AUNM= <au_zg>
##$AUTOPOS= <>
##$BF1= 200.13
##$BF2= 200.13
##$BF3= 200.13
##$BF4= 200.13
##$BF5= 200.13
##$BF6= 200.13
##$BF7= 200.13
##$BF8= 200.13
##$BYTORDA= 1
##$CFDGTYP= 0
##$CFRGTYP= 5
##$CHEMSTR= <none>
##$CNST= (0..31)
1 1 145 1 1 1 1 1 1 1 1 1 1 1 1 1 1 1 1 1 1 1 1 1 1 1 1 1 1 1 1 1 
##$CPDPRG= <>
##$CPDPRG1= <>
##$CPDPRG2= <>
##$CPDPRG3= <>
##$CPDPRG4= <mlev>
##$CPDPRG5= <mlev>
##$CPDPRG6= <mlev>
##$CPDPRG7= <mlev>
##$CPDPRG8= <mlev>
##$CPDPRGB= <>
##$CPDPRGT= <>
##$D= (0..31)
0 0.7 0 0 0 0 0 0 0 0 0 0.03 0 0 0 0 0 0 0 0 0 0 0 0 0 0 0 0 0 0 0 0 
##$DATE= 1750673539
##$DBL= (0..7)
120 120 120 120 120 120 120 120 
##$DBP= (0..7)
150 150 150 150 150 150 150 150 
##$DBP07= 0
##$DBPNAM0= <>
##$DBPNAM1= <>
##$DBPNAM2= <>
##$DBPNAM3= <>
##$DBPNAM4= <>
##$DBPNAM5= <>
##$DBPNAM6= <>
##$DBPNAM7= <>
##$DBPOAL= (0..7)
0.5 0.5 0.5 0.5 0.5 0.5 0.5 0.5 
##$DBPOFFS= (0..7)
0 0 0 0 0 0 0 0 
##$DE= 6
##$DECBNUC= <off>
##$DECIM= 32
##$DECNUC= <off>
##$DECSTAT= 4
##$DIGMOD= 1
##$DIGTYP= 9
##$DL= (0..7)
0 120 120 120 120 120 120 120 
##$DP= (0..7)
150 150 150 150 150 150 150 150 
##$DP07= 0
##$DPNAME0= <>
##$DPNAME1= <>
##$DPNAME2= <>
##$DPNAME3= <>
##$DPNAME4= <>
##$DPNAME5= <>
##$DPNAME6= <>
##$DPNAME7= <>
##$DPOAL= (0..7)
0.5 0.5 0.5 0.5 0.5 0.5 0.5 0.5 
##$DPOFFS= (0..7)
0 0 0 0 0 0 0 0 
##$DQDMODE= 0
##$DR= 18
##$DS= 0
##$DSLIST= <SSSSSSSSSSSSSSS>
$$ [...]
##$SUBNAM0= <"">
##$SUBNAM1= <"">
##$SUBNAM2= <"">
##$SUBNAM3= <"">
##$SUBNAM4= <"">
##$SUBNAM5= <"">
##$SUBNAM6= <"">
##$SUBNAM7= <"">
##$SUBNAM8= <"">
##$SUBNAM9= <"">
##$SW= 18.0517328524113
##$SWIBOX= (0..15)
0 0 2 0 0 0 0 0 0 0 0 0 0 0 0 0 
##$SW_h= 3612.71676300578
##$TD= 16384
##$TD0= 1
##$TE= 0
##$TE2= 300
##$TE3= 300
##$TEG= 300
##$TL= (0..7)
0 120 120 120 120 120 120 120 
##$TP= (0..7)
150 150 150 150 150 150 150 150 
##$TP07= 0
##$TPNAME0= <>
##$TPNAME1= <>
##$TPNAME2= <>
##$TPNAME3= <>
##$TPNAME4= <>
##$TPNAME5= <>
##$TPNAME6= <>
##$TPNAME7= <>
##$TPOAL= (0..7)
0.5 0.5 0.5 0.5 0.5 0.5 0.5 0.5 
##$TPOFFS= (0..7)
0 0 0 0 0 0 0 0 
##$TUNHIN= 0
##$TUNHOUT= 0
##$TUNXOUT= 0
##$USERA1= <user>
##$USERA2= <user>
##$USERA3= <user>
##$USERA4= <user>
##$USERA5= <user>
##$V9= 5
##$VALIST= <valist>
##$VCLIST= <CCCCCCCCCCCCCCC>
##$VD= 0
##$VDLIST= <DDDDDDDDDDDDDDD>
##$VPLIST= <PPPPPPPPPPPPPPP>
##$VTLIST= <TTTTTTTTTTTTTTT>
##$WBST= 1024
##$WBSW= 4
##$XGAIN= (0..3)
0 0 0 0 
##$XL= 0
##$YL= 0
##$YMAX_a= 242341
##$YMIN_a= -256182
##$ZGOPTNS= <>
##$ZL1= 120
##$ZL2= 120
##$ZL3= 120
##$ZL4= 120
##$ABSF1= 10
##$ABSF2= 0
##$ABSG= 5
##$ABSL= 3
##$ALPHA= 0
##$AQORDER= 0
##$ASSFAC= 0
##$ASSFACI= 0
##$ASSFACX= 0
##$ASSWID= 0
##$AUNMP= <proc_1d>
##$AZFE= 0.1
##$AZFW= 0.1
##$BCFW= 1
##$BC_mod= 2
##$BYTORDP= 1
##$COROFFS= 0
##$CY= -3
##$DATMOD= 1
##$DC= 2
##$DFILT= <>
##$DTYPP= 0
##$F1P= 0
##$F2P= 0
##$FCOR= 0.5
##$FTSIZE= 0
##$FT_mod= 4
##$GAMMA= 1
##$GB= 0.15
##$INTBC= 1
##$INTSCL= 1
##$ISEN= 128
##$LB= 0.25
##$LEV0= 0
##$LPBIN= 0
##$MAXI= 10000
##$MC2= 0
##$MEAN= 0
##$ME_mod= 0
##$MI= 1.114404
##$NCOEF= 0
##$NC_proc= 0
##$NLEV= 6
##$NOISF1= 3.799351
##$NOISF2= 2.8
##$NSP= 1
##$NTH_PI= 0
##$NZP= 0
##$OFFSET= 14.38212
##$PC= 1
##$PHC0= -1197.921
##$PHC1= 12.9922
##$PH_mod= 1
##$PKNL= yes
##$PPARMOD= 0
##$PSCAL= 0
##$PSIGN= 0
##$REVERSE= no
##$SF= 200.129724274929
##$SI= 16384
##$SIGF1= 3
##$SIGF2= 2
##$SINO= 400
##$SIOLD= 16384
##$SREGLST= <1H.CDCl3>
##$SSB= 0
##$STSI= 0
##$STSR= 0
##$SW_p= 3205.1282051282
##$SYMM= 0
##$S_DEV= 0
##$TDeff= 0
##$TDoff= 0
##$TI= <>
##$TILT= no
##$TM1= 0
##$TM2= 0
##$TOPLEV= 0
##$USERP1= <user>
##$USERP2= <user>
##$USERP3= <user>
##$USERP4= <user>
##$USERP5= <user>
##$WDW= 1
##$XDIM= 8192
##$YMAX_p= 0
##$YMIN_p= 0
$$ End of Bruker specific parameters
$$ ---------------------------------
##NTUPLES= NMR FID
##VAR_NAME=  TIME,          FID/REAL,        FID/IMAG
##SYMBOL=    X,             R,               I
##VAR_TYPE=  INDEPENDENT,   DEPENDENT,       DEPENDENT
##VAR_FORM=  AFFN,          ASDF,            ASDF
##VAR_DIM=   8192,          8192,            8192
##UNITS=     SECONDS,       ARBITRARY UNITS, ARBITRARY UNITS
##FACTOR=    0.0002768,     1,               1
##FIRST=     0,             0,               0
##LAST=      2.2672688,     0,               0
##MIN=       0,             -256182,         0
##MAX=       2.2672688,     242341,          0
$$ Real data points
##PAGE= N=1
##DATA TABLE= (X++(R..R)), XYDATA
$$ [...]
1657B04L24n35K52R9j35J93n81L31P9l31N3M71q00M08l27j02L48j51j58L07j75
1678b26K41K94l58J29J37n5l9m1P5N03n42k58K2K65l05m8k03O36l55n91O17L33
1700B31j17k46M13K60j31n35K80Q30j049j93L94j15J19n27J38N08p60L0L55JP1
1721d3q8k22O87j3m75N31k32j83K24j09lM92n79j10K60l16r3j9j32O53l29r0q0
1744b69J15N5L64k46j7L69j61j35p5P1L64m63r2M06k48k80J2P0J92k53l54O61
1766H6L1l51K75K53j99J04m26N89O2m33M3K22k23P3j78j5L64m67k30N77n32L66
1788i%k35M33N0k70J31P2j40J74j03j32K88l80K22p7m77M14k27j69J04J10M3J05
1811g3k79N69J38l58J74L29l66K36q4k74O07n57k89M39m15j12J33J4K30p6m39
$$ plain form
1657 204 528 -7 245 344 209 402 -179 152 231 -100 -47 424 -376 32 -295 -397 -49 -200 -358 -51 -226
1678 -226 15 309 -49 80 217 162 123 82 157 660 118 -140 -118 147 -158 -206 -409 227 -128 -719 -102 231
1700 231 114 -132 281 541 410 -125 155 985 -64 -257 137 22 141 -386 -248 260 -500 -470 -115 -114 -43
1721 -43 -131 -353 334 321 -154 377 145 -38 186 77 74 566 -13 -123 137 -179 -272 -291 -423 230 -99 -189 -269
1744 -269 -154 -99 265 19 2 371 210 75 0 71 435 -28 -120 286 38 -242 -230 -160 32 -221 -575 86
1766 86 117 -234 41 294 95 199 -227 362 424 -9 34 256 33 106 -72 -87 277 -190 -420 157 -375 -9
1788 -9 -9 -244 189 239 -31 100 172 32 206 103 -29 259 -121 101 24 -453 -39 -266 -435 -331 -221 -178 -73
1811 -73 -352 217 355 -3 171 500 134 370 286 12 619 62 -227 212 -203 -315 -182 -168 62 -14 -453
1832d53J92J64j08J82P0K60O6o76O13K69o38J74o2l0J65l27j27L77k60q2q8q3
1854d02L67Q1m26M08L50m69K72j76K24Pk20lL41l88K0M2j85K50k24j96J35J57
1876c5j13L8j43O30R6p38K45N61m43K8j67M6M88o87j40O41l05m63Q8Q7K62j98
1898b22k94O70R9n61L7K69K19j04l69M73K25l31k8j27K01M8l28n9J95j58k63M11
1920Ck57L86j64l49O45L0m26K49K2L34O6m33pL40m11L5j93j02K73k19l19N45n0
1943bl27R3K56J39L6o08N42N84r16J78K50K57j49o02J71L94n81q5L59j0J12l99
1965c08j18N98jn28M95l2O7k15k2P0N95o73K66j28j91J84l27K35J36k22j43o6
1987c28J74K29k05l40N18K27m24K16K3L56o1n50K30L55m06l54K70O4J49m58l45
$$ plain form
1832 -453 -261 -97 -205 -23 47 307 373 -303 310 579 -59 115 53 23 188 -139 -266 111 -149 -231 -319 -402
1854 -402 -35 46 -380 28 378 -91 181 5 229 236 16 13 354 -34 -14 28 -157 93 -131 -327 -192 -35
1876 -35 -148 -110 -253 377 473 -265 -20 541 98 126 -41 5 493 -194 -334 307 2 -461 -373 -286 -24 -222
1898 -222 -516 154 253 -308 -271 -2 217 113 -256 217 442 111 83 -44 157 205 -123 -182 13 -145 -408 3
1920 3 -254 132 -32 -381 264 294 -132 117 139 473 539 106 99 439 28 63 -130 -232 41 -178 -497 48 -2
1943 -2 -329 -236 20 159 195 -413 129 713 -203 -25 225 482 333 -269 -98 296 -285 -370 -11 -21 91 -308
1965 -308 -426 172 171 -357 138 106 173 -42 -64 6 601 -72 194 66 -125 59 -268 -33 103 -119 -262 -328
1987 -328 -154 75 -130 -470 48 275 -149 67 90 446 385 -165 65 420 14 -340 -70 -6 143 -315 -660
2008f60R44k43l62K22L56j71L8k19O13j18n49Q7M60k91K73n77K27L44p81L45J62
2029A00l38J24k75M48J99k19l83M64j09L6Q6p4K26l7m47M33o6j93Q0j43j24M63
2051B51n03k1L89m84K79J79j95J47K29k80K29k28L15j26l63L09L97n91O1l5K9
2072a2J67n19n0O34m25k3L72K4k79J33j01N07l8o72L11L61l42j24r6M31m0o92
2094d73N75M2n27j75O35j21j35mJ85K69m73L19O7n3M4p1J86j9k07j85L39k09j32
2117a23M64k86m17K59K9Q2p6r2K98O3l01kL40j2j43r5L08O4m58J22K27r1m12j05
2141c57K74J77o16J81N28M9l84J61Q7nj84J43L40l11k84K44O7q2L1l84N63k44
2163fn09N81l4m84L17J42J94n5j57K70K30n78j4M57l26q1K22K5J91o78j53Q67
$$ plain form
2008 -660 284 41 -321 -99 257 86 124 -95 518 400 -149 -62 398 107 380 -197 30 374 -407 -62 100
2029 100 -238 -114 -389 59 258 39 -344 120 11 47 133 59 285 248 -199 234 168 -25 55 -88 -212 251
2051 251 -252 -273 116 -368 -89 90 -105 42 271 -9 220 -8 307 181 -182 127 524 -67 -6 -41 -12
2072 -12 155 -364 -414 220 -205 -228 144 168 -111 22 -79 428 390 -282 29 390 48 -76 -172 259 219 -473
2094 -473 102 144 -383 -558 77 -44 -179 -183 2 271 -202 117 184 131 175 104 290 271 64 -121 218 9 -123
2117 -123 341 55 -362 -103 -74 8 -68 -160 138 201 -100 -102 238 226 83 -12 296 360 -98 24 251 160 -252 -357
2141 -357 -83 94 -522 -341 187 236 -148 13 100 95 -89 54 394 83 -201 43 110 28 59 -325 238 -6
2163 -6 -515 66 32 -452 -135 7 201 146 -11 259 489 -89 -103 354 28 -53 169 194 385 -293 -446 421
2185D21n79k94N52J41l66k93M80L31l13n42P70j9m94J67J13M07n52n10Q88J31
2205D39n17k47L83Q2m31j99M51L73r62M02N37k16l5J7Q0K14l54j6J69n5l84K58
2227a1J57k40R4j78K93k4l65K96L0j71k9N40k90j58o4M03J30p95L61L05j58j40
2249a4j51J78J85n81J01O48m77m94K70L35J69m55J37N30j33l33K88J50k50j21
2269a8J77N4J2n80K87jj02m5L6K14J4m40M63J66m86K17J20J14j21j12K16L1l52
2292a36J4K79j03n73M29J84k2m87K45O36n60l09O20m0n9j18L25N2m07l77N73O5
2314B31l16n7K22p8k11L4J25L21n07q9N59k34j27J76j66L68m20L50L39l94j11
2335A5NP1J54m23l4K93j92k55M35k01j79N32k88K03k22j5K49J6l14K83P8K5j42
$$ plain form
2185 421 -158 -452 100 241 -125 -418 62 393 80 -462 308 289 -205 -38 75 482 -70 -580 308 439
2205 439 -78 -325 58 140 -291 -490 -39 334 -628 -226 311 95 60 77 157 371 17 1 170 115 -269 -11
2227 -11 146 -94 0 -178 115 91 -274 22 52 -119 -148 392 102 -56 -120 283 413 -382 -21 284 126 -14
2249 -14 -165 13 198 -383 -282 366 -111 -605 -335 0 169 -286 -149 381 248 -85 203 353 103 -18
2269 -18 159 213 225 -355 -68 -69 -171 -216 -180 34 48 -392 71 237 -249 -32 88 202 81 -31 185 216 -136
2292 -136 -122 157 54 -519 -90 94 72 -415 -170 466 -94 -403 217 177 118 0 325 377 -30 -407 166 231
2314 231 -85 -142 80 2 -209 -175 -50 271 -236 -325 234 0 -127 49 -117 251 -169 181 520 126 15
2335 15 20 91 245 -178 -212 81 -111 -366 69 -132 -311 221 -67 136 -86 -101 148 164 -150 133 211 236 94
2358I4l35M02J10o58K52L20l18q0jL84p4l44J95L29l34J18N3j4J53m71J87L86
2380C54j11m86K82K16k34k56Q3J33R1m30K89J07m55M94J6j41R2J9n4K28l75J31
2402gL03j87k71K44j73J36l29K57K7k83L79l4r1j46K60OP5rm4K12l0l33J52j38
2426b4J76k76j03N09j08m36J7K87N9k08NJ65K25o01J00N65m53K04J02K1J9j39
2448A06j52J43j39K9M2j45MR2j72K60k29L5NM4M5K79r7p6K68j10j85O0j89J87
2472A05rk77L80j94k2j2k3j09J95k84JK81J16j57j1j8L46r0l73L81k05L4m4k2
2496a1m2Rm7K22j39j81J66o4P5J38N8J7K02m31J61j08O1J71J56m55K06j92k65
2519b93M53k02k53K79m3L6K38l96K41j90P7K62m85K01K79k12J38r0M7J93m24n3
$$ plain form
2358 94 -241 161 271 -387 -135 185 -133 -213 -214 170 96 -248 -53 276 -58 60 113 99 252 -219 -32 354
2380 354 243 -243 39 255 21 -235 -152 -19 72 -358 -69 38 -417 77 93 -48 44 63 9 237 -138 -7
2402 -7 296 109 -162 82 -91 45 -284 -27 0 -283 96 62 -29 -175 85 91 166 157 113 325 295 -38 114 -24
2426 -24 152 -124 -227 282 174 -262 -245 42 101 -107 -102 63 288 -313 -213 352 -101 103 205 226 245 106
2448 106 -46 97 -42 -13 29 -116 -112 -20 -192 68 -161 -126 -121 -77 -32 247 150 74 342 232 47 107 -82 105
2472 105 96 -181 199 5 -17 -29 -52 -161 34 -250 -249 32 148 -9 -20 -38 308 218 -155 226 21 55 11 -11
2496 -11 -53 -44 -91 131 -8 -189 -23 -87 -12 126 184 201 403 -28 133 25 86 257 413 -42 164 -28 -293
2519 -293 160 -42 -295 -16 -59 -23 215 -181 60 -130 -53 209 -276 -75 204 -8 130 40 87 280 -144 -197
2541a97L61k06%j34j9J49J36k58K41P0p8R5L0m7J32j19j2N7k91P6J19j20K8j02
2565h9l7J64l38J06J89j74j78L95J38M6jp4l7L5j30L69l20j50Q9j68N9L2j19K61
2589F8n5k17K32J25j81P0k43L03J86l57M9J13j25L3Q3k71J89J57j76o4k8k9J0
2612a28j61R8K27j81p6J95J55J41l62J2J10L16o05M04k37K3J32j22K06k92q4J82
2634d7K18k09J61k88K31J26j56j3Q7kj18J21o7J9j22J45j53J7J24j39j63J32J02
2657Fk94J44N1OP1l17N20%m01K09o0j3K07j49N8N4J73l56J05j45L25l27m3J90
2681A4l7o3q8K68j21N4j81K38N9O3l67N18k89l6Q5j72mR5j86J45r1k5L0j83K73
2706aPJ4k37M72l91O3K88j67J69o7k14J06p8J08J71k82K80j76j99J55J1J50p9
$$ plain form
2541 -197 164 -42 -42 -176 -195 -46 90 -168 73 143 65 160 190 143 275 156 144 201 -90 -14 105 -15 13 -89
2565 -89 -126 38 -300 -194 -5 -179 -357 38 176 222 221 147 110 145 15 384 64 -86 3 -165 -106 -74 -193 68
2589 68 13 -204 28 153 -28 42 -201 102 288 -69 -20 93 -32 1 84 -187 2 159 -17 -81 -109 -138 -128
2612 -128 -289 -191 36 -145 -221 -26 129 270 -92 -80 30 346 -259 145 -92 -69 63 -59 147 -145 -229 -47
2634 -47 171 -38 123 -165 66 192 36 23 110 108 -10 111 44 63 -59 86 -67 -50 74 -65 -228 -96 6
2657 6 -288 -144 -93 -87 -16 -333 187 187 -214 -5 -65 -78 129 -20 38 92 265 -91 14 -131 194 -133 -176 14
2681 14 -23 -86 -174 94 -27 27 -154 84 143 206 -161 357 68 32 117 -55 -59 36 -150 -5 -96 -121 -91 -274 -1
2706 -1 6 20 -217 255 -136 -73 215 48 217 150 -64 42 -36 72 243 -39 241 65 -134 21 32 182 103
2729A03j48o8J40J33j43R5nJ69l14K9N3j25l5K36l00K19j84r4J93k7k68K91J74
2752A24l5J03l56M14m3k87J13K17j65k87M51k90J92j01l71M65j80l2j06K2O3J05
2774A6j89L27r3l4m5L9N5j0K28m07J62j41m0N5pN2n6r4N8N7J8j20KM10j67k12
2800a36l2K70m5M9j39q3L28ml48K70p8j55n9N6N7K45n11L74M5k30K2O9R2j01j40
2825a84J99K89k91j63J48n7J12q7o2O6P9j12K17j43j74L99l85N8Jp4K25K47l97
2848h9J85j70l7J39O4j23j30J45mJ23j92K36r8m5j92K63N6K4j28M9J56l85P0J08
2872B5M8M6o5Q6Kr9k03K02l0j23j77Q3J90J25j97J93K7j04J55k7J2L5l10O4K04
2897A62j41K7j37O3n5k0j31L03k62Q9K32M1k51J37p8J77M3j69Lk4K3o6j17K14
$$ plain form
2729 103 -45 -113 27 160 17 112 107 276 -38 -9 44 -81 -116 120 -180 39 -145 -239 -46 -73 -341 -50 124
2752 124 89 192 -164 250 207 -80 33 250 85 -202 249 -41 151 50 -321 144 -36 -68 -174 -152 -89 16
2774 16 -173 154 61 27 -18 21 76 66 294 -113 49 -92 -132 -77 -84 -32 -88 -182 -124 -67 -49 -169 -167 243 76 -136
2800 -136 -168 102 57 106 -33 -116 212 208 -140 130 52 -103 -162 -106 -49 196 -315 59 104 -126 -104 -35 57 -44 -184
2825 -184 15 304 13 -150 -2 -59 53 -34 -96 -30 49 -63 154 11 -163 236 -149 -91 -90 -164 61 308 -89
2848 -89 96 -74 -111 28 92 -31 -161 -16 -20 103 -89 147 49 4 -188 75 131 155 27 76 232 -153 -83 25
2872 25 73 119 54 140 142 43 -160 42 12 -111 -288 -205 -15 110 -87 106 133 29 184 157 169 204 -106 -42 162
2897 162 21 48 -89 -26 -81 -101 -232 71 -191 -102 130 171 -80 57 -21 156 199 30 33 9 32 -34 -151 63
2921F3k35R4N2NK6m8J9j40K19J58k22k5K4J49p5j15R8J43k89JK48k68J82k45N7
2946a24J85pl69J90KL10j79l36N11n8k17J42J19rj03K8j49Q5j20M1K4n5k7j5K10
2971G9o2ro9j09N8K6J19k13J56K15k66J98l03P0J34kr4K72p5l91K26k16M3P8J4
2996a21J99j42j41K90n5J35n0N4p2q8j6l1O9Q5k04k12K82M3j28j09M8R7kj78J02
3021a45K32m5O3k7K02m46Q3Q9j23K01r5l7j8P2K5j51Q9P5j05r3r2K30k22P2J47
3046a9J50k60J63K46k44L4Q4j47o0K55k63j40J60j58J17J00j46J4K28j69K18j95
3068c2R3k0j18L3J11o4J9j11r9J87j48J47M1j04l9J32N6k1j59m9L36k19O8J17
3092A57M1m2j72l8J06J84j48n2J66k83J26m1L2k3j71L74k52j67K02J60j29J76
$$ plain form
2921 63 -172 -78 -26 -21 5 -43 -24 -164 55 213 -9 -34 -10 139 64 -51 47 190 -99 -98 150 -118 64 -181 -124
2946 -124 61 54 -315 -125 -123 187 8 -328 183 125 -92 50 169 160 57 85 -64 21 -99 -58 -34 -89 -116 -131 79
2971 79 17 8 -61 -170 -112 -86 33 -180 -24 191 -75 123 -180 -110 24 22 -72 200 125 -266 -40 -256 -213 -135 -121
2996 -121 78 -64 -205 85 30 165 115 169 97 9 -7 -38 31 116 -88 -300 -18 25 -103 -212 -164 -67 -69 -247 -145
3021 -145 87 42 105 78 280 -166 -83 6 -117 84 -11 -48 -66 6 31 -120 -31 44 -61 -154 -246 -16 -238 -166 -19
3046 -19 131 -129 34 280 36 70 154 7 -53 202 -61 -201 -41 -199 -82 18 -128 -114 114 -55 163 -32
3068 -32 61 41 -77 -44 67 3 22 -89 -188 -1 -149 -2 39 -65 -104 28 84 63 -96 -145 191 -28 40 157
3092 157 198 156 -16 -54 52 236 88 36 202 -81 45 4 36 13 -158 216 -36 -203 -1 159 30 206
3114B06j22qM1k34M1K62k02k90L49k13O5k9j59L24j60m7J59l1M7Q1o0P1M0pM2
3139A66Q0j63J2k70k4K92m3r2JQ9q9n2m6J23rn0J7j09J87Oo1J7K2K70k22J55k98
3166i1J41k01j7J51J00J3q6Oq6N1n1k1L09l36L59j76O9j13k7K3pm6K1J97l45K3
3192a40j39M8P0O7r4K68L2n1j37o5K02m5L0q4K25j43p2L63l53M4k9J0l7j49J73
3217fk7oJ14L6k77J65Q6j53O6j40J46O2qJ9M3j52K25l13J85J20m54J64R2N5k93
3242b51J6K18R9Q5j91Q7R7l04K08J8l8k3k16O1J88k73O9J01K04k07j2K28j43o0
3266c9p8K72j56RM9l4N4l8N4j33J77j66m1J23k06r2K22J56l68j08L59P9l07K79
3290F7j18p8L43k29j43N03m30J59M0q8j74M3o1L57l28J04K59m05l4K70j18j32
$$ plain form
3114 206 84 76 117 -117 -76 186 -16 -306 43 -170 -105 -134 -293 31 -129 -176 -17 -48 -1 80 20 91 131 124 166
3139 166 246 83 95 -175 -199 93 50 -42 -41 48 -41 -93 -139 -16 -25 -75 -58 -167 20 26 -35 -18 4 274 52 207 -91
3166 -91 50 -151 -168 -17 83 96 10 16 -70 -19 -70 -91 218 -118 241 65 134 21 -6 17 10 -36 -15 182 -163 -140
3192 -140 -279 -231 -161 -94 -188 80 112 61 -76 -141 61 16 46 -38 187 44 -28 335 -18 26 -3 7 -30 -179 -6
3217 -6 -33 -39 75 111 -166 -1 85 -68 -2 -142 4 66 58 77 120 -32 193 -120 65 185 -269 -105 -13 42 -251
3242 -251 -235 -17 82 167 -24 63 160 -144 64 82 44 21 -195 -134 54 -219 -150 -49 155 -52 -64 164 21 -39
3266 -39 -117 155 -1 8 57 23 77 39 93 -40 137 -29 -70 53 -153 -245 -23 133 -235 -343 16 95 -212 67
3290 67 -51 -129 214 -15 -158 345 -85 74 114 26 -148 -105 -166 191 -137 -33 226 -179 -213 57 -61 -193
3312a93L30k23K65J15m85L60J43m08O5N5j34J09k5J76j15j4o1N1j15J38k21K12
3334B5K26l05j92J10K5J26J75k68J99r9j25R8j39j76K94J8K7j74K30k13J78j43
3356a03M1J39p1J63j55mN3j06mK9K1j55K69L8j64j67J86R3j19k5j19L21p1j96
3380a06J09J25O5k07L2J99j10R8k00P8l28K86Q5n6k19J8L0J6J4J62J6N4m3k21
3404a03R6pJ60j29J5n5qM9J46k83J75Q7j47n5j4K74k38J65k09K41j42j54J69K78
3428C11m57O9J86n2p3j71K97j54j10o3K84J60l32O6O8pk49K38j01L30m5j01j66
3451g2M26k38k7j30J6N5l1r0n7p1P6J53M7m8k54Q0J12L63k12j29J98l8j6j07j13
3476a07j18K94j8p3n8K01j75O7J79j92j51L92j27k97J80J36p2jj0l4o5KR7o0l0
$$ plain form
3312 -193 137 -86 179 294 -191 169 312 -96 -31 24 -110 -1 -26 150 35 21 -40 11 -104 34 -187 25
3334 25 251 -54 -246 -136 -111 15 190 -78 121 22 -103 -5 -144 -320 -26 -8 19 -155 75 -138 40 -103
3356 -103 -62 77 6 169 14 10 63 -43 -47 -18 3 -152 117 155 -9 -176 10 103 -16 -41 -160 161 90 -106
3380 -106 3 128 193 -14 18 217 107 205 5 83 -245 41 126 70 -149 -131 -101 -85 -71 91 107 161 118 -103
3404 -103 -7 -14 146 17 32 -23 -31 18 164 -119 56 143 -4 -59 -73 201 -37 128 -81 160 18 -136 33 311
3428 311 -146 -77 109 57 -16 -187 110 -44 -154 -217 67 227 -105 -39 29 22 -227 11 -90 240 195 94 -72
3451 -72 354 116 89 -41 -25 30 -1 -91 -148 -219 -143 10 57 9 -245 -165 -53 310 98 -31 167 129 113 6 -107
3476 -107 -225 69 51 -22 -80 121 -54 13 192 0 -151 241 114 -183 -3 133 61 60 50 16 -49 -47 50 -10 -40
3501d0M6Q3k75K08j15k2O5N0j00J89m54L33J9j2K51l38J60j20o8J00L75k39j88
3524i2l8J63J77k65j0K63J06k92n3k6j2k0J02M5N2q7J64kk27K41k33r1J45N8k8
3549D0j5n7J75L4m50K32j56J36J65j22J16l2j16Q3k9O1L4k15J06J28j72P7m1l
3573b1j1O1j33l5%PK61l4j56J38o5j1j9n7M5J33l81K09K40j47N7j49l44L28n1
3598a35PO9L25k81O0m9M1L0j4PR0j78N7j33P5n6r8J96M9j1o2N9j57MJ52j28k1
3625a02O5J03r4m1J46J74m74K21J80l82L51j89L8j16M8r3J17r9L85l58K04J18
3647B02j74j60L22j48j57K02k93K40L8r6L7L4K3Oj31J11j2k51J31q8K73MJ37l34
3671h4K28j83m0K42j34Jp4J9J12k08K32j20J6q5j44K70L2k7j15Q0J43q2j66J90
$$ plain form
3501 -40 6 89 -186 22 -93 -115 -50 0 -100 89 -365 -32 -13 -25 226 -112 48 -72 -140 -40 335 96 -92
3524 -92 -130 33 210 -55 -65 198 304 12 -41 -67 -79 -99 3 48 100 13 177 175 -52 189 -44 -135 10 68 40
3549 40 25 -32 143 177 -273 -41 -197 -61 104 -18 98 66 -50 33 4 65 99 -116 -10 118 -54 23 -18 -21
3573 -21 -32 29 -104 -139 -139 -132 129 95 -61 77 12 1 -18 -75 -30 103 -278 -69 171 24 81 -68 -412 -84 -135
3598 -135 -128 -59 266 -15 45 -4 37 67 53 60 150 -28 29 -104 -29 -85 -183 13 62 51 -11 48 -109 -105 47 -81 -102
3625 -102 -37 66 -28 -69 77 251 -223 -2 178 -204 147 -42 -4 -120 -72 -165 -48 -147 238 -120 84 202
3647 202 28 -132 190 42 -115 87 -206 34 72 -24 13 47 70 76 -55 56 44 -207 -76 -164 109 113 250 -84
3671 -84 144 -39 -79 163 29 30 -44 -25 87 -121 111 -9 7 -78 -222 48 80 53 -62 18 161 79 -87 103
3695A03o3L7J58j02n8n3J0q8L29j21j43J1P2j4j27Mk1J3l3K71k50J53Lj08L05
3720B88m23K42q0k81J46J33J05j74J75j91J45j00l4N8k71L23J14l34L0L04j32
3741D3l2R9j91L09j75o2J4J2j30J23k10K58j61Mm5J66P8j88j5N4j7PM7P4j20L2
3767b6J22ok65J20NL04k94j2n3R1Q0m8q6L57k20j48J90j70J35k13j9K65Q0r2j10
3792a3J07k15J13r7R9J03L4l11P3p4lK09j21J1K29k99J39j89J38J97k48P9l2j74
3816b45L55j35k5NL7k6QK58n03L2K61J14P2o7L4j16J01p6j23pk3l9K4L4Rn0l43
3843d34J90P9L46j42r1L6M0l8J46q4N4j6K2Q2j90OJ93k92J04k96P3J02J50k64
3867b24L05j35j2Q0J07j22NK1Q3j46K04j84m4M3J27m8p4Q3k70M54k77Rl8J48k06
$$ plain form
3695 103 40 77 235 133 75 22 32 -56 273 152 9 20 92 78 -49 -45 -66 -53 -86 185 -65 88 91 -17 288
3720 288 -135 107 27 -254 -108 25 130 -44 131 -60 85 -15 -49 9 -262 61 175 -159 -129 175 43
3741 43 11 110 -81 228 53 -9 5 17 -113 10 -200 58 -103 -99 -144 22 100 -88 -103 -49 -66 -59 -12 62 -58 -26
3767 -26 96 90 -175 -55 -50 254 -40 -52 -105 -14 66 18 -68 289 69 -79 111 -59 76 -137 -156 109 189 97 -13
3792 -13 94 -121 -8 -105 -6 97 131 -180 -107 -181 -184 25 -96 -85 144 -155 -16 -205 -67 130 -118 -39 -71 -245
3816 -245 110 -25 -50 -45 -8 -34 -26 232 -271 -239 22 136 208 141 175 59 160 84 -39 -46 -69 -108 -84 -50 -41 -91 -434
3843 -434 -244 -165 181 39 -52 -16 24 -14 132 48 102 86 108 190 0 6 199 -93 11 -285 -212 -110 40 -224
3867 -224 81 -54 -66 14 121 -1 4 25 108 -38 166 -18 -62 -19 108 60 -14 69 -201 253 -24 -15 -53 95 -111
3892a11j9J44J53j23j65J90n9j05o7N3K50p5j23L5P0n8L5K7j68K75j07O0j27r3
3916a08J57k34L90k82K60j5k5pj71k74L55n8j11o9l4M51j43k97L41j18k2k45P7
3939a82L06K3j71M9J46j29M6o3N9m0l8k3k0o3pJ75j60r4P8j35J02L44l82J85j73
3964a67R9J25m0L1K2k5p9p3J16M4J43l53J45N5r3J61n6j03K0m1Q5J76j18Q1l4
3989A21k68L46k10N3J01q0l04K35L9R2j09o0N8j82K23M0l59L56m5J11k78R1j00
4012a29K00q9P1k23J40q1K18k00j6K35o2j57J38p2J24o8j52M83k71j48kj22M40
4035B57l06j15J68j84K09j13K03R8l55J90R9j48n8M9m2M1J60l7l95M63l33L24
4057A75K6k07j07lQ7J01j53J93M1k12N8Q9n4m9j44K12P8j42J11m9M3j98j35J70
$$ plain form
3892 -111 -130 14 167 44 -121 69 10 -95 -162 -109 141 66 -57 -22 48 -10 25 52 -116 159 52 112 -15 -108
3916 -108 49 -185 205 -77 183 168 143 136 -35 -309 46 -12 -123 -192 -226 225 82 -215 126 8 -14 -259 -182
3939 -182 124 147 -24 25 171 42 88 25 84 44 6 -17 -37 -100 -107 68 -92 -186 -108 -243 -141 203 -179 6 -167
3964 -167 -68 57 17 48 70 45 -34 -107 9 53 196 -157 -12 43 -50 111 55 -48 -28 -69 16 192 74 155 121
3989 121 -147 199 -11 42 143 63 -241 -6 33 125 16 -44 14 -168 55 95 -264 92 47 158 -120 -29 -129
4012 -129 71 -18 53 -170 -30 -111 107 -93 -109 126 64 -93 45 -27 97 29 -123 360 89 -59 -61 -183 257
4035 257 -49 -164 4 -180 29 -84 119 217 -138 52 151 3 -55 -6 -48 -7 153 116 -279 184 -149 175
4057 175 201 -6 -113 -116 -29 72 -81 112 153 -59 -1 88 34 -15 -159 53 131 -11 100 51 94 -104 -239 -69
4081f9o0Q1J26j00R9j3J20j45O9p3j29p9L31j44P6j84J00kj51L50m6k22j9J40
4105E6j23J44j55Q0j41N7N4l4r6J56J6R9r9K91j28j14Qk03J04J14N0j9r7o1J65
4130A24j59P2L4j33r0m9J78k2k8K53j89K34k29r6J09K28j85p7rN4J26r1n5j45
4154a45J12j48J17J25O8j71J0o8J04M5q6L7P3j51J21j8K33k55j43J41ok34O4J85
4178A0j23K21r5O0r7J55j33j00M0L4K0k0KR8k92J38q9K82O9k49o4K62n3M6r9J45
4204A68j66M2O9o6J7j01K6P8J61m42K91j47J76j20Q7k02p3J06K6M4PP1n2l8J17
4229G9Oj44K1l2J11K5n9j57L2K99j06L9j35m3O3L38m16R9j64K05j27J12j6j0q6
4254f6O8j46N0j0J27j60J0J24j98P6J02M1j37K92k46J7o6J4Q2N8KR0j20J18O7
$$ plain form
4081 -69 -129 -48 78 -22 77 64 184 39 108 35 -94 -173 158 14 90 -94 6 4 -147 203 157 -65 -84 56
4105 56 -67 77 -78 2 -139 -82 -28 -62 -158 -2 14 113 14 305 177 63 71 -132 -28 86 136 117 20 -41 124
4130 124 -35 37 71 -62 -152 -201 -23 -45 -73 180 -9 225 -4 -100 9 237 52 -25 -34 20 146 55 0 -145
4154 -145 -33 -181 -64 61 129 -42 -32 -100 4 49 -37 0 73 -78 43 25 258 3 -140 1 -5 -239 -175 10
4178 10 -113 108 13 73 -24 131 -2 -102 -62 -28 -8 -28 -26 72 -220 -82 -171 111 180 -69 -133 129 76 122 23 168
4204 168 2 44 113 47 64 -37 -11 67 228 -214 77 -70 106 -14 73 -129 -202 -96 -70 -26 -19 52 0 -38 79
4229 79 85 -59 -38 -70 41 66 7 -150 -118 181 75 114 -21 -64 -1 337 -79 20 -144 61 -66 46 30 20 -66
4254 -66 2 -144 -94 -104 23 -137 -127 -3 -201 -125 -23 18 -119 173 -73 -56 -122 -108 -26 32 34 124 4 122 189
4279A89k69L6k17K14L00k82J04k75J36qJ04k47K72kq0q1J69k18J91o7LJ90K9l73
4303a82J41n2K25j97j22J00J20M8m5j02q4J01l9J19k45J41J29o9O5J63j59j02
4325d6RO0J96p6k79K41k25J95m9k07m3J61K35j94J51k95N0J34l9K90k10j49L7
4348e3N8K60j23k49K77j09j02P3l1j00L0J08N3j70j28L95k36K16j16J7R2L3k39
4371d4l0M3j22J50K2k63L29o1p6j7p2J37o5L4K0K59m29J40j14L53j85q1J27j73
4395a18l2J84k8k48J20K84k9j50j14N9K32k22J21mk34K19R1%m4J5l26K71K97m42
4419i8q3R7k2K51k49K2J45K8j43j44K50j73K98j84Nr3J82k04K34o6lj27Np2J50
4444Fj61J09R8j23J47j92n1J26l4j63L53m4m3k0p8J96j43J46j38oJ38o9k25R0
$$ plain form
4279 189 -80 -44 -261 -47 253 -29 75 -200 -64 -72 32 -215 57 55 -25 -106 63 -155 36 -31 -28 162 191 -182
4303 -182 -41 -93 132 -65 -187 -87 33 81 36 -66 -150 -49 -88 31 -214 -73 56 -13 52 215 56 -46
4325 -46 -37 23 219 143 -136 105 -120 75 26 -181 -224 -63 172 -22 129 -166 -116 18 -21 269 59 -90 -53
4348 -53 5 265 142 -107 170 61 -41 32 1 -99 -69 39 92 -78 -206 189 -47 169 53 70 162 195 -44
4371 -44 -74 -31 -153 -3 19 -244 85 24 -52 -69 -141 -4 -69 -35 -15 244 -185 -45 -159 194 9 -72 55 -118
4395 -118 -150 34 6 -242 -122 162 133 -17 -131 -72 160 -62 59 55 -179 40 131 131 87 102 -224 47 344 -98
4419 -98 -181 -84 -106 145 -104 -82 63 91 -52 -196 54 -119 179 -5 0 -93 89 -115 119 53 50 -77 -72 -144 6
4444 6 -155 -46 52 -71 76 -116 -167 -41 -75 -238 115 71 28 8 -70 126 -17 129 -9 -15 123 54 -171 -81
4468h1P9m6K8m9K93l35P2K36j99P5l2p3O7j09J60J60j10p8J84l24rL00q1k88K20
4493F0m8q2J10K06n5k57N0J30j60M0J82o4l9J48k73m3J36N4O5R9m52K32J91l05
4517g5m2J32RJ10j35On0K6M8r2P9k41K14L9j6L3q6P7R0j98N9o3K7J18K6Lk88K23
4545C3J4j50J38O8l43K71l4j04j59M08j29j38J5Mq9K97l2k28J89j00M6J36O1k35
4569f1j0J91j03J25n7J5j76Q6J02j49o7K82j48KJ9q7J26J4j24m4J39k60J87J71
4593A73k48J4K11k39R7J19k40j75K93o7J41j45Mn1K31r4j36J13j45oL7L02J54
4616C43m99M8M7P3k7R0j96K06O4m33N14l57J40j0r0O4ol2%L7Q2m6K11k89j69J44
4642i1K3J00p9K3o4P9r5K76l60P2L4r4N9J65M9j41NK2J04Q1l17K19j53K42k48
$$ plain form
4468 -81 -2 -48 -20 -69 224 -111 -39 197 -2 73 41 -32 35 -74 86 246 136 58 242 -82 -91 209 128 -160 60
4493 60 12 -70 40 246 191 -66 -16 114 -46 -6 176 112 73 221 -52 -95 41 95 160 259 -193 39 230 -75
4517 -75 -117 15 24 134 -1 5 -45 -19 29 -63 16 -225 -11 28 12 45 -41 36 126 -72 -13 -76 -49 69 95 98 -190 33
4545 33 47 -103 35 103 -240 31 -3 -107 -266 142 13 -125 -110 -106 -195 102 70 -158 31 -69 -23 113 174 -61
4569 -61 -71 120 17 142 85 100 -76 10 112 -37 -104 178 30 32 51 -36 90 104 -20 -64 75 -185 2 173
4593 173 -75 -61 150 -89 8 127 -113 -288 5 -62 79 -66 -62 -113 118 24 -112 1 -144 -150 -113 189 343
4616 343 -156 -108 -61 12 -15 75 -121 85 149 -284 230 -127 13 3 -87 -23 -29 -61 -61 -24 58 12 223 -66 -235 -91
4642 -91 -68 32 -47 -24 -88 -9 -104 172 -188 -116 -82 -176 -117 48 97 -44 -39 -17 87 168 -149 70 -83 159 -89
4667h9K72j92M0P8p2k91L11L7n4n1j34K44j45K02k23Q0J4r1K02j91R8j30J14J09
4691A38j18J41j12k03J78j53K06N8j90M3j4J09k73P0J85j89K43j78J40k03J53
4712C1J9j01o5l1J45o2L4r6K50k38L13l32J49J60k88J00l2LM5J54n9j43o6j45
4736b55J15k7J99p2Q3L9j44J4P3j68Q5j36K02J28j92k57K61K0j42K13r2rMK49
4760A91j52J46k95K09l0n1K1k20K90k57P6Q7jq8N1p0j28L30n3k71J30J13k7J49
4784A50j58J7R1j16n7J51o9J8k3J4K0j6P8k7L7kp3r1p3K01k1o9l4J9J70p9oj36
4812h4q4K02Rk00J77l9N0m3J5j80J56J75j1j77o7R4j90k0M42p3k66K16J37k86
4836d7Qj78L08j97K0L23l42J67K9j27nj47p9L36j34LO7R3j8K6n8ll6J79j46k0
$$ plain form
4667 -89 183 -9 31 109 37 -254 57 94 40 -11 -145 99 -46 156 -67 13 27 -64 138 -53 45 -85 29 138
4691 138 20 161 49 -154 24 -129 77 135 -55 -12 -26 83 -190 -120 65 -124 119 -59 81 -122 31
4712 31 50 -51 -116 -147 -2 -64 -30 -126 124 -114 199 -133 16 176 -112 -12 -44 -41 4 158 99 -44 -110 -255
4736 -255 -140 -167 32 -40 43 82 -62 -48 25 -143 -58 -194 8 136 -56 -313 -52 -32 -174 39 -53 -62 -58 191
4760 191 39 185 -110 99 69 18 39 -181 109 -148 -72 15 14 -74 -23 -93 -221 109 56 -215 -85 28 1 150
4784 150 -8 9 100 -16 -73 78 9 27 4 18 38 22 100 73 110 108 35 -56 -129 72 51 -18 -52 -33 137 58 52 -84
4812 -84 -168 34 43 -157 20 -19 31 -12 3 -177 -21 154 143 -34 -101 -7 -197 -217 225 152 -114 102 239 -47
4836 -47 -39 -217 91 -106 -86 237 -105 62 91 -36 -41 -188 -267 69 -65 -62 5 98 80 106 48 45 9 188 42 22
4862B2r5J37Qj55O8j30L30j98J1R9k2j79K11n0n9O2j99K3MK20j47q4J68p2O4J70
4888B07l03K43l06N1J61M7q7j64J98k35K65n8p2O6l0N1k7J25j72O8O3Pr5J14j15
4913BR2j76k1J32J8p8J51j94Q9j51j63M01J4j0j27O6J03k79K2K68q0K2r7q3K81
4938B02k00N7J37k09J1j1Mk9k4R9j3k75M37l06J59j38K6K4j1J61k2k9n8K8M9q1
4964a2no1m7J12L8k12J95NQ6j68J72k50J78Qj17M20m16K8k2K31k74J73j53J00
4988IJ01p9%J60q0j31L7O4r5J50k3l24K20r2j9J40j38K69j73k9j1L9l1j20J70
5013A4Q5j5n0Pk48J36J2k74K31J88N2J06k43Kj05K8j3K49k34J21J14j83J18j1
5037H7j44J08qn6Q9k0p9J88j33J19j45p2L02k9k98j12K37p9O1O7N0j14%j77OK83
$$ plain form
4862 22 -73 64 72 -83 -15 -145 185 -13 -2 97 75 -104 107 57 -2 60 -139 -116 -112 108 -39 -123 45 -27 37 207
4888 207 -96 147 -159 -108 53 100 13 -151 47 -188 77 19 -53 13 -17 34 7 132 -40 28 91 98 3 117 2
4913 2 94 -82 -103 29 47 -31 120 -74 15 -136 -299 102 116 106 -21 45 148 -131 -109 159 79 101 4 -79 202
4938 202 2 59 196 -13 -2 -13 -9 -38 -62 37 24 -251 186 -120 39 -99 -73 -49 -60 101 79 50 -8 20 69 -12
4964 -12 -17 -78 -125 -13 25 -187 8 13 99 -69 103 -147 31 39 -78 342 -74 -46 -68 163 -111 62 -91 9
4988 9 110 31 31 191 111 -20 17 81 -14 136 113 -211 9 -83 -102 38 -100 169 -4 -33 -44 -5 -36 -156 14
5013 14 99 84 34 41 -207 -71 -59 -333 -102 86 138 244 1 3 -102 -74 -87 162 -72 49 163 -20 98 87
5037 87 -57 51 43 -13 76 56 -23 165 32 151 6 -66 236 207 -91 -203 34 -45 16 83 133 19 19 -158 -152 131
5063A31o3j41o3Q9O4j47k34L83k0k14K86j00O2j25M6M7j98M6K47J86j49l13J94
5086A4lMJ27l08J32L1J36n0p3J3q3R9l11K59j8K88l65J43j15J18j62J7J63K1k13
5111a36J84O4k38K64n3j78L20j70n2L9p0p8j6J76l2k23R9K58k59L48k65m9K39
5134A72j15n8%J31k56J55j43j10K64p9qn9K9j44K11N5J05j97J54k8L4O6j21j08
5158e0j44J03J30J07m7k56L26r9j24K8l3N1m5L0J21j2j13O3J1m6r9l3N8r1J5K8
5184a21R2R3J01j22o5N4M4P8k23R5k4J6j4j27K20l28J59qK07k42j81K77QK98l48
5209f1K80j02R9k56L5P7j22N6J36k71j9L82l80N8J79j08q7n5J49k0j01J41k08
5232a98K23k6k2J66k30K64k01Pj9Q6k45K44l5j44L25k12k7K01j35k1J77l17J31
$$ plain form
5063 131 68 -73 -136 -47 17 -130 -364 19 -1 -215 71 -29 33 -92 -46 1 -197 -151 96 282 133 -180 14
5086 14 11 15 142 -166 -34 -3 133 83 10 23 -60 39 -272 -13 -31 257 -108 35 -80 38 -124 -107 56 77 -136
5111 -136 48 112 -126 138 85 -93 227 57 5 44 -26 -104 -120 56 24 -199 -100 158 -101 247 -18 -67 172
5134 172 57 -1 -1 130 -126 29 -114 -224 40 -39 -47 -106 -77 -221 -10 45 150 -47 107 79 113 179 58 -50
5158 -50 -194 -91 39 146 99 -157 169 70 -54 -26 -59 -8 -53 -23 98 86 -27 36 47 1 -98 -131 -73 -164 -149 -121
5184 -121 -29 64 165 43 -22 32 76 154 -69 26 2 18 4 -123 97 -231 -72 -80 127 -115 -296 -19 -11 287 -61
5209 -61 219 117 216 -40 -5 72 -50 6 142 -129 -148 234 -146 -88 91 -17 -104 -159 -10 -30 -131 10 -198
5232 -198 25 -1 -23 143 -87 177 -24 -17 -36 50 -195 49 14 -130 195 -17 -44 157 22 1 178 -139 -8
5255hJ77r5j14j41L43j79j6k5K58j56j68J79p6j6l8J51k2j3L6O1j5k35N9j74J56
5280g1R8m1r9J45K3j36KL13l41o2K06J6n0m9R7k2m1l1J19kk51J23J72k14M1J28
5306G3J12l06J21L0K4J23j66j64J31q8J35pr2n4R0j17J79j4j86J39j64J78K5%
5330BO3K34j64k10P4K5Qj23J58r0K38j85n1O6j08r2L28p2j31k30J88K83j30M2
5354A23k17R5P3k6O5Q7j46l8n2j90J44J58j08J49k13k3O6R5J21p1o9k0j69K42
5378G6l3j39K18j8l7j34O6o4R0j31J90j05j34M16j39p7Lj01J63j18M9P1J92m27
5402a23J92K33k15l36J37J25j56j49j07K52K7l4L06k5nn9k07K14j08j92L44r0
5424B4n6m1J78j35J7J25j86R3l70M05o0J36j1Mj61l6K07o5j75O4n9nP2o5K72n8
$$ plain form
5255 -8 169 74 -40 -181 162 -17 -33 -58 200 44 -124 55 -21 -37 -75 76 54 41 77 138 123 -112 -53 -227 -71
5280 -71 27 -14 -113 32 55 -81 -79 234 -107 -169 37 53 3 -46 51 29 -12 -43 76 74 -177 -54 118 -96 -55 73
5306 73 185 -121 0 30 54 177 11 -153 -22 -110 25 18 -74 -128 -38 -155 24 10 -176 -37 -201 -23 2 2
5330 2 65 299 135 -75 -1 24 32 -91 67 -23 215 30 -21 45 -63 -155 173 101 -30 -260 -72 211 81 123
5354 123 -94 1 74 48 113 200 54 16 -36 -226 -82 76 -32 117 -96 -119 -53 42 163 92 23 3 -166 76
5378 76 43 -96 122 104 67 -67 -1 -65 25 -106 84 -21 -155 261 122 45 48 -53 110 -8 41 112 304 -123
5402 -123 69 302 87 -249 -112 13 -143 -292 -399 -147 -120 -154 152 127 122 63 -144 70 -38 -230 114 24
5424 24 -32 -73 105 -30 -13 112 -74 19 -351 54 -6 130 119 123 -38 -74 133 68 -107 -43 -102 -107 -35 -100 172 114
5450A14k23K4J35n9j36K13j39R9k12O7J33J25k21j85K72j0j18J46k51M46l13J9
5472g4k2l4K07k2k49J48P2j06p0J45k0K01j71J31k53K6K51r2P4j52J28k54L3N8
5496d5rJ33j10K9Plj03L71l07J23J46j12j85K4J2j14J93L0k9j11J70j96j77K57
5520fL4m7j3j05J80Q5j74j1J29j6J91l44J58J81j20J61l00J47j19k9R9L0r7p9
5544f5p7RL54k3l22K26k67P2o1O6K96j55k58K53L9O5j53j0m6J25j63J04o4j41
5568a96J62J66n1l20N00k85J70k51K24JO3k37J82m9k97M80m38j2L55j23l8j43
5590a37J87K8No6M4K50l43j09K57Lq9j62mP0n4K37j17j5mo1Q7j2l8P1jj63L82
5617B46l52O5K10q5n6L9K9kn4P5l0l7O4n9J68j89j24J58q2O6l5Q7q9JmJ70k79
$$ plain form
5450 114 -109 -85 50 -9 -145 68 -71 28 -184 -117 16 141 -80 -265 7 -3 -121 25 -226 220 -93 -74
5472 -74 -96 -130 77 55 -194 -46 26 -80 -150 -5 -25 176 5 136 -117 -91 160 68 142 -10 118 -136 -103 -45
5496 -45 -54 79 -31 -2 5 2 -101 270 -37 86 232 120 -65 -41 -29 -143 50 80 51 -60 110 -86 -263 -6
5520 -6 28 -19 -32 -137 43 128 -46 -57 72 56 247 -97 61 242 122 283 -17 130 11 -18 81 111 14 -65
5544 -65 -142 -133 221 198 -124 102 -165 -93 -154 -88 208 53 -205 48 87 152 -1 -11 -57 68 -95 9 -55 -196
5568 -196 -34 132 81 -239 261 -24 146 -105 119 120 183 -54 128 79 -218 262 -176 -188 167 44 6 -137
5590 -137 50 78 83 17 61 311 -32 -141 116 119 30 -132 -136 -66 -120 117 0 -15 -19 -80 7 -5 -43 28 27 -136 246
5617 246 -106 -41 169 84 28 67 96 94 40 115 85 48 112 53 221 32 -92 66 -16 50 15 102 13 14 10 180 -99
5644i9K05j19pO9p5R6L7K4j90J20k65K58j24O6K05j65l6j00%j15K89k69K8R1J13
5669C7j31J69j11P4k8J80k69K74n84M65q5K2Q2O6j39j51L6L3Q5k15K33l16J88
5692h5n7L88r3q8Q7j83LM5j5J94j53L4k35J12J11J09l9j57j76L23j46J48k83l5
5716a91J23P8J90j16p1n7q4J85K9j05Q7j14N8l1M5l8j37L15j18j13K5K0N3n7j10
5741a34kO2k%n0L09r8l08K45K6j7r3M3J15j09j1K10j93J62k98J76J7n6M7KJ11
5767A54m2l87K13k1J28J63m18J71M3j18L11r5j23K95k04Pk12K08pJ64j43N7l22
5790a78j18J50K40j91J18J59k68J06K6p0q4J75Rj89Ml1J22K19k79Q3o5R0O9j87
5814i0r8L4J84N4K1RJ14k43K50j49O1q5j65J82n1Q6K0kj67L1J17j54Rpl4l4Q2
$$ plain form
5644 -99 106 -13 -20 49 -26 70 107 131 -59 61 -204 54 -70 -4 201 36 0 -100 -100 -215 74 -195 -167 -76 37
5669 37 -94 75 -36 38 10 190 -79 195 -389 76 -9 13 95 161 22 -129 -93 -60 25 -190 43 -273 -85
5692 -85 -142 246 153 65 152 -31 -28 17 2 196 43 77 -158 -46 65 174 135 -22 -198 125 -21 127 -156 -191
5716 -191 -68 10 200 84 13 -44 -128 57 86 -19 68 -46 12 -19 26 -12 -149 166 48 -65 -40 -20 33 -24 -134
5741 -134 -136 -74 -76 -76 -126 183 85 -223 22 48 31 -62 -19 96 -13 -24 186 -7 155 -143 33 50 -6 41 43 154
5767 154 112 -275 -62 -83 45 208 -210 -39 4 -114 197 102 -21 274 70 77 -135 73 66 230 87 144 -178
5790 -178 -296 -146 94 -97 21 180 -88 18 44 -26 -110 65 74 -115 -111 -142 -20 199 -80 3 -62 28 97 -90
5814 -90 -188 -154 30 84 105 114 228 -15 235 86 147 62 -103 79 28 114 134 132 -35 -4 113 -41 -32 -39 -73 -107 -25
5841b5k31K28Q8l92L92l4L4j60J01L8q0jN9m7R8j36Q9K0m7k07K57p4O3k2J23q9
5867D5K7P0k02J65k44J81j71J88k2k19K07O4j9o9K0Q6l35K22j37Q7K9J42n8P5
5891A32M0j09j08J45j93j41K64l52L81j82J01m3J25j21M0n8k4J05K8r3O5j6JJ8
5915Ej33K68q6j36J22q7J82l22J36Q7l06J78N5K5J62j49m1K12k00qK8J56j88O3
5939B3K9M9j8o7p4K00j55O9l3N2M8j21J14k00j42L30n5q9R5k23M8J47n9o5J25
5964B8L7J27k05lp1K02j18j03O8K48k57K0J91l9m18K64K15k02M1O8j05n9L8l4
5988f7n3R3J06M9j76q7J95m6L8k24J24Q5n0j12K25p1l4L7o7j68K29m4L7N7j61
6013h5j76K48kM7j1K0l2R5Rj80l3J82j59K5J78j39l7J75o4j53j2J51j63L1K61
$$ plain form
5841 -25 -256 -28 60 -332 60 26 60 -100 1 39 -41 -42 17 -30 68 -68 21 41 -6 -213 44 -30 33 11 134 45
5867 45 72 142 -60 105 -139 42 -129 59 37 -182 25 89 70 1 21 107 -228 -6 -143 -56 -27 115 57 132
5891 132 172 63 -45 100 -93 -234 30 -322 59 -123 -22 -65 60 -61 -21 -79 -103 2 30 -63 2 -14 -13 5
5915 5 -128 140 54 -82 40 -47 135 -187 -51 36 -270 -92 -37 -12 150 1 -40 172 -28 -36 -8 148 -40 23
5939 23 52 101 83 16 -58 142 -13 56 23 75 123 2 116 -84 -226 104 49 -40 55 -168 -120 27 -32 -97 28
5964 28 65 192 -13 -16 -87 115 -3 -106 -38 210 -47 -27 164 125 -293 -29 186 -16 25 93 -12 -71 -33 -67
5988 -67 -120 -27 79 128 -48 -135 60 14 52 -172 -48 37 -13 -125 100 29 -5 32 -35 -203 26 -18 19 76 -85
6013 -85 -261 -13 -15 32 21 41 9 104 113 -67 -100 82 -77 -52 126 -13 -50 125 61 -92 -104 47 -116 -85 176
6038A76n2j88J52j92M2r5J58k00J94K1K5j27O1J03o5J26lj47q6j78J57J29nO9
6062G5j29k27K71O5L6j17K21l30J16K75k87J2O4q9n7O9Q6k9j34l7K5K06o1k02
6086a78J01J18%MK04j67k93M57k03n5J3J8j07L25k64l0J52k3k38J56O2l8j12j12
6110b10M29j33k36J04J47k02J90L2k13J24j26o2k7J30K43k18J07j46j8K2j14J75
6132bJ22J09j15m6J15l99K11j7O7q0J0L7j13L60m11j8J61j16J85pq5n0J18R1k26
6157i9q0J70K31j71j98K56P9j89J74k59k23M3L02j04L2l9K01Rj26pj49K30l48
6180b65J62J08J33j38J5p7R3P1j80N2k1j65R5P7ol9K7P3j7j13K45j18K2J05k15
6205g6J47j18k3m2L04N0k29j87L54j55j11K11n0m9j47J15k34K13J3j96P0L03l1
$$ plain form
6038 176 124 -64 88 -104 -62 -157 1 -199 -5 16 41 -86 -25 78 13 139 136 -11 -97 -275 -118 11 6 75
6062 75 -54 -281 -10 55 91 -26 195 -135 -19 256 -31 -19 45 -44 -101 -32 54 25 -109 -146 -121 85 24 -178
6086 -178 -77 41 41 45 249 82 -211 246 43 -12 1 19 -88 237 -27 -57 95 72 -166 -10 52 14 -98 -210
6110 -210 219 86 -150 -46 101 -101 89 121 -92 32 -94 -156 -183 -53 190 -28 79 -67 -85 -63 -177 -2
6132 -2 120 229 114 68 183 -216 -5 -22 45 -35 -25 12 -101 259 -152 -170 -9 -125 60 53 -32 -82 36 127 -99
6157 -99 -179 -9 222 51 -147 109 188 -1 173 -86 -309 -266 36 -68 -36 -75 126 135 9 2 -147 83 -265
6180 -265 -103 5 138 0 15 -62 31 102 -78 -26 -47 -212 -117 -40 -46 -85 -58 15 -2 -115 130 12 34 139 -76
6205 -76 71 -47 -70 -112 192 242 13 -174 180 25 -86 125 75 26 -121 -6 -240 -27 -14 -210 -140 163 132
6228A32j91K90j03j94po5J50RJ05k50N0l7k9J80M2p5l2M7j1J31k16PJ45L9k07
6253i0Lq3J15J66j81K05m1o8j21J62MJ40k61J26O3j44J7R8j09O2l3MJ33r4j13
6278d0P9j97K83j41k60J71o9J89j06K65l20K58M8n9l19N2L0p7M29k54K5N3j05
6301f5J55k7R8k22PK08q5r7P8M4j63M5R7k41L20p7N3k30M7K7Mj6K63k45N0J7J16
6328A61k43N0J53j81K62k05q9J67j00K4r0%p3K18mn1QO0o8p8Q4J48o5J67m71M14
6354A98j66j40K48n7k8N9o3L1j69N2pom2J11Jj39j08L53p0j58P3n6K5j89L24l
6380G4l0o4Q9j94J09J5L8k54L76j78R7J12r0j6j37K96l48J7O6m0o7J85q9J38n2
6405E3j62K04j65o7QQ4k8nQ2j12J40l28M40k25R8J16j3j29J47j10J12o8Q8j1j26
$$ plain form
6228 132 -59 231 128 -66 -73 -138 12 21 126 -124 -74 -111 -140 40 82 7 -25 22 11 142 -74 -67 78 117 -90
6253 -90 -87 -170 -55 111 -70 135 94 26 -95 67 71 211 -50 76 139 -5 12 110 1 63 30 34 167 73 -40
6278 -40 39 -158 125 -16 -276 -105 -174 15 -91 174 -146 112 160 101 -218 -166 -136 -213 216 -38 -13 40 -65
6301 -65 90 63 161 -61 -54 154 69 -28 50 94 -69 -24 73 -168 152 75 128 -102 -55 -28 -24 -40 223 -22 28 45 161
6328 161 -82 -32 121 -60 202 -3 -92 75 -25 -1 -91 -91 -164 54 50 -1 7 67 -1 -79 5 153 88 255 -216 198
6354 198 32 -108 140 83 55 114 51 82 -87 -35 -42 -48 -90 21 22 -117 -225 128 58 -100 -27 -83 -58 -247 77 74
6380 74 44 -20 69 -125 -16 -1 37 -217 159 -19 78 190 100 84 -53 243 -105 -88 -22 -62 -129 56 -33 105 53
6405 53 -109 95 -70 -137 -129 -45 -73 -78 4 -108 32 -296 144 -81 17 133 120 -9 138 28 140 72 160 149 23
6430B3J11j17j7Q4o8k9l4Q0k92N09j12l0K01k71J06j10J12J8j81LK07j48j8O2
6454H9l7k44M7J91k78N1K50k32K17o2Okj68J82J1M4O2k50j1nR3L1K06j75JK98
6480C15l33R6j29p6J60M7p3j06K6ML7J04K4j2j35J10j26K7J16j42P8l4J54j10
6504B2k82L92l11N9P9N4Q0q6k07M91n61K66j12J65j58PL10k37j8K31r9k79M32
6527B38j80J77j95N6r3P2k86K95j38J18j39J61K8j90P2j4J28o8j17J41j16J25
6549G5M1k96Q3K4m6Q3o4P3k7n2lK0K16p8Rk34K01L9r1J6p2K08j15qn3pJ58k3n1
6578B6k18J57J30r5Q3k52J93j72K66L2j77J43k28J76k6N2k21kK62j51m8l8K16
6601A08n6p1j58J0J48O0M5n9j13K08n6j95L52j48j03n4J37k7lM4j19Q7mj07J30
$$ plain form
6430 23 134 17 0 84 16 -13 -47 33 -259 250 138 108 309 38 144 34 146 164 -17 -14 193 45 27 89
6454 89 52 -192 -145 46 -232 -181 69 -163 54 -8 -2 -4 -172 10 21 65 127 -123 -134 -139 -46 -15 191 16 17 315
6480 315 -18 78 -51 -127 33 80 7 -99 -73 -69 -32 72 96 84 -51 59 -67 -40 76 -66 12 -22 132 22
6504 22 -260 132 -179 -120 -41 13 93 7 -200 291 -270 -4 -116 49 -109 -102 208 -29 -47 184 85 -194 238
6527 238 58 235 40 96 3 75 -211 84 -54 64 -75 86 114 -76 -4 -18 110 42 -75 66 -50 75
6549 75 116 -180 -97 -73 -119 -36 -100 -27 -54 -106 -109 -89 127 49 58 -176 25 64 -27 -11 -83 125 10 2 -51 -58 100 77 26
6578 26 -192 -35 95 0 83 -169 24 -148 118 150 -27 116 -112 64 38 90 -131 -133 129 -22 -70 -108 108
6601 108 52 -19 -177 -167 -19 41 86 27 -86 122 66 -129 223 75 -28 -82 55 28 25 69 -50 37 33 -74 56
6626E6q9J21j87o8m4K26O5j52Q5j20J65j09K2l2n5J14k29L40J2j05R6j66q0J91
6650E7J59j80Q3j64J39k3lj21L35l42N1K1k70Q8q7K87J36k70J26jn6J16pn4k26
6675b06J67R4O3q1kj21n8J84j24K0R9j00R6J41j52k29O00j70j33j76kK51k69J34
6699B6o0M4k10K48J35j83NK9o9k3k3K28k02K16j15r3K26j49J47j59Q9q4n4k1J31
6724G9N4j11j76J46K2n5M1J23j01J00m0J26j32j3j02Jo6M8K30k37J71j0L5j6K5
6749A42k19O1%j64J91P8l03K33RP3J47j31l68L05o7O9p9O1r0J12k67J03j10K49
6773C5j16J06KL0%L2j27m7J56q6J62j85J52l21N65l71%O0jp1O6pM7M4o7n1J18
6800A25j24k5Q1j06PO7j09K75j64P6j84J75P4k45R7j80P9J25mJ56k67R2Rj45J5
$$ plain form
6626 56 -33 88 -99 -167 -211 15 80 -72 13 -107 58 -51 -29 -61 -116 -2 -231 109 121 16 112 -54 -134 57
6650 57 216 36 119 -45 94 71 68 -53 282 -60 -9 12 -258 -170 -257 30 166 -104 22 21 -35 81 74 20 -206
6675 -206 -39 55 118 37 35 -86 -144 40 -84 -64 35 -65 31 172 20 -209 391 221 88 -88 -90 161 -108 26
6699 26 -34 10 -200 48 183 0 5 34 -35 -58 -81 147 -55 161 46 -47 179 30 177 18 107 23 -31 -52 79
6724 79 133 22 -154 -8 14 -41 0 123 22 122 82 208 76 63 -39 -38 -104 -56 174 -63 108 98 133 117 142
6749 142 -77 -16 -16 -180 11 89 -214 19 28 101 248 117 -251 54 -13 56 -23 38 -52 60 -207 -104 -214 35
6773 35 -81 25 27 57 57 89 -38 -85 71 -15 147 -38 114 -207 358 -13 -13 47 46 -25 41 34 81 125 58 7 125
6800 125 1 -24 57 -49 -42 25 -84 191 27 103 -81 94 168 -77 20 -160 -81 44 40 196 -71 21 30 -115 -100
6825a00J56J70k58J47j41J3N3j88L20n1j30Q0p6R1j35J53j28j34L74j88qO0L1
6848A11J1K0k38J82k50p0J44j5P3rJ15m9N0j04K0j13J76j54o0J23J8R8oj63j3
6873a03J43R9j20l3l8P0J59l83K75M0j76K53k03L9M6k87O4K15O7k07J55j64M1
6896d8J24Q4j19j39P6K28k05l6J25j50K0MQ3J05k4k38J93l60L47m8L4J0j39K23
6920A50k8o2L8k41J55J59j9j85j25L3K34k28J49n9J22j92M1J24j01Kqo3m0K18
6944G4m6l4P7R4j69m5L0J36j95J68r5o1r1K87O3k15k3j1K00k35R8J40l8k96L82
6969A95k99P1O9j32J05j5j01K49j79j21K28n5J04l06J2L21n8j4J54l63O2J05Q7
6992A19k17K57q3j80j3N9J15j77R7K34q6o7l3O0o4J23k11K59l87J38m8K63J36
$$ plain form
6825 -100 56 226 -32 115 -26 -13 40 -148 172 121 -9 71 -5 86 -49 104 -24 -158 216 28 20 80 111
6848 111 122 142 -96 86 -164 -234 -90 -105 -32 -41 74 25 75 -29 -9 -122 54 -100 -160 -37 -19 79 73 -90 -103
6873 -103 40 139 19 -14 -52 18 177 -206 69 109 -67 186 -17 22 68 -219 -155 60 127 -80 75 -89 -48
6896 -48 76 160 41 -98 -22 206 1 -35 90 -60 -40 -36 47 152 128 -110 83 -277 70 22 56 66 -73 150
6920 150 122 60 98 -143 12 171 152 -33 -158 -125 109 -119 30 -29 93 -99 -58 66 -35 -33 -41 -104 -144 74
6944 74 28 -6 71 165 -4 -49 -19 117 -78 90 -5 -66 -157 130 193 -22 -45 -56 144 -91 7 147 109 -187 195
6969 195 -104 -33 36 -96 9 -6 -107 142 -37 -158 70 15 119 -187 -175 146 88 74 228 -135 -73 32 119
6992 119 -98 159 76 -104 -117 -58 57 -120 -23 211 125 58 25 85 21 144 -67 192 -195 -57 -105 158 294
7015B94m67J19O5n5j07Q0j0K6L3M7J13k75P4k38N03Pl00K74k04N9R0q6m4J14j04
7040HO0j30j06J95l06L24Kk27L96j36n2N3L7j91j6J05N6q2m5j5O2Q0l7j38J38
7065C5Q6j0k13J68n1Rn4P0j62JJ32R2m7p7j62J24P7j43K50r3Mko2p1L4J35O8k22
7093h4Q4N1j89P0J60l9j38P0k6j8O4J26p8On3k1j8Q4J5j31qK9M0J10j16J56j37
7120Ij13K21l34J66O1j69J26R9k05P4R8No3o7M4O2J8j3P2j07J59l27J30J13l00
7145b41K19K7k5K31j46j91j79K76O5j35K63l06N3J93k30R8n4L42k22k51K62o9
7167b0K5N0j41J06J90k51J06j88j11M97k05j15j44K20r5O9J86l19N8P1J28l18
7189b01J81R0o7M4P5k99J47L0p8Q5L9J54l42M0L99l36J59j00L7J40k88J22J55
$$ plain form
7015 294 -173 -54 11 -44 -151 -71 -81 -55 -22 25 138 -137 -63 -301 202 209 -91 183 -21 38 128 42 -2 112 8
7040 8 68 -62 -168 27 -279 45 47 -180 216 80 28 81 118 -73 -89 16 72 -10 -55 -70 -8 72 35 -103 35
7065 35 121 111 -102 66 15 24 -30 40 -122 -121 11 103 56 -21 -183 -59 18 -125 125 32 36 34 -28 -99 -65 70 138 -84
7093 -84 0 51 -138 -68 92 53 -85 -15 -41 -59 5 131 53 59 6 -15 -33 51 66 -65 -73 -44 -4 106 -10 146 9
7120 9 -104 117 -217 -51 10 -159 -33 66 -139 -65 33 38 -25 -92 -48 14 32 19 91 -16 143 -184 -54 59 -241
7145 -241 -22 5 -20 211 65 -126 -305 -29 36 -99 164 -142 -89 104 -126 -28 -82 260 38 -213 49 -20
7167 -20 5 55 -86 20 210 -41 65 -123 -234 263 58 -57 -201 19 -76 -7 179 -140 -82 -11 117 -201
7189 -201 -20 70 3 47 122 -177 -30 0 -78 7 46 200 -142 -102 297 -39 120 20 57 197 -91 31 186
7212A86k84noN7L26l79P9k3Nj3j6RQ5k96J68j10L59mL7K1l05J63o2q5R2npO7R4
7241A48p2k95J2J76l2J56k14N3J20j00j1L0l4m3J68j65J67j13J94q3j49j6J65
7264F2j46J08Q4q3j66K78k32K14R2k84n7L80k16J10q1q3J37n8J1p7o3M5K44k11
7288HN1o4Mj38J81J25j74R0K5m2r5j80N1P3M2j07K31J33j43K9p0M8j15l0o7J72
7314C8j24K03k51M82k21M2m8j43J16p8j4N4l0k85L91l06L59j20N9l04M8n5J30
7337e7K01j18k60K51K49o2k14O9k00j5K55j84j1m2O8J92jk04J15k15J54M2j90
7360a77J52K7k6J59k39J73q1K1K19j79J15j58P8J17j48n6J46j10j85J54J02k1
7382H3n5q0J81k79J66J87j13k69J40J04o2J3r9O5kJ22j86j11L80j66Jo4r0J67
$$ plain form
7212 186 -98 -103 -109 -52 274 -105 -26 -49 -44 -57 -73 -64 21 -275 -107 -217 142 138 175 196 -109 54 -8 -93 -1 -6 -13 54 148
7241 148 76 -219 -207 -31 -63 93 -121 -68 52 -48 -59 -29 -63 -106 62 -103 64 -49 145 62 -87 -103 62
7264 62 -84 24 108 25 -141 137 -95 119 211 -73 -130 250 34 144 63 -20 117 59 70 -7 -70 -25 219 8
7288 8 59 -5 -1 -139 42 167 -7 83 108 66 -29 -209 -158 -85 -43 -150 81 214 71 100 30 78 -37 -67 -134 38
7314 38 -86 117 -134 348 127 169 121 -22 94 16 2 56 26 -259 132 -174 185 65 124 -180 -132 -187 -57
7337 -57 144 26 -234 17 266 204 -10 59 -141 -156 99 -85 -96 -138 -70 122 121 -83 32 -183 -29 13 -177
7360 -177 -25 2 -24 135 -104 69 -12 9 228 49 164 6 84 201 53 -3 143 33 -152 2 104 83
7382 83 28 -52 129 -150 16 203 90 -179 -39 65 3 16 -83 -18 -20 102 -84 -195 185 19 20 -44 -134 33
7406C3k10L03k7R7j2k22R3l3k53K39j92K79Kk50R6Q3J9j09j26J83j0j99J84J36
7430A04j01K72j22k72R4l5J95J65l31K31p6l9k36K02M3j78R3k23K5K52o8o2J19
7453E2q4N1M7j39J29Rn1J2j32J6J09J0j83q4L27K2k43K29o5N9l80L93J51k62Q4
7478G7J06j59q3J35l2j81K13J83k73K5P4l19J35oP3n2l3L63k35rk8N5p5J26l8
7503D2j20K57k22l4J95k20R1N1J14k66M2k6K27O0r0o0Oj65P1PJ12j00p9K02p6
7528A9K2r6R1j61J9P6l1J39J5p7q1K18J9Pj82J0r4j01J80O8m7J01K2p9j43K11
7554A25N6j50j17n9Q8L9j79J34k2q7J74j26J99k34K98j24j89M4K31R8k23J25k34
7577a33K56o7j86M07l42K75l75P3p6J31J7J72j49mM5J16j96J52k11O0J17j17N0
$$ plain form
7406 33 -177 126 99 196 184 -38 55 22 -231 8 -184 95 97 -153 -57 26 45 -64 -190 -7 -17 -216 -32 104
7430 104 3 275 153 -119 -25 -60 135 300 -31 200 124 85 -151 51 94 -84 9 -214 -189 63 -5 -67 52
7453 52 -32 19 66 -73 56 65 14 26 -106 -90 19 29 -154 -238 89 111 -132 97 32 91 -289 104 255 -7 77
7478 77 183 24 -59 76 44 -137 76 259 -14 11 85 -234 -99 -105 -32 -84 -117 246 11 2 -26 29 -46 80 42
7503 42 -78 179 -43 -77 118 -102 -11 40 154 -112 -70 -96 131 191 101 41 47 -118 -47 -40 72 -28 -107 95 19
7528 19 41 -55 36 -125 -106 -30 -61 78 93 16 -65 153 172 179 -3 7 -87 -188 -8 60 13 114 136 57 -86 125
7554 125 181 31 -86 -145 -57 -18 -197 -63 -85 -172 2 -124 75 -159 139 15 -174 -130 101 199 -24 101 -133
7577 -133 123 56 -130 277 -65 210 -165 -92 -168 -37 -20 152 3 -1 44 160 -36 116 -95 -35 82 -35 15
7600A5n2L8j16K52j49o7K04k9k09J89n9pJ24K7k30J87k92K30Q8j8J4j73k5M3J21
7625A06k21Q8n1J07nq7L77l83K77j68K9j12J42j79J92k48k0J17L1l1O3J86j17
7648I3j10l5R2j54K71j54K04k77L0JQ1O3j44n4J96n0N7j47j05P1J42prj66J07
7673dq6N7R1j39j5J37J9l22J23K83k29J50j3R9l13j4J80j65K54k7Pm3J57k08k8
7698d9j37K76O3M0o9j31J66l20K29L5j63J59j15o1j16M03k02k9J76k1j55J32J0
7721A21k35l7J39K50k34J03j58j9M7N4n5p9N9q3J3J18J8m1p5J1J26n1j1n5J96
7746A22K6r7j55K7K92k32J01l49K22P3j00Q1k4Q3j53l8J44n2J59j49j2J96j61
7769Dj7M1K21j16jq2j09J44q6L9L5m5k5j31p8L6K76j34O8Oj96R1M3J17q4l1J0
$$ plain form
7600 15 -37 1 -115 137 -12 -79 125 96 -113 76 17 10 134 161 -69 118 -174 56 144 126 140 -33 -58 -15 106
7625 106 -115 -27 -78 29 24 -63 314 -69 208 40 69 -43 99 -80 112 -136 -156 -39 -8 -39 24 210 93
7648 93 -17 -52 40 -114 157 3 207 -70 -40 -39 42 105 -39 -93 103 53 110 -37 -142 -71 71 64 55 -111 -4
7673 -4 -90 -33 58 -81 -96 41 60 -262 -139 144 -85 65 52 151 -162 -176 4 -161 93 66 73 30 187 -21 -49
7698 -49 -186 90 153 193 124 -7 159 -161 68 103 -60 99 -16 -77 -193 210 8 -21 155 134 -21 111 121
7721 121 -114 -151 -12 238 4 107 -51 -70 -23 31 -24 -103 -44 -127 -114 4 22 -19 -94 -83 43 -8 -19 -74 122
7746 122 148 51 -104 -77 215 -17 84 -265 -43 30 -70 11 -13 70 -83 -121 23 -29 130 -19 -31 165 4
7769 4 -13 28 249 133 132 50 -59 85 -1 38 73 28 3 -128 -206 -170 106 -28 40 46 -150 -59 -16 101 17 -14 -4
7796dM1j80J3J88l6M4l36L81j77O7j41J99Qj69O5K04J44l62L71m00J41j81L41
7819B21r2L5n3n1q6R4k19J23O8m1j42J33k13K50k7J15m10M05K4k55J68K7j47K34
7843A61k82l9J86J74k24j0p4J27J01j45q3LL26n18L42k0M7j14J23J01j95Nq9J55
7867E8l7q5L9K4RL7Q3k40J02K4q3J10L6k41L54j06k01L6R0K0J44p0k8j08J56r7
7893B6L3L0j98J36P9l7k66K49O6j83Nl9K55k23j03K02Jo3J14l29L41rk30K88j94
7918d9r7J02k9LM3J78k5j13r8OM4J43k82K37j46k00L62M7j11n0k7J63J39j73K0
7943H7o8M2q7J19O4k79R7k0Q6m1N8j02P2r3j09L92m18qJ48J08n8k2o9J01O7j46
7969g9K02j08j21jQ2k24L54j02Q5j8j21J83j70J64L0o1j40J77q2j13J4O1j7Q0
$$ plain form
7796 -4 37 -143 -130 58 22 66 -270 111 -66 1 -140 59 67 -102 -37 167 311 -51 320 -80 61 -120 221
7819 221 129 164 111 60 -26 68 -151 -28 40 -1 -143 -10 -223 27 0 115 -295 110 134 -121 47 74 -73 161
7843 161 -121 -160 26 200 -24 -34 -108 19 120 -25 -108 -105 221 -297 45 25 72 -42 81 182 -13 -8 -97 58
7867 58 21 -64 -25 -1 8 45 128 -112 -10 14 -69 41 77 -164 190 84 -117 -81 9 29 173 103 75 -33 123 26
7893 26 59 89 -109 27 106 69 -197 52 118 -65 -60 -99 156 -67 -170 32 33 -30 84 -245 96 87 -143 145 -49
7918 -49 -146 -44 -73 -70 -27 151 126 13 -85 -79 -35 108 -174 63 -83 -283 79 126 15 -35 -62 101 240 67 87
7943 87 19 61 -26 93 157 -122 -25 -45 41 0 58 -44 28 -65 -174 218 -200 -208 -60 48 -10 -32 -101 0 67 -79
7969 -79 123 15 -106 -107 -25 -249 105 3 88 70 -51 132 -38 126 156 95 -45 132 50 -63 -49 12 -5 75
7993G5j06J26k2Q4j81r7K07K1j74LK0k82J87R6O6k70K57O3k8k48M69j08j12Rk7
8018B8l7K9J13l2j27JJ79j08JJ01j83J4mj8P0L2k45K33qj39J64N4k3j23K03k25
8044e0J47M3j63j42K02n1j52K19K7J3J84l01RN4K36m13R5J19k11P5j69M24l15
8067a20R2j42K38J03j36L3r4J02j20k1k4J10k0J69k56Q2j46L83l97L7L49k87O7
8090BJ02k12P3O4M7NJ18j08j18jm1K46l32K01m7J3O4L5k13Q8q5K04l1J44l28J01
8116ik28M10l6p0M9l16K61j04M0l1q7L18j60k1L2r1K76k60J22j32k3L36j33n8
8140H5k6K3j95j6J75m2j22J65l8j02N3N6P0q3l5mm8J50K6j50q6j8J40J05j77J54
8166F0j00O2J61k24K00j51j79P2K57j10j77J01Q2LN3Jj18J7J4j05Q7J39j41o6
$$ plain form
7993 75 -31 95 73 157 -24 -121 86 107 -67 -64 -44 -326 -139 -43 23 -247 10 73 45 -203 266 158 46 55 28
8018 28 -9 20 133 101 -26 -25 154 46 47 148 -35 -21 -25 -43 27 59 -186 47 39 -100 64 118 95 -28 175 -50
8044 -50 97 140 -23 -165 37 -14 -166 53 80 93 277 -24 -15 39 275 -138 -43 76 -135 -60 -229 195 -120
8067 -120 -28 -170 68 171 35 68 -26 76 -44 -65 -89 21 1 170 -86 -4 -150 233 -164 -127 222 -65 2
8090 2 104 -108 -35 29 76 81 199 91 -27 -28 -69 177 -155 46 -1 12 76 111 -102 -14 -99 105 74 218 -110 -9
8116 -9 -237 173 137 67 116 -200 61 -43 -3 -34 -121 197 37 16 48 -43 233 -27 95 -37 -60 276 143 85
8140 85 59 82 -113 -129 46 4 -118 47 9 -93 -40 16 86 3 -32 -36 -84 66 92 -58 -144 -162 -22 83 -94 60
8166 60 -40 22 183 -41 159 8 -171 -99 158 48 -129 -28 54 57 110 111 -7 10 24 -81 6 145 4 -62
8190f2K8
$$ plain form
8190 -62 -34
8191c4
$$ Imaginary data points
##PAGE= N=2
##DATA TABLE= (X++(I..I)), XYDATA
0@%%%%%%%%%%%jRj6J6j6K4l2L2m0N1n9P2q8J04j20J36j59J84k09K40k75L14l57
34a90M05m55N11n75O42p16Q01q92R88j094J212j340J480j634J800j982K183k405
52a261K651k924L228l570L958m402M913n511O222p085Q157r530J1367j3961J7919
67A0171k4782L9990j36538R3210K60290j91214j93095N8099J78291m2320j14026
78f1924J2199Q7471k537j0023q992m8817n0225P3102J14866k7635j49745j5943
90h8203J11609L0101p1924j5021N1627J2958m5034m476J8315k5798N185P9995
102E9334J0585j02418n8422Q1679Q4433m5357o8407K9541L3892k8713k0295J6329
114g819R327p87K0489J0388n9886m5767P4614P5997n5901p4203M2758O5111n5087
$$ plain form
0 0 0 0 0 0 0 0 0 0 0 0 0 -1 8 -8 8 -8 16 -16 16 -24 27 -32 40 -48 56 -64 72 -87 97 -112 128 -147 167 -190
34 -190 215 -240 271 -304 338 -378 423 -469 519 -575 637 -703 777 -857 943 -1039 1144 -1261
52 -1261 1390 -1534 1694 -1876 2082 -2320 2593 -2918 3304 -3781 4376 -5154 6213 -7748 10171
67 10171 -14611 25379 -111159 -17949 242341 51127 -141968 -83869 94422 52102 -61924
78 -61924 -49725 37746 35209 25186 16194 -32623 -82848 -9746 105120 77485 -72260 -88203
90 -88203 23406 53507 -18417 -33438 18189 31147 -13887 -18363 -48 -25846 -20661 59334
102 59334 69919 -32499 -90921 -9242 75191 29834 -38573 -9032 24860 -3853 -24148 -7819
114 -7819 1508 721 21210 31598 -28288 -74055 559 76556 20655 -53548 -10790 54321 -766
127g66p3377P4679R3673p4666j00840N7073R0789n1361r1770N5052J06459m6703
139C8242j11238J7075Q6769R100m6635m938K4511j5477j6976K9777O414l3636
151a7012J1082M5194j6316o8814m223Q0723K4002o9873k4446M9617J0425m2312
163b1953n211M7047J2112m2633p922K8915q321k0285K2525K5779j8351l2387Q130
176a2555K4089j3850j1277K7716N957l2902j1136K4548J0242k1577K548L5814
188B7617j2944n0244J3425N3194n270m9693K876N6767m579o9843l750O8634J8824
201D5014n0301l0203K7740K5028j6697j1972J2123N38n58J0121q561k3709L863
214a7574M0657J7069m6815l3545L8414L3816k6195k8356J7553K5988j5780k5863
$$ plain form
127 -766 -74143 536 94209 19543 -81297 -24224 66565 15204 -76566 -21514 84945 38242
139 38242 -72996 -55921 30848 39948 -6687 -11625 12886 -2591 -19567 10210 16624 -17012
151 -17012 -5930 39264 22948 -45866 -50089 30634 54636 -15237 -39683 9934 20359 -21953
163 -21953 -27164 19883 31995 -10638 -18560 10355 2034 -18251 4274 30053 11702 -20685 -12555
176 -12555 11534 -2316 -13593 14123 20080 -12822 -23958 590 10832 -10745 -8197 27617
188 27617 14673 -35571 -22146 31048 25778 -23915 -21039 35728 31149 -38694 -42444 26190 45014
201 45014 -5287 -35490 -7750 17278 581 -11391 732 1270 712 10833 2272 -21437 -17574
214 -17574 23083 40152 -6663 -40208 -1794 32022 5827 -22529 -4976 21012 5232 -20631
226b0631J2831J4524j0937K802J5544q827k4657O12L2750J0246k8969r295K0243
239F236L877j3476l788Q438N149n619J930J110j9113k881K9323J1160k6030k0134
253b3818J8689K4992j6579k2815J9592K0303j3858j7646M201J2690j323o871Q823
266F380N04j6777l15J3854K203r005k506R040J537j3980J479J4376k120o597M704
281B777L541q100r607J2077J7067j3376j7715J0066J2663p618j3391N018J6946
294A0348l338j6002J491P504K21K088J348j669l965j390Q212K83j0688M373J1214
309A0030m851j2342k102J1273O047j0945k563Q685l777o245L900O504P7o306J039
324a576P456n387o905P734O384l346o103k117M827Qm214M413J376n604j60K305
$$ plain form
226 -20631 -7800 6724 -4213 -1411 14133 5306 -19351 -18739 14011 24257 -4712 -14007 6236
239 6236 10113 -3363 -7151 1287 6436 817 2747 3857 -15256 -18137 11186 22346 -3684 -23818
253 -23818 -5129 19863 3284 -19531 61 20364 6506 -11140 -6939 5751 4428 -2443 6380
266 6380 6884 -9893 -10208 3646 5849 -3156 -5662 3378 4915 -9065 -7586 6790 4670 -1927 2777
281 2777 6318 -1782 -11389 688 17755 4379 -13336 -3270 9393 1775 -11616 -6598 10348
294 10348 7010 -8992 -7501 3 224 2312 3660 1991 -1974 -3364 4848 5131 -5557 -1184 10030
309 10030 5179 -7163 -9265 2008 8055 -2890 -5453 3232 -545 -6790 -2890 3614 3691 -2615 -1576
324 -1576 5880 493 -6412 1322 7706 4360 -1743 -3860 967 975 -3239 1174 2550 -3054 -3214 -909
340i09J51j715j57P222R48j0334k55Q743P65l867j593L669J942p107j973O910
356B440l42k707J48r57m06j340Q12M897j481l918L344R12k244M5J038L866k10
373C897n045J050Q11k730K844K454k929l016j847M736K816o496p33N683J432j950
389I77m443j029P030L237k537l634m072M228O655l479o324q92M919N632o367q976
405i075M526Q599R71n348o424L393O442P5j295k293k294M860K752l763l235j196
421c305N103N068o414o753J665N232M000m089o295L145L763k73k76j737P09K543
437B086o40M32m35l782J569L496Q24j586o571n25P075J589m287k767l1L681J718
454A846k333l6j471l51O526K588p014o510K491J2787L651j6394r503J1725J3838
$$ plain form
340 -909 -758 -2473 -2630 4592 5540 -4794 -5049 3694 4459 592 -1001 2668 4610 -2497 -4470 2440
356 2440 2098 -609 -461 -1418 -1824 -3164 -2352 2545 1064 -2854 490 1402 -842 -797 241 4107 3897
373 3897 -1148 -98 713 -2017 827 3281 352 -2664 -4511 225 3041 -3455 -4188 1495 2927 977
389 977 -3466 -4495 2535 5772 3235 -399 -4471 -243 6412 2933 -3391 -4283 636 6268 -99 -9075
405 -9075 -4549 4050 5021 -327 -6751 -3358 3084 3159 1864 -429 -2723 2137 4889 1126 -2109 -3305
421 -3305 1798 6866 452 -6301 -4636 596 4596 507 -5788 -2643 1120 847 571 -1166 -457 2086
437 2086 1446 1878 1443 -2339 -770 2726 3550 1964 -4607 -5132 1943 3532 -755 -3522 -3553 128 1846
454 1846 -487 -523 -1994 -2345 4181 6769 -245 -6755 -4264 8523 12174 -4220 -13723 -1998 11840
469A1840l947j8186l286J7838P434j1599j0371K625J1899N192p861o331m66M423
483g96R224m62j1464n555P367J2490k068j8123l884J6966Q995j0426j5376K627
497a0485J7273L144j2102n176M746O798R75n563j486J631P4L884J126o604m409
512f174L691Q344L50j2512l064J1550M399p804n922N382Q670n611q386P321P956
527H190o482q584M685J2550l337j7398J228J7341K487j4626q853J0668J1715o678
541B906j0176K969N051J475J40j737k549k537M772J0321n193j5369J089J5880
555G042O626j4082j5108R805J7633m172j5215l874J0757J0112n640j0084M63N665
569g2M796Q52o068l734J773N469M862n920j0256L074J1269K448j0651j0456R071
$$ plain form
469 11840 7893 -10293 -13579 4259 11693 94 -10277 -7652 4247 9439 1578 -4753 -5219 -796
483 -796 8428 7966 -3498 -9053 -1686 10804 8736 -9387 -13271 3695 12690 2264 -13112 -10485
497 -10485 6788 9932 -2170 -7346 -2600 4198 5173 -390 -1876 -245 -171 3713 4839 -1765 -6174
512 -6174 -2483 5861 6211 -6301 -9365 2185 6584 -1220 -7142 -1760 6910 1299 -7087 234 8190
527 8190 1708 -6876 -2191 10359 7022 -10376 -9148 8193 10680 -3946 -12799 -2131 9584 2906
541 2906 -7270 -4301 750 2225 2365 628 -1921 -4458 314 10635 5442 -9927 -8838 7042
555 7042 13668 -414 -15522 -5717 11916 7744 -7471 -11345 -588 9524 3884 -6200 -5737 -72
569 -72 4724 5576 -492 -4226 -2453 3016 7878 1958 -8298 -5224 6045 8493 -2158 -12614 -3543
584c543J4270n774j3617M36J1963M596j0224n918J0501M409q053l262N862M369
598F015o393o062P929N423q024n301M594N517j749n698Q08M493k452j07M193k006
614A180m494J195O681K742r695n293R771O712o053r019j19R307L523p426m766
629e754J907M229M001l058n642N70M408M710j474p532j270O837M453k579p485
644c679l182Q358N918n100q556j495J0233N827r474q095N832R205O7r032k573
659e746P381K969l408j423o80J032J538l61k45k634j785M667J592m406j929J830
675a608L152j65l740R97K645j619K80J582p52r44o5J727J572m159j447M056K15
692A727k596q08J92J968m81j746J247O42q77J143l46k01Q63l53P58O7j543J486
$$ plain form
584 -3543 10727 4953 -8664 -8228 3735 8331 -1893 -7811 2690 7099 -954 -4216 1646 6015
598 6015 -378 -6440 1489 6912 -1112 -6413 -1819 3698 1949 -3749 -2941 1552 -900 -1007 3186 1180
614 1180 -3314 -2119 4562 7304 -2391 -7684 2087 8799 2746 -6273 -6392 2915 6438 -988 -5754
629 -5754 -3847 382 4383 1325 -4317 -3747 661 5371 3897 -3635 -4905 1932 6385 3806 -3679
644 -3679 -6861 1497 7415 2315 -6241 -7736 2497 8324 -1150 -9245 -3413 5792 5859 -3173 -5746
659 -5746 1635 4604 1196 -227 -907 125 1663 1302 1057 -1577 -3362 1305 2897 -1509 -3438 -1608
675 -1608 1544 1379 -2361 -1364 1281 -338 -58 1524 772 -172 -237 1490 3062 -1097 -2544 1512 1727
692 1727 -869 -1677 -1485 483 2 -1744 -497 145 -732 411 65 -136 727 374 1132 1199 -344 1142
710A142k21j965J111O33p81j125n07K061P92l479K69L273m19j513o26J673K523
727B841k090j997K355K09n33j81j689J150R13j173n0j274j64K842p71k450M83
744a579J384J938j220k786K400K443j905p36j50J104Q26j885l63J250j379k81
760i39J098j181N31n9o87J363j52p97J247p96M50J595j026o10L74JJ401j262k228
779a677J811Q09j166k92q13J051O35j809P48Q77j174J104P41q55L00k61L00J725
797B054j667j057J439l32Q6l93j345R69L3o27J204j450q31K443K98r39p02J09
815g08K632j83k890P33J644j20m8j685j98J888q56o39r0j351J742R48j749k63
833a193M48J395J025k476o94K740L55q87o77n52J811m72j314P27n28q61J753l28
$$ plain form
710 1142 921 -1044 67 700 -81 -1206 -1713 348 1140 -2339 -2070 1203 784 -729 -1355 318 2841
727 2841 751 -1246 1109 1318 785 604 -1085 65 978 -195 -245 -1519 -1683 1159 388 -2062 -1579
744 -1579 -195 1743 523 -2263 137 2580 675 -61 -211 893 1719 -166 -529 721 -658 -939
760 -939 159 -1022 -491 -550 -1237 126 -26 -823 424 -372 78 1673 647 37 411 412 1813 551 -1677
779 -1677 134 943 -223 -515 -1328 -277 358 -1451 -703 174 -1000 104 845 -10 290 29 329 2054
797 2054 387 -670 769 437 523 130 -1215 -246 -213 -840 364 -1086 -1917 526 824 -115 -817 -708
815 -708 1924 1741 -1149 -416 1228 1108 1060 -625 -823 1065 209 -430 -520 -1871 -129 819 -930 -1193
833 -1193 -745 650 1675 -801 -1495 1245 1600 713 36 -516 1295 823 -491 236 -292 -1153 600 272
851B72j231m48J5J785M67k470J067J345m39L96n29p8J020q04L13O28k221J41J826
870A055p85p62j058N18J945j670p77J741m86o20J470L08k18j211K53K745o17l063
888a232N09J740K23q72j848O47J197j285Q54J29j928R20J711L94j187k094J984
905a38L075j890k304J046J091P52r54j398L54m6K74J485k260j812K575J199q52
922A97j745j34K870N5k218J553Q77j588k23J053J478j882k978K953K752l571k298
939b849K206J913o44k761J169K198k103n77L161Q2k803j128L182L231m014m076
955c813L913L218j855l284n04K657J331k266k96k31p71K424J349j983j685M81
971a315L072J594l720j423J917J284R70j547l563R37L382J174l273m472L157N920
$$ plain form
851 272 -959 -1407 -1392 393 860 -1610 -543 802 363 759 230 152 1172 368 681 1309 -912 -771 1055
870 1055 270 -492 -1550 -1032 913 -757 -1534 207 -279 -899 571 879 661 -550 -297 2448 1831 -1232
888 -1232 -723 1017 1240 368 -1480 -833 364 -921 -67 62 -1866 -946 765 1159 -28 -2122 -138
905 -138 2937 1047 -1257 -211 880 1632 678 -720 -366 -412 -138 1347 -913 -2725 -150 1049 197
922 197 -1548 -1682 1188 1243 -975 578 1455 -133 -356 697 2175 293 -2685 268 3020 -551 -2849
939 -2849 -643 1270 626 -2135 -966 1232 -871 -1448 1713 1795 -1008 -2136 1046 4277 263 -3813
955 -3813 100 3318 1463 -1821 -2325 332 1663 -603 -899 -1130 -1901 523 1872 -111 -1796 -1315
971 -1315 1757 3351 -369 -1792 125 1409 2379 832 -2731 -1794 1588 2762 -511 -4983 -1826 4094
987D094k666n237R39M483J238l960j048M291q00k920K486K236k859l441K471N198
1003D505l006o896L400N939k477n146P36N313n0n832J537N362k334m000K464L854
1019C369r21n319O35N915j136m921M87K627O16j512j769J790p2j275K045L86k157
1036a212J80J339J223l62k055L41J691K66J29j881k518L125L126k233m591k93
1052c725N965J550o762j318N696J575l232k333K959K025l522J17M306j689m776
1067c164K123M753j095o306l09P557J65p423m05O111R29m515j877N027J328m899
1083b000M31M419j234l199O82L330l03m132M23M169j861k846J100J959m36k048
1099a546L89K502j503j596K138P22j132N9P89J22j074p3K089j476k504K414K024
$$ plain form
987 4094 1428 -3809 -2870 1613 2851 -1109 -2157 2134 1334 -1586 900 3136 277 -3164 -693 4505
1003 4505 1499 -5397 -1997 3942 1465 -3681 -2945 2368 2318 -3514 -1977 3385 1051 -2949 -485 3369
1019 3369 2448 -2871 -2236 3679 2543 -2378 -1891 736 1352 -160 -1929 -139 -211 -1486 559 945 -1212
1036 -1212 -1032 307 1530 1168 -887 -546 1145 1411 1540 -341 -2859 266 3392 1159 -3432 -3725
1052 -3725 2240 3790 -2972 -4290 1406 2981 -251 -2584 375 2400 -1122 -1005 3301 1612 -3164
1067 -3164 -1041 3712 2617 -3689 -3998 3559 3724 -3699 -4104 2007 2936 -1579 -3456 1571 2899 -2000
1083 -2000 -1569 2850 1616 -1583 -901 2429 2126 -2006 -1583 2586 725 -2121 -1021 938 502 -1546
1099 -1546 -1157 1345 -158 -1754 384 1106 -26 33 822 944 -130 -203 1886 410 -2094 320 2344
1116B344k576k378J643L244j857m008K469L556k322k077K049J787j566k038K599
1131H69K115l977j403M457N14l783j627L432K307m048k407M405J136l701l67K709
1147F31R30k516r03L898J40m250J185L454j077k966J4L495k61m297J096L425j913
1164H5k129J203J810o62k066J301K478k369j436K992O92k332o26J944J411k934
1180f38j751L737M03l172k03K265O82k432r68K815L62l195J470K634j507j517
1196a015P72K042q36k613J580K683k576j777J813J326j659j779J737K268l106
1211a140j434L256R93k572r54K525J495k581j237L127O22l039K15J861L6k044
1227h71n19K543j05l155R54K577j441j435N45J943m1k693J547K332j971j430J859
$$ plain form
1116 2344 -232 -2610 -967 2277 420 -3588 -1119 2437 115 -1962 87 1874 308 -1730 869
1131 869 2984 -993 -2396 2061 2575 -1208 -2835 597 2904 -1144 -3551 854 1990 -1711 -2078 631
1147 631 1561 -955 -1858 2040 2180 -2070 -885 2569 1492 -1474 -1460 2035 1774 -2523 -1427 1998 85
1164 85 -2044 -841 969 307 -1759 -458 2020 -349 -1785 1207 1899 -433 -1059 885 2296 -638
1180 -638 -2389 1348 1751 -1421 -1624 641 1323 -1109 -2077 738 1100 -2095 -625 2009 502 -1015
1196 -1015 -243 1799 963 -1650 -70 2613 37 -1740 73 1399 -260 -2039 -302 1966 -1140
1211 -1140 -2574 682 1675 -897 -1851 674 2169 -412 -1649 1478 2100 -939 -724 1137 1173 -871
1227 -871 -1390 1153 1048 -2107 -1153 1424 -17 -1452 -907 1036 995 -1698 -151 2181 210 -1220 639
1244F39P75j054j714J210K165k135j779K323N82j961l13J225Q12j360r90K598
1260A023K81k662R68J754m32j367j04K032k83k765J080J830j385j536J018J252
1276G04l06k542J367K359j656j539J666J199q34j175Q80J598j490j259K095J36
1292A203j976kJ252L96j784r14K275M02k221K33J646n7j049j63J708K17j916M76
1310b74K231j352j071L25J211m70j776O41J647j197j334J068M74k94p46K50J535
1327H68o55j018J832J82j435J68P71L38r85j087J616K83j792J80J183n85n93o6
1345g95Q47K20j081L80J344q91m92Q67O58o25q49O20J255j523q81J370N2r08m47
1364h79N49J105j061j349J786O24j347Q4M50R93n73j048J157O72j325k6R21k87
$$ plain form
1244 639 1414 360 -1354 -144 2021 -114 -1893 430 1012 -949 -1262 -37 775 -585 -1575 1023
1260 1023 1304 -1358 -390 1364 932 -435 -539 1493 1210 -1555 -475 1355 -30 -1566 -548 704
1276 704 398 -2144 -777 1582 -74 -1613 53 1252 418 -757 123 1721 231 -1028 1067 1203
1292 1203 -773 -775 477 873 -911 -1825 450 852 -1369 -1136 510 453 -596 -759 949 1166 -750 -274
1310 -274 1957 605 -466 -141 1070 600 -1176 -535 1112 -85 -1419 -351 123 -171 -917 -667 868
1327 868 213 -805 1027 1209 -226 -58 713 1051 66 -1021 595 878 -914 -734 449 -136 -729 -795
1345 -795 52 272 -809 -429 915 24 -468 399 1057 432 -417 203 1458 -65 -946 424 476 -432 -879
1364 -879 -330 775 -286 -1635 151 775 -572 -488 -38 955 382 -666 491 1163 -162 -188 733 446
1382D46p14k29N72L16j187k12J426n27n11K93J02O03l72l13R54m48k08P89m36
1401C44o47M90p1N03p37r30J032L57r44K42R8J0n6k17P18M18j391P13J172o41
1421D63l64l15P33M88j234k64R27k39n36l9j05O26l87q36J356M2p41K81K29L84
1441D69O7q22N28P63m79n64p0m0P32o51o42P26l54k24L41k91L92P2o17Q53M56
1462F45o95LK59M81K00j470J32J326l18q88l25N05O06n62q55N59N93n36Q1N2L39
1483A32K15j114J060N87n47p15M78O05L00j576M5J446p56q25j80Q51L11q71n43
1502a097J255N93j238J48P12N75q97p90J219Q69j316l83L60P42m40j180N63P71
1520D66o91o49N64L09o9l96q2J306j37j217O07P51j23n23n39Q05P08j340l46O62
$$ plain form
1382 446 -268 -497 75 391 -796 -1008 418 -109 -620 -327 -225 378 6 -307 647 199 -9 780 344
1401 344 -303 187 116 619 -118 -1048 -16 341 -603 -361 -263 -253 -309 -526 192 610 -781 -68 1104 463
1421 463 99 -216 517 1005 -229 -493 434 195 -341 -380 -485 141 -246 -1082 274 316 -425 -144 85 469
1441 469 536 -286 242 1005 526 -38 -108 -148 584 -67 -709 17 -337 -561 -220 -511 -119 -47 -664 189 645
1462 645 -50 -47 212 693 893 -577 -445 881 563 -325 -650 -145 461 -101 -956 -397 196 -340 -259 -207 132
1483 132 347 -767 293 880 333 -382 96 701 1001 -575 -530 916 160 -665 -845 6 317 -554 -1097
1502 -1097 158 751 -487 -339 373 948 51 -739 480 1349 33 -350 10 752 312 -868 -305 466
1520 466 -225 -874 -310 -1 -70 -466 -548 758 621 -596 11 762 639 116 -423 382 1090 -250 -596 66
1540F6N9K0q88j8R14j41p49N30K68k0k17k38R15K99r24O8P66r2p84n53P35P65
1562G81j281m35R42J61l56o18K50R83n69p07J149L14m37j93L2O46J5j272M24P52
1582E81n17k80p0J90K06p21R9P32k62m63K91K02N50o21m61R04l3l64K94k00K31
1603B88P8o76K81K24m54L6K38l02L50l43j45P39m26j74J09N2N88j23m14K00L48
1624D74l50J66k38J29J90q32J45O91o96n2J51J04J37j06j88Q25j32n93L48J77
1644C50Kj67l78N18K2p15L48J54J31l99k10K26K37p55L92L07j75Q7lj02M01k01
1666G0j28M65l01K1Lk29L09j31k85K05j83l50M85m53J76K30m3j0J19k16M95j09
1688A40l01P11r3m50J80j50O3L19r73M33K09m41m6K65L4L23n23J08Q79p37k21
$$ plain form
1540 66 125 145 -743 -761 153 12 -737 -207 61 41 -176 -414 501 800 -124 -56 710 618 -166 -719 16 781
1562 781 -500 -935 7 168 -188 -806 -556 427 -142 -849 300 614 177 -16 16 662 677 -595 -171 581
1582 581 64 -216 -286 -96 110 -611 -512 220 -42 -505 -214 -12 538 -83 -544 360 327 -37 257 57 288
1603 288 366 -310 -29 195 -259 -223 15 -287 63 -280 -425 314 -112 -286 -177 -125 463 340 -74 126 474
1624 474 124 290 52 181 371 -461 -316 375 -321 -373 -222 -118 19 -87 -275 550 418 -175 173 350
1644 350 352 185 -193 325 347 -368 -20 134 265 -134 -344 -118 119 -636 -244 63 -112 -25 -28 -130 271 70
1666 70 -58 407 106 127 130 -99 210 79 -206 -1 -184 -534 -49 -502 -326 -96 -139 -149 -30 -246 249 140
1688 140 -161 550 457 7 187 37 100 419 -554 -121 88 -353 -399 -134 -100 223 -300 -192 687 -50 -271
1709b71O81k16J57j98k68O30k84o51P46j46l08j19J33K15q6n09K70K56l80L59
1729A1jL6K55l65K44J75j84l18K72r4O1j18k61L81l84J35P3j12k23N91m04Q9L17
1752A76Q3Kp6k15M72J0l73J6q3K54j29k68J74m6n32J50K55k58K79j10JN75k73
1775H4k90M73O5j21j44M0L75l08k03J81j63r6K25l48P6K6o9J29m1j57L85j22k55
1798b58N79j25j01K22l45O5L73l43R4J25l25j67J09j48M05o89J58K53R1KK8J10
1820A13K24k43j60M25j91j00K87j68m0l0n63K11M48n20K95n5k49K77k86J76M74
1841C25m60J77J88j30J51K34n00J27J80l05K57k65j36J09l07QM50n57K45K27j55
1862a37K17p5k60M63K7l51M14k99K20J36o15L50pk40m8N5N8J01m53K9N14j13l39
$$ plain form
1709 -271 410 194 351 153 -115 515 231 -420 326 180 -128 -247 -114 101 15 -494 -224 32 -348 11
1729 11 10 46 301 -64 180 355 171 -147 125 31 92 -26 -287 94 -290 -155 -82 -194 -417 174 -230 -141 176
1752 176 259 261 185 -30 442 452 79 95 12 266 137 -131 43 -3 -535 -385 -130 -388 -109 -219 -218 357 84
1775 84 -206 267 332 211 67 107 482 174 -29 152 -11 -107 118 -230 -154 -128 -197 -68 -109 -266 119 -3 -258
1798 -258 321 196 95 317 -28 37 410 67 161 286 -39 -206 -97 -245 160 -529 -371 -118 -27 -25 3 113
1820 113 337 94 -66 359 168 68 355 187 147 117 -446 -235 213 -307 -12 -67 -316 -39 -325 -149 325
1841 325 -135 42 230 100 251 485 -15 112 292 -13 244 -21 -157 -48 -355 -347 103 -454 -209 18 -137
1862 -137 80 5 -255 208 235 -116 298 -1 219 355 -260 90 83 -157 -205 -150 -92 9 -444 -415 99 -14 -353
1885c53L02m5M68m54j67O41P6m50N1P7q0n9m41N86L1p56J41K98J59m2l07K99M83
1908D58n24j89L12R3k5j7L9K65j43l68Q4K4r6J50l72K08K46l48k15M38j30K86
1930A76l15K80K95j19m93K28K10q7j87k20N71r5n77J22O5P7k4k53l2P83m02l78
1952c75N89pK15l53l81P53j9n46L61lj86l4j57M04l10k49j9J19k0K1j42L46K32
1975B39n86K15L36R4o6k60L0M28k55n33M57k03Q0J78m13K30M5l19K00K25l29J94
1997a3k17K26L52m28m9M60j22n6j01k82N71k4p62L39J48k91q7q9L36L48o20J50
2019b11L76Q7j80MK03K40k61m44M16J61n41J18j4K39j83k11K22J21o33L66R1P4
2041D0qk62J79J93P1n8Q7r1J62j19k87M98l52j59O1m33K36L79k98J3k0J27K6j80
$$ plain form
1885 -353 -51 -96 372 -82 -249 392 468 18 69 146 66 7 -434 152 183 -573 -432 -134 25 -17 -324 -25 458
1908 458 -66 -255 57 150 125 108 147 412 269 -99 -15 9 -87 63 -309 -101 145 -203 -418 20 -110 176
1930 176 -139 141 436 317 -176 52 262 175 -12 -232 339 244 -333 -211 -146 -69 -93 -346 -378 405 3 -375
1952 -375 214 207 422 69 -312 441 422 -124 237 234 48 14 -143 261 -49 -298 -317 -198 -218 -197 -339 7 239
1975 239 -347 -132 204 298 232 -28 2 430 175 -358 99 -104 -24 154 -259 -29 16 -303 -103 122 -207 -13
1997 -13 -230 -4 348 -80 -129 331 209 153 52 -230 341 317 -445 -106 42 -249 -336 -425 -89 259 -361 -211
2019 -211 165 252 72 76 279 519 258 -186 230 391 -150 -32 -46 193 10 -201 21 142 -491 -125 -34 40
2041 40 32 -230 -51 142 213 155 242 151 313 194 -93 405 53 -106 -45 -478 -242 137 -161 -148 -168 -41 -15 -195
2065a95K29K26k61k73O35j50o4l40M3N96m57n91P75R3n79J09J10J73k2m90L56
2086g7M95m71PL29oJ14l92oM39l74k88M90j90l76L76m46N29n51j57N21j43j5K19
2109B7m2pj3NK70j99j72L03J45l57m0J2J40n3l90L58K57n23j2M74j04k07p8M61
2133B55J14n59r6O63k5k62n3J39J72n58J6L32q3o08O22L7l3k07j79M75j32k27
2155a97L23L52l82k67K21R0Q7l12M9M67o68R2K83o0j73K0M3J79l69j76O79l66
2177h5k54M32J99k16j21j42O62m44l49N59j00j43j73j53M41m56l14M22N65o47
2197c17R7L06K20j20n64N66L39n19k64N48k30j88p3K81J97o40j43O63k44l48J48
2218b85J36L07l49j78O16m5l85M92m6k31J52j97K68k11n22M93rk00j13K44O2k47
$$ plain form
2065 -195 34 260 -1 -274 361 211 147 -193 -150 446 -11 -602 173 266 -313 -204 -94 79 57 -433 -77
2086 -77 418 -53 -46 283 277 391 -1 -7 432 58 -230 260 70 -306 70 -376 153 -398 -555 -34 -177 -192 27
2109 27 -15 -22 -35 -30 240 41 -131 172 317 -40 -80 -68 72 19 -371 -13 244 -279 -291 183 79 -128 -206 255
2133 255 369 -190 -286 377 352 90 37 176 348 -210 -194 138 55 -553 69 106 73 -134 -313 162 30 -197
2155 -197 126 478 96 -171 50 140 227 -85 -36 431 -237 -145 138 78 -95 -75 -32 147 -222 -398 281 -85
2177 -85 -339 93 292 76 -45 -187 475 31 -318 241 141 -2 -175 -328 113 -343 -657 -235 330 -317
2197 -317 -220 86 306 186 -378 188 527 8 -256 292 62 -126 -199 82 279 -361 -504 159 -85 -433 -285
2218 -285 -149 158 -191 -369 247 202 -183 309 263 32 184 -13 255 44 -478 15 6 -194 -307 -63 -1 -248
2240b48M7L59Q2m34k52P61k1k85Q8J25K3k86o4N01l37l67O3K79j05k79J32M96
2262B78l63m71M96L17j54k21J27O6O4m53L85L26l72j31L15r5j14k75J72M55n04
2283a52k30M95j08k18L45j94M18l99K8M03l60o7K26J94k41j75k16L93j74n62O59
2304F5J59n18N8K11J52k91k36L88K15l86J84J63J52k99k01K40K51k64l83M87q1
2325F6n3j57J00K01l79k22P11j5l94J8K97J33j67j91L03j70k55K27K25m22j03
2346b47L13J15j15k49J38R2j76N6J92k02j29L67j0K58o04K72N96n84k34M8J58
2367E5o9p4j18L77q5l26J80J78j15j61k3L35j68Q1J32J64j53k88M9K65l1k58J76
2390A23J74n56p0J46K9J5K02j81J60q4l7K68j14J36n6L7P9k33Q5O3l27p2N11j92
$$ plain form
2240 -248 -201 158 240 -194 -446 315 294 9 97 222 245 -41 -105 396 59 -308 -245 34 -71 -350 -218 278
2262 278 -85 -556 -60 257 103 -118 9 75 139 -314 71 397 25 -106 209 114 0 -275 -103 352 -152
2283 -152 -382 113 5 -213 132 -62 356 -43 -15 388 28 -39 187 381 140 -35 -251 142 -32 -594 65
2304 65 224 -294 -236 -25 127 -164 -400 -12 203 -183 1 164 316 17 -184 56 307 43 -340 147 66
2325 66 13 -144 -44 157 -222 -444 267 252 -142 -124 173 306 139 -52 251 81 -174 53 278 -144 -247
2346 -247 66 181 66 -183 -45 47 -129 -73 119 -83 -212 155 145 403 -201 71 667 83 -151 -103 55
2367 55 -14 -88 -206 171 86 -240 -60 118 3 -158 -181 154 -14 67 199 363 210 -78 -29 236 205 -53 123
2390 123 297 -259 -329 -183 -154 -139 63 -118 42 -42 -79 189 75 211 155 192 271 38 123 186 -141 -213 298 106
2414A06m78M55N0j42k10p7L76P5k44q6L69J49l07j75K49J63l16O6K29p6j47j3
2436A6j15J11l30M7L53j35j9K0l6J09J6k8L12j37k45o2L27o2q8q2J00L8k08k8
2460a26qk01K60R0j76R7K20l10K01j16K16q1r8J75J67j68k33L27l04J26l93j30
2482d65M48Q4m45M14q5P5J17k58K03Mj02J66j8QK10l72J02K6l90M69j28l44L09
2505B8jk03M22l48j28J87K53k80L19k58N7o5J6L9J37k83K79j79j95L28k50m2K37
2528G0l86J99N2k35L93k91K81k47j9J49K89k94J28m6J01j69l6j64K99j00q4J82
2550G2l56J98J89k02K08j50JK15j70M0K44k71K2L1rj1q4J02J44j81l93N13j03
2573D9l16L96j35J14j31j72K32K26Pk46K00j74K24l11j43K20j20P9O1m27M56l08
$$ plain form
2414 106 -372 83 133 -9 -219 -296 80 155 -89 -175 194 343 36 -139 110 273 -43 23 252 176 29 16
2436 16 -99 12 -318 -271 82 -53 -72 -52 -88 21 37 9 321 184 -61 -123 204 142 54 -28 72 110 -98 -126
2460 -126 -134 -335 -75 15 -161 -64 156 -154 47 -69 147 66 -32 143 310 142 -91 236 -68 58 -335 -465
2482 -465 -17 67 -378 36 -49 26 143 -115 88 92 -10 156 138 146 356 -16 86 112 -278 191 63 -281 28
2505 28 27 -176 246 -102 -230 -43 210 -70 249 -9 48 -17 -1 38 175 -108 171 -8 -203 125 -125 -167 70
2528 70 -316 -117 -65 -300 93 -198 83 -164 -183 -34 255 -39 89 43 144 -25 -61 -225 74 -26 -110 72
2550 72 -284 -86 103 -99 109 -41 -40 175 5 45 289 18 40 71 62 51 -33 69 213 32 -361 152 49
2573 49 -267 129 -6 108 -23 -195 37 263 270 24 224 50 274 -37 -180 40 -80 -1 60 -367 89 -219
2595b19o7L29Kj27kJ04J66Q9l60K89N5m73L76j28r8N4K8j00K02r1j39K77l02J39
2619Dj84J52P4L4n9j22J03N6j0k37L14rj87J57R4k95J37j29j05R1%j25L96m3l
2644A04j97J58o9J16j09L8J31n4L1j08J8j0j41L5q9J00J35k04oQ9J72l08J28J36
2668I6j01N0j23J42R6l05J21J53O0j02j53j22M33m41m4J51J19j56J15j92K84j63
2690h2Q5K46j74J30l8j67R8O7l40L21M2k11k9OJ4K59m39K00q3N5j15J82j26R9
2714@P0k49M78J2l10J83j03K2J5l43O9J55P5j7j97k8R8n5l3J23K12k94J97j77
2738i7L90k82n2M8J13p1r1N4L4J28k41K52J8k97J40L0j94Q3M7o4K29p4j24q2K38
2763A35j01M2k61L78J8l55R5J61k25j1J76k26R3j64K37k37K15O1Jk6l2Lj13J65
$$ plain form
2595 -219 -286 43 45 -82 -84 20 186 275 -85 204 259 -214 162 34 -64 -10 18 -82 120 29 -110 167 -135 4
2619 4 -180 -28 46 80 21 -101 2 58 48 -189 125 116 -71 86 180 -115 22 -107 -212 -121 -121 -246 150 107 104
2644 104 -93 65 -4 112 3 41 172 118 149 41 59 49 -92 -57 -146 -46 89 -115 -121 -32 140 -168 -40 96
2668 96 -5 45 -78 64 160 -145 -24 129 189 87 -66 -188 245 -196 -240 -89 30 -126 -11 -203 81 -82
2690 -82 3 249 75 205 167 0 98 165 -175 146 188 -23 -52 -46 -32 227 -212 -12 -95 -40 -155 27 -99 0
2714 0 70 -179 299 311 1 184 81 103 118 -225 -156 -1 74 57 -140 -168 -70 -125 -158 -35 177 -117 80 -97
2738 -97 293 11 -41 7 120 49 -42 12 46 174 -67 185 203 -94 46 76 -118 -35 12 -52 177 103 -21 -103 135
2763 135 34 76 -185 193 211 -144 -49 112 -113 -124 52 -174 -81 -245 -8 -245 -30 31 32 6 -26 -23 -136 29
2787B9m3P1K40k21m7j6j63J11K79l88L43k41o8R1j25n6K47P3J78j75l15L91j42
2810E3j36J81J78l19r6L3q2J14l42L51P9k6P9j78O2K76j46j06J22mJ42k21L6L07
2834C57j97k53J11K35l96M0L9n9J70j58R7Oj06J14m1J34J00o8j14P4J06K5q1k14
2858g9J24P9k17M9J5n9J51j12K3J06j31j81J72L27l45L50l40M00p3m67L91Kj61
2881B4o8o6L17k66k24K50J60m08J01L71k12K17k0k78L62j79j39M5J18J2j15j86
2903a84K72n9l04R8K93k09K71j12k80N02m59K21J44k20J61j65K7K85r9j3k45O8
2925gK25k08j78J76Ql78J85M5L9L65m41K0K79k30M4J84L7o6j58OK61j39o6l0J10
2950H3L9j82j08J60mq2o4J65n7j66L26l8Q4j75Q0K0O3j73J09j97K07j19k1J98
$$ plain form
2787 29 -14 57 297 76 29 13 -150 -39 240 -148 195 -46 -114 -23 -148 -204 43 116 294 119 -196 195 53
2810 53 -83 98 276 -43 -139 -106 -188 -74 -416 -65 14 -12 67 -111 -49 227 81 -25 97 93 235 14 50 357
2834 357 160 -93 18 253 -143 -103 -64 -123 47 -111 -14 -8 -114 0 -41 93 193 125 11 85 191 216 135 -79
2858 -79 45 124 -93 -44 -29 -88 63 -49 -26 80 -51 -232 -60 267 -78 272 -68 332 259 -208 183 185 24
2881 24 -44 -110 207 -59 -283 -33 127 -281 -180 191 -21 196 176 -102 260 81 -58 -13 105 117 2 -184
2903 -184 88 29 -275 -177 116 -93 178 66 -214 288 -171 50 194 -26 135 -30 -3 282 183 170 -75 -7
2925 -7 218 10 -168 8 16 -362 -177 -132 -93 272 -169 -149 130 -100 -56 128 165 99 -59 -53 208 69 3 -27 83
2950 83 122 -60 -168 -8 -12 -94 -158 7 -50 -216 110 72 156 -19 61 81 144 -29 80 -117 90 -29 -50 148
2974A48j12M5j00k93L56K44l88K55k24J45j64L01l72L89k60k24L83j1k6j99K7
2995h0o3K02o0J5j25N2p8O5L21j95l2p0J42qm0j2k0K73l97L0N7o5L2j7P5O4j93
3022a27L7J26P6j69L04k20p2J99r3J51J22j62k25J53l6o0j62p0K91N3o12N14j54
3045a36J49j06j98L32J7p2j24K66k15J35j3LK10l77J12%r5J20l3j09L3j5pJ43
3069B0q7L8K92m08K65j25J01J54l70J09P1P6m14K31k12K91J2O9Jr2l9Q5k55L68
3093A81j78N2K42j48k04K23M3k49P5O7j9o4J6j35Q2k88J80K58k40k31L34J11K1
3116A29j07N9k0L3k11L3J84n8J90k99R1O5k65MJ05J4j4M9j28J73k53J55K27m5
3140A11r9J10l57K92O3K1J04l29Q6q4MP3K1j5L0m0l9j28NR5L29j69p5K1N5j00
$$ plain form
2974 148 36 81 -19 -312 44 288 -100 155 -69 76 -88 213 -159 230 -30 -254 129 118 92 -107 -80
2995 -80 -143 59 -1 14 -111 -59 -137 -72 249 54 22 -48 94 86 46 34 14 287 -110 -80 -23 -88 -56 -73 2 66 -127
3022 -127 -90 36 112 -57 247 27 -45 154 61 212 334 172 -53 100 64 4 -158 -228 63 116 -496 18 -136
3045 -136 13 -93 -291 41 58 -14 -138 128 -87 48 35 38 248 -129 -17 -17 -112 8 -25 -134 -101 -116 -123 20
3069 20 -67 -29 263 -145 120 -5 96 250 -120 -11 60 136 -278 -47 -259 32 44 113 114 22 -17 68 -187 181
3093 181 3 55 297 149 -55 168 211 -38 37 104 85 21 37 -98 -16 -304 -124 134 -106 -337 -3 108 129
3116 129 22 81 61 94 -117 -84 100 42 232 -67 24 89 -176 -172 -67 -53 -67 -18 -146 27 -226 -71 156 111
3140 111 12 122 -235 57 120 141 245 -84 2 -82 -78 -5 16 1 31 -9 -48 -176 -171 -76 253 84 9 30 85 -15
3166a5L22m48J31n9M2j55N28l18K16l70J27N5l64K88K48q5j79%l6J69j06R6J10
3189A97j35j11J0j63L59n5k97K31J1k16R5J9K60l48m5J24R1k26L09O1j46J17n0
3212I2m8Kk05O2K19j01p6M2j84K22j40j9J79j56j2J37n4k54K98J54j7l81L23K92
3236C75n33J26N2rJ69m44J73M0p7j52J10J29J09q3J76p7n5k13m6N00l10j09K91
3259A42k4k11N9j6n0N3j21J84o9Q6l3K8j08NL3K04j62o6J40j83R0K08j33K9j37
3284e2j90K72Q6j70j12K94l16O2p1J94p4J56n5J84q5M6j61oj93J52L5J7k6n3J95
3309A29o8q4l4L5j49R8k43M12J13k60Ol2K11o3k21R9J95j9r9j05l4O3j7N8K43
3334B34k81j9K73m1l63J06J38q0J46j0k94J32r7L30k11M3r4m9QJ5q2K39J03k10
$$ plain form
3166 -15 307 -141 -10 -69 -27 -182 346 28 244 -126 1 56 -308 -20 228 143 -36 -36 -72 97 -9 87 197
3189 197 62 -49 -39 -202 157 102 -195 36 47 -169 -74 -55 205 -143 -188 -64 27 -199 110 171 25 142 92
3212 92 44 46 -159 -97 122 21 -55 -13 -197 25 -115 -134 45 -111 -123 14 -40 -294 4 158 141 -240 83 375
3236 375 -158 -32 20 11 180 -264 -91 -51 -128 -280 -170 -41 68 -15 161 84 29 -184 -230 270 -40 -149 142
3259 142 118 -93 -34 -50 -100 -47 -168 16 -53 33 0 28 -80 -75 -42 162 0 -66 74 -109 -19 189 56 85 -52
3284 -52 -242 30 116 -54 -166 128 -188 -126 -197 -3 -77 79 24 208 123 169 8 2 -191 -39 -4 13 -13 -66 129
3309 129 61 -23 -57 -22 -171 -73 -316 96 209 -51 -45 -77 134 71 -150 -51 144 125 26 -79 -113 -50 -67 -9 234
3334 234 -47 -66 207 166 -197 -91 47 -33 113 103 -191 -59 -156 174 -37 6 -88 -137 -129 -114 -196 43 146 -64
3358f4j54K41J29j11j44J40J5q2k4R8J11r0j09o0mo2Q3R2p6k6n5J68O4j00J06
3383H6q9J06l2j31kJ20j12R7M6%k45L18j24j10R7j24J19n6r1qQ5M4j46J63p2J24
3409F3k5L4n9N2R0r3j51J95q9j5J53k21J77k74K08l02K11o6K42j47l7o3J07O8
3433E8k7j5j31L0J70q3J44k29RM69n01j57K39L5L9j62J01m2J26p9o1K35K3j66
3457B5Q0K0p6rj11K64k25J37k09N5R4m8j26J68j52J43K6J4J65j66j96J54J29j40
3481A6J43k72K38J41k65K20k14k33J78j0j9M7j07J89mp5J6n4J37j4j07J03k29
3504a75PK0J42K5j22j0J26Jj20J99l13mK03j30M27l52K31j93k9J66J18j10K7m6
3528H8j14J42k84L48k89k35L57p0p1Q5J1J6j36K98O7k3k15J56k74J80qRO0j20
$$ plain form
3358 -64 -218 23 152 41 -103 37 52 -30 -54 44 155 65 -44 -104 -108 -170 -87 5 -71 -97 -152 16 80 -20 86
3383 86 -3 103 71 -60 -62 58 -54 43 89 89 -156 162 38 -72 25 -99 20 -36 -127 -135 -50 -6 -152 11 -61 63
3409 63 38 72 13 65 155 62 -89 106 17 2 155 -66 111 -163 45 -257 -46 -112 130 -17 -54 -117 -10 58
3433 58 31 16 -115 -85 85 2 146 -83 -74 395 -106 -263 -24 11 50 -112 -11 -53 73 -6 -67 168 191 25
3457 25 105 125 49 40 -71 193 -32 105 -104 -49 45 -3 -129 39 -113 30 56 70 235 69 -127 27 156 16
3481 16 159 -113 125 266 1 221 7 -226 -48 -58 -77 -30 -137 52 48 -27 -11 -65 72 58 -49 54 -175
3504 -175 -168 -148 -6 19 -103 -113 13 14 -106 93 -220 -224 -21 -151 276 -76 155 -38 -67 99 217 107 134 88
3528 88 -26 116 -168 180 -109 -344 13 -57 -128 -43 -32 -16 -152 146 213 190 -25 131 -143 37 29 38 98 -22
3552b2r1J58M9j32l6L8O4j49K62k38l3L09j73J1L1n8J88p9nQ6k62K1J21n9J59
3577A60k39L7K13l33J21O2n1q6Q6J73n7o6o1Q3N8j64J10j75%J53k54K26M7K6J57
3602B26k70KJ58j02q6K0J79k6O2J84k92J71k11J07r9J1O9r5qOQ4q6j91J06K09
3627A28j46j23O5j8J61j21j1Q3J36j86K85l30L6J94j43L5K1M0j49J1j8P6j27K19
3651A18k08K66j55K10k23m3Q1M3j60j67K86Q7p1j37O6r9K0K32j28M9lq3J22O0
3675A63m81L61M6J39l80O6R0j24J66j22L08k26J29j44Q3r9j4J04j19j12L37j30
3697D1j08O0J14j53J45R2l82K64M6M7l41J88q1P3j03j45K85k71K22j42J71k13
3719a91K85lML5m8J86k43k0J27j85m2J76j59n4LK05j51P0j80J98o6J19l6o5J53
$$ plain form
3552 -22 -113 45 94 -38 -74 -36 28 -121 141 -97 -130 179 6 17 48 -10 178 99 94 180 -82 -61 60 1 160
3577 160 -79 -42 171 -162 -41 21 -30 -116 -30 143 86 20 -41 42 100 -64 46 -129 -129 24 -230 -4 43 69 226
3602 226 -44 -42 116 14 -72 -52 127 101 163 347 55 226 15 122 23 34 103 8 0 6 90 4 -187 -81 128
3627 128 -18 -141 -76 -94 67 -54 -65 18 154 -32 253 -77 -41 153 10 45 66 106 -43 -32 -50 26 -101 118
3651 118 -90 176 21 231 8 -35 46 89 -71 -238 48 135 64 -73 -7 -106 -86 146 18 67 64 -19 103 163
3675 163 -318 43 89 228 -152 -86 4 -120 46 -76 232 6 135 -9 74 -25 -39 65 -54 -166 171 41
3697 41 -67 -7 107 -46 99 191 -191 73 119 166 -175 13 -68 5 -98 -243 42 -229 -7 -149 22 -191
3719 -191 94 91 95 130 82 268 25 5 132 -53 -95 81 -78 -132 -129 76 -75 -5 -185 13 -53 66 30 -35 118
3744A18N1j34j94J77K37l53M0L79l42R4k47K56j78Q3j50K56Q8j61O8J40k16j8
3766fj57K74M2P7k11o0KP3r8J00q1J71j54q8K01j70N7J55j94OL24m8K0j50j88
3791a03J13m4M5rO0o7p5R4r7J17k47J79r6J1L06l36M7K70j94n2Q9j51J07K8K14
3816B09j04k13K50m1m4p3%O7k48K51m9m4j19M0K46k52o3J60J33j55k0j19K55j16
3840d9J56rp7m7M1l5L9M5j65p6J39j46J53J18j48O8K5J1k2J5J3J5N8j02M3P5k82
3867a44J39j15K90l35J86J40j31p3j88J49Q7N2K4J08j07lJ17j10m3j41L57j91
3889F8m4r6J95j39o2L78j77r8j0j05J70O4N2N7p9J5j92l4l8K3JJ85j83O8o1n2
3915i4J84j00j38J14j42m1K51l33J24J91J24j45q1K18j27j09J20L1n7J0o3j02
$$ plain form
3744 118 169 35 -159 18 255 -98 -58 321 -21 73 -174 82 -96 -13 -163 93 181 20 88 228 12 -6
3766 -6 -163 111 153 230 19 -41 -39 34 -64 36 -45 126 -28 -116 85 -85 -28 127 -67 -61 263 215 235 85 -103
3791 -103 10 -34 11 2 62 -5 -80 14 -83 34 -213 -34 -130 -119 187 -149 -102 168 -26 -78 11 -140 -33 -5 209
3816 209 105 -108 142 101 57 -16 -16 51 -197 54 5 -39 -158 -118 128 -124 -187 -27 106 -49 -69 -188 67 -49
3840 -49 107 98 21 -26 15 -20 19 64 -101 -177 -38 -184 -31 87 -61 7 32 43 21 36 49 64 122 20 63 138 -144
3867 -144 -5 -120 170 -165 21 161 30 -43 -231 -82 5 57 81 189 82 79 196 86 43 -98 259 68
3889 68 24 -72 123 -16 -78 300 123 25 15 -90 80 144 196 253 174 189 -3 -37 -75 -52 -51 134 -49 19 -42 -94
3915 -94 90 -10 -148 -34 -176 -217 34 -299 -175 16 140 -5 -86 132 5 -104 16 47 -10 0 -63 -165
3937a65J8M5j47K95J25j03j65J05l6lJ39j47K0M8R9k15K8j58J82L5k75L35p3j89
3961b02R1K4J68J7O3j03M8k68J17R0p1K16l28j12J64J42J50j31k31L9J26J8j83
3984a56J50N6r9l6J12m4Q6j19J17l8n0j22K81k60J97m3j05K96l53J03M0J07j09
4007A1j35j49J33J05J58k79K37o2J03k0O1j89J3J19j20o7n4L01p8k35J81j62J20
4030hL7J29j21j17P1L3qn3Q1J02K5j18k5k43J07R6N5q8j03K04p8j7o4N1q1K16
4056H3j78K46K7j14j33J45j7q5K71l47J75J55q5k53j20J99J29k09J94k70J46J47
4078A06j83J72J7MRk07K17O8l66N3J13k3j85J15pQ5k11J59r5J82j97J66N7r7p3
4103a21J50j52L43n04K86J39k02J42m1j00J91k26J44m7n5J72n5O1Pp3k11K81j
$$ plain form
3937 -165 -147 -102 -249 46 171 68 -97 8 -28 -31 108 -39 -19 29 128 -87 -59 -217 -35 0 -275 60 -13 -202
3961 -202 -111 -87 81 98 161 58 106 -162 -45 45 -26 190 -138 -250 -86 56 206 75 -156 -117 9 27 -156
3984 -156 -6 50 -49 -85 27 -17 69 -50 67 29 -21 -143 138 -122 75 32 -73 223 -130 -27 13 120 11
4007 11 -124 -273 -140 -35 123 -156 81 19 122 102 163 -26 -13 106 -14 -81 -135 166 88 -147 34 -128 -8
4030 -8 29 158 37 -80 -9 24 16 -37 44 146 171 53 28 -215 -108 -12 43 -45 -148 56 -22 -39 -103 -52 -133 83
4056 83 -95 151 178 64 -69 76 59 -26 245 -102 73 228 143 -110 -230 -31 98 -111 83 -187 -41 106
4078 106 -77 95 112 116 125 -82 135 203 -163 -110 3 -20 -205 -90 -97 -12 -223 -64 -159 23 -174 -8 49 -48 -121
4103 -121 29 -123 220 -284 2 141 -61 81 40 -60 131 -95 49 2 -53 119 64 125 132 59 -152 129 128
4126A28l6p9J66j0k40K6K26k95K73j88l0J46j91Q2j04K73O5k98M3j49J16O4k9
4149d1L32q2p5j68K63j61J04j84k5J16m2O7j23l5L8j00LK27j29M6P4r1R1j2k4
4174F9o1m7n8K62m5J6j85l3K72l54J02o6J70Q5j21J24q5j31K45Rj57R1J64m94
4198b28M48j79l1J57k33O8q0n5K55J2k9j20n0P7J77j50j45J21L9n0J51j45P2j5
4222F7J54k6j54o4Q9k14K27k38r5K36p3J45j08R4j64J82J63k81K39k3l75L36j66
4245d9j55J39j12JK87j91Q2j00j28J35K43o1R5k51J18k7l4m1R1J21no6p9J68l17
4270a36o5J10K37k40K1n4o7J71j20L03k4j18k2K9J11j95L7q1K19k47J28N0MK7
4294G8k60J85k17J42L4Q6k39J38J57j3p2J28k98QL13p7O6k00K0l1m6qj8J41J8
$$ plain form
4126 128 92 13 179 169 -71 -45 181 -114 159 -29 -59 87 -104 -22 -126 147 212 -86 -43 -192 -76 -12 -41
4149 -41 291 209 134 -34 229 68 172 -12 -37 79 37 104 -19 -54 -16 -116 -113 114 -15 31 105 14 105 93 69
4174 69 8 -39 -97 165 120 136 -49 -82 190 -164 -62 -128 42 127 6 130 45 -86 159 168 11 102 266 -228
4198 -228 220 41 10 167 -66 2 -78 -133 122 134 105 -15 -65 12 189 39 -106 15 54 4 155 10 82 67
4222 67 221 195 41 -23 66 -148 79 -159 -254 -18 -91 54 -54 40 -124 58 221 -60 179 156 -219 117 -49
4245 -49 -204 -65 -177 -176 111 -80 2 -98 -226 -91 152 91 186 -65 53 26 -8 -49 42 163 158 92 13 181 -136
4270 -136 -201 -91 146 -94 -73 -127 -194 -23 -143 160 136 18 -4 25 136 -59 -22 -103 116 -131 -3 47 51 78
4294 78 -182 3 -214 -72 -38 48 -191 -53 104 91 19 147 -151 -143 170 93 159 -41 -21 -52 -98 -106 -124 17 35
4319C5o1K6r2K43k80J56k59L49K5k36l0J08m9K72k48P3k34J0J42J01L9p7K36j76
4343G3j96L80k15l9Q4J6m0k12J13R9J8q1J2N7j21o9Q1N1p9N1K1j31N2J15r3K20
4369A67Q9j83n1J42j84l6j74M72j62j68J40n0p5J47k38J40j95K09J19q2j24k1
4391a18j6jK21m2J46j83J03j62Q5k0m2N8J18j4j67J37j08o4J17j75mK1p2j8J27
4416g3M05k95o5J7j08j14L91j86k2L4N8P0o4P5j94q0J93j85j09L88oj78N8j10
4440a00r3K18J60o1q1n6n7r7J23k8k0J75kn8j03R9j68L2J77j5p4P7o4k11L02n6
4466A9n7K4O4k63K61j28J76k63J51Q0q3l4O3j21N0K59j38J88j06J5Q3j35j59J43
4490H9k65j05K97n9k8k1p4K29p7J31k42K22q0J85r1k55L97l30o4J60j97J93k15
$$ plain form
4319 35 -26 0 -92 151 -129 27 -232 117 142 -94 -124 -16 -65 207 -41 32 -202 -192 -50 51 90 13 249 73
4343 73 -123 257 42 3 87 103 63 -149 -36 63 81 0 12 69 -52 -121 -40 11 -68 -17 4 -127 -75 40 -53 167
4369 167 256 73 22 164 -20 -56 -230 242 80 -88 52 2 -73 74 -164 -24 -219 -10 109 27 -97 -118
4391 -118 -134 -135 86 44 190 7 110 -52 33 13 -29 29 147 133 -34 103 -5 -69 48 -127 -131 -110 -182 -200 -73
4416 -73 332 37 -28 -11 -119 -233 158 -28 -50 -16 42 112 48 123 -71 -151 42 -143 -252 136 130 -48 10 -100
4440 -100 -193 25 185 124 43 -13 -70 -167 -44 -72 -92 83 81 23 -80 19 -149 -117 60 45 -29 48 -16 -227 75 19
4466 19 -38 -14 50 -213 48 -80 96 -167 -16 64 -19 -53 10 -111 -61 198 60 248 142 157 240 105 -54 89
4490 89 -176 -281 16 -43 -71 -92 -166 63 -14 117 -125 97 17 202 111 -144 253 -77 -141 19 -178 15 -200
4513b00R7J42J3j44j25K3O8o7M7L65k29j36K70j51ll7K8M2o9J35J00j33J8oj31
4538h3R0j64J26Q2j14J36l1L2j89J52J35j45K10j59q3j00N7O8K5O8k20L0J09L6
4562F8k2k58K32po5P9o9q7Q3Q9J38l79Q0K37j8J49l55K10k52R4R2O0q5J12j09
4587A7j83L44j71JJ12J29j05j37K44k89L1k07M00j68o2l0M2j80Q2LM5O0j17r6
4611b35K88j60K12j14N4j07J61k84N5J65J92k69M4J51J26m67K30J8j94m5K48m9
4633B0q8N6l7N1p4j9K79j64j3M9j77J13P3O5j04J9J41j15m3o2R1j03J39j35J05
4658F7j67n0J38J85J00k79K14j87J08j92N4r5K02N6j03K5P2k62K0J13j95J37J25
4681H6k00Q2n3O1K4j5j90K84P5j43LJ51k06K5K0r0k5L5K8p1J47j64J80J99j54
$$ plain form
4513 -200 -103 39 52 -92 -217 -194 -126 -193 -146 219 -10 -146 124 -27 -30 -67 -39 3 -66 69 169 36 54 48 -83
4538 -83 7 -157 -31 51 -63 73 42 74 -115 37 172 27 237 78 -5 -105 -48 20 45 113 -107 -77 32 68
4562 68 46 -212 20 13 -52 27 -42 -129 -46 43 181 -198 -118 119 101 250 -105 105 -147 -53 39 99 14 126 17
4587 17 -166 178 7 8 120 249 144 7 251 -38 -7 -214 186 18 -44 -74 -32 -212 -130 -127 -82 -22 -139 -235
4611 -235 53 -107 105 -9 45 -62 99 -185 -130 35 227 -42 2 153 279 -188 42 60 -134 -179 69 20
4633 20 -68 -12 -49 2 -72 -91 188 24 11 60 -117 -4 69 134 30 49 190 75 32 -30 61 -42 97 -38 67
4658 67 -100 -150 -12 173 273 -6 208 21 129 -63 -9 -104 98 154 51 76 148 -114 -94 19 -176 -39 86
4681 86 -114 -32 -85 -24 0 -15 -205 79 154 11 14 165 -41 -16 4 -86 -111 -76 -48 -119 28 -136 44 243 89
4706H9m2j55J58j09K49p7N7k20Q6j2P5l9o4j31k7L09j57J34n0j08R3j15J20p1
4730gP8r7oJ63o9k22pJ06K07j58j17J06m5j2N7Kj35l8J58o9Q5m5l8MJ74n6K03
4757B22l47N6M1J39k9j77L4J33k31O0j8K36p8l8j9J18k3p0J23k5j78Q8k78J76
4781h5K04j68n5M7J55k27J15K21k10m4o1K57o7j44L6M7M6k10N2K9q8K28m3O8j43
4806d0J10p4j56J29m6Oj78J33J9L0jR8L5j71R4J1L6K37j59n9p2o3K10o4K0o8N3
4833G0o1Q0k22Q8J82j46q0K76o7m4o0p0J69j86k90K36M7mJ73j34q8R6j39K34J29
4858A89l27J84K2m8NP8k51M54n6j87J83o0j54r0K5j00J97k37J54R9j01J38k30
4881a13J98P3k48q1J35K10J8k10j57J43K31l44R2J83k66J55R5l68K21j75J40J15
$$ plain form
4706 89 47 -108 50 -59 190 113 170 -50 36 24 99 60 -4 -135 -162 147 -10 124 74 -34 59 -56 64 -7
4730 -7 71 -26 -32 131 62 -160 -167 -61 146 -12 -129 -23 -68 -80 -23 -21 -156 -194 -36 -105 -20 -65 -103 -99 75 19 222
4757 222 -125 -69 -28 111 82 -95 -61 72 -159 -99 -117 119 41 3 -16 102 79 9 132 107 -71 17 -261 -85
4781 -85 119 -49 -104 -57 98 -129 -14 207 -3 -47 -108 149 82 -62 -26 21 67 -143 -91 -62 -150 78 35 103 -40
4806 -40 70 -4 -160 -31 -77 -71 -249 -116 -97 -67 -68 30 65 -106 -12 -1 35 272 113 54 -18 -81 129 65 85 17 70
4833 70 9 89 -133 -45 137 -9 -89 187 120 76 16 -54 115 -71 -361 -125 -78 -82 91 -43 -131 -35 -174 60 189
4858 189 -138 46 68 20 25 103 -148 306 250 63 246 186 32 -58 -33 -133 64 -173 -19 80 -21 117 -113
4881 -113 85 158 -90 -171 -36 174 192 -18 -175 -32 199 -145 -53 130 -136 19 114 -254 -33 -208 -68 47
4903D7l4l5J08j5j69P8N7j9l8R5P7j59O7j57J32KK0N4j91M28m47L7N9j72K49j15
4929d1k34L37j9K0o1M7o2N4k20L9J18N8m6l9j91L18r7J35k51J51N3j0K2k1O0j90
4955g0M9K2nJ25k13m0J58j1j25J16J9o6P1j13J08q5K8j72M07j07O1k42KJ96k5
4980H8k20K92n8n9j57O4J55k58J50q4K0Q2k3J89l33P8R8k6Q4o5j93K46k3l0j1
5005FK7j96J6K19j47J2P6k60R3K06n8j27pK12O4k05j4p8L39k7j96J35l00K21j94
5030a83K85K1J60k86jm6L7k52L21M7j82J54j91J08R7o8p5K26L4j21o0p2k8QlK37
5056A67k43k4J92l51M36p9l8p3j46m7L68j93m3K25J34j14l20QJ32L7LJ59j86j84
5080a80J94j26j22L68k75K46k17Q7P5j17P2k3N6j27J37j41Q1N7j03o1q5K38j26
$$ plain form
4903 47 13 -22 86 71 -98 -20 37 18 -20 75 152 -7 60 -97 35 37 57 111 -80 348 -99 -62 -3 -175 74 -41
4929 -41 -275 62 43 63 2 49 -13 41 -179 -140 -22 36 -10 -49 -240 78 -19 116 -135 16 69 59 81 60 120 -70
4955 -70 -21 1 -4 121 -92 -132 26 15 -110 6 25 -41 30 -83 25 -60 -32 -204 203 96 157 -85 -83 113 88
4980 88 -132 160 102 43 -114 -50 105 -153 -3 -87 -67 15 -8 181 -152 -74 24 -2 82 17 -176 70 47 17 6
5005 6 33 -163 -147 72 -75 -63 13 -247 -154 52 -6 -133 -140 72 136 -69 -83 -161 178 151 -45 90 -210 11 -183
5030 -183 102 123 283 -3 -4 -50 -13 -265 56 103 -79 75 -116 -8 89 21 -54 172 206 85 25 -47 -75 -67 -70 167
5056 167 -76 -100 92 -259 177 98 60 -13 -159 -206 162 -31 -74 151 285 171 -149 -141 -9 28 31 190 4 -180
5080 -180 14 -112 -234 134 -141 105 -112 -25 50 -67 5 -18 38 -89 48 -93 -12 45 -58 -119 -204 34 -92
5103i2J6j15L31l05J29J87N4j70J26j14J08O1k02p1J32j09P0l1n0O3N4j70J37
5126C9j21K21j67o0PJ21k75K79r2p8J40J19j19qo3K93j92R3j35k86J55N1mqK58
5151A68k57M1M9q3qJ16p8j0J84M7j26p4M5r6O7m2N0R3L6N0n9J26J3n01K90M8R7
5178A86j46j47J16K1m7n0K33l13L02k16r7J67l1m1j00J24K7p3J2J84l0l75J91
5201a03J31k6l3K4j6P3q9p3J5K75k02Q5j8Q7j59L0J83j88j8j7J61j68J49J9j35
5226a3j96J67L3Qn1NK03j17K5J5k2l59K91J00r4j0L8J27j43j0N6J8j47J31%Q9
5252A44j75K06j4o3j56K58k69p7J46K50l63K75j07O8k6k7p7J00q7M5M8k81L77
5275A95k5l15m2K80k15j6J17K1m4m3O0mJ09j29P0J0L5L47l69m8j22K91j74m1J22
$$ plain form
5103 -92 -76 -191 140 -165 -36 151 205 35 161 47 155 216 14 -57 75 -34 36 5 -45 18 72 -98 39
5126 39 -82 139 -28 -88 -81 40 -235 44 -48 -126 14 133 14 6 -57 236 44 137 2 -284 -129 -78 -82 -90 168
5151 168 -89 -48 1 -82 -90 26 -52 -62 122 169 43 -31 14 -82 -15 -57 -7 86 122 172 113 239 252 -249 41 89 186
5178 186 40 -107 9 30 -17 -67 166 -147 155 -61 -158 9 -22 -63 -163 -39 -12 -85 -73 111 81 -294 -103
5201 -103 28 2 -31 -7 -23 50 -39 -112 -97 178 -24 61 43 130 -29 1 184 -4 -22 -39 122 -46 103 122 -13
5226 -13 -209 -42 -9 -1 -52 -47 156 39 64 79 57 -302 -11 89 -5 -15 23 150 7 -3 53 71 -76 55 55 144
5252 144 -31 175 161 98 -58 200 -69 -146 0 250 -113 162 55 123 97 70 -7 93 6 51 99 -182 195
5275 195 170 -145 -187 93 -122 -138 -21 0 -44 -87 -27 -31 78 -51 19 29 64 411 42 -6 -128 163 -11 -52 70
5300G0m6n4J01l0M3j56K33j35q9J61J7Ok31J87j86L06l59J85K7N6k08Q2Oq0J27
5325C3p1J23j72j43K34j46J94J32k39L51l07PJ67M9l35J71j06J5J95q7j63N9J4
5348b5k2P1j54p7J79Q6q1Pk07K49K1k8j6M5j53K4O9J10m8k98K80j79J91n0j5O5
5374D4M8k8j96K12L8k05P1J13J4p1k2J05n3k60J29J49j79J05r9L4J27q3l6L2J72
5399A61k69jK34k2r9Q7j16o3K01k01Q3R0R2r0k6J01j56k2M7r2K7k67J37N4J55
5424D5j73P7K37k13P5j33J37n9K92l05k4k2O5J8j07P1n8K81l04n3J15J32j28p5
5448a09Q1K7m5j5R3M0j87K02K7n5j35J5Q2M4l8N8j49J6m6j7K07j83oJ3K60k0j76
5475a6MJ43q2O7l4l13L44J05k81J02j80K91k55n6K79k40J36rj71J36J72q6k56
$$ plain form
5300 70 24 -30 71 41 84 -72 161 26 -63 98 115 121 -110 77 -109 197 -162 23 50 106 -102 -20 -14 -94 33
5325 33 -38 85 -87 -230 4 -142 52 184 -55 296 -11 -4 163 212 -123 48 -58 -43 152 65 -98 -39 -25
5348 -25 -47 24 -130 -207 -28 58 -23 -16 -223 26 47 19 3 48 -105 -81 -12 98 50 -248 32 -147 44 -6 -21 44
5374 44 92 64 -132 80 118 -87 -16 97 111 40 18 123 70 -190 -61 88 -91 14 -85 -51 76 -7 -43 -11 161
5399 161 -108 -109 125 103 4 91 -25 -88 113 -88 -5 85 177 87 61 162 6 -16 31 -61 -34 -301 -164 -110 45
5424 45 -128 -51 186 -27 48 -85 52 -7 285 -20 -44 -66 -1 17 -90 -19 -77 204 -100 -153 -38 94 -34 -109
5448 -109 -28 -1 -46 -61 32 72 -115 87 114 59 -76 -61 21 65 27 85 -64 -48 -94 -111 96 -87 -93 -80 180 160 -16
5475 -16 -12 131 49 116 82 -231 113 218 -63 39 -141 150 -105 -161 118 -122 14 5 -166 -30 142 56 -200
5498b00L25k47J44O9o7j72P1j02L00j46j05L50l27j82K86q4J50q4k3j47K97Pn1
5521F2R7r8j60L56j43k27O8Q9j26O0m6K75k73LNj05K01q7n9J66q9J37J31j23j57
5546d3J72j66J40P8j94r3j70L34j00J93j7k03M9j27R8L0M9J20j65oMj25L12k34
5570f4r6J02J47k18J33Mo7J05j28K46l10K94r0j9K4j72j70L06n8J38l24K13J90
5593A86j78l5J2p6P9J83J0k40Q9K2J76l43K87l09J36Q6j65J5K69p4m04L37m3K0
5617D0N7Rk55L9K19j1k46J72R6n5K8Nj79K6K28k94J46l0JNM0O2l05N1n0L18j38
5644b1o4j43L06k37J05P6j40N1M0n2J32J39j57q0l2O1n1j67K21o6O2M4n4o7P1
5669b3K19k34Q7l3Q8j58J64j20K15N7l41p7Q7J46k17J08j01N9K34j74J42k32N6
$$ plain form
5498 -200 125 -122 22 91 24 -148 -77 -179 121 -25 -130 220 -107 -289 -3 -87 63 -21 -44 -191 106 113 62
5521 62 159 61 -99 257 114 -113 -45 44 -82 -22 -68 207 -66 -63 -58 -163 38 -49 -108 58 -31 106 237 114 -43
5546 -43 129 -37 103 181 -13 -106 -276 58 -42 151 134 -69 -20 -147 -49 -19 30 150 -15 -21 -17 -142 170 -64
5570 -64 -160 -58 89 -129 4 8 -59 46 -82 164 -146 148 58 39 63 -109 -279 27 -31 107 -217 -4 186
5593 186 8 -27 -15 -91 -12 171 181 -59 30 52 228 -115 172 -137 -1 85 -80 -65 204 130 -274 63 20 40
5617 40 97 106 -149 -110 109 98 -148 24 120 65 93 98 -81 -55 173 -121 25 -5 -4 1 41 103 -202 -151 -201 117 -21
5644 -21 -85 -228 78 -159 -54 22 -118 -67 -27 -79 53 192 35 -45 -77 -16 -67 -234 -13 -79 -17 27 -27 -94 -23
5669 -23 196 -38 49 16 104 -54 110 -10 205 262 -79 -156 -69 77 -140 -32 -133 -74 160 -14 128 -104 -48
5692d8m9K13q4M3r8J45m2Q1j71o5n6J91j50p2K75j42J92k50K72l06K19k30J67
5715C5M8Q0k43J52R4j02l5p2K6K79l70L08j86LK2j94K37j35J70k6p0p5Q1P5n1
5740E1n6K20j36j45K08j19j01j09J38J23r9j7k02J98J4p7J20l6n0K5q6P9q2Q4
5764e5J35L6j12o8J27l5Qk24L07j63K12j78J2K05p0N7j98km3K7J28o3l7j88J92
5789A0P9J33k45M1j49J33n3%mJ08J04k05n2Q6Or7J57mJ16j39O2j32J37L7j12j2
5815EJ39j16J35n34L46J27j67JN4N8Q5j45O2j39q9L39l4j88L9O4M0j76J00pn0
5840e1k1N8J51k46J27R1l6r2r2J10J23jk65J41q8j16L93m9r0o3m0J23j23R0k38
5865b04J69R1J0m7j32J53r5R0M5q8O1M2Q8p4q4j31J78j74L0J36j84J86j03l5J73
$$ plain form
5692 -48 -97 116 32 75 -23 122 80 161 -10 -75 -131 60 -90 -162 113 -29 163 -87 185 -121 98 -132 35
5715 35 83 163 -80 72 166 64 29 -43 -17 262 -108 200 14 17 39 -155 82 -53 117 91 21 -54 27 102 51
5740 51 -5 215 79 -66 142 23 -78 -187 -49 74 -25 -42 -244 -46 -32 -109 11 -25 -75 -50 -136 -57 -139 -55
5764 -55 80 116 4 -64 63 28 36 -188 119 -44 168 -10 2 207 137 194 -4 -6 -49 -22 106 43 6 -182 10
5789 10 89 222 -23 18 -131 2 -51 -51 -55 53 157 -48 -100 -14 -8 -105 52 48 164 25 87 -45 92 129 17 5
5815 5 144 28 163 -371 -25 102 -65 -64 -10 48 133 -12 50 -89 -178 161 127 -61 -22 42 82 -94 6 -1 -51
5840 -51 -72 -14 137 -109 18 109 73 -19 -111 -1 122 121 -144 -3 -91 -207 186 137 47 -16 -56 67 -56 34 -204
5865 -204 -35 56 66 19 -113 40 -55 35 80 -8 53 95 183 109 25 -106 72 -102 -72 64 -120 66 -37 -72 101
5890A01j04K06j74l6o6J52l4j2O4k07J76j51j33o3J83J19J29l98L16k68L46j80
5912c4k06M53l91J82m6r2r0K47j65K59k27o1J77J45N6m37K65R2m1O0k98n6L28
5935A20l2L6k92L09n9n7j7J31k89J35k15K55J46l50K07q3j89J58J35j46J55k29
5957a71J79P4k04J22j98J64Q0J9K6M1j74n7K32j78J2l2R0PJ33Q4k65j90qJ83K5
5982fj21j5N4L8%K9Q9k19K74J5j31o3o0K6l3l6R6j10K31j03J14j44J11j4k22J51
6008d9M4o9J39K5q3Rk33L14o1j23j76K32J31j56N6j02L91m09J21J56j80O9p9P7
6032D4j22R4M2j09k0j6R6K9j53R9J12j64l5O2P6j5r2J26p0L9K8o1Q0M3j0j11R4
6059H6j2m8j21J09j15K0J16j83N7P1n9J7K30j69L8j14j03L17J41j89J36l39J58
$$ plain form
5890 101 -3 203 29 -7 -73 79 45 33 97 -110 66 -85 -218 -281 -98 21 150 -248 68 -200 146 -34
5912 -34 -240 213 -178 4 -42 -134 -224 23 -142 117 -110 -171 6 151 207 -230 35 127 86 146 -152 -208 120
5935 120 88 124 -168 141 82 25 8 139 -150 -15 -230 25 171 -179 28 -55 -244 -86 49 -97 58 -171
5957 -171 8 82 -122 0 -198 -34 46 65 91 132 -42 -99 133 -45 -33 -65 25 32 165 249 -16 -206 -214 -31 -6
5982 -6 -127 -142 -88 -50 -50 -21 68 -151 123 138 7 -56 -116 -90 -123 -159 -63 -173 58 -45 69 -75 36 22 -200 -49
6008 -49 -5 -74 65 90 7 16 -217 97 36 -87 -263 -31 100 -56 0 -102 289 -120 1 157 -23 46 -33 44
6032 44 -78 16 58 -51 -71 -87 9 38 -115 -16 96 -68 -103 -41 35 20 -72 54 -16 23 51 -10 70 113 103 -8 86
6059 86 74 26 -95 14 -101 -81 35 -148 -91 -20 -79 -62 168 -1 37 -77 -180 137 278 89 225 -114 44
6082D4N9Jl7n3p6j76K47Q7L8l68K61L7M7j00n2j7L16l65O8n8K71j53o1K3k4n2
$$ plain form
6082 44 103 104 67 14 -62 -238 9 96 134 -234 27 64 111 11 -41 -58 258 -107 -39 -97 174 21 -40 -17 -41 -93
$$ [...]
8191F8
##END NTUPLES=NMR FID
##END=
