##TITLE=1H_Pr 5037-2M
 CDCl3
 8 sc, 
 4.05.2022
##JCAMPDX= 6.0         $$ Bruker NMR JCAMP-DX V2.0
##DATA TYPE= NMR FID
##DATA CLASS= NTUPLES
##ORIGIN= UXNMR, Bruker Analytische Messtechnik GmbH
##OWNER= root
$$ XWIN-NMR		Version 3.5
$$ Wed May  4 14:32:35 2022 Russian Standard Time (UT+4h)  she@DPX200
##.OBSERVE FREQUENCY= 200.13135
##.OBSERVE NUCLEUS= ^1H
##.DELAY= (6, 6)
##.ACQUISITION MODE= SIMULTANEOUS
##.ACQUISITION SCHEME= undefined
##.AVERAGES= 8
##.DIGITISER RES= 18
##SPECTROMETER/DATA SYSTEM= spect
##.PULSE SEQUENCE= zg30
##.SOLVENT NAME= CDCl3
##.SHIFT REFERENCE= (INTERNAL, CDCl3, 0, 15.7039)
##AUDIT TRAIL= $$ (NUMBER, WHEN, WHO, WHERE, WHAT)
$$ ##TITLE= Audit trail, XWIN-NMR		Version 3.5
$$ ##JCAMPDX= 5.01
$$ ##ORIGIN= Bruker BioSpin GmbH
$$ ##OWNER= she
$$ F:/spectra/data/she/nmr/H-F/1/audita.txt
$$ ##AUDIT TRAIL=  $$ (NUMBER, WHEN, WHO, WHERE, WHAT)
(   1,<2022-05-04 14:31:29.45 +0400>,<she>,<DPX200>,
      <created by zg, POWCHK disabled, PULCHK disabled
       configuration hash MD5:
       00 E9 B6 7A A2 85 ED C7 34 08 36 98 17 FE 4E 26
       data hash MD5: 16K
       76 CC FA C6 40 02 91 C2 D7 72 7C E1 83 63 53 8C>)
$$ ##END=
$$ 
$$ hash MD5
$$ 75 C5 70 B8 8C 12 6F 43 67 B2 C3 D3 04 45 FE C7
##$RELAX= 
##$RELAX= 
##$RELAX= 
##$RELAX= 
##$RELAX= 
##$RELAX= 
$$ Bruker specific parameters
$$ --------------------------
##$DU= <F:/spectra>
##$EXPNO= 1
##$NAME= <H-F>
##$PROCNO= 1
##$TYPE= <nmr>
##$USER= <she>
##$AMP= (0..31)
100 100 100 100 100 100 100 100 100 100 100 100 100 100 100 100 100 100 
100 100 100 100 100 100 100 100 100 100 100 100 100 100 
##$AQSEQ= 0
##$AQ_mod= 1
##$AUNM= <au_zg>
##$AUTOPOS= <>
##$BF1= 200.13
##$BF2= 200.13
##$BF3= 200.13
##$BF4= 200.13
##$BF5= 200.13
##$BF6= 200.13
##$BF7= 200.13
##$BF8= 200.13
##$BYTORDA= 1
##$CFDGTYP= 0
##$CFRGTYP= 5
##$CHEMSTR= <none>
##$CNST= (0..31)
1 1 145 1 1 1 1 1 1 1 1 1 1 1 1 1 1 1 1 1 1 1 1 1 1 1 1 1 1 1 1 1 
##$CPDPRG= <>
##$CPDPRG1= <>
##$CPDPRG2= <>
##$CPDPRG3= <>
##$CPDPRG4= <mlev>
##$CPDPRG5= <mlev>
##$CPDPRG6= <mlev>
##$CPDPRG7= <mlev>
##$CPDPRG8= <mlev>
##$CPDPRGB= <>
##$CPDPRGT= <>
##$D= (0..31)
0 1.2 0 0 0 0 0 0 0 0.06 0 0.03 0 0 0 0 0.0002 0 0 0 0 0 0 0 0 0 0 0 0 
0 0 0 
##$DATE= 1651660288
##$DBL= (0..7)
120 120 120 120 120 120 120 120 
##$DBP= (0..7)
150 150 150 150 150 150 150 150 
##$DBP07= 0
##$DBPNAM0= <>
##$DBPNAM1= <>
##$DBPNAM2= <>
##$DBPNAM3= <>
##$DBPNAM4= <>
##$DBPNAM5= <>
##$DBPNAM6= <>
##$DBPNAM7= <>
##$DBPOAL= (0..7)
0.5 0.5 0.5 0.5 0.5 0.5 0.5 0.5 
##$DBPOFFS= (0..7)
0 0 0 0 0 0 0 0 
##$DE= 6
##$DECBNUC= <off>
##$DECIM= 32
##$DECNUC= <off>
##$DECSTAT= 4
##$DIGMOD= 1
##$DIGTYP= 9
##$DL= (0..7)
0 120 120 120 120 120 120 120 
##$DP= (0..7)
150 150 150 150 150 150 150 150 
##$DP07= 0
##$DPNAME0= <>
##$DPNAME1= <>
##$DPNAME2= <>
##$DPNAME3= <>
##$DPNAME4= <>
##$DPNAME5= <>
##$DPNAME6= <>
##$DPNAME7= <>
##$DPOAL= (0..7)
0.5 0.5 0.5 0.5 0.5 0.5 0.5 0.5 
##$DPOFFS= (0..7)
0 0 0 0 0 0 0 0 
##$DQDMODE= 0
##$DR= 18
##$DS= 0
##$DSLIST= <SSSSSSSSSSSSSSS>
$$ [...]
##$SUBNAM2= <"">
##$SUBNAM3= <"">
##$SUBNAM4= <"">
##$SUBNAM5= <"">
##$SUBNAM6= <"">
##$SUBNAM7= <"">
##$SUBNAM8= <"">
##$SUBNAM9= <"">
##$SW= 18.05172834244
##$SWIBOX= (0..15)
0 0 2 0 0 0 0 0 0 0 0 0 0 0 0 0 
##$SW_h= 3612.71676300578
##$TD= 16384
##$TD0= 1
##$TE= 0
##$TE2= 300
##$TE3= 300
##$TEG= 300
##$TL= (0..7)
0 120 120 120 120 120 120 120 
##$TP= (0..7)
150 150 150 150 150 150 150 150 
##$TP07= 0
##$TPNAME0= <>
##$TPNAME1= <>
##$TPNAME2= <>
##$TPNAME3= <>
##$TPNAME4= <>
##$TPNAME5= <>
##$TPNAME6= <>
##$TPNAME7= <>
##$TPOAL= (0..7)
0.5 0.5 0.5 0.5 0.5 0.5 0.5 0.5 
##$TPOFFS= (0..7)
0 0 0 0 0 0 0 0 
##$TUNHIN= 0
##$TUNHOUT= 0
##$TUNXOUT= 0
##$USERA1= <user>
##$USERA2= <user>
##$USERA3= <user>
##$USERA4= <user>
##$USERA5= <user>
##$V9= 5
##$VALIST= <valist>
##$VCLIST= <CCCCCCCCCCCCCCC>
##$VD= 0
##$VDLIST= <DDDDDDDDDDDDDDD>
##$VPLIST= <PPPPPPPPPPPPPPP>
##$VTLIST= <TTTTTTTTTTTTTTT>
##$WBST= 1024
##$WBSW= 4
##$XGAIN= (0..3)
0 0 0 0 
##$XL= 0
##$YL= 0
##$YMAX_a= 217730
##$YMIN_a= -274075
##$ZGOPTNS= <>
##$ZL1= 120
##$ZL2= 120
##$ZL3= 120
##$ZL4= 120
##$ABSF1= 10
##$ABSF2= 0
##$ABSG= 5
##$ABSL= 3
##$ALPHA= 0
##$AQORDER= 0
##$ASSFAC= 0
##$ASSFACI= 0
##$ASSFACX= 0
##$ASSWID= 0
##$AUNMP= <proc_1d>
##$AZFE= 0.1
##$AZFW= 0.1
##$BCFW= 1
##$BC_mod= 2
##$BYTORDP= 1
##$COROFFS= 0
##$CY= 11.3945322036743
##$DATMOD= 1
##$DC= 2
##$DFILT= <>
##$DTYPP= 0
##$F1P= 2.36226072786647
##$F2P= -0.459571619588291
##$FCOR= 0.5
##$FTSIZE= 0
##$FT_mod= 4
##$GAMMA= 1
##$GB= 0.15
##$INTBC= 1
##$INTSCL= 1
##$ISEN= 128
##$LB= 0.24
##$LEV0= 0
##$LPBIN= 0
##$MAXI= 10000
##$MC2= 0
##$MEAN= 0
##$ME_mod= 0
##$MI= 1.114404
##$NCOEF= 0
##$NC_proc= 0
##$NLEV= 6
##$NOISF1= 3.799351
##$NOISF2= 2.8
##$NSP= 1
##$NTH_PI= 0
##$NZP= 0
##$OFFSET= 15.70392
##$PC= 1
##$PHC0= -18399.62
##$PHC1= 17.80075
##$PH_mod= 1
##$PKNL= yes
##$PPARMOD= 0
##$PSCAL= 0
##$PSIGN= 0
##$REVERSE= no
##$SF= 200.130013532006
##$SI= 16384
##$SIGF1= 3
##$SIGF2= 2
##$SINO= 400
##$SIOLD= 16384
##$SREGLST= <1H.CDCl3>
##$SSB= 0
##$STSI= 0
##$STSR= 0
##$SW_p= 3612.71676300578
##$SYMM= 0
##$S_DEV= 0
##$TDeff= 0
##$TDoff= 0
##$TI= <>
##$TILT= no
##$TM1= 0
##$TM2= 0
##$TOPLEV= 0
##$USERP1= <user>
##$USERP2= <user>
##$USERP3= <user>
##$USERP4= <user>
##$USERP5= <user>
##$WDW= 1
##$XDIM= 8192
##$YMAX_p= 0
##$YMIN_p= 0
$$ End of Bruker specific parameters
$$ ---------------------------------
##NTUPLES= NMR FID
##VAR_NAME=  TIME,          FID/REAL,        FID/IMAG
##SYMBOL=    X,             R,               I
##VAR_TYPE=  INDEPENDENT,   DEPENDENT,       DEPENDENT
##VAR_FORM=  AFFN,          ASDF,            ASDF
##VAR_DIM=   8192,          8192,            8192
##UNITS=     SECONDS,       ARBITRARY UNITS, ARBITRARY UNITS
##FACTOR=    0.0002768,     1,               1
##FIRST=     0,             0,               0
##LAST=      2.2672688,     0,               0
##MIN=       0,             -274075,         0
##MAX=       2.2672688,     217730,          0
$$ Real data points
##PAGE= N=1
##DATA TABLE= (X++(R..R)), XYDATA
0 0 0 0 0 0 0 0 0 0 0 0 0 8 -8 8 -8 8 -16 16 -19 24 -32 32 -40 48 -56 64 -80 88 -104 120 -136 155 -176 200
34 200 -227 254 -286 323 -360 401 -445 497 -551 609 -673 744 -822 907 -998 1100 -1212 1336
52 1336 -1472 1624 -1793 1985 -2203 2453 -2743 3083 -3491 3991 -4616 5429 -6531 8118 -10607
67 -10607 15111 -25812 109934 -34514 -263185 23731 180311 18036 -124968 14423 85908
78 85908 -2276 -61525 -15330 -2798 30272 69584 1900 -124364 -60890 103990 84631 -73240
90 -73240 -70782 38166 32204 -43310 -18505 35032 18276 -5768 1356 -31742 -41272 48337 92897
103 92897 -17909 -96331 -5796 78156 14699 -41522 7794 32728 -15001 -27265 2123 5769
115 5769 10568 31046 -8431 -71229 -20753 71329 26879 -62464 -17364 50231 -15690 -66307
127 -66307 31417 81644 -31944 -78035 34315 63304 -45051 -47776 71870 60137 -71399
138 -71399 -64817 57547 61946 -28058 -32068 18615 6334 -20662 4409 14862 -10600 -1125 16174
151 16174 -23665 -42244 22699 54541 -16861 -57480 5627 37840 -13937 -24336 26712 23544
163 23544 -28438 -21825 23080 15944 -9306 8780 15490 -17840 -18672 21000 22696 -10369 -8442
176 -8442 10777 -6778 -19596 10947 21314 -10080 -17215 4694 -2188 -18321 8403 26941 -14316
189 -14316 -34298 12232 27243 -20866 -24224 34274 30937 -38552 -36673 36528 42033 -19619 -28505
202 -28505 16087 21164 -10718 -11139 9508 9769 2645 -2090 -16315 -14016 19080 26355 -17427 -36380
216 -36380 7437 28583 -10692 -26716 10107 21309 -12875 -21926 7005 13874 -1895 1490 6065
229 6065 -10686 -10755 17222 20377 -9668 -15176 11308 13154 -9563 -7115 11665 8313 -5906 -6960
243 -6960 -3687 -3391 5893 12436 -8555 -23082 965 18737 -3330 -19892 3320 18025 -7885
256 -7885 -20629 5525 18327 -142 -9683 1613 4129 -2986 3389 11524 276 -7616 3148
269 3148 6323 -3459 -2365 8285 4053 -9274 -4942 4211 -928 -3276 4165 182 -12560 -6630
283 -6630 9891 4601 -12216 -4599 10560 12 -13203 -792 14511 4799 -9643 -3101 6685
296 6685 3515 946 3556 1059 -1517 1685 2920 -2280 -1051 7651 2766 -10466 -6437 6716 4115
311 4115 -7034 -4794 2970 -1697 -7899 96 5276 -1817 -4651 728 1371 -3459 54 7600 2698
326 2698 -5396 -981 5517 2789 -200 2388 3152 -1130 -1459 2765 1396 -1143 1899 1121 -4810 -4738
342 -4738 2661 3713 -4411 -5252 1111 99 -4894 -2194 3431 1386 -4442 -2205 2307 879 297 2703
358 2703 1579 -1062 266 3005 2300 121 2339 3041 -1336 -2010 1770 3387 117 -1754 -752 -1098
374 -1098 -1979 42 105 -2949 -2911 40 -298 -4031 -2532 3285 2710 -3689 -4137 1504 4622 2361 -2188
391 -2188 -1313 2483 4227 1468 -2326 -150 5798 3876 -3548 -5008 2941 7110 -278 -7119 -2475
406 -2475 3709 1688 -3509 -4258 82 928 -1040 -3260 -3198 492 3447 610 -3825 -3049 2889 5615
422 5615 664 -3220 428 4203 2841 -760 -796 2450 2627 20 -1144 -512 287 1169 782 -1083 -3818
439 -3818 -2689 1517 2241 -2834 -5627 -1144 3612 270 -4822 -2911 2756 3172 -892 -3275 -540 2939
455 2939 4688 1873 -3797 -3372 5469 8858 -585 -9247 -556 11854 4580 -10897 -7602 8672 10117
470 10117 -7143 -13443 867 9951 804 -9279 -5962 3050 4609 -832 -5462 -3908 2658 6956
484 6956 24 -7990 -3072 9485 9112 -5837 -9307 5185 12111 798 -9512 -1551 9193 4145
498 4145 -5916 -4259 3555 3300 -1547 -3419 -1622 -1225 -68 1692 -1305 -4997 -1905 3717 2070
513 2070 -4824 -3590 4539 3719 -3602 -2383 4584 3291 -2784 -303 5601 1015 -5591 1589 9609
528 9609 795 -10571 -1702 12007 3433 -12189 -5930 9492 5911 -8753 -8894 4004 6094 -2715
542 -2715 -5329 -2150 694 2665 2253 -2682 -5949 1922 9816 1417 -9873 -2825 11299 7760 -8318
557 -8318 -8258 7172 10877 -2282 -9137 -327 7439 2942 -5363 -4235 1210 2599 166 -3390 -3997
572 -3997 -598 2964 1913 -4568 -5804 2326 6411 -595 -7304 -743 8022 2865 -6404 -1581 7397
587 7397 3630 -4984 -1702 6285 2349 -4929 -320 6154 279 -6504 -392 6568 -211 -7780 -1936
602 -1936 5090 647 -5016 -2647 1809 990 -1199 -705 -1510 -1466 3314 3435 -2905 -4395 3673 7581 -590
619 -590 -6656 446 7906 2850 -4899 -3343 4117 4991 -946 -4433 -1616 2917 2879 -2257 -4872 -1188
635 -1188 3002 1689 -3783 -4633 664 4205 478 -4693 -3253 3649 5448 -1782 -5780 932 7213
650 7213 2516 -5346 -1964 5586 4019 -2684 -2848 2512 3137 -1245 -1627 -172 69 -235 101 -583 -2069
667 -2069 -1389 1183 32 -2794 -1206 1158 257 -1237 -578 658 171 42 1375 326 -680 881
683 881 2453 663 -1038 305 2730 558 -1233 27 1254 43 -931 -376 89 -708 -666 -260 -1096
700 -1096 -1363 -234 -395 -664 -992 -634 69 -268 19 1 87 493 1490 521 -611 895 1913 951 -556
719 -556 518 2116 486 -984 -114 1312 96 -1613 -872 490 -77 -1055 -1341 -579 4 -623 -1034 -1026
737 -1026 -469 690 -479 -1204 459 1688 502 -811 198 1456 1088 -273 539 1146 508 140 166
754 166 690 133 -272 310 -115 -956 -594 -294 -226 -814 -1146 -724 -376 -196 -477 -1076 -232 490 -228 -541 -126
775 -126 1077 1044 130 -205 1315 1414 371 223 327 868 218 109 259 -530 -90 448 -204 -1186 -645 149
795 149 -110 -1446 -730 -346 70 -595 -655 -318 -50 440 62 -336 38 1352 951 -367 -168 1439 1349 108
815 108 -540 704 1703 -3 -552 -37 633 149 -718 -677 -341 -32 -282 -981 -1272 -195 70 -877 -1244 -152
835 -152 879 -93 -1032 -27 962 405 -40 356 706 475 465 1025 266 57 786 576 -66 -237 339 743
855 743 -476 -955 -294 -287 -545 -593 -832 -576 -479 -211 -385 -1118 -289 634 242 -429 203 662 582 296 654 576
877 576 184 585 1091 111 -545 276 1357 108 -1492 -79 987 -4 -1138 -809 10 -206 -621 -374
895 -374 -1026 -924 664 380 -1288 -994 620 1150 -567 -906 790 1156 137 -104 67 530 752 793 75
914 75 -457 63 1232 -92 -978 -24 702 -439 -921 11 -25 -1343 -573 391 -946 -1772 104 1629 -292
933 -292 -2145 -18 2022 111 -1219 228 1187 282 -1 994 383 -611 893 1989 -581 -1936 698
950 698 2294 -322 -2690 -324 1691 -77 -2098 -1142 353 285 -591 -1417 -780 201 1241 -84 -1451
967 -1451 -372 1417 1197 -638 -819 847 1516 819 -70 -720 590 2061 663 -1873 -977 1870 1201
984 1201 -2227 -1562 1579 718 -1962 -1390 938 -113 -1790 78 1441 -1136 -1713 1425 1968 -1519
1000 -1519 -1735 1960 2360 -1437 -1267 2376 1556 -1603 105 2088 250 -1663 780 2138 -965 -2179
1016 -2179 1254 2088 -1687 -2654 470 1758 -1136 -2096 -296 708 119 -494 -410 -347 279 1036 208 -1186
1034 -1186 248 1518 577 -214 -388 599 1220 699 -379 -789 389 2109 -228 -2607 -594 2180 595
1051 595 -3122 -1075 2165 157 -2571 -731 1180 -845 -1624 556 914 -1564 -881 2134 617 -2315
1067 -2315 -163 3258 596 -2429 114 2997 50 -2073 762 2223 -611 -1743 1020 1279 -2013
1082 -2013 -1083 1381 194 -1603 -463 880 -262 -1401 -267 544 -664 -417 808 309 -884 427
1098 427 1018 256 -486 503 1045 28 7 702 207 370 770 393 -1250 -531 1348 227 -2002 -480
1116 -480 1364 -221 -2175 -456 1332 -417 -1715 375 953 -883 -683 1002 217 -1156 86 1857
1132 1857 -71 -1425 971 2072 -653 -1094 1341 1448 -1177 -901 1317 601 -1384 -367 818 -514
1148 -514 -1514 145 605 -1247 -1280 772 197 -1410 -652 1197 180 -1322 232 1366 -222 -687 836
1165 836 821 -421 -106 977 315 -655 593 1231 -522 -820 948 511 -1051 -713 871 181 -1430 -348
1183 -348 770 -601 -1289 135 744 -1105 -762 784 18 -841 73 1307 -59 -796 565 1120 -355
1200 -355 -248 1255 619 -694 -122 1240 220 -940 550 1033 -521 -1039 412 643 -1197 -1121 750
1217 750 304 -1099 -206 798 -328 -1062 486 725 -585 -505 956 1039 -507 80 1248 221 -444 502
1235 502 904 -329 -471 630 597 -982 -356 982 -96 -940 -205 310 -446 -1148 -22 544 -878 -464
1253 -464 470 153 -922 -156 857 -12 -777 663 726 -395 -180 683 368 -549 115 1207 333 -783
1271 -783 662 644 -591 -906 504 4 -732 -693 400 -11 -813 -224 501 -121 -621 137 321 -433 -293
1290 -293 713 228 -469 43 1028 0 -682 630 976 3 -280 547 564 -408 -108 747 -231 -1028 -199
1309 -199 615 -628 -1129 -7 315 -611 -481 447 -85 -611 10 604 -127 -282 137 413 155 -184 728
1328 728 388 -225 247 463 405 -134 250 469 -420 -482 519 144 -614 -375 137 -225 -731 -281 363 -381
1348 -381 -484 113 198 -565 -180 340 74 -103 120 838 -49 158 410 659 -303 -199 487 553 -203 -137 401
1369 401 107 -354 -322 149 -256 -312 -236 -269 -203 -393 -50 -346 -483 -345 102 -66 -471 190 382 61 220 142
1391 142 78 436 517 307 275 -98 249 146 -97 -84 185 41 -16 174 -120 -44 -398 -265 -249 -232 -384 181 -23
1414 -23 -329 -383 212 230 -404 17 399 268 -102 74 436 223 129 275 521 243 -236 51 347 -220 -481
1435 -481 61 5 -248 -369 99 0 -272 -492 -238 43 -137 -379 -231 -24 83 -227 -206 -105 -201 29 404
1456 404 519 104 -167 518 307 0 206 199 85 -417 -647 105 286 -591 -532 -10 9 -250 -480 -34 -11 -177
1478 -177 -111 64 64 -184 -353 747 321 -85 38 385 169 -129 37 525 394 -214 -189 548 -94 -622 19
1499 19 653 13 -455 15 409 -462 -515 -325 18 -362 -818 25 454 -50 -358 294 280 -31 -22 303 254 -263
1521 -263 102 838 470 -109 -154 689 310 -368 -400 398 74 -458 -297 373 61 -342 -356 -34 137 -227 -143
1542 -143 78 -88 -331 -118 394 195 -142 244 549 403 -457 180 574 96 -466 80 415 144 -356 -385
1562 -385 491 -59 -492 80 83 -350 -461 240 101 -332 -367 120 227 -281 -43 514 422 -330 -25 467 237
1583 237 -65 184 332 12 -135 149 253 39 -24 -41 195 -152 -287 -5 294 -44 -495 -176 -257 14 -314
1604 -314 -207 -117 -62 -108 33 95 142 -90 16 204 100 -1 210 130 220 56 200 378 -99 -53 250 184 -107
1627 -107 -296 28 370 -124 -232 150 -97 -196 -361 -63 -212 -455 -97 -58 -12 -170 239 101 -71 -54 292
1648 292 352 218 -4 210 260 -151 -55 147 282 -321 -68 80 -33 -183 86 -136 -139 -329 -143 -339 -285 -38
1670 -38 1 22 -28 -52 -396 58 189 242 -69 93 442 255 35 182 261 135 -134 35 351 -31 -108 -24 96
1693 96 -50 -482 -75 -6 -201 -316 -23 -97 -232 -86 266 48 -128 -142 215 -51 -107 239 256 35 -294 172
1715 172 345 216 191 291 86 -117 -22 93 80 -330 -1 316 -199 -190 69 -65 -146 -160 60 -143 -19 54 -301
1738 -301 -363 135 31 -68 -10 280 124 50 -177 270 285 -34 208 270 312 -173 -31 234 -13 -100 -172 -230 -446
1761 -446 -354 -103 -17 -277 3 309 -112 -204 -249 264 75 43 -36 24 266 297 326 36 183 42 19 50 32 -67
1785 -67 -4 132 17 -62 -7 70 -59 -453 -171 -133 -202 -83 -235 -173 -387 -9 -342 81 32 215 8 200 136
1808 136 10 -72 433 210 -61 2 176 62 132 -39 -77 14 -18 -269 -141 -71 -92 -207 -308 -66 -301 -217 75
1831 75 16 -241 -212 -2 90 149 -50 9 197 -310 -72 104 397 155 101 231 -2 -162 267 262 92 60 -378
1854 -378 8 25 49 -350 -93 -243 -95 -252 -11 67 -361 -154 195 -184 -146 -105 244 231 -205 165 267 90
1876 90 -176 68 300 -13 -268 186 214 -206 -405 -11 352 117 -391 45 77 -508 -176 60 72 -101 -282
1897 -282 206 -30 69 -78 56 -15 -67 -231 286 504 242 -82 361 187 146 85 109 109 -142 -155 59 6 -140
1920 -140 -90 -163 100 -15 -86 44 41 7 -181 -86 71 53 -114 -8 230 -19 -150 235 224 -140 22 341 84
1943 84 -56 109 265 70 -406 -139 148 -342 -456 -376 -103 -23 -345 -238 80 -257 -337 -153 106 -111 -141 -22
1965 -22 63 81 -287 121 239 91 146 266 201 391 -27 363 167 -19 -231 -102 384 29 -254 -141 54 -174
1987 -174 -329 -4 65 -46 -307 162 378 -142 -35 61 -18 -89 -2 287 220 -34 136 325 -30 -128 45 318
2009 318 339 -183 -48 177 104 -59 -104 37 -129 -215 79 -169 -329 -176 73 132 -121 53 165 182 136 -169
2031 -169 257 86 9 78 322 279 3 139 214 269 -296 170 98 -463 -55 18 -51 45 -54 -60 -33 -194 -118 -314 -107
2056 -107 87 -230 -390 -11 72 -101 -4 284 72 51 12 385 159 -184 -6 113 50 -164 -31 206 -17 -118
2078 -118 169 188 74 -454 -132 47 -281 -269 26 -379 -161 -240 220 -93 -89 -194 84 -131 93 244 123 143
2100 143 288 37 103 -26 350 225 23 247 529 -95 -199 -317 58 11 -430 -1 137 -88 -352 72 -417
2121 -417 -193 -249 182 51 -211 -36 427 -75 16 128 469 -89 38 333 433 -17 25 72 208 -332 -35
2142 -35 399 -153 -198 74 175 -371 -209 33 -140 -153 -207 -129 -245 -115 79 24 -263 18 151 198 266 -47 504
2165 504 -74 -144 347 25 -133 -237 113 85 -244 41 199 -183 -367 -119 211 -176 -399 -17 189 -570 -307
2186 -307 325 -35 -408 61 179 0 -97 304 275 53 1 395 254 -123 24 252 115 -228 68 284 111
2207 111 -84 -59 98 -212 -137 76 -208 -482 -219 -28 -136 -217 27 -125 27 -83 391 181 -13 389 352
2228 352 -131 12 190 168 -143 79 314 -51 -333 89 5 19 -338 169 -85 -240 -228 -169 -13 -470 -132 -31
2250 -31 -322 -245 177 309 163 -175 219 -28 -44 -254 374 39 -181 255 246 -143 -205 71 87 86 -209 -175 -72
2273 -72 -444 -219 -5 -325 -205 -131 -97 -157 61 27 -88 -521 213 100 -71 -197 95 332 -205 111 112 263
2295 263 -89 157 285 219 -284 -196 306 71 -324 307 153 -324 -283 305 178 -81 52 -2 0 -125 -72 197
2317 197 -124 -185 179 168 -58 -80 154 113 -201 -3 521 162 58 214 -88 -91 0 99 -154 5 -140 -356 -399
2340 -399 -163 47 46 -443 22 240 -99 -169 132 76 -272 85 321 162 -213 -41 187 -12 -143 92 440
2361 440 75 -344 79 298 -153 -432 241 96 -461 -228 207 156 -112 -298 79 -152 -209 -68 129 -174 -102
2382 -102 -48 -8 -175 -29 -25 13 -120 88 3 201 -38 281 -204 15 135 150 -217 -267 -216 -134 -237 -407 332
2405 332 -145 -456 -121 -64 -270 -142 195 -47 -152 -58 -28 291 -330 48 458 -184 -164 223 587 127 -381
2426 -381 181 262 -52 -28 50 296 -111 172 110 38 -190 -172 117 -118 -137 -126 205 53 -27 -6 -131 -72 155 -140
2450 -140 -121 71 -114 166 -44 69 91 -61 257 72 163 144 -220 76 -50 -216 32 -248 18 6 -198 8
2472 8 -303 -278 1 212 -264 -200 7 163 -142 134 41 -278 -100 150 339 61 26 74 159 107 -72 -126 -18
2495 -18 228 66 216 -239 -248 -72 102 -59 12 -98 -63 76 -106 -43 -47 -14 15 -184 197 142 124 156 16 78 -293
2520 -293 211 290 252 -6 -211 118 -79 -20 126 -46 104 -140 69 -33 -167 -356 -9 83 -22 -222 104
2541 104 10 166 -17 193 243 129 263 -140 50 214 -53 154 -17 -17 174 88 56 14 -118 -46 -217 -120 -112 -239
2565 -239 -43 -252 -260 -59 81 -256 -92 -21 -69 1 68 -5 52 -343 -11 111 94 176 72 404 -121 25 124 95
2589 95 -38 77 -5 -65 132 -63 112 -109 -421 -142 130 85 38 75 -125 39 -159 81 28 -189 19 68 219
2612 219 223 -99 43 -54 194 110 64 -72 300 208 27 -86 -90 119 -236 -274 87 -46 51 3 -53 -173 -183 -42
2636 -42 139 166 250 -78 52 192 122 211 151 -5 73 152 -5 81 100 145 -131 -273 272 -138 -46 216 -148 187
2660 187 -88 148 -168 38 -114 -92 -190 -130 -88 -100 -90 -303 315 200 63 -140 201 143 -177 64 106 209 -98
2683 -98 116 210 141 -220 34 141 -155 -188 -321 -59 -128 -134 -198 -2 -296 -122 -103 -86 316 137 76 25 -14 -108 127
2708 127 -264 -75 -192 -227 139 84 -193 182 158 -83 23 -9 -168 -18 62 -138 43 -247 3 -251 44 -97
2730 -97 -156 -56 178 62 120 58 129 78 -194 152 127 182 -179 140 2 -83 234 57 194 -283 -101 164 32
2753 32 -41 289 -37 64 -157 90 109 -43 -31 -230 -23 64 108 10 -18 -150 128 -15 2 93 121 84 152 -53
2777 -53 -82 124 90 77 -35 113 262 -298 -179 23 249 -200 -274 -188 328 -240 -179 242 132 -140 -189 121 209
2800 209 -123 -42 211 120 -83 182 46 196 90 -154 0 -62 -162 36 71 13 -31 -47 68 26 79 85 182 28
2824 28 -240 -67 59 17 -36 128 -83 143 -15 -135 49 70 223 3 -96 53 -13 196 313 -49 -68 -128 27
2847 27 217 84 -212 87 -9 82 -196 31 -41 -245 115 113 -154 -155 176 35 -5 24 107 -166 -211 -83 227 157
2871 157 101 -94 18 -25 -172 -107 -15 -34 98 82 -58 -25 -265 19 59 -2 -38 275 -43 -60 -68 138 -155 38
2895 38 -28 37 142 64 247 90 -89 83 -30 -3 -24 -5 132 -196 -69 42 -38 -133 225 -125 -167 109 293
2918 293 -42 -243 148 56 -255 87 -234 22 -337 -128 4 66 -148 -22 229 67 -241 -98 -1 -11 167
2939 167 -15 280 144 48 216 32 -209 -80 123 9 -156 97 -127 -84 -157 -100 -71 -22 191 -47 -146 17
2961 17 -14 -166 13 -7 -298 -51 225 166 90 76 44 137 -102 -28 50 -118 -30 19 -46 141 26 20 -17 37 -17 7
2987 7 157 -244 -57 -29 322 -207 -32 -63 38 203 -146 198 -21 -38 140 185 219 -24 -103 88 273 172 -100
3010 -100 104 298 7 -102 129 128 -164 -40 -75 68 -58 20 11 -95 141 -94 -74 -53 158 198 300 148 121
3033 121 14 33 -37 -28 38 181 181 191 22 197 -60 -137 -82 -60 69 121 245 -182 -49 -16 -65 -16 -42 149 73 -210
3059 -210 251 124 191 -16 223 51 -6 -25 111 -66 -77 21 78 210 140 -160 -170 -251 28 -67 214 161 -110 -74
3083 -74 186 -200 -82 84 -104 -271 183 161 -97 48 -64 26 100 44 -85 49 31 101 45 -244 -74 9 -53
3106 -53 73 -124 9 8 -112 223 -130 -21 252 252 23 -220 -71 124 129 29 -90 -115 192 -8 42 101 108 -65
3130 -65 -67 40 68 218 91 48 -215 -89 -17 158 -89 195 194 16 -195 -105 -164 180 27 141 92 -42 -306 -15
3154 -15 121 -91 123 121 209 -99 360 -44 468 189 -141 170 -186 257 79 -283 225 -30 -285 -269 -6 1
3176 1 99 -123 -107 2 -158 94 281 -64 26 -101 37 5 -40 270 -33 -155 -52 -56 -109 -64 110 5 -36 -2
3200 -2 -25 1 16 240 160 40 -148 23 57 55 -213 51 -33 -94 -67 -162 -96 205 25 32 -21 -262 -133 177 52 -2
3226 -2 -150 -113 64 -200 -176 -32 143 50 -45 -142 -28 208 -12 -60 165 -44 -341 -7 250 151 -45 -135 -84 -120
3250 -120 50 -22 -132 116 -149 66 139 32 -33 82 -142 5 105 -34 155 64 -80 -78 43 -340 -6 -18
3272 -18 81 -145 72 5 -101 -105 315 9 176 235 0 -5 46 8 97 -153 29 -87 -239 -21 43 61 15 -25 -27 5
3298 5 -276 70 17 199 -225 194 25 66 -97 -57 84 -126 7 102 -105 -10 -19 -37 -91 152 -165 118 23 45
3322 45 16 237 98 106 106 73 142 -59 315 -30 -83 -170 -62 107 16 238 -129 4 50 17 13 -65 86 -58 107
3347 107 64 276 -161 -32 153 -141 171 16 86 -81 208 -73 -66 -61 -277 209 123 20 -214 -6 0 -131 -144
3370 -144 6 -252 36 -208 -3 -1 -236 -52 40 -31 -59 -32 102 -32 -57 -89 34 27 137 -7 51 -323 19 -93
3394 -93 114 52 -54 135 -77 179 151 97 2 44 -146 -79 48 -129 -57 37 13 -1 64 -151 9 5 -145 17 17
3419 17 -172 -199 -81 90 -35 -88 97 131 204 -249 63 279 -45 1 -54 271 -193 -126 196 -111 58 126 -157
3442 -157 110 -87 -50 -86 99 138 -344 18 140 -174 160 146 -41 8 -90 -60 45 28 -13 141 42 7 -143 39
3466 39 -21 -17 -185 17 -34 -113 139 -116 -59 69 68 25 82 192 185 -82 211 56 210 33 166 -86 -113 117 121
3491 121 171 -19 -156 -4 69 -223 58 42 90 -41 139 141 -348 -6 115 80 70 30 314 93 181 -83 151
3514 151 133 174 53 5 93 -8 48 6 -26 -37 0 -231 45 -78 -289 -120 -162 -38 -474 110 -61 -64 165 -71
3538 -71 -60 -222 158 -35 -314 -27 242 13 188 -115 14 -97 -37 92 -137 18 -27 -133 90 56 133 -206
3560 -206 -76 42 -30 134 180 43 -129 -127 65 -59 -107 122 -86 12 41 116 47 89 -79 -32 -79 -107 -133 -48 169
3585 169 -126 238 -85 118 -109 -224 -115 -105 31 74 308 -23 -14 -34 61 -25 -9 224 -211 -82 113 98 184
3608 184 93 116 -76 47 344 183 -105 19 -56 -10 119 -120 110 -108 67 74 142 -50 -23 78 98 -138 13
3631 13 -133 98 -36 -114 -73 -88 62 -183 144 66 44 173 149 261 54 -18 -75 -130 164 90 67 130 -69 108
3655 108 41 182 -29 -214 35 25 -143 -179 -254 -93 50 3 -39 -32 13 -132 -105 66 148 -28 -236 -108 -113 -51 -190
3680 -190 266 375 -130 -101 173 -58 18 -61 32 11 157 -162 -187 -11 -85 -10 13 198 -63 289 90 -199 47
3703 47 -70 -129 -56 -70 69 23 35 65 -227 305 96 55 -1 154 -83 -439 63 145 135 48 180 -102 45 -83
3727 -83 -105 -82 37 -193 129 60 -88 36 0 -118 41 -32 -79 12 47 -180 -154 69 -27 99 38 59 -49 -230
3751 -230 88 -85 -12 -162 -97 -205 90 -184 -22 53 -100 -86 -69 -41 -163 151 60 -61 17 309 27 -114 -68
3774 -68 -87 -196 118 19 -63 -51 -3 11 61 -189 -114 -223 17 96 57 -40 -122 159 -166 -25 -156 111 280 -174
3798 -174 155 -8 47 101 98 55 66 72 122 -37 195 -110 40 105 123 -100 -34 -16 215 -57 2 -46 -28 91 -12
3823 -12 127 -119 -27 -2 107 283 58 30 -77 28 213 38 214 -53 90 120 -137 54 -104 89 10 57
3845 57 59 51 120 -340 -78 144 -171 -23 50 -113 36 110 175 -24 234 35 137 279 -52 -170 -260 -74 201
3868 201 115 -99 53 -157 -214 32 -111 -75 49 48 -68 -153 247 -81 185 51 307 -68 -85 -219 42 -44 80
3891 80 79 82 72 73 -102 -76 106 17 157 82 -248 14 46 -89 -112 -165 45 -70 -101 -59 184 -31 -76 -271 20 -90
3917 -90 84 -143 -186 25 87 -1 -219 75 -32 -357 -82 144 111 -145 103 394 -73 174 160 42 87 140 -159
3940 -159 58 79 -240 -37 -4 -45 -2 185 187 164 -3 10 -39 -159 -37 103 82 175 -6 -51 94 78 97 61 335
3965 335 -70 -28 258 43 190 -219 84 -71 65 76 133 -8 -121 -134 -136 47 239 181 -38 81 -9 161 121
3988 121 53 3 121 -48 386 13 -107 198 -265 -160 70 480 -118 -61 -62 -18 97 -14 -78 -226 19 183
4010 183 172 56 -213 38 67 42 -29 184 -273 149 13 41 -20 89 -276 -256 7 1 -35 11 19 2 -226 -236 26
4035 26 -88 -95 -126 161 130 -81 -279 -2 227 -183 -11 195 57 72 -62 -8 -92 72 154 20 -105 -233 -110
4058 -110 80 -38 222 130 245 -96 6 -117 31 59 42 -183 -93 -119 29 5 -329 23 -130 -130 131 -42 -191
4081 -191 19 31 -37 -15 -38 220 57 -70 20 46 -62 372 -38 -141 -146 20 -59 106 7 -91 137 174 176 28 6
4106 6 126 207 99 55 20 36 -127 22 92 335 -213 56 133 -184 25 -66 -63 -86 9 143 -9 68 -75 -12 113
4131 113 -101 10 -163 -267 -20 -42 -80 -199 50 53 71 302 -240 68 -96 13 242 3 -77 -131 156 47
4153 47 197 194 -3 81 -44 -14 -129 205 -91 58 118 85 -36 58 -8 -160 -233 -1 -194 40 -115 -116 82 -124
4177 -124 247 -57 17 -10 102 -22 228 -63 -87 28 39 -115 28 283 84 35 -59 40 -101 -155 102 -39 -64
4200 -64 -183 136 -97 -57 -3 30 -190 -90 30 -73 -185 148 39 -137 0 -122 20 -241 287 -123 12
4221 12 100 -48 -89 192 51 -167 -178 -335 -42 80 143 -1 -138 255 82 -16 -146 158 -273 61 273 -148
4243 -148 33 220 -272 -270 -11 -153 38 65 -32 29 -14 118 -137 195 4 77 -120 -155 -187 53 158 -31 132
4266 132 -56 89 -269 -294 -161 -150 112 12 -38 356 -2 -25 194 -7 9 38 219 88 -366 125 -227 -146
4288 -146 62 -177 -120 138 -56 -106 147 -32 -82 -150 -90 -105 37 -169 -16 -73 -120 18 33 284 -38 -289 69
4311 69 86 -230 8 246 126 -74 -107 137 69 3 28 -190 -151 -124 -65 2 73 130 43 156 211 79 34 44 84 -86
4337 -86 80 170 133 10 21 67 4 -104 64 62 -281 128 72 38 33 37 117 -71 63 62 122 -67 -42 116 -84 -39 -251
4364 -251 63 -28 59 -49 -99 -118 167 -42 -218 44 -38 74 323 58 8 109 190 209 306 43 107 181 55 -10
4388 -10 64 -85 -84 -8 71 -116 61 87 -96 154 -164 -56 -25 -78 -87 7 -16 2 -10 6 -85 17 -179 -31 -151 200
4414 200 166 -102 53 -222 106 -114 44 -144 88 -184 -6 -134 82 -26 -133 180 223 -171 -45 132 -103
4435 -103 -57 -9 -21 -66 4 -129 7 -98 215 253 350 -81 15 111 15 109 71 -189 137 -68 54 -158 210 118
4459 118 203 219 -66 274 -245 -198 60 -119 -73 97 145 -17 -102 245 -17 -39 109 -239 42 -30 200 -145 -6
4482 -6 104 -117 -210 -120 -268 -85 -5 -134 -17 106 32 -23 12 -16 -106 -24 -29 -223 142 17 93 313 -217 -140 -86
4507 -86 -109 84 75 -15 -27 201 -69 -36 38 -109 21 -137 -95 110 -179 2 -65 -131 64 -28 44 10 91 -151 -333
4532 -333 -22 -89 137 -1 -73 -158 8 250 108 58 23 -32 -150 271 2 -48 121 279 72 -31 -20 13 -161
4555 -161 154 -24 23 -199 -115 -58 -144 -183 -65 108 206 292 59 142 -119 145 155 28 -271 -243 188 -22 57 -32
4579 -32 -27 121 263 -316 -7 128 21 90 -17 -19 157 -70 -57 3 -136 -14 -2 -141 26 -66 -81 9 -285 -15
4603 -15 44 -118 315 204 132 278 -127 -15 73 123 14 185 -19 156 -221 119 120 -277 -102 36 12 39 -95
4626 -95 -163 -208 127 152 -77 -152 -80 -25 28 170 -288 99 296 264 -74 -105 162 99 -192 -94 -228 91 22 -267
4650 -267 -120 39 -222 -123 -307 91 -1 -221 25 45 32 -18 250 -27 27 -71 184 -280 75 289 -58 -66 6
4673 6 73 25 -59 -18 66 33 31 166 -76 -113 -174 -134 -135 -253 -142 -80 -26 -71 -19 -184 32 -28 11 -264 -224 -104 -38 -70
4701 -70 98 55 99 -69 -138 26 -11 83 42 125 -206 102 81 2 -123 90 -141 43 -26 346 -56 -333 157 266
4725 266 21 24 309 177 304 -2 232 195 193 -109 -94 237 45 112 -8 -32 -80 49 -20 245 -42 -87 7 181
4749 181 120 -31 -257 -178 93 -48 75 154 -34 41 111 139 -71 86 193 49 16 -152 -122 316 -87 35 -41
4772 -41 109 179 -124 -31 5 -65 -190 -212 81 -143 -160 55 50 123 46 -106 32 -8 -72 216 -17 -282 -22 140
4796 140 -144 13 -114 84 38 130 59 -88 343 -150 -224 -321 -65 -56 -70 -82 -171 -14 -98 -141 -66 10 144 -344 34
4821 34 173 117 -90 143 112 18 -167 -4 422 143 52 43 128 -64 -2 -33 -211 -19 -12 50 -42 -120 -24 -139 86
4846 86 49 93 -123 -155 -64 178 -207 138 8 40 -175 -59 137 -137 -99 6 207 149 155 444 85 -220 -348
4869 -348 285 -29 -142 130 -77 34 -68 269 -151 -84 81 22 58 -200 167 323 148 -15 -5 391 -112
4890 -112 -37 36 -164 313 86 35 -174 211 85 4 -87 168 152 151 -153 -20 -11 -4 -78 187 26 -224 -83 140
4914 140 16 -93 -154 -37 157 20 -10 75 195 19 67 232 255 -191 181 -31 30 -129 -53 50 -127 -135 -30
4937 -30 -160 -87 -22 -138 -90 175 -13 11 95 -95 1 32 -6 -6 -27 -105 5 -102 158 -27 -198 -194 -219 149 -99
4962 -99 8 -96 -149 9 51 -65 19 113 -11 -302 -171 44 -11 -64 13 36 -82 -141 42 174 11 255 -157
4985 -157 -190 46 -140 148 259 -164 -58 137 -208 -140 67 249 115 69 50 53 -110 -67 -57 -18 -109 144 3
5008 3 -27 272 63 211 -76 312 189 262 102 53 -203 -218 280 -94 30 -67 -64 -76 -3 79 177 12 277 -125
5032 -125 -44 109 91 -186 -168 98 -18 -189 -116 -93 -348 -79 55 267 23 48 143 -267 -163 -53 -274 80
5054 80 173 13 -114 -241 94 -4 161 -171 211 -102 27 -80 -19 68 5 -152 248 53 -66 77 -49 -160
5076 -160 11 317 105 26 -76 147 43 20 -264 41 52 21 -163 -10 14 23 -2 217 -330 39 134 -168 9
5099 9 -278 -156 -20 43 55 -161 -65 -174 -47 316 -329 19 -84 -30 -166 -127 12 -11 48 7 174 -44 -50 137
5123 137 31 2 -98 -182 -163 130 -29 2 200 162 -4 -7 2 -20 -289 -139 129 44 39 -107 -281 290 123 -57
5147 -57 -132 87 -176 64 216 5 36 -108 -133 120 154 -85 2 -162 -125 -170 -167 -69 424 -211 -152 -38 278 -95
5171 -95 176 -93 -161 58 -40 116 -38 -64 11 195 71 -93 -134 104 -360 169 -157 -163 132 -21 -53 18 86 268
5195 268 81 -35 -55 -110 -126 -195 -22 -27 -255 29 -139 -62 -26 168 -4 87 -95 -83 -76 -80 -109 71 51 105 -17 -195
5221 -195 -94 99 -97 -258 88 145 -8 118 -78 180 17 -156 145 -58 -121 60 40 96 127 15 169 174
5243 174 -59 350 -27 -194 17 -73 58 78 179 -11 50 -250 33 101 166 -135 -135 -43 93 212 -123 -345 -181
5266 -181 84 -9 -88 5 -150 108 -35 -88 -22 -20 109 -75 -38 -123 79 31 -110 153 208 27 -273 -16 8 -4
5290 -4 -224 -40 -109 60 -99 42 -117 -149 36 58 -118 -108 65 198 103 -70 107 -243 216 89 106 219 -36
5313 -36 152 -197 -129 -93 85 -170 -185 -64 -142 -50 72 -66 281 158 -115 -83 -204 186 -153 -6 -221 -3
5335 -3 166 -24 -79 -150 364 131 -41 111 110 183 -6 182 0 22 72 -34 59 43 -89 60 -41 -84 -270 105
5359 105 -33 -168 -190 -59 90 -109 -60 -57 -48 -101 241 12 182 -114 43 -170 279 -61 199 48 171 42
5381 42 228 -4 80 172 107 -88 62 -161 -236 -49 -110 37 299 -44 24 -112 -14 130 6 68 308 64 57 30
5405 30 189 33 7 329 -192 214 -199 141 9 176 -32 110 -225 170 -3 63 -115 -171 -108 -77 271 -263
5427 -263 54 -225 -79 -72 -190 112 -181 154 6 291 -60 56 21 110 95 -119 21 48 88 -51 -246 230
5449 230 106 -38 71 -269 190 -81 147 26 -227 105 106 -16 66 -124 107 -28 161 118 -149 96 15 10
5471 10 223 -24 52 13 -260 -137 34 86 99 -135 299 3 -71 -29 -63 -108 -15 46 64 -84 -13 186 191 84 -86
5496 -86 102 -115 -55 349 -193 123 116 66 28 -28 115 176 73 -84 -23 16 29 186 -177 8 123 114 -138 66
5520 66 -51 63 267 -100 -147 -59 137 -176 -123 -156 -80 58 -32 136 -84 66 57 159 110 54 282 24 -226 -137
5544 -137 25 -13 106 36 43 127 -74 -105 -241 -47 35 -138 -128 -158 149 -230 -15 123 -301 130 154 -128 94
5567 94 106 -71 -8 103 156 238 211 -74 56 -17 -178 81 -146 152 63 77 -20 83 77 -69 -126 28 -170 -112 -53
5592 -53 13 35 71 126 11 -48 -102 -172 14 -99 -59 -15 108 11 9 -178 40 -12 -111 -66 -83 -36 -91 -178 -107 -110 -236 -37
5620 -37 129 -34 -73 -55 53 36 8 -104 -127 115 162 139 149 155 3 28 54 -75 -116 128 -173 127 -55 -404 89
5645 89 283 -98 -36 42 -77 -108 36 46 302 -127 -28 131 -44 -60 128 52 28 58 -24 -50 30 38 194 -5 54
5670 54 204 -145 -223 -291 25 -18 -144 -71 58 -81 75 -210 152 38 -93 146 -41 -61 100 120 -368 -148
5692 -148 84 -165 -349 -13 163 -15 187 -270 -55 -117 169 126 55 60 -103 -99 -85 103 -42 -145 119 -207 -99
5715 -99 1 -55 91 -9 126 -5 -83 -237 -18 127 112 -31 -89 76 125 266 108 24 11 225 -183 81 -101
5738 -101 -312 -174 36 17 54 -8 -63 -6 -163 -85 -52 111 170 168 -1 86 25 172 5 -9 129 494 -91 200
5762 200 -28 -126 208 86 -163 -150 164 159 120 161 26 65 -104 -55 -46 93 -11 -135 59 -178 -234 -163 -145 40
5786 40 16 -121 -135 170 133 307 112 -53 83 -25 -191 183 127 167 117 62 -191 -51 88 -187 82 60 172
5809 172 -17 -18 -99 -59 -244 56 96 -155 23 -65 174 -147 202 -34 119 382 95 102 98 -188 -220 -34 51 -152
5833 -152 -9 74 177 -97 -203 99 -39 -242 -136 48 -155 -317 -16 -102 -265 -52 -129 -89 129 185 302 245
5855 245 -40 24 -162 163 -179 282 46 -203 -28 -153 110 77 -77 130 -37 -43 210 -117 -217 -138 -5 -36
5877 -36 -70 -29 63 -122 80 -142 13 127 90 37 78 122 44 186 -30 226 47 33 163 168 -101 -200 -115 -21 75
5902 75 -76 82 -104 12 90 44 181 -7 -128 -114 160 53 -12 24 49 122 -302 -214 186 309 218 101 -29
5925 -29 36 -116 63 128 -69 -150 108 -75 -15 70 152 31 -299 -84 326 -127 88 24 -112 148 65 173 218
5948 218 105 125 -2 29 -119 45 174 90 35 29 -187 119 11 -20 -180 252 -170 172 26 153 -152 -286
5970 -286 -140 -12 -209 -58 239 -180 -29 -123 169 261 9 76 -312 126 124 -93 31 -155 165 -139 -187 43
5992 43 133 -195 -52 90 -195 -190 -58 42 174 -199 -13 124 272 -47 -95 51 -217 92 262 165 183 68
6014 68 -170 -74 36 28 246 21 -104 -117 -145 59 -209 24 100 44 -105 90 9 73 -131 -311 52 -280 259
6037 259 -36 -2 -209 -142 111 -32 -81 112 -121 92 122 -37 -87 100 -336 74 -218 -21 16 63 -155 75
6059 75 42 -13 88 -157 106 -75 -225 11 -35 -11 -150 33 63 153 55 -194 71 -77 98 115 89 132 265 77
6083 77 9 -12 77 -112 75 -87 -2 61 164 9 -238 -358 -189 -72 -198 -284 -31 66 -83 178 -123 297 -72
6106 -72 -42 -10 -138 -145 82 -68 239 -56 23 4 17 -118 -88 128 -75 230 98 3 120 42 12 186 -204 -205 56
6131 56 33 -24 111 250 -72 142 72 46 -11 -43 -30 180 -52 111 141 -116 43 14 -59 10 -182 55 65 186
6155 186 -101 -200 47 -162 -48 152 70 -163 -1 256 -190 3 103 -198 -23 -216 31 73 21 58 90 -170
6177 -170 29 212 -27 9 150 -97 -15 288 46 -181 -52 183 201 55 -25 -197 150 272 73 -47 -74 -174
6199 -174 148 82 -62 140 16 -213 13 161 -81 -66 4 -108 -131 -146 -197 -141 92 9 -33 5 -44 -59 -119 -159 156
6224 156 -51 -141 116 -22 -70 64 -67 -145 -133 95 40 -105 -20 -98 -176 119 115 103 56 383 155 -33 -218 -118
6248 -118 -98 -184 91 -123 44 -109 132 -81 -151 86 -135 -58 -7 116 20 -186 -5 -358 307 -57 107 -70
6270 -70 146 21 -21 -9 -221 1 206 -78 94 8 158 6 -87 23 -178 -77 51 -166 -272 -191 36 -66
6292 -66 -55 -301 175 -139 -165 50 26 -95 -1 146 179 -61 -13 19 167 -69 -129 22 187 268 20 43 15 -54
6316 -54 -246 167 -16 56 163 -180 -143 -95 32 42 -7 270 -58 15 191 -22 99 -85 -160 -21 -195 -54 -307
6339 -307 25 -31 100 246 -74 -41 -136 -25 87 -15 7 -38 130 -277 -199 18 178 -73 -188 -164 108 -92
6361 -92 -51 25 233 24 75 135 132 14 21 -91 12 139 223 -36 54 8 -75 -33 174 111 86 -176 22 75 372 -150
6387 -150 -62 187 -123 -118 -22 62 -58 -107 77 85 128 -191 28 -154 -43 140 -2 47 160 -38 186 5 -60 94
6411 94 45 85 37 -114 -59 -208 201 44 -232 41 -92 -150 151 -264 -152 -44 -188 -248 -187 -49 41 42 -72 101
6435 101 182 201 -25 92 75 157 -193 144 -133 10 -56 27 76 35 16 -75 -34 -342 123 30 -18 -75 5 121 10
6460 10 57 101 -97 -97 203 194 -52 -110 203 88 39 -90 38 182 168 181 110 -9 -55 175 -1 -55 23 16 -93 -3
6486 -3 -39 218 -24 -73 -177 89 56 134 102 -374 38 -140 33 -84 100 63 -27 31 -138 29 213 -23 -145
6509 -145 109 -37 -43 -185 -311 103 -130 14 -152 74 -96 83 169 65 -64 97 64 -58 -44 -114 -139 108
6531 108 -169 -170 -2 -42 -232 12 -3 -153 272 152 -111 -203 -51 -144 304 -111 67 32 42 -10 59 -324 -176
6554 -176 281 -107 1 -15 -36 -199 -5 104 156 -76 -321 -76 -280 95 -114 -99 -97 76 -133 42 46 -43 38
6577 38 -220 -257 -79 -141 -5 -192 -334 16 39 327 53 157 -32 -50 -44 -75 1 -53 -1 -277 -64 83 -39 88
6601 88 5 150 30 122 159 126 -12 -50 140 70 -102 90 43 -265 -449 -28 51 -198 -105 106 47 -55 43 -81
6625 -81 199 72 6 7 -136 -46 -124 103 -194 101 -213 171 44 36 -17 83 -79 -307 27 -92 -38 -58 63 -29
6649 -29 -1 -64 -37 -120 -220 -243 -253 -53 183 48 79 -117 -309 101 74 41 129 1 -219 203 -62 3 -421 -88
6673 -88 40 176 45 -40 2 68 22 -96 49 -23 275 -85 303 133 55 31 11 104 -16 -80 242 200 -85 -69
6697 -69 127 160 310 -208 224 -40 -68 -398 -70 28 -182 -13 -40 117 -41 -2 -7 148 -63 -280 -19 104 -221
6720 -221 -31 72 -145 195 213 -12 -42 -140 59 36 88 -42 199 149 -24 165 193 275 -23 -112 133 60 161
6743 161 138 109 -77 332 -87 146 27 -36 -181 193 -254 149 -57 -93 196 57 0 93 -84 -95 168 -210
6765 -210 31 203 130 54 -22 108 -97 -312 30 -88 50 -217 -43 303 11 -47 415 -8 24 210 -70 88
6787 88 -91 12 -36 -1 -56 49 119 53 -122 -3 130 125 -91 14 -154 -119 270 1 -95 58 65 -26 -102 113 99
6812 99 -7 -15 24 189 -199 44 -5 -143 92 -98 138 -4 157 163 144 355 -19 -114 33 -72 236 -11 71
6835 71 -27 -182 -98 -151 -59 170 -299 32 -103 89 91 16 -19 -31 -38 -14 20 -71 -160 -33 137 -310 234 0 78 104
6861 104 279 -60 56 99 -1 13 -78 -20 -72 -55 -134 -147 -187 40 -28 16 95 -13 -73 -30 95 59 -318 55 -133
6886 -133 4 69 59 119 -39 -22 -79 305 25 -105 -84 143 159 -199 57 25 23 -128 53 200 -59 -124 57 -22
6910 -22 -127 -42 178 121 101 239 23 61 -242 130 -124 13 388 -23 -161 51 -192 292 -25 52 -111 17
6932 17 -42 174 -171 170 -87 130 -35 81 93 -72 -72 95 220 -95 59 -4 -77 113 -311 192 184 12 75
6955 75 -41 -258 -90 166 -57 153 -12 -5 91 -174 -152 91 127 133 -41 3 -51 6 29 -166 -73 -145 -72 21 -231
6980 -231 -24 -107 -85 -78 122 -249 53 -31 243 -22 -311 185 79 -85 -84 -65 13 134 127 -141 88 -81 134 93
7004 93 92 141 -67 100 -64 -47 81 25 107 38 4 77 -24 333 255 -135 45 -101 -140 -117 -148 36 97 -54 -173
7029 -173 -131 -128 -51 82 -164 15 228 74 72 -19 -147 110 72 147 -67 -156 13 224 207 -113 -123 219 -101 173
7053 173 30 45 20 70 -242 -143 176 261 191 -92 13 79 -60 112 -110 197 -127 -96 -159 28 -287 202 70
7076 70 48 -110 235 64 -19 186 -178 -28 137 441 9 -92 159 -85 -23 122 7 -133 -14 12 -82 234
7098 234 88 -199 -93 26 114 74 -76 294 -79 -97 -128 265 -38 233 237 -50 -94 53 66 -77 -224 77 -145
7121 -145 162 -25 109 107 119 -95 -311 14 296 -42 -128 300 -56 -198 238 20 -10 75 -7 -200 -62 -36 -59
7144 -59 139 -58 294 -11 117 93 -72 149 -160 99 7 1 -26 -123 -253 203 -148 -106 -56 -129 23 170 -303
7167 -303 19 25 98 -135 66 -10 -245 91 -151 83 -138 -21 72 160 -31 -13 -10 79 32 161 121 111 -86 -248
7191 -248 23 24 84 -121 165 -61 77 28 98 -116 -364 -109 -99 68 -21 101 -22 135 -39 127 -150 -24
7213 -24 -178 -118 -71 104 -102 189 -6 151 113 141 105 1 -134 203 39 -5 66 -107 -207 -34 -310 -167 69
7236 69 -139 -89 133 29 -53 -5 -52 -17 -80 -390 -178 -93 57 60 -70 162 -231 -19 -184 -254 -281 78 41 116 324
7261 324 79 178 70 145 -136 93 281 177 147 96 162 -19 -100 116 -41 159 175 36 -30 111 76 -8 -111
7284 -111 80 -66 -44 216 -49 219 95 -70 23 -124 122 37 -53 126 44 -41 107 -43 -70 -214 96 -53
7306 -53 261 -103 113 -21 -72 -152 -166 281 -192 116 -42 13 160 -294 153 4 -41 -298 -72 -206 225 -205
7328 -205 114 -80 -35 34 25 -159 226 157 -41 -180 205 271 183 171 -46 223 -80 -113 -51 97 -8 54 113 303
7352 303 180 104 -84 -5 -204 208 -151 125 -141 -44 -175 310 -56 -93 -102 197 93 174 -48 48 48 143 213 128
7376 128 128 -40 45 56 19 -34 -3 -104 116 -118 -107 -284 -115 157 28 -82 -164 12 43 77 116 251 -172 9
7400 9 145 -1 -131 -146 104 62 171 -28 -45 37 182 7 148 -203 83 -75 -125 -290 -18 -78 -16 -41 28 -188
7424 -188 -126 72 -95 -80 132 140 -137 29 247 -292 12 -17 176 190 39 -85 -155 37 -91 107 -176 -8
7446 -8 -66 126 231 -203 -112 78 71 -2 54 -107 137 -68 122 7 -97 3 20 -6 -13 78 -239 31 152 -10
7470 -10 -7 211 -54 202 -145 122 -211 87 253 -154 -67 10 129 -16 -106 214 -158 15 21 -25 101 78 29 90
7494 90 -153 -9 75 -97 32 -89 -28 -98 -91 79 -46 249 -286 -1 -54 32 -79 -58 -12 136 137 -32 38 -117
7518 -117 112 7 -249 50 -46 -347 -84 72 67 -224 -26 -57 -270 -173 12 16 113 114 -242 1 45 -118 181 -347
7542 -347 13 -124 151 -88 -82 25 -51 174 98 -246 -98 92 -280 54 3 218 111 215 -89 -56 53 -45
7564 -45 -16 20 -64 -15 -1 -138 73 164 -77 -91 -56 57 289 -152 236 -310 -99 8 -42 118 -13 123 -60
7587 -60 -108 23 24 -78 -184 47 -130 46 -137 -174 92 -248 67 -93 -24 -72 -133 -89 -73 -33 -122 -35 -9 -149 -120
7612 -120 -48 131 107 -109 51 94 102 93 -146 28 -97 -81 -54 123 -257 22 -336 -78 192 1 120 -352 -54
7635 -54 -91 5 126 104 -158 -25 183 -73 -88 42 -88 -201 -37 -46 74 166 -56 -74 247 -74 282 -51 -215
7658 -215 -112 -4 25 -22 -37 -1 25 133 93 49 -317 -43 34 171 -72 18 26 52 -166 28 -13 -143 88 -68
7682 -68 30 28 157 -32 205 222 7 102 -165 -202 43 -4 -21 -66 -15 85 -7 -114 160 -182 156 49 -48 151
7706 151 -113 -157 -92 -250 130 118 -199 -430 122 -33 169 -152 -137 112 134 21 99 -253 -99 -30 43 204 40
7729 40 12 -156 -214 -110 42 6 -245 7 57 -10 -255 2 143 -147 59 -122 -17 189 127 -55 31 -95 145
7752 145 146 -290 1 143 117 247 26 24 -106 64 168 -124 -34 35 146 88 26 74 -99 -102 29 75 80 -29 -191
7777 -191 166 -147 -177 168 15 -250 -29 18 -207 84 2 -56 132 278 157 -26 22 -88 101 95 16 -118 -110
7800 -110 115 -189 73 128 82 -17 -147 -33 -6 152 -5 16 90 14 232 23 58 51 19 56 -69 40 18 120
7824 120 -90 82 75 -169 101 38 194 164 54 -35 -129 -226 119 133 38 79 125 208 -90 99 -43 4 197 17
7848 17 -141 -64 10 -121 143 -37 47 -180 -5 69 39 -73 103 82 52 77 -192 -281 -88 66 -35 119 -172
7871 -172 68 -230 -54 -8 -166 -101 104 116 61 59 97 -78 -118 125 16 -37 74 42 80 -111 -266 227 222 145 -4
7896 -4 -169 -60 -124 -22 52 -23 130 38 -21 -108 -37 -104 -11 45 115 158 -164 -121 -158 -158 -110 -15 -230 -38 -356 121 17
7923 17 21 -228 -43 94 -87 -48 125 -75 -81 -22 51 -24 126 63 19 -213 13 53 -123 49 -256 -37 6 43 278
7948 278 81 0 18 137 -79 -89 20 9 -174 -182 -62 -162 34 24 218 65 -218 -143 10 -273 79 -178 121
7971 121 -71 -76 184 -299 69 -240 22 162 26 -82 121 176 -23 85 -116 34 147 -98 282 -36 -93
7992 -93 -47 -218 55 258 78 60 176 -92 19 -23 81 -135 37 -183 40 -85 -32 -131 -84 71 -199 53
8014 53 -230 -1 -189 214 80 59 225 -74 -58 131 -113 112 38 167 -152 67 -57 150 169 -251 22 -84
8036 -84 -12 11 -53 -17 17 151 195 92 120 -262 -90 -3 70 61 -76 310 105 -9 87 54 66 -64 -90 -51 -102 -33
8062 -33 175 66 -2 -19 87 -108 -101 175 79 27 95 39 0 -254 36 138 -145 82 -32 66 196 -157 -27 149
8086 149 -8 209 460 -20 173 -86 -110 31 -40 -109 3 177 195 75 -48 70 -40 -108 -251 -80 56 -96
8108 -96 51 52 203 -56 -17 147 107 304 -160 344 -17 -37 -52 21 172 -104 96 -87 69 -159 85 -244 -134
8131 -134 -44 -152 44 -158 -142 -73 -47 -89 -11 -229 109 -93 88 102 -259 315 -51 78 125 -120 136 -173 -196
8154 -196 -33 -136 -60 -99 -91 -230 104 -199 31 77 -106 123 -119 -60 -293 65 156 -63 239 122 -158 197
8176 197 -73 -20 121 -3 62 -46 24 -76 -10 -110 -183 -104 127 3 16
8191A6
$$ Imaginary data points
##PAGE= N=2
##DATA TABLE= (X++(I..I)), XYDATA
0 0 0 0 0 0 0 0 0 0 0 0 0 0 0 0 8 -8 8 -8 8 -16 16 -16 23 -24 31 -32 40 -43 50 -57 65 -75 84 -96 107 -123
36 -123 138 -155 171 -188 211 -235 260 -286 317 -350 387 -425 469 -518 568 -626 690 -763 845
55 845 -937 1043 -1166 1309 -1480 1687 -1948 2284 -2731 3364 -4320 5936 -9158 18028 -93842
70 -93842 -274075 38894 217730 9917 -150787 3632 103604 -6034 -73115 1030 36561
81 36561 32900 39480 -15315 -101334 -28498 121153 80004 -90425 -83003 49702 48495 -42319
93 -42319 -25422 37251 14396 -28254 -16118 -18516 -22145 42275 67845 -38036 -100280 4483
105 4483 91139 15801 -56179 -1310 38277 -10621 -26378 14452 23273 9132 14437 -9839 -52002
118 -52002 -4465 75951 26838 -68720 -26670 51945 -1773 -59497 22690 71754 -36696 -86000
130 -86000 28478 68476 -39832 -55375 57516 51476 -74928 -62875 68162 68056 -39887
141 -39887 -45784 24030 21324 -15646 4475 22531 -4809 -7312 13520 -11446 -27667 25615 49460
154 49460 -21733 -60362 7515 45945 -10803 -32571 17427 19513 -31920 -25848 24458 19018 -16496
167 -16496 -4557 10760 -14432 -15826 22720 24467 -13203 -14044 12000 2990 -11633 13335 24004
180 24004 -9258 -19265 7372 8316 -10197 5695 22286 -13510 -33916 10713 28905 -18103
192 -18103 -27520 25054 24062 -40197 -36107 37116 39797 -28978 -36579 17451 25481 -11786 -13727 13143
206 13143 12699 -1743 -4229 -7246 -2592 21289 22487 -17682 -31572 12742 33793 -8354 -28118
219 -28118 9185 21873 -14426 -24134 7811 16420 -6540 -9139 957 -8586 -9601 13913 15235
232 15235 -13968 -18515 10745 15423 -8728 -7816 13114 9697 -7079 -5613 3606 4540 7463 9781
246 9781 -6949 -17939 4948 21418 -2265 -20393 1874 16791 -8026 -21882 4503 17910
258 17910 -5164 -16789 -1640 5075 -3445 -615 7632 -2054 -9530 2557 8572 -1168 -2161 7781
272 7781 4773 -7205 -2545 9219 4510 -1959 3551 2061 -8148 -3475 11209 5475 -12313 -6491
286 -6491 9429 192 -13817 -2099 12103 738 -14391 -5704 7083 2806 -3076 17 468 -2079
300 -2079 1400 3930 48 -21 7320 3933 -7414 -2646 10922 7228 -5456 -4147 4984 1757 -5635
315 -5635 520 5785 -2626 -6770 -794 1107 -4097 -2249 4202 -385 -8793 -3296 4659 1636 -2577
330 -2577 -134 2236 -1076 -1334 3701 3395 13 2043 2454 -1641 -985 4970 5573 -2373 -4520 2538
346 2538 2718 -3582 -1888 3226 124 -5768 -3816 1490 144 -2491 -609 -890 -3074 -1745 1584 975
362 975 -1161 340 1958 -884 -1205 3395 4605 869 -1205 696 2170 1097 1776 1846 -888 -1505 1331
379 1331 717 -2612 -2016 2290 1020 -5350 -5077 1103 3143 -1002 -4964 -2921 1589 2134 -921 -3115
395 -3115 -281 4914 2694 -3908 -3226 5123 7773 -80 -6045 200 6683 3205 -2756 -2685 2137 2768
411 2768 -1113 -3082 -1799 990 2241 -1754 -5581 -3331 1867 3014 -2426 -5424 -1163 3403 1144
426 1144 -2614 -1727 2326 2659 -517 -529 860 2411 2550 1455 503 -1008 413 4064 3136 -1960 -3907
443 -3907 569 4266 306 -5213 -2786 2509 1464 -3463 -4675 -1273 2428 1625 -1467 -5201 -3018
458 -3018 4669 6246 -2988 -8339 1068 11883 4087 -10151 -4638 11608 10476 -6771 -11036 4998
472 4998 12490 286 -9713 -3444 6027 4843 -3172 -6272 -2677 2745 4432 -2756 -9110 -2867 7645
487 7645 5065 -8445 -9957 5324 11331 -1766 -10479 -563 10379 4065 -6325 -2967 6300 5283
501 5283 -951 -2426 814 2087 1341 1588 -623 -3786 -1056 3915 976 -5598 -4066 3249 2375 -4947
517 -4947 -4438 2759 2095 -4135 -2521 3989 374 -5566 772 8434 235 -8801 195 12750 3882
532 3882 -10812 -3834 11760 6744 -8501 -7163 6758 7557 -3839 -6199 -549 2381 1407 -353
546 -353 -4161 -5277 1350 6763 -1224 -11005 -2683 10186 5164 -9975 -8001 8455 10692 -4192
560 -4192 -9196 1985 9721 2918 -5111 -2689 4194 4265 449 -2697 -1826 1484 3442 817 -4424 -4773
576 -4773 2562 5279 -2982 -8111 -975 6636 949 -8448 -3089 6506 2483 -5871 -2687 5682 2472
591 2472 -4958 -383 6321 1079 -5324 1080 7590 1037 -6217 -178 6977 1267 -4927 -1895 3227
606 3227 1471 -1971 -1538 -1030 -1414 1285 1088 -4085 -4933 2240 5402 -2231 -7473 599 7432 1389
622 1389 -5988 -2705 5371 5025 -1354 -3925 717 4849 3357 -1904 -3587 936 4579 1982 -3538
637 -3538 -3914 2087 4080 -857 -5272 -3058 3412 3432 -3931 -6436 460 5866 475 -6502 -2663 5588
653 5588 3176 -3860 -3034 3381 4126 -984 -1419 1573 1861 640 833 320 -800 -201 1622 410 -2187
670 -2187 -1190 1070 -202 -1987 -1318 276 -430 -1271 -239 -377 -1393 -243 1142 -141 -1652 -200
686 -200 2314 700 -1175 633 2038 820 19 517 1491 856 236 612 -47 -277 443 447 -476 -851 -430
705 -430 -369 -938 -873 -558 -1116 -646 71 -730 -1303 -177 891 -145 -1178 294 2111 443 -973 648
723 648 2052 1010 -573 145 1789 998 -330 -173 480 590 -124 -952 -783 -450 187 -992 -1922 -400
741 -400 423 -757 -1684 -669 542 -64 -1013 -85 885 329 137 433 1090 424 118 1285 1017 -52 389
760 389 757 688 -185 -315 537 372 19 -676 -975 -463 -73 -559 -1307 -894 6 -91 -1268 -893 187 425
780 425 -528 -492 171 790 472 362 527 243 787 1337 535 -39 244 972 652 -607 -267 485 -7 -443
800 -443 -825 -701 27 -293 -716 -926 -540 -135 -99 -1272 -1050 437 536 -388 -602 881 1194 -106 -541 613
820 613 1453 902 80 -13 1014 943 353 -398 -289 646 380 -687 -1187 -88 582 -575 -1590 -727 383
839 383 -602 -930 -446 -89 -12 -200 157 25 11 670 794 -97 300 780 1356 299 -369 823 674 315
859 315 12 2 -84 27 -17 -315 -1183 -713 201 -417 -1145 -793 -193 -138 -769 -456 149 -523 312 948 -118
880 -118 -585 461 1581 349 -647 422 1734 561 -302 290 589 468 131 61 -188 -325 553 284 -1143
899 -1143 -1124 580 378 -1231 -1777 -64 605 -516 -850 -137 392 526 420 191 -215 733 1500 379 -445
918 -445 527 1348 345 -461 521 631 -257 -233 746 -261 -1312 -203 1266 -807 -2274 -676 1699 -557
936 -557 -2262 -370 622 -277 -885 328 305 -705 774 1828 -537 -1473 1253 2635 -178 -2005 652
953 652 2968 559 -1696 -402 1393 826 -780 -943 -401 43 661 -538 -1822 -831 823 248 -1077
970 -1077 -1304 491 785 -63 -885 -535 868 1721 442 -1248 -205 2491 1549 -1559 -1154 2357 1774
987 1774 -1359 -913 1462 519 -1491 -274 1240 -1004 -2011 633 1384 -2150 -2257 1398 1734 -2371
1003 -2371 -2257 1833 1316 -1825 -751 2006 398 -1499 721 2497 -421 -1472 1844 2606 -981 -1975
1019 -1975 1370 2573 -1029 -2011 521 1025 -211 -880 -748 -333 -113 156 -600 -1652 -500 949 106
1036 106 -867 -797 447 730 282 -566 -642 810 2207 39 -2295 438 2927 782 -2665 -633 2954
1053 2954 664 -2452 -718 1890 -9 -1593 -101 1104 -1515 -1437 1426 427 -2728 -590 2409 119
1069 119 -2774 -137 2725 -166 -2389 539 2554 -482 -1509 1277 1730 -841 -717 1757 834 -1662
1085 -1662 -111 1445 -193 -1395 -67 478 -802 -799 437 51 -1504 -569 660 -335 -1419 114 682
1102 682 -314 -554 378 167 -225 601 718 -506 -101 1572 660 -1270 181 1989 23 -1714 -192
1119 -192 1578 -161 -1512 8 923 -890 -1217 621 58 -1622 -358 1242 -578 -2143 508 1572
1135 1572 -941 -1718 1114 1585 -766 -732 1727 930 -975 -8 1450 185 -885 504 1325 -694 -1271
1152 -1271 1024 644 -1218 -699 964 15 -1517 -370 910 -670 -1302 398 483 -674 -440 735 130
1169 130 -916 166 1334 -252 -470 1111 1087 -310 -311 1104 876 -1042 -105 1103 -230 -999 350
1186 350 744 -529 -1090 458 4 -1235 -632 645 -242 -1150 127 660 -732 -1040 572 815 -751
1203 -751 75 1235 556 -772 428 1294 -3 -766 809 1144 -640 -503 831 411 -936 -391 745
1220 745 -251 -1186 46 670 -883 -1267 486 293 -911 -292 953 213 -759 199 860 27 -542 736
1238 736 868 -325 -336 1071 460 -560 64 1080 105 -927 217 350 -749 -608 559 210 -913
1255 -913 -415 618 -269 -1035 -147 413 -386 -588 333 604 -561 -192 837 230 -656 456 859 -115 -446
1274 -446 841 832 -558 -385 743 212 -748 -322 671 -131 -1045 -131 235 -331 -516 177 -27 -962 -144 604
1294 604 57 -817 240 532 1 -455 473 644 -375 -22 809 617 -566 251 573 -7 -361 595 444
1313 444 -404 -872 98 253 -939 -449 474 -148 -927 -69 143 -129 -628 173 -38 -350 -17 466 14 -417
1333 -417 245 682 116 -116 486 440 -172 130 399 97 -188 7 356 -100 -462 295 -203 -679 -516 210
1353 210 -120 -869 -301 448 -340 -467 154 283 -316 -312 490 269 -25 -77 799 365 -184 -6 691 177 -4
1374 -4 68 379 -17 -264 196 -122 -730 -159 213 -273 -273 -362 -151 -359 -287 -195 -153 -17 -40 -37 10 -36 366 387 -133
1399 -133 11 191 268 48 49 325 228 -34 289 347 -202 -236 165 -235 -566 -459 190 -9 -547 -260 165 -32
1421 -32 -390 -232 20 120 -182 181 341 26 -130 265 404 38 89 441 454 -125 -235 288 647 -37 -567
1442 -567 -33 208 -49 -548 -247 22 52 -332 -100 51 -39 -307 -130 -136 -200 54 376 322 -264 -39 373 584
1464 584 260 -5 231 330 -155 -95 122 340 -161 -230 -37 159 -278 -347 -13 17 -668 -494 191 -45 -496 -197
1486 -197 143 -146 -149 -317 636 371 -301 1 629 197 -322 114 532 145 -331 118 508 -106 -358 99 310
1507 310 -160 -797 162 187 -635 -652 -333 61 -542 -494 -146 44 -218 -214 173 57 -25 -13 594 312 -125 -133 609
1530 609 505 56 -84 244 392 -67 -384 403 246 -332 -260 -158 207 -267 -240 113 -117 -291 -252 286 30
1551 30 -306 -1 388 32 -189 123 202 231 -157 313 619 -140 -278 -8 323 -260 -416 75 665 -50 -371
1572 -371 4 280 -210 -376 49 -8 -458 -258 -84 90 -476 14 216 124 -332 151 398 48 19 273 477
1593 477 38 -76 210 687 -248 -47 70 -18 123 -105 -41 105 -175 53 -44 -152 8 -141 -164 -184 13 -473
1615 -473 48 -12 153 -271 16 264 132 105 102 486 203 41 73 505 21 -46 265 165 -153 -154 151 247 -144
1638 -144 -71 -200 -215 -409 -96 293 -61 -458 24 77 -339 -395 227 54 160 -55 206 269 -105 -56 357 140
1660 140 -110 329 310 224 76 -18 41 -305 -98 120 -362 -138 -120 -108 -151 -250 -255 -186 -33 128 -26 -315 -168 334
1684 334 364 37 79 386 231 24 425 243 13 167 28 441 -278 -223 217 -183 -245 -176 13 -71 -418 1
1706 1 -55 -120 -367 96 -88 93 68 -3 328 -101 -38 390 308 441 237 295 252 130 2 236 208 -94 73 85
1730 85 -164 74 -104 21 50 180 -163 -594 -134 -164 -41 -192 -146 230 -69 -22 20 98 4 198 256 55 43
1753 43 141 278 145 -6 202 46 36 -250 138 368 -91 -215 -146 -53 -318 -77 67 -43 57 -179 49 -126
1775 -126 -214 -31 -60 -156 -199 -68 -91 288 -149 281 178 267 261 335 128 5 -34 40 20 -276 153 121 -60 28 22
1800 22 -279 -189 -85 -142 -149 -26 -368 -305 -5 70 -147 -33 -12 185 88 -87 -84 168 209 67 87 126 224 -119 274
1825 274 -16 -58 -61 -53 16 -95 -324 -307 -176 -216 -96 -315 -113 152 -94 89 189 182 -342 78 58 157 255 103
1849 103 372 368 -71 243 53 270 -33 -62 24 14 -41 -13 85 62 -34 -387 -188 -348 -89 -121 279 -224 27 -192
1873 -192 -39 56 27 323 233 283 -301 -153 266 75 -141 220 243 210 -272 188 104 -108 -85 48 26 -189 -574
1896 -574 -398 82 -268 -158 123 -165 -332 -319 100 115 -242 -38 155 206 4 -1 -159 250 216 204 299 214 -64
1919 -64 -12 225 27 -129 -241 164 39 -244 -254 -36 -17 -291 -289 35 -35 -98 -318 -49 81 -388 -59 378 112
1942 112 -21 -99 205 268 42 67 160 144 -21 96 229 13 -216 52 140 -201 -196 -103 99 -216 -41 208 53
1965 53 6 -333 12 -292 -40 70 -266 199 -6 -29 16 293 19 254 325 262 199 -76 37 369 -2 31 101
1988 101 248 -342 -185 247 156 -225 -172 -84 62 -48 -450 62 -115 -85 50 98 134 -342 22 554 226 56
2010 56 -274 254 134 -112 222 268 314 -299 -34 186 155 -204 -98 104 -433 -247 -130 50 3 -30 -447 -62
2032 -62 -175 -231 108 -188 -11 -35 320 150 91 208 164 24 151 202 111 79 310 85 -64 238 -213 -221 -164 111
2056 111 -14 198 -128 248 -104 -140 -323 -101 -302 35 15 55 -198 -173 225 120 -128 64 371 84 22 52
2078 52 296 -30 -117 -103 330 115 -306 -44 -58 8 -107 -84 57 -147 81 11 -283 -230 -18 104 -212 -149 4
2101 4 128 -226 -121 358 12 42 263 161 41 -25 402 190 28 298 429 -233 -238 247 136 -149 -194 115
2123 115 94 -214 -103 121 -262 -491 169 69 -118 -289 130 342 18 -92 354 115 -239 63 452 -18
2143 -18 -212 252 303 -200 130 93 140 -246 -73 172 -121 -64 -92 83 -174 -368 -138 160 -236 -135 -72 15 -278
2166 -278 363 312 -63 -122 339 211 -65 46 240 210 -57 218 68 -215 -106 260 66 -536 -269 261 -67
2187 -67 -406 -7 -111 -143 -269 102 78 -198 -425 240 59 -226 -54 346 207 -225 -29 314 91 -181 372
2208 372 192 129 -26 293 191 -92 -357 267 -86 -399 84 -19 -341 -226 18 -126 -276 -149 334 -61
2228 -61 -26 277 -55 -239 117 149 208 -121 295 284 70 -28 161 326 -116 -43 237 -44 -231 -145 264 -30 -204
2251 -204 -33 37 -122 -193 305 30 -205 -74 344 -59 -513 70 399 94 -200 340 198 -138 -110 175 242
2272 242 27 96 431 -127 -323 226 140 -237 -304 128 -59 -206 -45 224 -282 -340 -7 220 -570 12 169
2293 169 19 -207 86 113 -66 -180 29 280 174 -144 381 178 -181 -78 439 147 -162 93 172 194 -253
2314 -253 -91 48 -262 -22 -68 139 -407 -13 213 -18 -174 -182 326 -108 -249 178 274 -87 205 262 39 -90
2336 -90 290 215 120 -68 181 207 -282 -145 236 -249 -258 40 26 75 -411 130 165 -423 -112 128 -48 -112 215
2359 215 480 153 -400 83 365 306 -31 376 200 -120 -134 263 27 -315 -62 140 4 -197 -108 -125 -376
2380 -376 -137 7 45 -169 42 47 -195 13 -45 -80 104 191 68 170 -155 47 235 33 106 297 241 -267 87
2403 87 123 41 -21 -35 22 -122 -116 215 11 -395 -448 111 -205 -303 -204 226 66 -203 -88 145 -269 -238 283 218
2427 218 -80 -27 139 275 145 76 165 76 -142 -152 483 -10 -132 -94 -15 138 -106 -76 -30 -64 -51 -30 -218 -178
2451 -178 150 -136 -84 250 8 161 106 313 41 -30 102 289 152 59 -30 44 246 -33 81 121 -192 -118 109
2474 109 -40 -263 116 -118 -23 -67 -125 -214 -180 -179 192 -90 126 4 71 161 -131 41 225 70 -146 -47 187
2497 187 22 -224 45 -89 -63 -40 -66 -112 119 310 35 5 -247 -2 -21 -266 -115 -141 5 50 139 63 232
2520 232 -97 89 -106 -76 174 -146 -40 152 179 126 -86 -89 83 -42 -230 -4 195 -209 -47 -78 93 -256
2542 -256 -211 97 -181 -179 -275 122 -85 -42 127 -218 -5 182 -72 -144 20 54 -31 139 241 128 123 -7 233
2565 233 119 167 -59 188 -56 63 -78 -93 8 -279 -148 -210 28 -75 18 -174 -111 -10 51 109 0 -36 -28
2588 -28 76 192 127 56 -19 147 108 -118 126 111 138 237 81 199 -150 -155 -95 -1 -359 -202 -201 -117 -36 135 135 -106
2614 -106 -372 -37 178 7 -126 -65 154 135 145 -12 -52 80 -96 38 -254 157 40 -201 -124 6 -59 145
2636 145 78 210 -150 2 -265 -176 -146 84 -169 -166 -68 28 7 48 74 21 157 283 41 -14 247 198 -125 -112 135
2661 135 18 -127 67 175 -145 -183 -137 -140 -103 -191 -62 23 -61 -109 -12 19 -65 169 175 76 -127 -2 85 -73 -208
2686 -208 192 226 180 -106 -17 267 96 39 229 -125 -119 -111 171 13 -122 124 -150 -342 -178 51 -284 -119 272
2709 272 -141 -111 -63 175 -159 48 162 6 53 -69 151 91 118 122 117 -83 -7 -8 379 -139 -77 -17 49 -152 -130
2734 -130 348 295 -97 -175 -156 130 -448 -372 16 130 -87 116 215 -16 -41 238 158 139 4 59 305 -282 275
2757 275 50 206 -20 35 205 -215 -143 66 -107 -41 -53 9 -71 -236 185 70 -230 63 -95 -297 65 -213
2779 -213 -117 -84 91 132 -107 -244 113 212 -96 50 40 218 -7 -233 108 -66 28 -207 22 -168 -27 -298
2801 -298 150 49 -130 -135 -89 32 -165 69 117 -164 -255 25 61 6 25 275 198 11 180 31 43 210 126 221
2825 221 -16 -57 50 258 -202 -324 -129 33 -5 -230 -168 -39 -161 162 -221 101 182 -224 -15 44 68 -91
2847 -91 67 290 57 51 107 75 -42 79 -288 84 235 -261 -322 28 -22 -59 -20 -58 118 -161 -20 -46 -126 260
2871 260 -29 128 28 -26 -33 -9 26 124 174 109 -120 64 103 151 -13 88 -40 -149 -51 -36 81 123 236 -93
2895 -93 -148 -70 65 39 167 72 -145 -217 -64 187 -40 -19 -3 -66 20 -224 409 45 335 -282 156 274 -23
2918 -23 -330 -195 1 -115 -78 -133 128 -66 -159 71 -24 -187 -169 -42 203 -41 -17 280 -102 -97 153 234 -7
2941 -7 -185 72 82 -177 -82 92 76 254 198 167 -120 -118 -94 -118 -39 -370 66 -2 106 -173 -180 215 -154 -19 -105
2966 -105 -208 8 136 111 134 -55 -11 129 72 104 -125 142 225 -22 -60 -114 202 57 94 -147 -80 -65 -71 67
2990 67 179 44 -330 -135 135 8 82 45 160 -262 -137 79 106 -132 -6 -60 324 106 161 197 16 57 10
3013 10 122 -117 -65 -185 -13 -18 -76 -67 -17 52 -147 -15 -136 -105 -231 33 -114 -7 -58 -35 90 54 192 -114
3037 -114 6 -215 -174 11 221 -109 150 26 -93 -20 100 -64 -62 85 -101 -130 -420 46 -77 44 146 -73
3059 -73 2 -69 -102 -203 133 75 81 -80 6 39 80 119 -35 77 -251 -83 175 -67 -128 45 -75 -18 271 -90
3083 -90 -211 36 -12 -110 -379 71 21 72 -136 -242 -83 107 -61 -50 35 -162 65 -92 -83 222 22 -70 38
3106 38 -50 -121 23 -122 121 12 28 -154 122 23 203 122 -31 103 150 -89 -42 -5 108 -181 29 196 69
3129 69 -171 114 -282 198 67 66 -33 28 -8 72 -22 217 43 98 74 -262 -35 -359 -32 -386 101 -199 -52
3152 -52 -29 -97 125 -23 103 32 167 114 -124 -108 141 -64 -69 -26 322 359 6 104 117 -440 -157 -177 81 228
3176 228 -129 337 -298 -179 75 20 52 22 95 -215 -7 3 -21 -104 -23 130 58 122 102 -103 28 204 -70 -16
3200 -16 168 -258 135 -129 85 176 -42 -83 35 68 -139 -5 -242 -66 71 12 -134 43 41 -171 -98 -162 219
3223 219 -183 -103 198 23 -244 -63 -84 172 18 -1 -112 -8 140 75 130 97 -154 290 144 169 15 27 109
3246 109 -76 37 105 88 -190 -156 -160 45 -180 49 -7 19 -71 40 54 -94 -17 40 93 -107 71 68 -16 209 -91
3271 -91 -96 199 -52 -167 53 172 201 -64 -58 76 -177 -98 -91 -19 187 -68 114 48 -39 -102 267 109 213 29
3295 29 -113 7 -3 164 -18 263 53 87 50 79 -231 50 -30 -59 -111 -88 210 -18 -89 54 -6 -239 -17 -166
3319 -166 288 -66 -117 -64 150 -323 288 133 107 53 227 183 20 27 -35 15 -43 10 46 -226 188 25 76 149 22
3344 22 -140 139 -206 -223 -215 -172 -50 192 253 68 143 -36 -68 -97 53 219 156 150 197 -24 217 36 -1 64 -27
3369 -27 -6 -55 -57 71 35 140 -129 -118 -76 -68 -182 40 222 4 39 -233 -236 -26 266 108 -210 230 3 61 -100
3394 -100 65 -8 69 1 -24 -120 -111 -31 -5 -125 -96 -67 -33 -19 -129 43 -102 -126 40 92 92 -34 34 116 44 -255 -155
3421 -155 302 37 -38 -91 -72 -72 -261 -33 244 -24 58 -275 13 44 -202 22 22 -155 104 -154 95 -126 -43
3444 -43 201 -53 -133 220 -105 171 -198 46 -15 -20 169 165 -88 36 200 28 -26 106 -86 -50 41 -143 8
3467 8 24 234 -20 191 -86 157 -186 96 -11 84 -67 -81 -117 -26 -41 75 208 118 -38 -83 26 83 -60 25
3491 25 159 211 31 -163 7 33 69 -50 304 155 -63 129 -75 181 291 -74 5 -34 181 186 22 173 -124
3514 -124 -14 25 -45 -9 -95 -228 -40 -201 165 37 57 255 52 182 26 10 -99 50 -26 -242 -14 -12 -57
3537 -57 139 -58 53 -120 -23 53 170 -37 29 124 193 37 -54 -6 -175 -145 156 -104 206 -190 85 -130 7
3560 7 100 -72 -10 -18 -84 -62 -77 -203 62 -367 -5 -34 -82 34 243 -63 73 -53 211 67 -80 14 90 -295
3584 -295 -149 110 -16 212 250 -66 272 105 -143 -125 -25 -97 -62 -98 5 34 50 -269 46 53 167 -185 -158
3607 -158 -65 -107 243 -18 -42 -80 -102 -59 -38 -54 88 -99 -158 37 -53 -41 -101 -26 -176 68 -104 -121 1 -75 202
3632 202 -29 -163 -69 15 -8 -27 -63 10 122 7 -7 5 39 73 -101 -8 153 -122 50 59 191 -100 -76 141 -64
3657 -64 -95 0 -42 -241 116 -66 -186 216 168 11 -54 -101 13 -59 37 95 19 -128 0 -120 135 52 -14 -59 97
3682 97 177 -140 -173 -30 86 99 35 -67 103 132 -185 -16 105 -33 -314 200 91 -51 101 9 0 -76 14 -95
3706 -95 10 -17 91 -228 15 -376 -76 -93 87 -45 72 -232 -41 -2 153 243 157 -53 88 191 -33 95
3728 95 63 -34 -5 -132 19 -25 -54 194 -125 -84 -65 81 25 109 73 53 195 341 35 95 127 -206 60 10 -79
3753 -79 -165 35 -75 82 -108 -74 -161 272 -18 -91 130 -108 -18 0 -225 -40 94 176 177 345 198 121 31 150
3777 150 -78 160 180 -36 -117 156 48 -229 -47 28 -74 -7 165 102 -262 -46 -20 -141 -117 51 -128 200
3799 200 166 -173 -57 -187 13 34 134 137 -23 -3 70 100 28 105 -106 -7 192 -30 -75 45 -1 161 17 -18
3823 -18 264 -99 -80 88 67 -64 -169 42 -95 262 100 148 -40 -179 88 199 73 208 80 -13 143 -33
3845 -33 164 -8 69 120 189 148 161 88 1 160 -223 -91 205 -21 116 -131 -139 58 92 43 -12 -39 163 206 -182
3870 -182 -249 -44 -114 12 65 138 182 -162 -112 -62 -16 79 -60 20 -57 -78 85 85 -81 10 182 63 101 -237 -194 38
3896 38 117 131 -103 32 16 212 -29 -56 14 -150 -56 60 -34 -96 -173 -99 95 74 26 186 -185 -175 64 -71 -166
3921 -166 -106 85 13 -54 -19 75 198 60 -62 16 -136 186 64 -19 44 -19 -27 -12 218 219 -80 -166 68 -68 -67 62
3947 62 152 -61 -6 -46 292 -218 -152 -175 -42 -36 -134 216 -31 -30 -26 -304 47 -106 -29 137 119 11 -110 176 98
3972 98 -48 89 12 -256 95 230 62 44 124 -70 54 34 -316 -195 100 174 -402 93 148 -30 -25 -35 -90 -129
3996 -129 177 39 -247 49 88 -181 -58 102 176 -174 -39 -202 -67 156 178 195 282 128 81 32 183 71
4018 71 70 -211 -172 -329 -93 -317 105 -28 -170 -256 43 103 -26 87 -112 -222 259 -48 27 -49 9 168 152
4041 152 20 -73 83 -128 -30 145 -11 -242 198 42 -13 -37 -77 -100 243 -116 -252 309 52 -22 100 -102
4063 -102 20 227 134 -226 -229 17 113 -107 211 210 -22 104 -95 71 4 76 -189 -85 -49 -60 -179 -110 -114 185
4087 185 -316 138 75 172 -23 -82 109 -87 -158 130 51 -130 35 99 193 -56 -25 -96 8 -166 -271 322 25
4110 25 -88 -65 5 107 -100 123 -277 -74 -309 107 32 133 -131 112 271 32 -78 141 -255 8 -117
4131 -117 2 -121 -25 68 -37 -87 88 -15 54 -27 -38 -33 35 -114 73 -149 175 -22 19 -34 126 186 291 -258
4155 -258 202 89 2 -205 -199 70 122 281 27 -64 26 -103 64 -116 136 -99 -59 37 19 -52 -162 37 -33 59
4179 59 -153 -46 21 7 82 216 38 156 -257 -27 167 209 -84 157 -10 -9 82 -53 195 94 -19 -91 -135
4202 -135 -53 129 17 -214 -101 -125 -330 -50 -50 -25 -49 25 -8 -126 -119 -110 23 46 -149 2 164 -126 40 64 432
4227 432 209 -38 -18 -34 38 37 -256 169 -99 27 -144 141 91 251 136 -158 -27 -90 -73 -272 -48 -112 25
4250 25 113 -67 -3 -8 131 51 51 -77 98 141 98 24 -232 120 86 153 -7 46 48 -179 -183 -360 -52 102 77 42 -225
4277 -225 -204 80 -102 294 -92 -103 17 -28 -75 162 -115 -299 -100 -14 224 -133 -108 -47 -44 -86 196 87 -152
4300 -152 32 -91 -64 145 -216 101 -110 -72 44 155 -45 -309 -196 -59 192 -32 -13 78 -68 31 171 102
4322 102 -49 -76 -141 10 132 -196 181 -54 159 135 44 77 -73 83 35 -90 291 -132 -187 -213 60 -19 138
4345 138 -61 -272 -135 -41 -48 -193 -177 -100 -18 -64 166 113 39 223 -30 181 231 -28 125 78 200 6 -99 -153
4369 -153 -43 -21 -67 -28 7 77 -241 -45 -16 -151 -303 85 92 -3 -47 16 -45 -99 30 66 27 -93 55 -172 163
4394 163 -57 133 121 39 135 -143 -141 -199 96 60 136 220 -159 209 -116 167 324 -119 -318 -168 -9 -121 165
4417 165 52 167 -93 38 -105 -57 152 171 112 183 -29 -218 189 -181 -33 -74 100 10 49 -77 77 6 -157
4440 -157 129 -33 9 -33 159 -140 75 -193 170 -180 168 -42 -12 66 -232 91 -136 136 -201 -82 156
4461 156 25 59 -170 -210 -89 475 -185 -76 -1 -250 4 72 89 -97 -3 -123 -54 13 131 -277 -74 -30 27
4484 27 -316 34 31 -289 91 71 224 -55 78 19 -37 -23 28 35 276 -139 117 95 45 51 -179 -133 -232 100 128 -43
4510 -43 -21 142 91 186 -92 173 -36 15 62 -147 99 -85 -9 30 -131 104 152 -68 268 -305 175 102 148 -34
4534 -34 119 -156 -60 -23 71 -143 129 -184 30 212 -90 -173 -10 -11 51 -79 37 -65 83 -37 52 25 -21 -120
4558 -120 -124 143 -61 -5 150 127 -36 -122 -36 -38 10 -164 -30 -11 -175 183 44 223 110 -54 25 214 -212 -6
4582 -6 108 125 -89 -278 79 -110 -93 -90 -51 -1 34 28 -87 15 23 -54 117 83 -77 -10 -60 -57 -19 -124 132 -70 30
4609 30 135 -71 -171 68 201 -144 250 -87 -107 -190 6 109 90 -226 -28 56 203 79 -385 31 14 -162
4631 -162 -272 -105 -117 -121 111 78 -96 49 157 327 20 -100 216 110 -157 -115 175 -158 177 135 5 -101
4653 -101 83 32 81 -149 104 -7 -74 10 -3 -132 -81 126 73 -35 -181 60 119 -92 4 -34 10 150 166 -67
4677 -67 87 -52 50 -15 17 -6 126 98 -34 -181 -20 -76 128 -2 20 -189 203 106 -106 -86 -172 198 46
4700 46 16 -407 15 91 50 46 -307 1 67 -165 -85 49 61 10 23 -64 133 164 -133 165 85 5 -272 84 118
4725 118 47 -29 -87 53 -124 44 26 -19 69 -120 -352 -148 -113 -275 6 179 324 -75 82 225 170 122 -106
4748 -106 -44 -105 170 76 -97 107 -10 -34 66 -15 334 49 227 -41 72 183 176 175 -15 40 -13 -138 -166 -5
4772 -5 129 62 -27 27 -32 38 -154 -164 -123 78 -102 -2 113 125 -34 -103 -58 -61 -10 50 -36 -88 -232 -67 107 -154
4798 -154 264 61 159 202 289 -95 -169 62 45 -176 -121 41 135 -48 -5 180 151 59 207 294 -132 -140 -175 77 -165
4823 -165 -222 -73 -19 -22 -37 -43 110 79 -133 181 -159 -51 122 -125 159 -58 182 129 308 60 53 -82 60 8
4847 8 11 -84 44 -60 -51 -40 -95 338 -130 -53 1 207 19 -101 -3 -68 24 203 274 45 80 83 -248 -44 -16 -48 80
4874 80 84 42 78 181 20 -75 -99 -49 -150 -49 -17 288 195 111 -102 53 93 37 171 134 -111 -85 222 128 -107
4899 -107 211 -59 -244 37 280 28 -110 -62 10 -60 3 145 -203 -309 -100 103 31 -27 -151 80 193 -325
4921 -325 -32 -198 -39 113 -5 228 -160 215 248 65 78 305 -34 127 -54 319 -38 -81 -184 67 -123
4942 -123 196 -16 -45 -7 -374 59 -52 -115 -33 100 -186 -99 36 -112 -90 -219 116 -86 146 103 28 124 13
4965 13 -9 -79 -50 40 49 -78 197 -132 13 136 -145 22 -45 -8 -45 117 12 101 213 227 -85 -203 -82 -61
4989 -61 -140 90 108 -8 202 -113 -60 -56 -83 261 -213 -27 -103 134 49 149 85 -33 12 31 -120 42 -177 -56
5013 -56 -267 -119 -178 70 40 63 -1 184 223 179 234 87 -112 131 -17 138 -13 29 61 226 84 -55 -19 -83
5037 -83 -44 20 -107 -75 176 -63 144 159 14 -128 -12 -61 -204 -58 254 -260 4 221 154 -101 -15 113 -172
5060 -172 36 140 227 73 161 61 257 23 -19 232 119 -149 -243 -4 -46 -50 -87 29 4 -133 -137 74 -60 -73
5084 -73 -35 65 -175 -4 129 -21 -89 32 -54 53 402 -130 -67 -365 144 85 94 -193 -169 -98 -266 -191 -260 -61
5108 -61 -153 100 -59 -154 3 -23 5 -238 200 78 96 -3 237 -147 -175 -38 -148 -47 263 -8 -73 3 96 217
5132 217 -202 87 345 26 -38 -163 187 146 63 -24 -161 -38 58 313 227 102 98 242 439 -20 -78 158 136
5155 136 63 -134 268 147 -163 147 -245 -20 -310 84 19 136 -136 -147 70 -48 141 -62 -31 -33 75 373
5177 373 -58 121 61 6 180 -58 89 -40 132 -6 -43 60 40 -260 -107 11 -168 132 18 60 -31 109
5199 109 -46 5 170 -25 12 62 -115 -105 -18 -196 97 74 86 92 -339 66 127 9 -77 92 -44 92 94 43 -23
5224 -23 316 52 -82 -63 63 -59 287 -36 75 72 -41 -15 -59 -103 -44 -45 102 130 73 -173 158 78 44 -187 -31
5249 -31 29 144 193 49 235 -99 -65 -4 -51 -20 74 75 -47 22 1 28 92 -36 0 -235 150 -60 44 -38 103
5274 103 -204 72 146 62 55 212 -49 109 183 -121 -24 -206 189 -160 -384 -69 36 92 -92 -34 33 138 -31
5297 -31 -163 -137 121 42 121 48 -247 232 -18 -164 167 47 97 -102 -137 84 -58 -173 219 -81 27 140
5319 140 256 -10 179 -4 -131 -88 -136 -78 -40 -126 -182 87 -230 -268 113 -71 -32 -253 -232 66 25 -106 24
5342 24 -98 -229 -103 209 30 214 47 91 -3 -8 172 -90 -229 -49 134 216 116 4 -283 -54 68 -46
5364 -46 -114 12 -325 279 234 106 102 -109 69 -51 -188 -168 -61 46 172 -177 205 66 -26 177 140 68 79
5387 79 -46 93 -55 -206 -123 56 -112 13 -15 -7 -74 19 108 -168 -14 -10 65 138 178 13 -43 -243 -125 170 -23
5412 -23 -12 112 -68 55 34 320 179 -150 -20 -71 -74 191 36 20 -138 -181 -14 -88 144 146 -18 -158 -183 -63
5436 -63 -153 -21 243 -101 -211 -208 -52 106 49 -72 98 -6 -4 50 76 -117 -19 102 92 -222 37 -69 9 55
5460 55 -165 -185 -8 130 45 94 -19 90 -77 -213 292 -141 81 -42 -108 -253 178 66 92 73 315 38
5482 38 -74 77 -16 100 158 -70 89 -107 -61 -10 24 6 110 -84 -279 14 -15 -13 -177 -95 60 2 113 81
5506 81 34 141 18 143 90 -10 10 -64 -167 -89 108 295 161 -45 -73 226 -117 85 -161 -344 -129 -53 -139
5529 -139 -230 145 18 -7 -8 24 112 117 -104 -203 7 154 4 -296 219 -42 100 95 12 253 -197 146 212 0
5553 0 -23 -47 -158 -40 -107 -335 161 67 -79 -26 -27 156 84 -96 -60 21 -6 -124 -104 198 126 6 58 38 109 142
5579 142 158 -202 -203 -23 -20 194 110 46 137 -54 -228 140 264 -92 91 -12 -261 -79 -138 47 -45 -123 66 -28
5603 -28 -164 44 -47 74 -56 98 7 -240 7 -92 -22 -102 227 -79 -120 65 390 -316 18 72 -20 -109 19
5626 19 190 -40 22 36 111 -36 126 179 47 69 18 198 -25 -72 -225 -60 -27 -194 91 47 84 -64 -31 -23 -7
5651 -7 97 245 -72 -63 175 -124 197 120 -13 30 -139 -138 60 132 -21 17 -191 -190 -239 123 433 189 -249 82
5675 82 -591 -37 -26 185 20 -293 106 2 89 -161 64 37 38 67 49 24 -142 49 17 74 56 -34 160 -124
5699 -124 213 -146 -79 340 125 29 -64 -17 33 10 260 -21 38 -77 -132 59 -122 29 -52 65 -177 -160 -168 79
5723 79 -208 -70 -105 -56 -106 -29 -122 -250 -16 -170 -122 278 74 185 -91 36 313 -140 347 -33 172 -365
5745 -365 336 45 -50 -156 125 183 -20 -256 10 -21 -352 50 75 80 2 -308 94 -118 -10 -96 -213 -38 -115
5768 -115 -12 29 97 39 74 263 44 -241 3 53 299 -117 -10 -52 71 91 234 -244 -119 102 -46 -12 355
5791 355 -118 173 44 -44 -97 3 39 73 214 39 -63 222 -3 -33 126 13 125 165 -149 -153 -317 97 57
5814 57 -23 -69 111 -140 -77 -165 -12 -49 -31 -44 20 69 -4 72 209 -32 -4 92 129 56 -15 83 140 -159 32 84 -172
5841 -172 -333 -147 223 50 146 18 7 -129 -114 -185 -204 -116 -47 -96 -36 -6 22 -144 -73 -123 -180 221 113 71 30
5866 30 -362 82 -185 -224 82 160 -81 -33 -56 -9 -144 11 -225 155 -151 96 88 -176 -58 -243 135 -85 103
5889 103 153 84 -43 -200 -128 144 57 140 73 90 176 -83 10 -95 122 -118 -67 105 9 82 36 88 23 -41 12 -109
5915 -109 98 5 206 -56 -26 118 -100 -63 -53 -33 43 104 -34 302 166 -78 -304 -248 87 57 -4 35 98 113
5939 113 -17 -86 52 53 -6 47 64 146 -147 -240 159 -29 -132 -92 -86 -95 72 326 124 12 129 -59 -58 -48 -5 194
5965 194 69 167 -19 45 -193 92 30 84 -52 -7 44 220 247 65 217 96 133 103 -105 81 -205 133 188
5988 188 151 156 -71 146 36 148 62 9 -144 189 5 -56 235 -105 -71 -43 80 156 -51 -83 46 146 -66
6011 -66 -143 -124 -217 -64 -176 -156 125 30 -246 -48 49 324 180 47 156 -182 -106 159 -120 -81 106 -25 -260
6034 -260 -44 -10 61 12 99 5 38 147 152 27 -56 12 50 -124 -166 43 159 194 115 256 71 128 25 235 27
6059 27 351 5 79 -112 -118 -149 -26 -20 -111 -243 5 -110 6 14 -171 26 58 -72 31 67 -98 7 -229 -94
6083 -94 -110 -250 -151 -126 196 88 214 75 123 71 -55 -6 25 287 -17 18 -29 45 53 -121 -191 173 -100 -177 88
6108 88 131 -129 59 -28 -51 133 176 47 18 103 157 21 32 147 2 72 29 140 103 -165 107 30 -47 -75 75
6133 75 1 -116 120 -26 355 -129 -50 -59 91 93 -12 -121 22 -217 40 139 125 -162 87 376 8 49 261
6156 261 -111 135 166 -42 21 -269 -7 33 -74 -90 19 99 33 135 197 211 -145 -114 -239 -43 -23 -326 -102
6179 -102 203 314 -36 -248 -270 123 294 140 -172 150 -117 -56 52 78 -172 -19 -183 -10 155 -113 -30
6200 -30 -14 104 46 265 -215 -29 -85 54 139 -99 210 111 87 204 106 70 -22 47 -44 224 2 -3 -7 163 -51
6225 -51 169 15 -33 17 149 -81 -124 30 -160 147 -25 20 -122 -265 -58 101 -62 -25 -29 -276 -141 177 -11
6248 -11 279 98 38 48 68 193 -68 153 -52 -58 -126 -151 -34 -1 -18 -142 -25 91 63 20 -196 -49 -146 131
6272 131 299 118 0 81 166 159 -170 250 -216 -151 116 -183 -171 12 -235 341 135 234 124 -82 143 64 148
6295 148 97 147 28 120 -197 243 -202 -49 109 20 -1 5 -159 137 183 85 89 -49 95 235 242 -49 161 14
6319 14 -2 168 21 -108 -8 -180 -98 -204 70 2 -61 -11 -19 79 59 -113 -54 -183 -27 -180 127 -127 88 13
6343 13 73 43 97 11 18 167 207 203 14 51 80 128 41 -67 188 204 244 105 -150 -137 -86 -68 -107 110 -254 -22 74
6370 74 74 236 -154 5 -204 -153 109 -16 159 144 137 -82 60 93 -295 -39 -232 -33 278 31 -16 188 -105
6393 -105 59 76 94 -62 -99 61 -179 -35 -143 -3 -57 140 -180 -91 28 -82 -76 208 71 -133 -236 73
6415 73 22 -27 -58 -187 37 -322 53 44 37 -162 -17 -94 -108 3 -152 -185 -200 145 -132 121 112 171 140 94 1 130
6441 130 -147 310 213 17 217 -237 106 -103 84 -309 -94 140 -18 33 123 29 -2 88 -272 31 -225 -297
6463 -297 -98 -14 -28 -154 -125 -13 -246 -57 88 -128 103 -98 -98 161 45 -94 11 25 124 62 81 169 47
6486 47 -81 -157 -71 -65 -200 42 51 -94 -24 -37 9 -123 -32 -125 23 44 30 -140 198 -33 -33 33 44 -26 40 191 -12
6513 -12 -25 -272 -177 -43 -153 146 300 -9 13 30 -73 -105 65 59 29 14 249 191 -100 67 -10 25 185 -32
6537 -32 -88 33 8 -10 237 -92 149 56 -180 -77 -245 145 29 -47 -14 179 231 56 172 35 -5 -119 -80
6560 -80 156 26 143 -16 -147 -80 -22 74 142 -342 -14 88 -111 39 129 116 -154 -5 -26 82 -23 33 73
6583 73 40 187 -14 -268 -133 -216 -162 -27 -108 -103 -149 -275 -132 3 -164 94 -113 225 -58 117 102 4 85 -57
6607 -57 234 97 -179 111 -115 -65 51 126 -316 178 -328 -130 82 -107 -36 79 -102 -77 142 42 68 111
6629 111 -35 -37 228 -74 8 -111 58 -55 -146 -21 148 -41 94 44 -146 56 222 236 142 169 23 44 -89
6652 -89 29 60 -93 28 -55 -70 -226 2 209 -116 138 -12 -19 -167 23 -160 -81 6 107 -24 2 -180 10
6675 10 326 -103 -48 -100 -88 196 -7 147 135 88 185 59 61 177 76 84 79 77 33 -198 -153 -38 -86 -12 42 -70 234
6702 234 118 -153 19 162 -204 -2 -338 168 -114 -176 96 -233 71 3 106 171 93 179 -149 9 169 -10
6724 -10 -25 -15 37 94 -19 -59 -202 65 -9 25 117 184 -70 -23 162 -42 250 108 192 -25 -55 -55 27 155 -11
6749 -11 -156 60 70 167 -8 -64 18 -65 103 -12 19 86 331 30 32 149 -260 64 -72 -90 -65 -25 -36 113 84
6774 84 -13 51 182 100 -14 -6 105 -70 70 -10 -26 -182 179 237 -89 -41 -59 -75 18 92 -105 92 108 153 -56
6799 -56 -24 -4 -6 36 87 -185 -93 -292 116 -58 -101 -193 19 -46 -3 -81 2 28 -94 63 101 -63 44 -17 14 90
6825 90 -278 112 42 60 -14 -81 128 294 -2 107 -111 -166 284 114 41 65 -110 150 60 -374 -19 106 120
6848 120 -38 -160 58 -21 -167 81 -19 -121 119 140 -140 33 0 122 0 -100 88 67 -120 -103 -68 64
6870 64 171 -222 131 -22 -11 92 56 -139 -199 -77 55 -134 -166 -258 -65 -12 19 52 130 -54 -171 -127 -159 203
6894 203 23 153 42 56 -179 128 -1 86 -96 199 28 -15 29 82 81 102 -259 79 -149 -89 -62 -138 123 -102
6918 -102 165 48 66 -151 -21 -228 190 -127 -26 -20 72 -11 30 47 63 35 -22 -137 122 -14 136 -74 64
6941 64 20 -140 -42 16 -74 -61 19 8 -204 253 -2 96 291 101 38 27 63 14 -64 90 129 219 24 70 -141 101
6967 101 14 205 -31 -12 138 -183 -91 135 43 -78 -190 -166 130 -236 63 -21 -93 63 7 -34 -213 -10 214
6990 214 14 32 -163 220 109 -111 29 -293 -20 51 -99 61 -76 81 -267 -120 -219 69 -67 -214 63
7011 63 -186 -23 -23 48 -34 37 -44 -207 -65 172 56 92 -329 -268 -121 -119 -31 109 -12 -395 11 17 181 118 -33
7036 -33 28 -103 243 63 -36 243 36 65 -155 -178 22 -149 51 3 49 -62 -118 -18 -87 3 26 -250 53 15
7060 15 -7 95 6 15 34 205 8 108 119 -168 -32 -46 5 4 154 224 -65 -91 -305 -260 239 -67 225 207 -212
7085 -212 -196 -94 76 -56 -171 68 85 169 -28 228 47 246 97 124 4 -209 70 -29 -136 -157 360 158
7107 158 -72 -71 -60 137 103 16 -6 -41 -64 116 27 -108 157 -5 120 193 71 -117 27 -215 85 234 21
7130 21 -102 -18 253 187 -133 -42 -265 -56 133 -86 12 167 -143 -114 -125 26 -254 30 91 -106 19 28 -225
7153 -225 126 -153 81 -20 -2 -16 -184 94 -137 -37 70 30 -115 -214 196 90 170 -66 -89 -24 -84 177 -118
7176 -118 -148 43 -134 -86 192 46 163 106 117 -204 -19 0 6 -262 30 -171 -186 -23 225 129 117 -225 -176 72
7200 72 -95 136 -54 -119 -64 -45 -41 -106 -83 241 -12 199 37 135 85 -7 -233 212 42 278 -133 57 143 168
7224 168 34 -214 104 -109 136 247 -48 -20 -61 -45 -107 154 200 -91 -201 -153 -81 -135 -265 -198 -15 -38 48 -113
7248 -113 -110 150 -16 -5 -232 -115 68 36 -135 -81 -46 -226 -62 -48 -190 -120 -26 -119 91 124 118 -220 -77 69
7272 69 -19 153 -99 185 -178 -227 -139 -91 25 -35 194 -193 256 -77 -15 -45 -217 -220 65 -31 58 96 -103 -112 -46
7297 -46 242 -80 -162 71 193 219 101 4 -247 -39 19 -177 36 271 186 -91 -184 59 20 57 35 -170 -163 -59
7321 -59 -17 -17 -77 -64 -50 -88 -11 92 -72 -150 55 44 -108 287 -146 -204 -146 -21 53 40 -38 58 -55 -73 -55 -41 -15
7348 -15 88 224 -120 52 9 -104 158 47 -80 14 -34 23 -47 -28 -41 38 60 17 -145 -28 243 -179 175 -28
7372 -28 -26 -157 104 -83 151 -102 -69 60 -39 -153 165 33 -208 113 -3 -70 158 36 -156 -124 -100 121 175
7395 175 218 -18 37 -78 -128 -138 -171 24 -128 -115 -262 30 -158 -215 -50 -100 -157 14 120 -16 46 -57 -123 123
7419 123 115 118 -55 30 -37 97 -206 -23 240 -115 196 89 198 -213 83 270 155 -16 30 39 -35 -37 79 -184
7443 -184 75 -13 162 66 236 -8 -217 78 -108 9 -149 -87 213 -32 5 33 -158 118 -13 66 -48 -57 21
7466 21 32 -12 -76 49 -84 41 -52 123 -74 116 118 -31 75 -44 119 -66 -12 46 -112 165 -60 117 94
7489 94 227 186 -95 48 -130 -23 -9 -118 150 1 3 2 -361 -53 139 41 -116 -86 85 157 -178 112 -136
7512 -136 13 -153 6 184 -3 -22 -1 -38 27 234 -195 -68 -192 25 -64 91 -80 -72 28 -164 -1 63 -60
7535 -60 -16 99 60 19 76 76 3 262 -49 -28 -44 -40 -73 -16 -157 18 80 -78 130 42 -13 -77 -92 7 -107 -177 5
7562 5 -33 -71 -49 -49 24 -44 152 33 -249 242 -93 65 333 74 -77 24 146 196 -206 113 171 -39 61 132
7586 132 148 -159 274 -86 -116 43 60 -28 77 94 48 -66 -296 245 165 -19 -73 -197 -118 -62 -99 152 -77 130
7610 130 153 389 -125 93 63 7 -241 -213 70 116 -255 -249 -3 -86 -11 125 99 -44 205 -259 213 54 166
7633 166 37 67 313 89 -40 24 302 -258 -23 -19 -20 217 -199 85 70 -1 76 164 268 -272 81 87 96 -22 40
7658 40 -208 -55 -45 14 -146 -142 58 -118 -83 241 240 -100 -350 58 -44 98 -200 -15 -47 172 37 220 321
7681 321 53 69 7 -239 112 -113 13 -99 -305 -22 315 -28 -199 -227 58 9 -199 101 -10 88 11 115
7703 115 171 -74 -55 -88 45 16 -82 -189 -19 28 49 -118 315 -291 133 -130 90 144 14 -43 -20 -42 -71 -215
7727 -215 159 309 -166 270 -72 -77 65 168 79 -32 6 174 76 53 -143 -265 22 13 -80 22 -18 84 117 184
7751 184 -20 25 89 29 -243 -98 -20 215 -81 -120 208 -18 -152 170 108 154 183 -259 104 103 -14 375 -16
7774 -16 -137 -56 342 -249 36 189 -20 -164 2 -150 -94 136 -137 117 146 13 68 -160 -18 106 -104 -89
7796 -89 36 -139 -84 -218 -43 130 -43 187 -114 61 -32 -201 -187 51 92 -68 40 41 -102 -7 -143 373 -204
7819 -204 -176 69 -35 -138 -56 -4 2 2 -53 -47 -86 128 70 64 151 -262 -259 26 -9 -144 41 -161 9 -113 -46 -76 -152
7846 -152 117 483 -168 26 208 129 205 53 -62 100 -267 -89 1 256 24 -27 56 147 22 105 -58 68
7868 68 133 11 6 -140 219 143 18 74 -63 -238 -10 -210 -95 7 120 110 109 82 13 0 -27 -85 -78 -205 22
7893 22 -5 112 -56 166 143 137 1 64 225 -236 -21 -389 284 76 -167 71 40 -112 -281 -131 -40 143 8
7916 8 185 -209 100 -130 328 5 40 142 -45 6 -177 -2 317 -87 -84 151 205 -100 -116 69 -64 -56 262
7939 262 34 41 -23 -79 67 -29 21 -53 157 113 45 -96 -126 -37 -208 143 -35 68 150 -57 59 156 128 -212 -156
7964 -156 -78 158 40 5 158 -72 -271 -111 -72 -390 78 199 125 -98 71 85 91 198 -44 -379 -171 -24
7986 -24 92 82 51 29 -11 248 63 132 -162 -7 130 75 253 315 114 -89 -110 126 273 -11 45 -72 25 107
8010 107 -146 185 -206 -103 -170 -87 -130 38 -15 83 141 -245 -73 -201 134 125 -62 133 63 246 178 166 -135 -130
8034 -130 -90 -143 -44 157 73 219 45 135 49 169 41 197 49 -119 -70 -4 100 -184 213 -135 -4 131 115
8057 115 -108 134 -260 -43 -205 -108 -71 303 30 146 96 -171 -207 -262 -5 34 -102 39 -13 -174 229 169 -140
8080 -140 -157 322 -57 132 141 -97 16 -154 209 83 125 6 65 14 106 239 -112 -105 21 -12 250 -177 137
8103 137 -211 11 -134 117 -106 -221 37 66 22 -126 17 63 -88 -107 82 161 28 -352 43 72 65 85 31
8126 31 -23 54 49 9 -201 -142 -11 125 -127 5 -71 -88 36 278 -215 -237 24 -15 6 112 -32 257 -97 -199
8150 -199 -144 -51 -251 -58 146 142 179 -102 139 194 -84 218 -131 13 -42 35 503 15 150 75 -227 -59 -9
8173 -9 -141 -140 127 -15 -114 -180 79 -8 -4 -102 -55 -172 -23 -285 -60 -54 -26 85
8191H5
##END NTUPLES=NMR FID
##END=
