##TITLE=1H_Pr 5037-12
 CDCl3
 8 sc, 
 17.12.2021
##JCAMPDX= 6.0         $$ Bruker NMR JCAMP-DX V2.0
##DATA TYPE= NMR FID
##DATA CLASS= NTUPLES
##ORIGIN= UXNMR, Bruker Analytische Messtechnik GmbH
##OWNER= root
$$ XWIN-NMR		Version 3.5
$$ Fri Dec 17 13:46:08 2021 Russian Standard Time (UT+4h)  she@DPX200
##.OBSERVE FREQUENCY= 200.131346
##.OBSERVE NUCLEUS= ^1H
##.DELAY= (6, 6)
##.ACQUISITION MODE= SIMULTANEOUS
##.ACQUISITION SCHEME= undefined
##.AVERAGES= 8
##.DIGITISER RES= 18
##SPECTROMETER/DATA SYSTEM= spect
##.PULSE SEQUENCE= zg30
##.SOLVENT NAME= CDCl3
##.SHIFT REFERENCE= (INTERNAL, CDCl3, 0, 15.7039)
##AUDIT TRAIL= $$ (NUMBER, WHEN, WHO, WHERE, WHAT)
$$ ##TITLE= Audit trail, XWIN-NMR		Version 3.5
$$ ##JCAMPDX= 5.01
$$ ##ORIGIN= Bruker BioSpin GmbH
$$ ##OWNER= she
$$ F:/spectra/data/she/nmr/H-F/1/audita.txt
$$ ##AUDIT TRAIL=  $$ (NUMBER, WHEN, WHO, WHERE, WHAT)
(   1,<2021-12-17 13:45:02.92 +0400>,<she>,<DPX200>,
      <created by zg, POWCHK disabled, PULCHK disabled
       configuration hash MD5:
       00 E9 B6 7A A2 85 ED C7 34 08 36 98 17 FE 4E 26
       data hash MD5: 16K
       69 CD 0E A0 1D A6 95 FD 06 E5 D2 60 02 DE C2 7C>)
$$ ##END=
$$ 
$$ hash MD5
$$ 77 78 DA 65 6A 25 20 AA C5 88 39 83 1B F7 8F 34
##$RELAX= 
##$RELAX= 
##$RELAX= 
##$RELAX= 
##$RELAX= 
##$RELAX= 
$$ Bruker specific parameters
$$ --------------------------
##$DU= <F:/spectra>
##$EXPNO= 1
##$NAME= <H-F>
##$PROCNO= 1
##$TYPE= <nmr>
##$USER= <she>
##$AMP= (0..31)
100 100 100 100 100 100 100 100 100 100 100 100 100 100 100 100 100 100 
100 100 100 100 100 100 100 100 100 100 100 100 100 100 
##$AQSEQ= 0
##$AQ_mod= 1
##$AUNM= <au_zg>
##$AUTOPOS= <>
##$BF1= 200.13
##$BF2= 200.13
##$BF3= 200.13
##$BF4= 200.13
##$BF5= 200.13
##$BF6= 200.13
##$BF7= 200.13
##$BF8= 200.13
##$BYTORDA= 1
##$CFDGTYP= 0
##$CFRGTYP= 5
##$CHEMSTR= <none>
##$CNST= (0..31)
1 1 145 1 1 1 1 1 1 1 1 1 1 1 1 1 1 1 1 1 1 1 1 1 1 1 1 1 1 1 1 1 
##$CPDPRG= <>
##$CPDPRG1= <>
##$CPDPRG2= <>
##$CPDPRG3= <>
##$CPDPRG4= <mlev>
##$CPDPRG5= <mlev>
##$CPDPRG6= <mlev>
##$CPDPRG7= <mlev>
##$CPDPRG8= <mlev>
##$CPDPRGB= <>
##$CPDPRGT= <>
##$D= (0..31)
0 1.2 0 0 0 0 0 0 0 0.06 0 0.03 0 0 0 0 0.0002 0 0 0 0 0 0 0 0 0 0 0 0 
0 0 0 
##$DATE= 1639734302
##$DBL= (0..7)
120 120 120 120 120 120 120 120 
##$DBP= (0..7)
150 150 150 150 150 150 150 150 
##$DBP07= 0
##$DBPNAM0= <>
##$DBPNAM1= <>
##$DBPNAM2= <>
##$DBPNAM3= <>
##$DBPNAM4= <>
##$DBPNAM5= <>
##$DBPNAM6= <>
##$DBPNAM7= <>
##$DBPOAL= (0..7)
0.5 0.5 0.5 0.5 0.5 0.5 0.5 0.5 
##$DBPOFFS= (0..7)
0 0 0 0 0 0 0 0 
##$DE= 6
##$DECBNUC= <off>
##$DECIM= 32
##$DECNUC= <off>
##$DECSTAT= 4
##$DIGMOD= 1
##$DIGTYP= 9
##$DL= (0..7)
0 120 120 120 120 120 120 120 
##$DP= (0..7)
150 150 150 150 150 150 150 150 
##$DP07= 0
##$DPNAME0= <>
##$DPNAME1= <>
##$DPNAME2= <>
##$DPNAME3= <>
##$DPNAME4= <>
##$DPNAME5= <>
##$DPNAME6= <>
##$DPNAME7= <>
##$DPOAL= (0..7)
0.5 0.5 0.5 0.5 0.5 0.5 0.5 0.5 
##$DPOFFS= (0..7)
0 0 0 0 0 0 0 0 
##$DQDMODE= 0
##$DR= 18
##$DS= 0
##$DSLIST= <SSSSSSSSSSSSSSS>
$$ [...]
##$SUBNAM2= <"">
##$SUBNAM3= <"">
##$SUBNAM4= <"">
##$SUBNAM5= <"">
##$SUBNAM6= <"">
##$SUBNAM7= <"">
##$SUBNAM8= <"">
##$SUBNAM9= <"">
##$SW= 18.0517287032376
##$SWIBOX= (0..15)
0 0 2 0 0 0 0 0 0 0 0 0 0 0 0 0 
##$SW_h= 3612.71676300578
##$TD= 16384
##$TD0= 1
##$TE= 0
##$TE2= 300
##$TE3= 300
##$TEG= 300
##$TL= (0..7)
0 120 120 120 120 120 120 120 
##$TP= (0..7)
150 150 150 150 150 150 150 150 
##$TP07= 0
##$TPNAME0= <>
##$TPNAME1= <>
##$TPNAME2= <>
##$TPNAME3= <>
##$TPNAME4= <>
##$TPNAME5= <>
##$TPNAME6= <>
##$TPNAME7= <>
##$TPOAL= (0..7)
0.5 0.5 0.5 0.5 0.5 0.5 0.5 0.5 
##$TPOFFS= (0..7)
0 0 0 0 0 0 0 0 
##$TUNHIN= 0
##$TUNHOUT= 0
##$TUNXOUT= 0
##$USERA1= <user>
##$USERA2= <user>
##$USERA3= <user>
##$USERA4= <user>
##$USERA5= <user>
##$V9= 5
##$VALIST= <valist>
##$VCLIST= <CCCCCCCCCCCCCCC>
##$VD= 0
##$VDLIST= <DDDDDDDDDDDDDDD>
##$VPLIST= <PPPPPPPPPPPPPPP>
##$VTLIST= <TTTTTTTTTTTTTTT>
##$WBST= 1024
##$WBSW= 4
##$XGAIN= (0..3)
0 0 0 0 
##$XL= 0
##$YL= 0
##$YMAX_a= 420547
##$YMIN_a= -536494
##$ZGOPTNS= <>
##$ZL1= 120
##$ZL2= 120
##$ZL3= 120
##$ZL4= 120
##$ABSF1= 10
##$ABSF2= 0
##$ABSG= 5
##$ABSL= 3
##$ALPHA= 0
##$AQORDER= 0
##$ASSFAC= 0
##$ASSFACI= 0
##$ASSFACX= 0
##$ASSWID= 0
##$AUNMP= <proc_1d>
##$AZFE= 0.1
##$AZFW= 0.1
##$BCFW= 1
##$BC_mod= 2
##$BYTORDP= 1
##$COROFFS= 0
##$CY= 11.3945322036743
##$DATMOD= 1
##$DC= 2
##$DFILT= <>
##$DTYPP= 0
##$F1P= 2.36226072786647
##$F2P= -0.459571619588291
##$FCOR= 0.5
##$FTSIZE= 0
##$FT_mod= 4
##$GAMMA= 1
##$GB= 0.15
##$INTBC= 1
##$INTSCL= 1
##$ISEN= 128
##$LB= 0.24
##$LEV0= 0
##$LPBIN= 0
##$MAXI= 10000
##$MC2= 0
##$MEAN= 0
##$ME_mod= 0
##$MI= 1.114404
##$NCOEF= 0
##$NC_proc= 0
##$NLEV= 6
##$NOISF1= 3.799351
##$NOISF2= 2.8
##$NSP= 1
##$NTH_PI= 0
##$NZP= 0
##$OFFSET= 15.70392
##$PC= 1
##$PHC0= -15873.29
##$PHC1= 15.80079
##$PH_mod= 1
##$PKNL= yes
##$PPARMOD= 0
##$PSCAL= 0
##$PSIGN= 0
##$REVERSE= no
##$SF= 200.130013532006
##$SI= 16384
##$SIGF1= 3
##$SIGF2= 2
##$SINO= 400
##$SIOLD= 16384
##$SREGLST= <1H.CDCl3>
##$SSB= 0
##$STSI= 0
##$STSR= 0
##$SW_p= 3612.71676300578
##$SYMM= 0
##$S_DEV= 0
##$TDeff= 0
##$TDoff= 0
##$TI= <>
##$TILT= no
##$TM1= 0
##$TM2= 0
##$TOPLEV= 0
##$USERP1= <user>
##$USERP2= <user>
##$USERP3= <user>
##$USERP4= <user>
##$USERP5= <user>
##$WDW= 1
##$XDIM= 8192
##$YMAX_p= 0
##$YMIN_p= 0
$$ End of Bruker specific parameters
$$ ---------------------------------
##NTUPLES= NMR FID
##VAR_NAME=  TIME,          FID/REAL,        FID/IMAG
##SYMBOL=    X,             R,               I
##VAR_TYPE=  INDEPENDENT,   DEPENDENT,       DEPENDENT
##VAR_FORM=  AFFN,          ASDF,            ASDF
##VAR_DIM=   8192,          8192,            8192
##UNITS=     SECONDS,       ARBITRARY UNITS, ARBITRARY UNITS
##FACTOR=    0.0002768,     1,               1
##FIRST=     0,             0,               0
##LAST=      2.2672688,     0,               0
##MIN=       0,             -536494,         0
##MAX=       2.2672688,     420547,          0
$$ Real data points
##PAGE= N=1
##DATA TABLE= (X++(R..R)), XYDATA
$$ plain form
0 0 0 0 0 0 0 0 0 0 0 0 -8 8 -8 16 -16 24 -24 32 -40 48 -56 72 -80 96 -113 136 -154 181 -208 238 -273 311
32 311 -353 399 -454 510 -574 641 -718 801 -892 990 -1101 1215 -1347 1487 -1643 1811 -1995
49 -1995 2197 -2420 2666 -2940 3243 -3584 3968 -4404 4901 -5482 6163 -6981 7980 -9233
63 -9233 10865 -13081 16271 -21295 30403 -52136 217096 -27263 -504364 27391 348877
74 348877 66498 -237345 19344 182793 826 -123977 -25071 -7750 49748 122532 16625
85 16625 -217279 -147819 159851 168460 -123951 -133696 53385 40897 -84039 -41631 64654
96 64654 37193 -20413 10754 -53431 -101672 79026 195053 -3780 -179577 -35897 154805
107 154805 48770 -85270 20576 85465 -16399 -57857 -9325 18599 31403 61628 5614
$$ packed form
0@%%%%%%%%%%qJ6j6K4l2M0m8N6p2Q8j04J28j52J76k09K49k90L35l89M46n11N84
32C11o64P52q53R64j084J215j359J519j693J882k091K316k562K834l130L454l806
49a995M192m617N086n606O183o827P552q372R305j0383J1645j3144J4961j7213
63i233K0098k3946K9352l7566N1698q2539K69232k44359m77101N31755L21486
74C48877k82379l03843K56689J63449j81967j24803R8906J7321N7498P2784j05907
85A6625k33904O9460L07670Q609k92411r745J87081j2488j24936M2408J06285
96F4654k7461n7606L1167o4185m8241J80698J16027j98833j75797J43680J90702
107A54805j06035j34040J05846O4889j01864m1458M8532K7924J2804L0225n6014
$$ plain form
118 5614 -131475 -71131 123649 67144 -104225 -40275 83513 -24394 -143019 31378 171012
129 171012 -43378 -166348 49213 125454 -86399 -123274 126445 162151 -122332 -168729 89313
140 89313 137983 -34977 -66960 37272 34319 -47108 -11061 44491 -3221 2140 42806 -34392
152 -34392 -88471 19220 112994 9306 -107207 -12369 72360 -24018 -56008 43832 57056
163 57056 -40122 -60486 22637 27836 -27451 18495 45379 -38241 -59055 21517 51257 -8929
175 -8929 -27199 27124 4345 -53025 156 49971 6011 -21524 1684 957 -31658 1669 63421
188 63421 1747 -62531 13479 52020 -32779 -54813 54233 86318 -54901 -100845 42967
199 42967 86426 -25091 -58832 18782 44141 -25680 -42742 15862 22470 4191 5595 -28464
$$ packed form
118E614j37089O0344J94780n6505j71369O3950J23788j07907j18625J74397J39634
129A71012k14390j22970K15561P6241k11853l6875K49719L5706k84483m6397K58042
140H9313M8670j72960l1983J04232k953q1427L6047N5552m7712N361M0666p7198
152c4392n4079J07691R3774j03688j16513R4838Q4729r6378l1990R9840J3224
163E7056r7178k0364Q3123N199n5287M5946K6884q3620k0814Q0572K9740o0186
175h929j8270N4323k2779n7370N3181M9815m3960k7535K3208p27l2615L3327O1752
188F3421o1674o4278P6010L8541q4799k2034J09046L2085j41219m5944J43812
199D2967M3459j11517l3741P7614K5359o9821j7062N8604O608j8279J404l4059
$$ plain form
211 -28464 -43399 15176 58704 3766 -66597 -11992 60036 -2096 -53974 10856 54427 3102
223 3102 -45170 -7955 29347 3077 6911 24107 -18050 -33814 15535 39152 -3970 -34535
235 -34535 11935 30750 -26082 -30602 18146 22370 -3614 -15997 -10650 -11532 -4664 29461 12035
248 12035 -40663 -15380 31626 8283 -30950 -6529 43371 12271 -44859 -10069 33590 12903
260 12903 -7134 139 5810 -8545 -7834 20653 9181 -16829 3487 9564 -13700 -14297 9832
273 9832 19398 -9431 -20683 5794 -1229 -13023 11093 15087 -11978 -22110 5398 22467 -11330
286 -11330 -16913 23629 15679 -22228 -17177 16685 25398 -6087 -15049 7166 2553 -3221 5719 847
300 847 -791 3083 -176 -8672 -13471 11710 21740 -15083 -22099 7022 11367 -6012 -11264 9958
$$ packed form
211b8464j4935N8575M3528n4938p0363N4605P2028o2132n1878O4830M3571n1325
223C102m8272L7215L7302k6270L834J7196m2157j5764M9349K3617m3122l0565
235c4535M6470J8815n6832m520M8748M224k5984j2383N347q82O868L4125j7426
248A2035n2698K5283M7006k3343l9233K4421M9900l1100n7130L4790M3659k0687
260A2903k0037P273N671j4355P11K8487j1472k6010K0316O077k3264n97K4129
273I832R566k8829j1252K6477p023j1794K4116L994k7065j0132K7508J7069l3797
286a1330n583M0542p950l7907N051L3862Q713l1485q962K2215m613n774Q940m872
300H47j638L874l259q496m799K5181J0030l6823p016K9121M345j7379n252K1222
$$ plain form
314 9958 12493 -17463 -10965 14123 5559 -3458 989 5434 -1916 -12052 6766 16730 -4130 -6726
328 -6726 1406 -314 569 -409 4416 2214 -6774 599 -1689 -8916 6686 10455 -5077 -12562 -3313
343 -3313 12337 1239 -12166 7086 10287 -8723 -9713 3713 13269 1350 -10114 3445 3875
356 3875 -5766 1582 3959 2854 -720 -6219 -119 -564 -749 6776 -2080 -6661 495 -1314 169 1376
372 1376 927 2533 -6501 -2927 8041 -1381 -3774 5258 5290 -1975 -10998 892 17237 1229 -11663
387 -11663 -3699 5628 7933 -5447 -9291 5626 5993 -1852 -8841 -9494 9180 11439 -6858 -11993
401 -11993 -3473 9896 7410 -10081 -4600 7329 3233 -951 -5040 80 8745 3226 895 -3457
415 -3457 -7435 6975 11174 -1008 -8572 -6264 8781 7511 -10676 -6886 5635 5314 -3263 -12555
$$ packed form
314I958K535k9956O498K5088q564r017M447M445p350j0136J8818R964k0860k596
328f726Q132j720Q83r78M825k202q988P373k288p227J5602L769j5532p485R249
343c313J5650j1098j3405J9252L201j9010r90J3426R556j1919j1464J3559M30
356C875r641P348K377j105l574n499O100m45j85P525q856m581P156j809J483J207
372A376m49J606r034L574J0968r422k393R032L2p265r023J1890J6345j6008j2892
387a1663P964R327K305j3380l844J4917L67p845o989o53J8674K259j8297n135
401a1993Q520J3369k486j7491N481J1929m096m184m089N120Q665n519k331m352
415c457l978J4410M199j2182p564K308J5045j270j8187L790J2521l21q577r292
$$ plain form
429 -12555 -1985 9187 -463 -4242 -3191 -3102 1906 732 3058 2758 -7726 -616 9310 3721 -3015
444 -3015 -5421 6666 13647 -4312 -10702 2169 10545 9331 -6899 -12138 1844 8326 6395 -5711
458 -5711 -17113 723 15365 1533 -18380 -15756 15301 22005 -16076 -27632 3737 25956 7930
471 7930 -24931 -13413 19621 14904 -6489 -12499 -622 15551 9169 -5110 -9895 -4291 16930
484 16930 17430 -13624 -21073 5575 25371 5335 -28992 -11189 24961 12166 -19728 -19978 9830
497 9830 20622 -8689 -19494 1196 8019 2201 -4536 -3618 1085 -3241 1715 8506 -4507 -8030
511 -8030 5208 10411 932 -12167 -860 16704 2020 -9883 390 6712 1363 -5513 4107
524 4107 9603 -10817 -10651 14641 11932 -13387 -18567 11707 24193 -12677 -27673 7634 23882
$$ packed form
429a2555J0570J1172r650l779J051Q9N008j174K326l00j0484P110R926n589o736
444c015k406J2087O981j7959o390J2871Q376j214j6230n239J3982O482j931j2106
458e711j1402J7836J4642j3832j9913K624L1057O704l8081j1556L1369K2219j8026
471G930l2861J1518L3034m717k1393o010J1877J6173o382j4279m785N604K1221
484A6930N00l1054p449K6648J9796k0036l4327J7803L6150j2795l1894k50K9808
497I830J0792k9311j0805K0690O823n818o737R18M703m326M956O791j3013l523
511h030J3238N203r479j3099J1307J7564j4684j1903J0273O322n349o876R620
524D107N496k0420J66K5292k709k5319n180L0274J2486l6870j4996L5307J6248
$$ plain form
537 23882 -157 -22958 -8144 17113 7018 -8952 -6103 -3778 3810 10217 104 -13317 -9948
550 -9948 16022 20793 -16635 -25207 12497 29118 -497 -28858 -5252 29688 10402 -19837 -11026
563 -11026 12343 16096 -4016 -13454 1062 6241 4512 1056 -8309 -6219 2990 7845 1768 -14626
577 -14626 -9193 12846 7888 -12545 -14625 5926 17237 -7328 -19310 5204 14929 -1945 -12245
590 -12245 2180 14812 -3018 -12209 9922 13523 -5892 -9799 7287 16307 -4503 -13976 7525
603 7525 12275 -2667 -8197 -2688 5020 2217 -2663 -2672 -8856 -2421 10765 -831 -16065 -7517 11586
618 11586 10810 -14578 -16311 11323 14694 -5031 -12999 -1430 14204 6864 -6104 -3345 2017 8645
632 8645 8563 -4310 -5956 3284 10233 6171 -9767 -8829 8330 9599 -2710 -14040 -6674 12473
$$ packed form
537B3882k4039k2801J4814K5257j0095j5970K849K325P588O407j0113j3421L369
550i948K5970M771l7428q572L7704J6621k9615k8361K3606L4940j9286l0239Q811
563a1026K3369L753k0112r438J4516N179j729l456r365K090R209M855o077j6394
577a4626N433K2039m958k0433k080K0551J1311k4565j1982K4514R725j6874j0300
590a2245J4425J2632j7830r191K2131L601j9415l907J7086R020k0810r473K1501
603G525M750j4942n530N509P708k803m880ro184O435J3186j1596j5234Q548J9103
618A1586p76k5388j733K7634L371j9725p968J1569J5634p340j2968K759N362O628
632H645q2j2873j646R240O949m062j5938R38J7159J269j2309j1330P366J9147
$$ plain form
646 12473 6397 -13930 -12840 4330 12787 -4464 -18591 401 13445 463 -10414 -4497 8792
659 8792 5456 -6048 568 5144 492 1715 2977 2319 360 -829 5998 2592 -4750 508 2555
674 2555 264 -97 -2874 -1331 -874 -952 1822 -4485 -6000 3274 1578 -4359 -4948 370 5623 -2555
690 -2555 -5860 3439 3058 -721 -184 1067 3018 -89 -641 4862 335 -1718 2250 1705 1004 -1214
706 -1214 -2321 2845 621 -2211 -1194 -2572 2157 1754 -5186 -2678 2068 1896 -2178 -6075 2381 6097
722 6097 -4006 -4515 2234 4373 995 -4647 1019 5814 -929 -1449 835 1078 2885 -1487 -1678 1516
738 1516 -268 915 -481 -3170 1716 256 -2240 -229 -924 730 -581 -2776 2197 45 -2665
753 -2665 1949 1287 -11 -1277 -811 4599 1266 -3964 1203 2768 803 -1141 -2065 2404 1657 -2245
$$ packed form
646A2473o076k0327J090J7170Q457j7251j4127J8992J3044j2982j0877N917J3289
659H792l336j1504O616M576m652J223J262o58j959j189O827l406p342N258K047
674B555k291l61k777J543M57p8K774o307j515R274j696n937n89N318N253q178
690b555l305R299l81l779N37J251J951l107n52N503m527k053L968n45p01k218
706a214j107N166k224k832J017j378M729m03o940K508M746j72m074l897Q456L716
722F097j0103n09O749K139l378n642N666M795o743n20K284K43J807m372j91L194
738A516j784J183j396k689M886j460k496K011o95J654j311k195M973k152k710
753b665M614o62j298j266M66N410l333n230N167J565j965j944r24M469p47l902
$$ plain form
769 -2245 -311 -1085 -157 1885 -2056 -1605 103 -645 1393 -1931 -1723 1915 -637 -314 849 -1300 668
786 668 1148 732 1252 -2616 1263 4305 -1185 -1972 329 2471 2315 -4103 -1897 3764 -160 -1393 -2007
803 -2007 -1035 2506 -1057 -2647 -10 -892 1284 158 -3255 486 1932 329 -267 -1822 2176 2822
819 2822 -1727 639 1102 355 1970 -454 10 846 -333 2028 -754 -3356 1842 1767 -1758 -2500 -1765
836 -1765 2739 -123 -4550 18 1250 -307 -651 -2300 1061 1498 -975 941 -796 -356 3261 309
852 309 -644 951 1045 2128 -615 -960 2685 -589 -903 1537 -986 -1002 -998 284 1437 -3600 -2470 3037
870 3037 46 -2005 -1715 -323 2211 -1390 -1716 1007 -778 1469 1764 -2100 -330 1603 2288 507
886 507 -3185 1099 3743 -1051 -792 407 -205 793 -583 140 -582 -2877 2495 2233 -4474 -2662 1582
$$ packed form
769b245J934p74R28K042l941M51J708p48K038l324K08L638k552L23J163k149J968
786F68M80m16N20l868L879L042n490p87K301K142j56o418K206N661l924j233o14
803b007R72L541l563j590K637q82K176j126l413L741J446j603n96j555L998O46
819B822m549K366M63p47J615k424M64Q36j179K361k782k602N198p5l525p42P35
836a765M504k862m427M568J232j557l44j649L361M37k473J916j737M40L617k952
852C09r53J595R4J083k743l45L645l274l14K440k523j6MJ282J153n037J130N507
870C037k991k051K90J392K534l601l26K723j785K247K95l864J770J933O85j781
886E07l692M284K644m794K59J199o12R98j376P23p22k295N372k62o707J812M244
$$ plain form
903 1582 2903 -1370 -5533 1534 3968 -1709 -1664 -299 1296 2475 -1016 -557 195 352 2726 -906
919 -906 -2235 2163 813 -1022 -147 392 1181 -2264 -756 4103 -1986 -4872 2088 3856 -915 -5707
935 -5707 -417 6740 -839 -4972 1630 2611 330 -886 554 1334 -2481 1478 4919 -2944 -4370 3513
951 3513 4673 -1554 -6663 307 6831 -1574 -5307 -329 1241 1220 -1032 -2427 -736 -471 2939 1782
967 1782 -5375 -1638 4781 2768 -2092 -4401 2394 5959 -534 -2681 -560 1859 4672 -969 -4661
982 -4661 795 3490 1537 -4204 -3373 4686 828 -5442 -405 2186 -1597 -4085 279 4184 -4374
997 -4374 -5832 5987 4497 -5959 -4395 5494 6410 -4997 -4396 7282 3144 -4881 734 5128 429
1012 429 -4047 2173 7253 -3935 -6983 5630 5475 -5147 -6847 2044 6143 -3463 -6276 1546 1158
$$ packed form
903A582J321m273m163P067K434n677M5J365J595J179l491M59P52J57K374l632
919i06j329M398j350j835Q75N39P89l445J508M859o089k886O960J768m771m792
935e707N290P157p579m133O602R81k281j216J440P80l815L959L441p863j426P883
951C513J160o227n109O970O524q405l733M978J570k1k252j395J691K65L410j157
967A782p157L737O419k013m860k309O795L565o493k147K121K419K813n641l692
982d661N456K695j953n741Q31Q059l858o270N037K591l783k488M364L905q558
997d374j458J1819j490j0456J564R889R16j1407O01J1678m138q025N615M394m699
1012D29m476O220N080j1188l048J2613j55j0622j700Q891M099r606k813P822l88
$$ plain form
1027 1158 -1276 -478 -1704 -1358 -47 2067 1424 -4590 -1033 6297 1619 -3076 -1872 2844 5112 -191
1043 -191 -2934 299 2416 4248 -702 -5820 1369 5887 -307 -5610 -2126 5808 784 -6679 -274
1058 -274 3155 -2325 -2749 1585 1454 -3868 -2508 6461 898 -8129 447 8025 262 -6781 -40 9274
1074 9274 -134 -7551 3368 6322 -2773 -4158 3267 4690 -3628 -4156 5495 1837 -5607 -686 3413
1089 3413 208 -3503 -873 3331 -1534 -2915 3022 220 -3457 613 2781 316 -3562 39 4623
1104 4623 -999 -2910 2082 1161 -658 137 283 -206 -1420 2325 2192 -4176 -996 4382 308 -3670
1120 -3670 -755 3306 990 -4231 490 3300 -2570 -1163 2638 142 -2472 -113 4113 -231 -5297
1135 -5297 2288 5433 -3121 -3826 3056 4040 -2870 -4573 4000 2972 -4958 -1178 3660 51 -3348
$$ packed form
1027A158k434P98j226L46J311K114o43o014L557P330m678m695J204M716K268n303
1043a91k743L233K117J832m950n118P189M518o194n303L484P934n024p463O405
1058b74L429n480m24M334j31n322J360Q969n563r027Q576P578p763p043O741R314
1074I274r408p417J0919K954r095j385P425J423q318n28R651l658p444M921M099
1089C413l205l711K630M204m865j381N937k802l677M070K168k465l878L601M584
1104D623n622j911M992r21j819P95J46m89j214L745j33o368L180N378m074l978
1120c670K915M061k316n221M721K810n870J407L801k496k614K359M226m344n066
1135e297P585L145q554p05O882R84o910j703Q573j028p930L780M838l609l399
$$ plain form
1150 -3348 -351 3727 -1032 -3905 3005 2399 -3065 -920 3077 1149 -2489 -866 4211 -333 -3578
1165 -3578 2478 2257 -1814 -1111 1875 1475 -2848 -811 3707 -1631 -3868 1954 1913 -2406 -2819 1816
1181 1816 2816 -3409 -2215 3768 168 -2770 552 2082 110 -1805 1194 2600 -2225 -352 3175
1196 3175 -285 -1615 921 2028 -195 -2524 2103 2460 -3352 -969 3354 -342 -3116 -775 3089
1211 3089 -420 -4728 1052 3008 -2470 -2271 1686 1732 -1539 -1954 2861 1550 -3093 1131 2664 -1073
1227 -1073 -1056 1673 2277 -1151 -2019 2459 700 -2589 1121 1708 -1385 -2000 301 1903 -2363 -2860 2848
1244 2848 729 -3384 -788 1824 271 -2466 -609 3382 -485 -2222 1812 1185 -740 -66 1472
1259 1472 1532 -1609 48 2910 -678 -1228 1659 420 -998 -704 1074 742 -2993 -97 2540 -2010
$$ packed form
1150c348K997M078m759k873O910o06n464K145L997j928l638J623N077m544l245
1165c578O056k21m071P03K986m00m323K037M518n338k237N822m1m319m13M635
1181A816J000o225J194N983l600k938L322J530j972j915K999J406m825J873L527
1196C175l460j330K536J107k223k329M627L57n812K383M323l696k774K341L864
1211C089l509m308N780J956n478J99L957M6l271m15M815j311m643M224J533l737
1227a073J7K729O04l428q68M478j759l289L710N87l093o15K301J602m266m97N708
1244B848k119m113K596K612j553k737J857L991l867j737M034o27j925O74J538
1259A472O0l141J657K862l588n50K887j239j418K94J778l32l735K896K637m550
$$ plain form
1275 -2010 -2438 1173 1398 -1171 -2589 1516 2084 -2655 -806 2537 463 -897 175 1850 735 -1509
1291 -1509 1585 1732 -1481 209 1851 37 -1099 -236 1618 -275 -2487 1035 888 -2235 -512 897
1307 897 283 -1686 -1084 2231 -35 -2301 992 1743 -912 -1209 858 2061 -543 -1424 2325 1338 -1330
1324 -1330 645 923 320 -458 -321 1463 -800 -1177 1219 -585 -1235 277 -55 -402 -1119 -78 1132
1341 1132 -1328 -1126 1605 -373 -964 230 1061 838 -1513 362 2032 -787 -609 1256 292 -344 -583
1358 -583 747 1024 -1249 282 1122 -1372 -687 365 231 -591 -1363 604 534 -2213 -86 856 -520
1375 -520 -605 80 812 301 -1314 1149 1278 -1248 198 1341 728 -368 -451 1398 846 -1219 306 619
1393 619 -458 -296 -658 -265 8 -763 139 -528 -945 840 -459 -581 274 -338 371 -326 105 1198 -560
$$ packed form
1275b010m28L611K25k569j418M105N68m739J849L343k074j360J072J675j115k244
1291a509L094J47l213J690J642j814j136Q63J854j893k212L522j47l123J723J409
1307H97o14j969O02L315k266k266L293P51k655k97K067J203k604q81L749r87k668
1324a330J975K78o03p78J37J784k263l77K396j804o50J512l32l47p17J041J210
1341A132k460K02K731j978n91J194Q31k23k351J875J670k819J78J865r64o36k39
1358e83J330K77k273J531Q40k494O85J052j34q22p72J967p0k747K127R42j376
1375e20q5O85P32n11j615K463J29k526J446J143o13j096q3J849n52k065J525L13
1393F19j077J62l62L93K73p71R02o67m17J785j299j22Q55o12P09o97M31J093j758
$$ plain form
1412 -560 -668 1601 268 -405 -174 1005 1152 -790 -658 1503 130 -568 -244 319 698 -810 -678 918
1430 918 -654 -861 233 -355 -116 -888 -112 1071 -615 -991 702 215 271 -494 -26 1086 301 -335
1448 -335 719 -502 819 541 -478 523 -188 -147 721 -433 -566 224 -196 354 -879 -801 806 21
1466 21 -808 -515 -431 1089 -502 -984 1036 231 -512 17 178 642 -311 -495 1511 191 -975 132
1484 132 864 801 -652 -772 1561 134 -1508 109 471 254 -600 -919 1327 -177 -1475 365 855
1501 855 -68 -877 -433 1612 -53 -1418 713 911 283 -840 -100 1546 143 -1204 714 523 -434
1518 -434 -213 -197 310 -289 -861 702 13 -1258 -34 71 419 -519 -704 1154 357 -1030 274 468
1536 468 549 -233 -292 1069 331 -524 481 396 114 17 -410 879 -8 -1282 434 573 -426 -586 -552 774
$$ packed form
1412e60j08K269j333o73K31J179J47j942J32K161j373o98L24N63L79j508J32J596
1430I18j572k07J094n88K39p72P76J183j686l76J693m87N6p65M68J112p85o36
1448c35J054j221J321k78j019J001p11M1Q68j154j33P90m20N50j233P8J607p85
1466B1q29K93Q4J520j591m82K020q05p43N29J61M64r53j84K006j320j166J107
1484A32P32o3j453j20K333j427j642J617L62k17q54l19K246j504j298J840M90
1501H55r23q09M44K045j665j365K131J98o28j123P40J646j403j347J918j91r57
1518d34K21J6N07n99n72J563o89j271J224J05L48r38j85J858p97j387J304J94
1536D68Q1p82n9J361p38q55J005q5k82r7m27J289q87j274J716J39r99j60L4J326
$$ plain form
1556 774 -107 -1489 392 431 -646 -588 0 1092 -135 -1128 774 904 -429 -133 611 925 167 -1077
1574 -1077 1129 1145 -891 51 361 465 -193 -1080 641 209 -1133 -446 -100 -279 -350 -808 223 96 -997
1593 -997 203 316 -43 167 -401 757 497 -425 562 386 52 356 300 444 138 -524 431 237 -319 111
1613 111 -394 -183 -36 -808 169 -42 -556 -195 -268 -315 -270 -809 272 362 -902 288 266 218 76 -383 484
1634 484 897 -773 89 770 158 355 -705 273 762 -563 -240 360 -217 -101 -576 173 151 -970 -9
1653 -9 250 -729 -24 -381 -1 420 -684 177 515 -172 310 217 119 705 -12 459 309 -267 520 -13 -501
1674 -501 292 -178 58 -130 -632 -135 -171 -401 104 -346 -369 140 -496 134 -47 -186 418 -355 -113 594 -306
1695 -306 101 840 -119 286 -297 76 848 -312 -18 620 263 70 -491 -83 388 -994 -294 372 -577
$$ packed form
1556G74q81j382J881L9j077N8N88J092j227r93J902J30j333K96P44L14p58j244
1574a077K206J6k036R42L10J04o58q87J721m32j342O87L46j79p1m58J031j27j093
1593i97J200J13l59K10n68J158k60r22R87j76l34L04n6J44l06o62R55j94n56M30
1613A11n05K11J47p72R77k11n14L61p3m7M5n39J081R0j264J190k2m8j42m59Q67
1634D84M13j670Q62O81o12J97j060R78M89j325L23O00n77J16m75P49k2j121R61
1653iK59r79P05l57L80M21j104Q61L38o87M82r3r8N86p17M71j50n76P87n33m88
1674e01P93m70K36j88n02M97l6k30N05m50k3N09o36O30j81j39O04p73K42P07r00
1695c06M07P39r59M05n83L73P72j160K94O38l57j93n61M08M71j382P00O66r49
$$ plain form
1714 -577 -382 -313 -101 444 -1024 -157 592 -360 -81 135 85 590 -292 230 599 -135 -106 53 -94 445 -260
1735 -260 20 685 -368 -144 112 -449 292 -326 -710 124 -82 -239 114 -341 471 -18 -581 427 148
1754 148 -92 123 -52 465 -52 -158 521 -153 39 520 -268 259 19 -317 376 -306 -521 546 -329 -350
1774 -350 -162 -176 156 -274 -535 233 -256 -240 260 -79 151 -194 -210 586 -18 -153 452 63 62 18 -308 485
1796 485 150 -136 352 -220 200 48 -676 279 16 -442 -70 -361 -126 239 -704 127 92 -281 368 -313
1816 -313 122 301 -372 265 244 -154 331 23 486 535 -426 317 505 -355 -229 -219 -110 86 -808 -103 461
1837 461 -538 -408 -9 -79 115 -583 368 226 -544 324 43 -100 304 -221 276 335 -92 185 539 48 109
1858 109 -175 -180 247 -269 59 258 -208 92 -176 -339 173 -456 -244 -76 -311 133 88 -139 107 -622 -54
$$ packed form
1714e77J95O9K12N45j468Q67P49r52K79K16n0N05q82N22L69p34K9J59j47N39p05
1735b60K80O65j053K24K56n61P41o18l84Q34k06j57L53m55Q12m89n63J008k79
1754A48k40K15j75N17n17j06O79o74J92M81p88N27k40l36O93o82k15J067q75k1
1774c50J88j4L32m30k61P68m89J6N00l39K30l45j6P96o04j35O05l89jm4l26P93
1796D85l35k86M88n72M20j52p24R55k63m58L72k91K35L65r43Q31l5l73O49o81
1816c13M35J79o73O37k1l98M85l08M63M9r61P43J88q60J26J0J09J96q94P05N64
1837D61r99J30L99p0J94o98R51j42p70Q68k81j43M04n25M97N9m27K77L54m91O1
1858A09k84nM27n16L28J99m66L00k68j63N12o29K12J68k35M44m5k27K46p29N68
$$ plain form
1879 -54 567 -85 -84 173 406 522 -493 174 770 -106 -132 210 271 131 -607 -140 526 -484 -283 264 -11
1900 -11 -8 -853 -49 655 -618 -182 403 -64 152 66 133 667 -327 -66 560 172 29 78 -27 595 -335 -218
1922 -218 416 -230 239 -270 54 552 -368 -485 24 -163 -268 -265 -469 147 -361 -401 102 123 130 -5 226 886
1944 886 39 -408 862 -92 -275 110 75 535 -360 -237 853 149 -498 176 113 -30 -340 -268 411 -430
1964 -430 -776 474 140 -243 -435 -141 356 -386 -295 595 329 -175 -29 22 468 39 -155 394 330 -161 270
1985 270 -196 273 -132 -449 268 -169 178 -185 -551 269 -104 -878 232 10 -342 -78 -199 473 237 -251
2005 -251 386 602 -114 138 357 385 451 -402 713 508 -440 -76 -125 322 -272 -319 430 -88 -672 -51 206
2026 206 -148 -599 26 162 9 -272 145 368 -66 58 103 448 114 -275 296 174 -295 477 46 82 246
$$ packed form
1879e4O21o52JK57K33J16j015O67N96q76k6L42O1j40p38M67O66j010K01N47k75
1900a1Lq45Q04P04j273M36N85m67K16q6O7N34r94K61O26l88j43M9j05O22r30J17
1922b18O34o46M69n09L24M98r20j17N09j87j05Lk04O16n08m0N03K1Pj35K31O60
1944H86q47m47J270r54j83L85l5M60q95J23J090p04o47O74o3j43l10P2O79q41
1964d30l46J250l34l83j92K94M97p42R1Q90k66n04J46N1M46m29j94N49o4m91M31
1985B70m66M69m05l17P17m37L47l63l66Q20l73p74J110k22l52K64j21O72k36m88
2005b51O37K16p16K52K19K8O6q53J115k05r48L64m9M47n94m7P49n18n84O21K57
2026B06l54m51O25J36j53k81M17K23m34J24M5L45l34l89N71j22m69P72m31L6J64
$$ plain form
2047 246 -278 202 -37 -247 317 -181 -299 39 -435 -55 53 -296 281 -378 36 125 -188 93 303 -229
2067 -229 -292 139 427 247 -360 79 568 -315 -12 54 107 293 -533 239 393 -451 -22 65 41 -142 -270 217
2089 217 203 -727 -168 496 -350 68 250 -2 -91 -227 326 235 67 273 279 -18 212 -207 306 -198 -114 400
2111 400 267 -72 234 -94 -216 -177 -185 -74 -283 -307 375 -340 -233 351 270 6 -319 28 526 -467 70 644
2133 644 -56 -25 209 190 252 -522 187 588 -413 -265 288 102 23 -193 188 337 -628 97 485 -289 -289 -69
2155 -69 105 109 -207 315 396 -253 -9 473 5 65 -103 349 -15 -210 302 143 -274 217 142 -1 -25 -50 242
2178 242 -140 -592 205 35 -321 -140 -31 -69 -4 242 377 -170 -562 516 246 -180 46 -108 271 9
2198 9 -5 729 -88 -520 319 48 -116 -452 198 393 -670 -436 510 -253 -388 90 14 394 -418 242 460
$$ packed form
2047B46n24M80k39k10N64m98j18L38m74L80J08l49N77o59M14Q9l13K81K10n32
2067b29o3M31K88j80o07M39M89q83L03O6N3J86q26P72J54q44M29Q7k4j83j28M87
2089B17j4r30N59O64q46M18J82k52q9j36N53r1j68K06Ok97K30m19N13n04Q4N14
2111D00j33l39L06l28j22L9qJ11k09k4O82p15J07N84q1k64l25L47M98r93N37N74
2133F44p00L1K34j9O2p74P09M01j001J48N53j86p9k16L81J49r65P25L88p74%K20
2155f9J74Ml16N22Q1o49K44M82m68O0j68M52l64j95N12j59m17M91p5j43k4k5K92
2178B42l82m52P97j70l56J81J09l8O5K46J35n47l92J078k70m26K26j54L79k62
2198Ij4P34q17m32Q39k71j64l36O50J95j063K34R46p63j35M78p6L80q12O60K18
$$ plain form
2219 460 -185 -345 477 237 47 -240 491 133 -159 10 272 -84 204 147 -191 270 110 -160 77 -599
2239 -599 -79 196 -486 119 -22 39 -378 -224 421 162 -534 264 137 -403 -194 20 9 -261 5 591 349
2260 349 -117 365 406 -145 -38 -219 273 -179 -422 297 -151 -115 -78 210 132 -236 -227 295 -69 -150 258 -34
2282 -34 41 -118 202 79 -12 -88 387 -62 240 258 -147 50 -116 334 162 -404 172 513 -321 -145 277 -244
2304 -244 -65 -478 -109 46 -518 -134 237 -153 -279 -264 505 -16 -615 186 482 -400 -183 133 52 -60 -321
2325 -321 379 -39 -246 171 136 -189 58 -83 -265 -96 -19 252 -255 -296 184 188 -143 -168 -39 168 -179 -198
2347 -198 330 -167 -247 211 29 37 -77 344 347 5 -147 263 -407 -203 72 126 165 -120 13 487 -350 -340 382
2370 382 20 -221 -79 78 -7 -460 79 383 -327 -191 275 -12 304 -267 250 370 -170 154 173 118 122 355
$$ packed form
2219D60o45j60Q22k40j90k87P31l58k92J69K62l56K88n7l38M61j60k70K37o76
2239e99N20K75o82O05j41O1m17J54O45k59o96P98j27n40K09K14j1k70K66N86k42
2260C49m66M82M1n51J07j81M92m52k43P19m48L6L7K88p8l68RN22l64q1M08k92
2282c4P5j59L20j23r1p6M75m49L02J8m05J97j66M50j72n66N76L41q34J76M22n21
2304b44J79m13L69J55n64L84L71l90j26J5P69n21n99Q01K96q82K17L16q1j12k61
2325c21P00m18k07M17l5l25K47j41j82J69P7K71n07m1M80Ml31k5J29K07l47j9
2347a98N28m97q0M58j82Qj14M21Ll42j52M10o70K04K75N4L9k85J33M74q37J0P22
2370C82l62k41J42J57q5m53N39L04p10J36M66k87L16n71N17J20n40L24J9n5MK33
$$ plain form
2392 355 259 95 12 176 101 -418 153 -59 -133 256 -17 -152 84 -149 -62 -33 -128 322 193 90 98 114 217
2415 217 84 -140 269 88 -212 446 201 117 -83 -168 409 -173 -457 440 -309 -160 153 -49 -52 -225 -161 338
2437 338 20 -176 157 47 -61 -52 252 426 -19 -171 418 324 -75 164 17 -93 -250 39 358 -105 53
2458 53 198 -182 -368 -190 -51 87 -354 -139 -45 -383 4 62 -54 176 -178 -49 193 47 92 -37 -130 -94
2480 -94 147 -44 152 107 35 33 -311 -39 210 -256 188 6 -136 -94 -196 54 -54 -249 187 -149 -150 -42 122
2503 122 20 182 114 235 261 -24 173 66 129 -159 -84 151 -125 112 49 -22 -96 1 -32 -44 -77 -122 117 -147
2527 -147 8 64 52 289 274 -11 57 28 84 204 -24 55 -216 -107 222 101 159 324 44 92 216 -537 -142
2550 -142 88 -204 -25 -76 -170 -30 -163 109 -225 -110 95 -47 150 99 68 260 240 -112 57 -126 107 89
$$ packed form
2392C55r6j64q3J64p5n19N71k12p4L89k73j35K36k33Q7K9r5M50j29j03QJ6J03
2415B17j33k24M09j81l00O58k45q4k00q5N77n82k84Q97p49J49L13k02lj73O4M99
2437C38l18j96L33j10j08RL04J74m45j52N89r4l99K39j47j10j57K89L19m63J58
2458E3J45l80j86J78J39J38m41K15R4l38L87N8j16K30l54J29K42j46M5j29r3L6
2480i4K41j91J96m5p2kl44K72K49m66M44j82j42M2j02K50j08j95M36l36jJ08J64
2503A22j02J62o8J21K6k85J97j07O3k88P5K35k76K37o3p1p4R7l3j2l3m5K39k64
2527a47J55N6j2K37j5k85O8k9N6J20k28P9k71J09L29j21N8J65k80M8J24p53L95
2550a42K30k92J79n1r4J40j33K72l34J15K05j42J97n1l1J92k0l52J69j83K33j8
$$ plain form
2572 89 -64 47 -1 44 296 66 199 20 -46 183 -41 -123 -120 -45 72 199 -257 18 36 -39 260 43 -233
2595 -233 129 -247 93 14 -206 -129 136 114 213 160 153 204 -35 -36 -29 125 220 -232 -5 -30 -67 16 -213 -285 -42 -186
2621 -186 -47 132 46 -71 314 -297 -153 -505 -49 193 -101 131 275 11 56 91 57 234 -105 -249 88
2642 88 -41 82 -163 -45 52 -308 -222 271 -361 10 -87 -292 137 8 49 154 245 398 98 -364 339 119
2664 119 -270 -43 218 -57 86 -239 231 -78 -208 108 158 -23 -157 -221 218 -26 38 50 -28 -15 22 -41 126
2687 126 -309 -102 320 -75 124 -29 19 100 67 -28 315 211 -240 -52 88 -7 -102 42 412 92 -11 91
2709 91 205 -122 -70 2 -100 -70 -246 194 178 -207 -30 134 22 -166 50 319 434 125 48 17 273 219 -43
2732 -43 -21 -23 -153 -55 29 -73 78 -247 -46 -134 -233 184 -132 51 -103 -117 282 -54 74 -248 59 47 20 -114
$$ packed form
2572H9j53J11m8M5K52k30J33j79o6K29k24q2LP5J17J27m56K75J8p5K99k17k76
2595b33L62l76L40p9k20P7K65k2R9n3pN1k39jPJ54R5m52K27k5l7Q3k29p2K43j44
2621a86J39J79q6j17L85o11J44l52M56K42k94K32J44k64M5L5l4J77l39j44L37
2642H8j29J23k45J18R7l60Q6M93o32L71r7k05M29j29M1J05R1J53l00m62P03k20
2664A19l89K27K61k75J43l25M70l09j30L16N0j81j34o4M39k44O4J2p8J3L7o3J67
2687A26m35K07M22l95J99j53M8Q1l3r5L43j04m51J88J40r5r5J44L70l20j03J02
2709I1J14l27N2P2j02L0j76M40j6l85J77J64j12j88K16K69J15l09p7l1K56n4k62
2732d3K2kj30R8Q4j02J51l25K01q8r9M17l16J83j54j4L99l36J28l22L07j2k7j34
$$ plain form
2756 -114 242 162 -434 140 -131 253 -258 -403 452 -12 -26 130 139 32 170 -39 -175 -8 -92 -21 12 131
2778 131 176 41 -89 -23 211 55 77 7 538 268 -25 293 -158 326 109 -15 225 -104 104 -94 -289
2799 -289 -58 -10 79 -31 -220 -64 148 -94 -117 7 87 -178 59 111 34 -263 167 83 -70 -75 478 107 78
2822 78 -283 -115 -85 -17 -79 114 -178 -194 -36 92 247 -282 175 271 49 -21 -197 136 11 -438 -37 157
2844 157 -212 -213 -73 118 -128 119 26 144 -118 175 215 -93 40 -73 100 252 153 80 -91 32 111 -205
2866 -205 -162 -75 -88 131 -22 -202 185 -306 -11 -172 46 173 296 -237 -70 -69 -42 10 -157 45 231 32
2888 32 -222 104 -189 73 -186 -57 28 32 -306 108 -78 224 -184 -6 -53 -179 -162 -72 -26 27 102 34 60 -144
2912 -144 -102 59 73 -62 -23 -21 239 -147 -56 -17 -46 -31 66 -218 180 -126 -297 194 -176 -106 -117 -182 275 50
$$ packed form
2756a14L56q0n96N74k71L84n11j45Q55m64j4J56Rj07J38k09j36J67q4P1L3J19
2778A31M5j35j30O6K34j56K2p0N31k70k93L18m51M84k17j24K40l29K08j98j95
2799b89K31M8Q9j10j89J56K12k42k3J24Q0k65K37N2p7k97M30q4j53nN53l71k9
2822G8l61J68L0O8o2J93k92j6J58J28J55n29M57R6k22p0j76L33j25m49M01J94
2844A57l69jJ40J91k46K47r3J18k62K93M0l08J33j13J73J52r9p3j71J23P9l16
2866b05M3Q7j3K19j53j80L87m91K95j61K18J27J23n33J67JK7N2j67K02J86j99
2888C2k54L26k93K62k59J29Q5Ml38M14j86L02m08J78m7j26J7R0M6N3P5o8K6k04
2912a44M2J61J4j35L9KK60l86R1L9k9J5R7k84L98l06j71M91l70P0j1o5M57k25
$$ plain form
2936 50 -170 168 146 45 -154 105 9 5 -70 228 148 58 71 43 197 -260 25 172 44 -268 45 73 -50 -42
2960 -42 -96 184 59 -185 43 45 -157 -158 -120 481 31 -149 83 -14 -75 -68 12 202 3 120 -65 47 199 43
2984 43 32 67 50 211 50 -62 -145 -13 88 -165 197 3 71 53 242 19 18 61 99 110 9 237 8 -118
3008 -118 3 83 -37 3 139 66 -264 84 -61 -145 176 -40 -45 -165 -170 -143 -117 -181 -130 -125 46 196 -8 115 -120
3033 -120 -136 313 77 -104 -105 5 210 86 -88 -115 42 87 -144 28 228 -131 -67 -109 160 14 105 -75 52
3056 52 -257 -123 82 -22 81 345 222 272 130 -113 225 61 -6 118 -12 36 -138 -198 -45 -105 17 244
3078 244 48 -205 -12 54 -4 57 399 57 -48 21 144 -252 -79 -34 -395 -50 -14 -176 8 -271 114 249
3100 249 -9 -72 30 37 82 131 -209 94 -240 167 -67 -368 -182 40 191 -59 -196 85 -32 -124 111 -22
$$ packed form
2936E0k20L38k2j01j99K59r6mp5K98q0r0J3k8J54m57K85J47j28l12L13K8j23Q
2960d2n4K80j25k44K28Kk02jL8O01m50j80K32r7o1PQ0J90j99J17j85J12J52j56
2984D3j1L5j7J61j61j12q3J32J01k53L62j94O8j8J89k23jM3L8J1j01K28k29j26
3008a18J21Q0j20M0J36p3l30L48j45q4L21k16nj20nK7K6o4N1NJ71J50k04J23k35
3033a20j6M49k36j81jJ10K05j24j74k7J57M5k31J72K00l59O4m2K69j46R1j80J27
3056E2l09J34K05j04J03K64j23N0j42k43L38j64o7J24j30M8j74o0J53o0J22K27
3078B44j96k53J93O6n8O1L42l42j05O9J23l96J73M5l61L45L6j62J84k79L85J35
3100B49k58o3J02PM5M9l40L03l34M07k34l01J86K22J51k50j37K81j17r2K35j33
$$ plain form
3122 -22 -11 51 -43 -191 -13 -123 196 35 -112 126 68 49 333 133 106 -79 52 43 -174 -226 -61 -375 -66
3145 -66 48 -96 9 70 -207 61 -190 73 156 -289 -59 -46 -109 231 202 203 396 97 245 125 102 6 -74 -159
3169 -159 162 88 45 35 -134 -368 -158 -131 -255 -300 155 -138 -333 -76 -134 -128 -88 101 -64 284 40 -214 -45
3192 -45 112 51 103 228 455 -85 -228 123 -120 -196 50 -69 -252 -99 -23 237 36 7 154 -291 -146 -193
3214 -193 -82 -11 -326 213 -78 5 105 -142 56 154 -24 -164 -285 -137 194 5 -31 -58 -59 -18 55 55 -231 108
3238 108 -140 190 122 142 -147 -107 -292 -62 -153 -9 -133 -163 166 128 177 111 -137 129 -152 76 199 73 -103
3261 -103 -90 0 170 12 -36 162 -175 182 -55 -24 -130 4 34 35 -386 -104 4 64 -129 -107 72 -33 -451
3284 -451 88 85 -112 -43 -7 79 -320 -91 58 -147 -53 -138 137 18 69 -171 -18 -128 -149 -13 -248 57 66 -165
$$ packed form
3122b2J1O2r4j48J78j10L19j61j47K38n8j9K84k00k7j85J31rk17n2J65l14L09
3145f6J14j44J05O1k77K68k51K63Q3m45K30J3o3L40k9JJ93k99J48j20k3r6q0q5
3169a59L21p4m3j0j69k34K10K7j24m5M55k93j95K57n8OM0J89j65L48k44k54J69
3192d5J57o1N2J25K27n40j43L51k43p6K46j19j83J53P6K60k01k9J47m45J45m7
3214a93J11P1l15N39k91Q3J00k47J98R8j78j40j21J48L31j89l6k7jM1P3%k86L39
3238A08k48L30o8K0k89M0j85K30r1J44j24l0L29l8M9o6k48K66k81K28J23j26j76
3261a03J3R0J70j58m8J98l37L57k37L1j06J34L0Jm21K82J08O0j93K2J79j05m18
3284d51N39lj97O9L6Q6l99K29J49k05R4q5K75j19N1k40J53j10k1J36k35L05Rk31
$$ plain form
3308 -165 -145 178 142 149 50 -16 136 58 132 54 148 -208 -126 125 168 -124 65 45 -73 -348 8 159 83 -93 160
3333 160 133 -101 -221 -6 -17 -264 69 -85 60 55 -150 -73 82 -226 6 105 -95 -24 58 390 130 -94 141
3356 141 -38 -78 100 -80 43 87 35 -24 143 -51 5 -138 21 89 -165 27 -8 267 -173 -151 216 -18 -155
3379 -155 -25 244 3 -252 -159 15 235 29 -42 -72 -94 13 -82 201 -240 -141 206 -34 -146 -65 122 41 86
3402 86 -196 95 58 -38 -249 -28 87 -141 -110 149 -153 26 -2 144 -18 73 -83 -48 26 45 22 -57 47 215
3426 215 48 35 23 211 158 -110 98 -38 -236 -127 295 -216 25 77 -138 -27 -45 157 44 45 72 120 117 -224
3450 -224 -127 398 -109 -103 -206 -104 -59 150 -134 -91 -451 -219 184 82 -70 -13 147 172 -112 -216 209 -92
3472 -92 -21 -97 112 34 89 265 152 89 -100 -117 -170 48 -28 -145 -10 -22 -123 51 -187 56 -103 -101 89 17
$$ packed form
3308a65K0L23l6Pr9o6J52p8P4p8R4l56Q2K51M3k92J89k0j18k75L56J51p6j76K53
3333A60k7k34j20K15j1k47L33j54J45nk05P7J55l08K32R9k00P1Q2L32k60k24K35
3356A41j79m0J78j80J23M4n2n9J67j94N6j43J59O8k54J92l5K75m40K2L67k34j37
3379a55J30K69k41k55R3J74K20k06p1l0k2J07r5K83m41R9L47k40j12Q1J87q1M5
3402H6k82K91l7r6k11K21J15k28L1K59l02J79k8J46j62R1j56L5P4J9k3p9J04J68
3426B15j67j3j2J88n3k68K08j36j98J09M22n11K41N2k15J11j8K02j13JK7M8ll41
3450b24R7N25n07Oj03J02M5K09k84M3l60K32M03j02j52N7J60K5k84j04M25l01
3472i2P1p6K09p8N5J76j13o3j89j7n3K18p6j17J35j2j01J74k38K43j59KJ90p2
$$ plain form
3496 17 -243 -317 -123 -47 -443 -44 69 363 102 172 282 128 151 210 280 283 50 199 80 -60 -101 -39 -68 57
3520 57 -9 28 367 55 130 81 256 -116 -74 275 -98 163 300 -154 -129 137 -180 269 216 34 -178 95 311
3543 311 -112 -279 -40 -8 94 87 -17 230 -87 -194 -77 33 -222 5 -125 -57 136 -240 81 -141 128
3564 128 -198 -137 22 -71 -272 -88 195 -179 -6 337 186 -169 -5 133 19 -134 -34 155 -93 -122 -203
3585 -203 -159 364 95 91 -23 12 131 53 231 130 34 280 90 -129 207 65 -16 -35 85 -74 -116 41 -8
3608 -8 244 24 -25 -150 -130 -15 -173 124 -270 148 -125 129 -248 52 343 36 140 -79 231 -138 -75 202
3630 202 19 -4 209 -106 -29 211 -96 120 -48 -55 -74 203 21 -7 -137 50 49 -82 -145 12 182 52 -34
3653 -34 -77 -291 92 143 -132 -85 266 143 -40 245 109 18 181 64 -129 1 -1 -27 23 -111 -24 -49 18 97
$$ packed form
3496A7k60p4J94P6l96L99J13K94k61P0J10j54K3N9P0Lk33J49j19j40m1O2k9J25
3520E7o6L7L39l12P5m9J75l72M2L49l73K61J37m54K5K66l17M49n3j82k12K73K16
3543C11m23j67K39L2J02pj04K47l17j07J17J10k55K27j30O8J93l76L21k22K69
3564A28l26O1J59r3k01J84K83l74J73L43j51l55J64J38j14j53J00J89k48k9q1
3585b03M4N23k69mj14L5J19p8J78j01r6K46j90k19L36j42q1j9J20j59m2J57m9
3608hK52k20m9j25K0J15j58K97l94M18k73K54l77L00K91l07J04k19L10l69O3K77
3630B02j83k3K13l15P7K40l07K16j68pj9K77j82k8j30J87jj31o3J57J70j30q6
3653c4m3k14L83N1k75M7L51j23j83K85j36r1J63j17j93J30kk6N0j34Q7k5O7P9
$$ plain form
3677 97 86 105 -38 -174 -38 -123 50 -122 -277 489 39 335 -157 181 260 11 40 72 22 -1 47 150 -56
3700 -56 -224 -8 -33 -222 -165 -29 -149 -257 138 14 -32 -231 146 -135 366 -188 258 46 -286 54 -105
3721 -105 284 -47 -158 -157 1 218 128 193 10 -402 113 -182 -74 -116 -96 -245 -184 -57 -124 -96 -136 -86 -177 10
3745 10 167 -97 -133 -184 -29 104 320 -104 196 -257 -148 268 203 -25 137 -186 -76 -61 154 72 -182 -107
3767 -107 -150 -262 233 40 -67 105 -405 -12 -88 -71 157 -165 -383 83 -32 -20 -177 -38 -33 -82 118 87 -12
3790 -12 -299 35 146 238 -53 -196 -24 154 56 -23 -149 -241 105 -72 -150 -169 -46 -111 4 -138 -28 49 -232
3813 -232 -22 112 159 154 -9 54 -262 -97 34 87 124 101 -170 102 -27 -31 -132 -153 53 -168 -154 -72 -65 -255 -97
3838 -97 -147 -46 204 77 148 -3 -153 131 -85 -161 124 -139 155 125 7 104 -187 -65 -40 -185 54 -263
$$ packed form
3677I7j1J9j43j36J36q5J73j72j55P66m50K96m92L38P9k49K9L2n0k3M8J03k06
3700e6j68K16k5j89N7J36j20j08L95j24m6j99L77k81N01n54M46k12l32L40j59
3721a05L89l31j11JJ58K17r0O5j83m12N15k95J08m2K0j49O1J27o7K8m0N0r1J87
3745A0J57k64l6n1J55J33K16m24L00m53J09M16o5k28J62l23J10J5K15q2k54P5
3767a07m3j12M95j93j07J72n10L93p6J7K28l22k18M66j15J2j57J39Nm9K00l1r9
3790a2k87L34J11R2k91j43J72J78r8p9j26r2L46j77p8j9J23o5J15j42J10P7k81
3813b32K10J34M7nj63O3l16J65J31N3L7k3k71K72j29mj01k1K06k21J4Q2Pj90J58
3838i7n0J01K50j27P1j51j50K84k16p6K85k63K94l0j18R7k91J22K5j45K39l17
$$ plain form
3860 -263 -88 136 -78 -122 4 54 -50 -55 -31 -39 98 16 -139 -20 -42 131 -91 7 -21 211 122 233 -68 247
3884 247 293 -27 -24 49 -139 -114 -211 552 152 -2 231 -109 98 -209 98 -172 -21 -135 -160 -78 296 -188 29
3907 29 54 -100 -41 -117 -229 157 54 -49 37 -67 -47 -95 116 171 -70 -51 41 -17 -132 86 -83 21 -58 39
3931 39 -26 -206 178 -155 -152 -43 -127 197 197 -220 80 3 -82 -61 89 312 35 -10 145 -245 -112 -51 -101 86
3955 86 74 -43 -40 0 -70 5 56 -21 -39 -128 176 167 91 -40 277 -97 22 43 -245 6 142 59 -87 -91 -64 190
3981 190 -43 -63 173 -70 273 -347 -131 40 -41 96 29 -87 67 -52 -34 55 -107 19 313 -2 13 -70
4003 -70 -113 124 93 136 117 -39 324 192 -25 183 223 36 36 -71 -47 -126 121 -8 108 -63 -195 33 37 -42
4027 -42 -116 94 -63 158 168 218 43 -235 -152 11 -61 137 129 115 -139 88 -242 126 2 -188 -126 -113 59 20
$$ packed form
3860b63J75K24k14m4J26N0j04nK4qJ37q2j55J19k2J73k22R8k8K32q9J11l01L15
3884B47M6l20LP3j88K5r7P63m00j54K33l40K07l07L07k70J51j14k5Q2L74m84K17
3907B9K5j54N9p6j12L86j03j03Q6j04K0m8K11N5k41J9R2n8j15K18j69J04p9R7
3931C9o5j80L84l33LJ09q4L24%m17L00p7q5K1J50K23k77m5J55l90J33O1n0J87
3955H6j2j17LM0p0P5N1p7j8q9L04rp6j31L17l74J19K1k88K51J36q3j46mK7K54
3981A90k33k0K36k43L43o20K16J71q1J37o7j16J54j19J8Q9j62J26K94l15J5q3
4003g0m3K37l1M3j9j56L63j32k17K08M0j87%j07K4p9K47j29J16j71j32K28Mp9
4027d2p4K10j57K21J0N0j75k78Q3J63p2J98qj4k54K27l30L68j24j90O2J3J72l9
$$ plain form
4051 20 -56 0 126 53 62 -2 165 -130 7 223 -180 -9 77 -27 -176 82 -122 32 -4 124 -76 41 189
4074 189 161 84 -29 9 85 37 -30 -14 98 -43 70 21 -374 -36 -21 10 -42 -35 76 -68 54 -8 104 5 111
4099 111 -98 128 -61 93 226 -49 92 169 200 -170 176 -124 225 -192 -11 -138 -10 -107 -218 -112 -167
4120 -167 224 -78 -126 -128 65 -12 -338 -94 189 78 166 -74 103 74 -123 48 100 350 -77 148 15 -46 52
4143 52 -81 -51 -197 53 -158 -95 -121 70 -6 -132 -53 -89 72 -63 -6 171 65 78 330 -63 199 14 64
4166 64 185 57 138 173 148 157 -30 -179 226 153 5 -178 -112 -81 -95 -182 198 -205 357 153 -127 -116 148 -23
4190 -23 -159 116 165 155 -239 23 -26 140 -52 -84 -100 -165 -181 2 -27 160 -193 -142 206 -28 -102 32 240 136
4214 136 227 -48 -97 111 73 162 101 121 73 -48 -93 186 -13 76 185 250 -166 -114 40 57 -36 -121 -175 41 -245
$$ packed form
4051B0p6N6J26p3Ro4J67k95J37K16m03J71Q6j04j49K58k04J54l6J28k00J17J48
4074A89k8p7j13L8P6m8o7J6J12j41J13m9l95L38J5L1n2PJ11j44J22o2J12r9J06
4099A11k09K26j89J54J33k75J41P7L1l70L46l00L49m17J81j27J28r7j11J06n5
4120a67L91l02m8kJ93p7l26K44K83j11Q8k40J77k9j97J71N2K50m27K25j33o1R8
4143E2j33L0j46K50k11O3k6J91p6j26P9l6J61j35N7J77j06J3K52l93K62j85N0
4166F4J21j28Q1L5k5Rj87j49M05p3j48j83O6L1j4q7L80m03N62k04k80J1K64j71
4190b3j36K75M9j0l94K62m9J66j92l2j6o5j6J83k9J87l53N1L48k34p4J34K08j04
4214A36R1k75m9K08l8Q9o1K0m8j21m5K79j99Q9J09O5m16N2J54J7r3q5n4K16k86
$$ plain form
4239 -245 -9 209 -245 140 -93 2 9 -297 -106 -72 -101 287 -110 -74 189 209 123 -4 258 -150 333 45 -220
4262 -220 102 -157 -80 179 115 -127 -65 33 20 -58 -18 -72 -147 8 -22 -172 3 -428 86 -163 -135 -231 254 151
4286 151 147 -131 -69 74 -219 46 -3 303 -7 241 -54 -44 131 -228 83 -203 121 -2 161 271 -104 111
4308 111 174 167 -182 -1 -21 -15 -121 195 -151 96 14 -60 65 17 -2 27 250 -112 -94 89 -16 245 165 120 28
4333 28 91 331 -298 -38 78 -16 -291 42 -213 128 36 12 -140 -39 -86 11 183 -2 84 -46 -12 -128 -49
4356 -49 -215 -95 -55 277 83 -89 148 -271 -101 285 155 169 -210 -111 134 -41 -35 -154 -35 49 -79 -1 115
4379 115 147 -70 228 13 180 79 -229 59 -132 116 -77 66 -198 142 -417 -65 69 13 -38 -78 181
4400 181 92 -36 31 46 36 3 -126 309 251 -195 -52 -70 -291 -22 178 -1 -78 76 122 292 48 -129 -40
$$ packed form
4239b45K36K18m54L85k33R5Pl06J91L4k9L88l97L6K63K0q6j27K62m08M83k88k65
4262b20L22k59P7K59o4k42O2R8j3p8M0n4p5J55l0j50J75m31N14k49K8r6M85j03
4286A51mk78O2J43k93K65m9L06l10K48k95J0J75l59L11k86L24j23J63J10l75K15
4308A11O3pl49J81k0Oj06L16l46K47q2p4J25m8j9K9K23l62J8J83j05K61q0m5r2
4333B8O3K40o29K60J16r4k75L33k55L41r2k4j52J01m7R7J72j85Q6j30L4j16P9
4356d9j66J20M0L32j94j72K37m19J70L86j30J4l79R9K45j75Oj19J19Q4j28P8J16
4379A15L2k17K98k15J67j01l08K88j91K48j93J43k64L40n59L52J34n6n1m0K59
4400A81q9j28O7J5j0l3j29M35n8m46J43j8k21K69K00j79p7J54M6J70k44j77Q9
$$ plain form
4423 -40 -196 -188 -103 296 -60 40 -154 12 -14 9 -146 -217 -56 86 -116 -149 -163 33 248 -210 88 -19 77
4446 77 198 6 -5 104 54 -184 17 342 160 30 0 -201 104 139 -152 -334 -116 -314 -307 -156 11 -55 36
4469 36 194 -76 -111 220 192 -23 272 -171 0 174 -150 -46 197 79 190 -6 61 -101 -189 232 -62 -338
4491 -338 112 -5 16 -349 -314 -5 -64 91 -39 -33 -4 114 179 53 -203 -145 2 126 -121 429 142 189 95
4514 95 -77 140 -28 145 79 198 -81 384 -87 -348 -71 -255 140 -216 -344 -59 106 80 -12 96 107 -63
4536 -63 179 -99 -117 -107 141 51 116 32 -44 98 -140 97 -50 -7 13 90 -251 113 100 -127 24 -133 -172 -4
4560 -4 2 125 66 -50 131 99 440 74 -2 193 18 -50 173 82 -77 -288 -255 161 51 -273 40 81 -54 -154
4584 -154 -213 -101 92 -61 55 133 168 72 57 261 308 -204 333 52 -55 6 137 60 -14 170 -21 -149 67
$$ packed form
4423d0j56QQ5L99l56J00j94J66k6K3j55p1J61J42k02l3j4J96K15m58K98j07R6
4446G7J21j92j1J09n0k38K01L25j82j30l0k01L05L5k91j82K18j98PJ51J67o6R1
4469C6J58k70l5L31k8k15K95m43J71J74l24J04K43j18J11j96O7j62q8M21k94k76
4491c38M50j17K1l65L5L09n9J55j30OK9J18O5j26k56N8J47J24k47N50k87M7r4
4514I5j72K17j68J73o6J19k79M65m71k61K77j84L95l56j28K85J65k6r2J08J1j70
4536f3K42k78j8J0K48r0O5q4p6J42k38K37j47M3K0P7l41L64j3k27J51j57l9J68
4560dOJ23n9j16J81l2L41l66p6J95j75o8K23r1j59k11L3M16j10l24L13M1j35j00
4584a54n9J12J93j53J16P8L5r6j5K04M7n12N37k81j07O1J31p7p4J84j91j28K16
$$ plain form
4607 67 -14 253 122 146 -318 -27 -21 -108 129 -200 152 57 155 -270 -66 182 -25 54 147 24 -64 168 -98 4
4631 4 35 120 -271 59 297 17 193 140 -121 -90 156 127 86 168 105 167 227 -85 -279 -74 -75 127 -21 -185 298
4656 298 -93 35 7 162 10 21 121 4 -63 -87 100 198 15 58 -97 52 -23 178 -3 263 -159 150
4678 150 36 -79 -197 -12 46 -151 112 -203 -31 114 81 92 -90 84 -75 31 215 21 77 -338 169
4699 169 -94 250 -63 54 -14 36 -3 -72 4 15 -76 -100 -55 100 84 170 -156 -133 -250 -104 77 -139 60 323
4723 323 152 -68 -102 83 -46 168 -204 -13 84 -359 195 158 -113 -14 0 -97 95 -109 -185 -39 -295 -205 -3
4746 -3 -88 -32 -88 216 -15 25 134 24 -12 47 142 202 -116 359 -7 -88 -10 303 105 10 123 -45 77 82 -21
4771 -21 -32 99 -173 -279 35 -6 73 185 -27 117 105 -215 102 176 -66 126 121 -42 -82 43 -187 123 161
$$ packed form
4607F7q1K67j31K4m64K91Oq7K37l29L52r5R8m25K04K48k07P9R3j23q8K32k66J02
4631DL1Q5l91L30K38k80J76n3k61L1K46k9m1Q2o3O2O0l12j94K05jK02j48j64M83
4656B98l91J28k8J55j52J1J00j17o7k4J87R8j83M3j55J49p5K01j81K66m22L09
4678A50j14j15j18J85N8j97K63l15J72J45l3J1j82J74j59J06J84j94N6m15N07
4699A69k63L44l13J17o8N0l9o9P6J1r1k4M5J55j6Q6l26K3j17J46J81k16J99K63
4723C23j71k20l4J85j29K14l72J91R7m43N54l7k71R9J4r7J92k04p6J46k56R0K02
4746cq5N6n6L04k31M0J09j10l6N9R5O0l18M75l66q1P8L13j98r5J13j68J22Nj03
4771b1j1J31k72j06L14m1P9J12k12J44j2l20L17P4k42J92nj63m0J25k30L10L8
$$ plain form
4794 161 244 -78 92 50 101 -72 -103 -167 -134 -57 -98 44 -34 -12 40 180 292 82 -23 419 29 -193 10 168
4818 168 33 304 146 100 122 -290 195 -153 -349 23 248 -60 136 -81 8 26 -125 -63 36 -23 -47 -291 -93
4841 -93 15 154 67 -92 -354 11 161 -26 -39 19 57 286 124 76 -142 30 335 101 2 15 -97 -38 110
4864 110 50 91 -29 -69 27 -35 120 119 -222 52 -9 -109 -204 6 282 -84 421 32 -25 49 -12 -87 336 -73
4888 -73 -216 -89 -128 -52 5 74 -109 -20 182 -8 106 -153 82 -68 -144 -105 -103 -161 -116 34 -26 307 -115 35
4912 35 -211 -26 -40 -126 89 -55 95 -118 55 -233 -18 -7 -9 14 -238 -17 31 -142 -87 5 -18 44 14 -60 -16
4937 -16 -97 -118 -21 20 58 -91 89 -64 -16 214 -14 -9 194 -229 -119 -110 -176 89 78 -233 -187 -78 -194 31 -53
4962 -53 -85 -336 178 -88 -316 71 354 -136 259 90 14 69 -7 83 214 134 19 172 182 -43 -132 -7 -46
$$ packed form
4794A61Q3l22J70m2N1j73l1o4L3P7m1J42p8K2N2J40J12k10j05M42l90k22K03J58
4818A68j35K71j58m6K2m12M85l48j96L72K25l08J96k17Q9J8j51O2R9n9k4k44J98
4841i3J08J39q7j59k62L65J50j87j3N8L8K29j62m8k18J72L05k34r9J3j12N9J48
4864A10o0M1j20m0R6o2J55jl41K74o1j00r5K10K76l66N05l89n7P4o1p5M23m09
4888g3j43J27l9P6N7O9j83Q9K02j90J14k59K35j50p6L9Kn8M5J50o0L33m22J50
4912C5k46J85j4q6K15j44J50k13J73k88K15J1kK3k52K21M8j73N5R2k3O2l0p4M4
4937a6q1k1R7M1L8j49J80j53M8K30k28NK03m23J10Ro6K65j1l11M6J09j16K25q4
4962e3l2k51N14k66k28L87K83m90L95j69p6N5p6R0J31q0j15J53J0k25q9J25l9
$$ plain form
4985 -46 9 80 -70 -165 90 50 -127 -161 -85 -144 105 173 -9 -96 -228 152 -178 -16 -159 102 114 -31 -135 48
5009 48 -167 242 -79 93 -223 -174 -64 44 85 274 -79 178 -31 -117 -116 114 -4 -258 63 -327 -96 -41
5031 -41 86 109 -64 -33 156 5 -11 167 232 -230 -127 -80 356 163 -203 161 -82 -136 -71 29 -39 -40 117 -103
5055 -103 201 94 -79 -128 285 -33 87 -213 113 304 210 -126 -27 -218 46 78 5 -220 130 121 -328 -214
5077 -214 -219 -69 215 83 18 -102 19 2 -237 -44 43 -67 118 -14 -32 74 -165 -68 -92 -64 -186 73 20
5100 20 19 138 306 332 64 -43 92 233 -22 36 135 150 14 -172 -164 -147 -152 -105 66 200 -310 -123 -119 52 -150
5125 -150 59 289 -133 -109 93 -4 -68 279 108 300 92 115 -75 330 47 -186 226 -132 151 -210 -51
5146 -51 -150 -27 -2 -174 -192 -151 -137 31 -71 206 156 264 -62 -73 -107 101 83 -72 114 176 96 -390 -9 -149
$$ packed form
4985d6N5P1j50r5K55m0j77l4P6n9K49O8j82q7j32L80l30J62j43K61J2j45j04J83
5009D8k15M09l21J72l16M9J10J08M1J89l53K57k09q6JK30j18k54L21l90K31N5
5031d1J27K3j73L1J89j51j6J78O5m62J03M7M36j93l66L64k43n4O5J00o8jJ57k20
5055a03L04j07j73m9M13l18J20l00L26J91r4l36R9j91K64L2p3k25L50rm49J14
5077b14nJ50K84j32o5j20J21j7k39J93Q7j10J85j32j8J06k39R7k4K8j22K59n3
5100B0jJ19J68K6k68j07J35J41k55N8R9J5j36j86QJ7nM7J71J34n10J87MJ71k02
5125a50K09K30m22K4K02r7o4L47j71J92k08K3j90M05k83k33M12l58K83l61J59
5146e1r9J23K5j72j8M1J4J68j02K77n0J08l26j1l4K08j8j55J86O2q0m86L81j40
$$ plain form
5170 -149 60 -6 176 -73 -25 146 -10 41 -12 81 79 -138 109 153 -216 122 3 -301 197 -40 158 114 119 142
5194 142 107 7 79 119 102 18 167 -212 18 -128 29 121 -151 -231 -167 -112 1 25 32 -68 -107 121 2 68 50
5219 50 -112 -66 139 -51 -5 23 41 170 78 43 -35 127 167 -191 72 175 -160 -157 -101 -192 -249 18 -91 -217 -191
5244 -191 53 75 -62 -56 -104 -426 -3 -88 -160 121 -108 -312 35 -41 44 179 -143 105 106 -229 172 224 70 -238
5268 -238 -185 67 -22 -249 112 19 -57 -130 -256 87 -245 -284 -120 64 173 77 25 28 -90 -161 -40 139 66 236
5292 236 -224 1 -16 -108 198 125 180 -113 133 171 -42 89 -98 53 -28 -284 -142 -153 -145 -14 84 -63 19 -85
5316 -85 -125 -32 391 238 177 80 133 -5 -63 408 290 -211 -44 2 -132 192 -6 255 -71 -12 173 -170 -59
5339 -59 22 77 -39 -108 -26 -134 108 -184 103 -143 -150 -146 134 115 66 -218 128 96 -38 252 76 -130 361 126
$$ packed form
5170a49K09o6J82k49M8J71j56N1n3R3kk17K47M4l69L38j19l04M98k37J98m4NK3
5194A42l5j00P2M0j7q4J49l79K30j46J57R2k72q0O4N5J13K4Pj00l9K28j19O6j8
5219E0j62M6K05j90M6K8J8J29r2l5p8J62M0l58K63J03l35LN6r1n7K67j09j26K6
5244a91K44K2j37Om8l22M23q5p2K81k29k04L47p6Q5J35l22K48Jl35M01N2j54l08
5268b38N3K52q9k27L61r3p6p3j26L43l32l9J64J84J09r6n2Lj18p1J21J79p3J70
5292B36m60K25j7r2L06p3N5k93K46L8k13J31j87J51q1k56J42j1QJ31R8j47Q2j04
5316h5m0R3M23j53o1r7N3j38n8M71j18n01J67M6j34L24j98K61l26N9J85l43J11
5339e9Q1N5j16o9Q2j08K42k92K87k46pMK80j9m9k84L46l2j34K90j76k06M91k35
$$ plain form
5363 126 -113 38 -71 398 58 -244 33 174 -82 6 -65 135 -42 57 133 -231 241 16 27 100 -112 302
5385 302 34 197 11 163 -52 -21 16 48 46 -109 77 -161 -244 84 -8 -156 113 -93 122 -48 -269 189
5407 189 65 -176 161 -14 124 160 -250 310 50 104 95 -32 109 -57 120 45 254 -20 128 -201 -242 -160
5429 -160 -146 -184 100 116 237 95 -138 105 -63 -154 58 -64 35 -66 169 344 -20 82 90 -64 -188 -106 192
5452 192 -90 -140 -56 -44 37 -72 -185 -40 83 -36 180 -13 82 -103 115 69 329 -374 -338 98 47 84 184
5475 184 2 -17 -52 -171 -20 61 42 -131 -82 87 -26 46 -67 -152 69 -40 23 -60 18 -54 45 103 -454 183
5499 183 -81 -357 179 -157 182 4 -160 30 -57 -1 94 -89 161 -111 8 211 30 123 -46 -45 -13 98
5521 98 -19 150 -198 -175 105 -90 153 -188 -243 178 -125 124 -86 33 25 -41 -64 71 107 -173 86 49 36
$$ packed form
5363A26k39J51j09M69l40l02K77J41k56Q8p1K00j77R9P6l64M72k25J1P3k12M14
5385C02k68J63j86J52k15L1L7L2kj55J86k38q3L28r2j48K69k06K15j70k21M58
5407A89j24k41L37j75J38L6m10N60k60N4rj27J41j66J77p5K09k74J48l29m1Q2
5429a60J4l8K84J6J21j42k33K43j68r1K12j22R9j01K35J75l64J02Qj54j24Q2K98
5452A92k82n0Q4J2Q1j09j13J45J23j19K16j93R5j85K18m6K60p03L6M36n1L7J00
5475A84j82j9l5j19J51Q1j9j73M9J69j13P2j13q5K21j09O3q3P8p2R9N8n57O37
5499A83k64k76N36l36L39j78j64J90q7N6R5j83K50k72J19K03j81R3j69JL2J11
5521I8j17J69l48K3K80j95K43l41n5M21l03K49k10J19qo6k3J35L6k80K59l7j3
$$ plain form
5544 36 -15 -176 209 -262 -68 210 83 -40 -61 -236 -81 179 184 65 -59 51 -322 -156 166 214 -408 -128
5566 -128 6 24 -58 134 8 -303 11 338 142 -231 138 77 -75 -39 -61 -37 87 -153 45 111 -219 20
5588 20 -220 -64 -126 57 274 122 -422 -77 71 -116 40 -20 -63 -143 121 355 -27 204 258 -276 201 236
5610 236 -109 -128 133 35 7 -118 -84 68 -20 168 158 84 -127 130 41 209 -91 112 290 -43 12 -37 -89 222
5634 222 -71 25 551 -129 -2 38 -177 -100 73 95 155 -50 151 -105 105 -180 148 -39 77 -125 192 -231
5656 -231 -30 68 -107 241 183 45 73 -102 -225 0 156 130 113 133 213 -204 184 -63 45 95 321 30 -145
5679 -145 -143 -209 125 -161 137 130 -87 85 14 160 61 -232 -2 98 119 46 105 62 -116 37 121 180 -2 -130
5703 -130 10 70 25 97 -125 262 -158 -247 199 -13 51 18 -55 91 91 -130 221 -8 213 243 82 75 8 -12 418
$$ packed form
5544C6n1j61L85m71J94K78j27j23k1j75J55K60Nj19j24J10l73J66L22M8o22K80
5566a28J34J8q2J92j26l11L14L27j96l73L69o1j52L6k2K4J24k40J98O6l30K39
5588B0k40J56o2J83K17j52n44L45J48j87J56o0m3q0K64K34l82K31N4n34M77L5
5610B36l45j9K61r8k8j25L4J52q8J88j0p4k11K57q9J68l00K03J78l33N5m9n2L11
5634B22k93R6N26o80J27M0k15P7J73K2O0k05K01k56K10k85L28j87J16k02L17m23
5656b31K01R8j75L48n8j38K8j75j23K25J56k6j7K0Q0m17L88k47J08N0K26k91j75
5679a45Ko6L34k86K98pk17J72p1J46r9k93K30J00K1p3N9m3j78J53Q4N9j82j28
5703a30J40O0m5P2k22L87m20q9M46k12O4l3p3J46%k21L51k29K21L0j61po7k0M30
$$ plain form
5728 418 -34 157 -1 -95 34 5 -213 208 -178 59 68 210 43 118 16 45 -72 20 94 -154 -14 -159 43
5751 43 -59 -87 53 -170 133 3 -297 -129 146 72 318 48 7 12 78 117 8 66 -181 168 -102 81 57
5774 57 -119 132 -21 -122 383 -12 -129 -151 -15 -12 390 49 -27 13 -66 66 -44 82 19 -19 73 114 169 117
5798 117 -92 -240 -128 -178 -165 -107 44 267 -67 287 -83 -194 48 -155 -42 -87 260 -100 136 -8 145
5819 145 103 -184 10 -22 -35 -87 -27 -110 -34 129 -43 77 -373 29 -8 243 61 -37 -88 157 11 -76 206 -101
5843 -101 205 102 -28 167 2 205 121 -165 151 165 34 17 105 -53 44 146 151 50 42 146 348 -95 -266
5866 -266 -128 -89 -116 -122 -39 -295 172 26 -113 -60 19 -5 -41 -204 27 -29 -25 -5 -148 104 64 -70 -43 -204 187
5891 187 170 21 -342 -170 1 165 -97 -66 46 -34 -97 172 19 -277 -13 -70 -91 -87 -86 283 13 15 -163 -55
$$ packed form
5728D18m52J91j58r4J29k9k18M21l86K37RJ42j67P5j02K9j17R2P4k48J40j45K02
5751D3j02k8J40k23L03j30l00J68K75p4K46k70m1NO6L9j09N8k47L49k70J83k4
5774E7j76K51j53j01N05l95j17k2J36LM02l41p6M0p9J32j10J26o3l8R2M1N5n2
5798A17k09j48J12n0J3N8J51K23l34L54l70j11K42k03J13m5L47l60K36j44J53
5819A45m2k87J94l2j3n2O0q3P6J63j72J20m50M02l7K51j82r8n1K45j46q7K82l07
5843a01L06j03j30J95j65K03q4k86L16J4j31j7Q8j58R7J02Nj01qJ04K02m43j71
5866b66J38L9k7oQ3k56M67j46j39N3P9k4l6j63K31n6MK0j43K52m0j34K7j61L91
5891A87j7j49l63J72J71J64k62L1J12q0o3K69j53k96K64n7k1MJL69k70Kj78J08
$$ plain form
5915 -55 21 75 136 141 -134 85 272 -9 -9 -11 -44 -70 61 -96 -39 173 -152 35 -43 -52 -7 -94 1 94 143 58 25 5
5943 5 -150 -22 221 246 50 133 -27 -129 273 36 90 106 139 142 -30 -97 -103 123 -125 20 -103 120 -43 -35 18
5968 18 44 -1 235 176 -98 82 -88 246 75 11 -92 -66 103 251 16 156 145 66 363 -143 -49 -131 94
5991 94 -79 -74 -186 -10 -4 23 1 -208 313 88 -84 41 -48 83 237 64 57 -65 199 224 -154 -47 -128 -284
6015 -284 -42 89 93 117 35 -81 119 85 -131 52 176 -65 -7 -35 -23 -141 112 80 -148 102 -105 -131 -102 -126
6039 -126 46 -202 132 7 58 267 -144 -206 -1 149 -154 148 137 113 196 -62 139 -111 -435 182 144 -149
6061 -149 -103 147 -108 -29 -174 83 -258 -94 96 -71 -77 79 -160 -31 -1 322 -79 2 144 49 -15 -11 -162
6084 -162 -105 -76 -89 121 236 -13 -228 -79 -31 181 -155 7 -138 6 39 180 -179 9 -86 -92 182 -221 -29
$$ packed form
5915e5P6N4O1Nk75K19J87k81%kl3k6J31j57N7K12l25J87p8rM5q7R5R3M9q5l3k0
5943Ej55J28K43K5j96Q3j60j02M02k37N4J6L3Lj72o7oK26k48J45j23K23j63QN3
5968A8K6m5K36n9k74J80j70L34j71o4j03K6J69J48k35J40j1p9K97n06R4q2K25
5991I4j73Nj12J76OK7k2k09N21k25j72J25q9J31J54j73pj22K64K5l78J07q1j56
6015b84K42J31MK4q2j16K00l4k16J83J24k41N8k8J2j18K53l2k28K50k07k6K9k4
6039a26J72k48L34j25N1K09m11o2K05J50l03L02j1k4Q3k58K01k50l24O17l8k93
6061a49M6K50k55P9j45K57l41J64J90j67oJ56k39J29L0L23m01Q1J42r5o4Mj51
6084a62N7K9j3K10J15k49k15J49M8K12l36J62j45J44L3J41l59J88r5oK74m03J92
$$ plain form
6107 -29 68 -53 -195 -45 -37 0 -103 134 114 355 -32 72 36 106 163 -163 77 29 -48 -23 -162 -14 -1 -246
6131 -246 185 67 -44 330 71 151 45 42 296 51 -43 -76 114 155 -22 -17 30 -75 -12 171 205 425 -39 74
6155 74 184 -77 -208 -14 32 -66 126 -147 -91 174 -92 90 -60 135 274 -265 8 151 -212 50 127 33
6177 33 -12 191 61 -178 -161 10 319 32 168 -198 112 132 -92 61 -92 -297 -117 99 235 -96 -41 100
6199 100 80 31 -123 100 -74 -63 160 205 146 -147 -108 115 6 28 -156 239 -73 110 -75 172 -138 165
6221 165 182 -13 13 162 60 -158 254 -217 -136 36 35 18 27 -175 27 -31 -3 161 415 240 102 143 141 -75
6245 -75 66 -285 -30 -348 179 -3 -145 -98 -129 28 -18 -135 -77 -238 109 -116 232 10 68 -27 -375 0
6267 0 -67 244 73 121 -134 40 -159 -55 21 -150 12 -42 -187 -162 1 -95 -92 216 183 1 -181 -27 -76 -52
$$ packed form
6107b9R7j21j42J50QL7j03K37k0K41l87J04l6P0N7l26K40m8p7K5j39J48J3k45
6131b46M31j18j11L74k59Q0j06lK54k45r4l3J90M1j77NM7j05O3J83L4K20m64J13
6155G4J10k61j31J94M6r8J92k73N6K65k66J82j50J95J39n39K73J43l63K62P7r4
6177C3m5K03j30k39J7J71L09k87J36l66L10K0k24J53j53k05J80K16J36l31N5J41
6199A00k0m9j54K23j74J1K23M5n9k93L9K23j09K2j84L95l12J83j85K47l10L03
6221A65J7j95K6J49j02k18M12m71Q1J72jj7Rk02K02n8K8J64K54j75j38M1kk16
6245g5J41l51K55l18N27j82j42M7l1J57m6j17N8j61L47k25L48k22N8r5l48L75
6267@o7L11j71M8k55J74j99J04P6j71J62n4j45K5J63r6LL08l3j82j82J54m9K4
$$ plain form
6291 -52 -156 39 123 -226 -69 28 -290 126 -41 46 38 115 -333 70 218 44 192 -127 30 74 14 -92 -228
6314 -228 34 158 -92 -15 -114 8 -452 116 8 -47 217 83 -105 -178 -50 305 40 -245 33 228 121
6335 121 -174 59 -147 164 -40 -349 33 -76 -204 -27 -80 51 -137 -134 164 -45 -113 79 46 -115 -50 -254
6357 -254 86 6 183 69 -118 -133 65 -98 198 -158 -192 49 -232 97 263 -106 116 150 -213 -99 104
6378 104 -34 -299 -38 -79 -118 -139 62 68 85 86 -70 -80 -146 -145 58 -38 118 -85 -83 -32 -67 -66 409 139 -67 -68 -64 172
6406 172 110 -179 164 195 -49 149 -111 27 -28 -71 63 13 27 266 -35 16 -130 -318 -72 171 -282 101
6428 101 -79 121 -224 -238 -121 71 75 307 -308 -14 76 -193 -41 293 19 -279 421 -181 323 19 -76 71
6450 71 -231 111 -300 104 -53 -23 176 170 -177 20 97 0 -297 -103 -108 -107 -297 -151 156 -7 11 157 -248 -85
$$ packed form
6291e2j04J95Q4l49J57R7l18M16j67Q7qP7m48M03J48j74J48l19J57M4o0j06j36
6314b28K62J24k50P7r9J22m60N68j08n5K64j34j88p3J28L55k65k85K78J95j07
6335A21k95K33k06L11k04l09L82j09j28J77n3J31j88LK98k09o8J92l3j61O5k04
6357b54L40q0J77j14j87j5J98j63K96l56l4K41k81L29J66l69K22L4l63J14K03
6378A04j38k65K61m1l9k1K01OJ7Jj56j0o6JK03r6J56k03KN1l5JM75k70k06jMK36
6406A72o2k89L43L1k44J98k60J38n5m3J34n0J4K39l01N1j46j88K46K43m53L83
6428A01j80K00l45j4J17J92MK32o15K94R0k69J52L34k74k98P00o02N04l04r5J47
6450G1l02L42m11M04j57L0J99ol47J97P7r7k97J94nJj90J46L07j63J8J46m05J63
$$ plain form
6474 -85 71 102 8 -17 133 142 60 237 -97 -45 196 -32 -12 -37 58 -134 120 -164 -44 31 -63 247 -129 -155 14
6499 14 -150 45 -69 98 -192 26 123 35 34 -137 147 75 -190 -184 146 5 207 -78 -71 -63 45 -160 -208 140
6523 140 -141 49 50 -284 11 -110 -1 -22 -67 40 -83 -96 -98 -207 171 86 -16 150 -26 89 296 50 49
6546 49 99 -54 94 -192 -85 64 43 126 -126 -137 35 127 6 -48 -162 8 172 161 -110 390 -199 100 -10
6569 -10 -39 113 -177 -48 -97 61 -50 -74 95 151 103 64 87 -247 -42 24 -107 -15 -39 62 36 -291 -146 146
6593 146 -193 232 -94 70 -58 74 197 -46 -242 127 232 -157 -211 163 166 -6 -56 -122 334 -143 -73 -66 72
6616 72 -118 -121 19 0 61 -76 132 143 -55 -160 -135 234 -75 -170 -42 -148 313 89 -96 272 27 -128 33
6639 33 -106 -85 -153 13 18 -12 41 183 -52 251 1 -53 -64 36 -102 201 50 -216 168 -31 -128 -234 -33
$$ packed form
6474h5J56L1r4k5J50Rq2J77l34N2K41k28K0k5R5j92K54k84J20P5r4L10l76k6J69
6499A4j64J95j14J67k90K18R7q8jj71K84p2k65OL30j41K02k85PQJ08k05m8L48
6523A40k81J90Jl34K95j21J09k1m5J07j23j3kj09L78q5j02J66j76J15K07k46j
6546D9N0j53J48k86J07J49k1Q3k52j1J72R2j21n4j14J70J64j1k71N00n89K99j10
6569a0k9J52k90J29m9J58j11k4J69N6m8l9K3l34K05O6j31R2k4J01k6l27J45K92
6593A46l39M25l26J64j28J32J23k43j96L69J05l89n4L74Lj72n0o6M56m77P0PJ38
6616G2j90lJ40j9O1j37K08J1j98j05K5L69l09r5J28j06M61k24j85L68k45j55J61
6639C3j39K1o8J66Nl0N3J42k35L03k50n4j1J00j38L03j51k66L84j99r7j06K01
$$ plain form
6662 -33 -1 -114 54 -152 3 -74 -216 -50 -23 -101 -75 -44 21 -262 -146 75 -65 36 -22 301 -146 153 -118
6685 -118 252 -84 79 -189 37 9 -34 -83 -239 -109 -222 63 -22 -85 39 165 123 139 -154 132 16 -4 226
6708 226 316 78 -11 -59 -217 241 78 -124 -121 201 255 -118 -78 -151 -81 247 166 -39 -39 -167 -20 -62 12 166 -138
6733 -138 -218 -153 -216 66 -27 227 -45 50 187 196 90 69 35 128 -55 95 47 92 37 264 -276 10 -32 220 45
6758 45 -102 -168 -72 38 -171 -205 153 -2 43 83 -107 248 57 71 -176 36 -74 99 -165 -52 168 -201
6780 -201 14 -246 -200 43 -201 -172 -37 30 -49 94 39 8 55 64 -212 66 -176 -52 -64 -94 141 -67 -7 -182
6804 -182 207 -48 -122 -169 -5 -93 -12 -143 108 -226 110 79 -292 -138 191 -47 145 220 -144 -180 154 -22
6826 -22 229 72 -114 -12 -263 8 -51 -47 284 -176 -211 159 6 -6 208 222 40 1 -83 -190 198 -13 88
$$ packed form
6662c3L2j13J68k06J55p7j42J66K7p8K6L1O5k83J16K21j40J01n8L23m47K99k71
6685a18L70l36J63k68K26k8m3m9j56J30j13K85q5o3J24J26m2J6k93K86j16k0K30
6708B26R0k38q9m8j58M58j63k02LL22N4l73M0p3P0L28q1k05%j28J47m2P4J54l04
6733a38q0O5o3K82r3K54k72R5J37Rj06k1l4R3j83J50m8M5n5K27n40K86m2K52j75
6758D5j47o6R6J10k09l4L58j55M5M0j90L55j91J4k47K12j10J73k64J13K20l69
6780b01K15k60M6K43k44K9J35O7p9J43n5l1M7Rk76K78k42J24j2l0K35k08O0j75
6804a82L89k55p4m7J64q8Q1j31K51l34L36l1l71J54L29k38J92P5l64l6L34j76
6826b2K51j57j86J02k51K71n9ML31m60l5L70j53j2K14J4j82l9q4j07L88k11J01
$$ plain form
6849 88 -14 -81 33 -57 251 15 191 17 48 108 -90 -57 188 -67 -118 12 -255 290 113 195 -61 202 -60
6872 -60 65 44 66 85 -4 2 -167 366 -83 -113 55 15 -262 173 -26 -252 161 6 -28 -61 -121 90 -78 -113
6896 -113 2 -291 299 -44 -166 -119 -137 -115 25 -48 -34 -66 -189 185 -154 -56 237 -273 136 122 -146 -32 75
6919 75 195 -12 -120 -31 91 -139 137 -109 20 26 -40 -80 107 -100 29 -140 156 256 -141 -27 -3 -129
6941 -129 239 -46 -132 236 24 -36 -56 -51 227 202 -105 35 -80 88 15 -216 11 -71 -117 35 68 -61 4 83
6965 83 -33 99 -17 104 186 -416 -127 -71 -70 35 -4 -102 13 38 -252 -136 39 -119 163 201 132 -116 70
6988 70 115 -77 30 -91 -154 -37 15 88 163 -99 -107 -163 -202 -12 -46 91 132 27 -8 -70 -29 -44 -140 170 -131 -78
7014 -78 26 88 -135 21 -329 -10 135 56 175 144 67 173 -37 -38 104 -273 -137 -12 48 13 152 -61 -121
$$ packed form
6849H8j02o7J14r0L08k36J76j74L1O0j98L3K45k55n1J30k67N45j77Q2k56K63k62
6872f0J25k1K2J9q9Oj69N33m49l0J68m0k77M35j99k26M13j55l4l3o0K11j68l5
6896a13J15k93N90l43j22M7j8K2J40p3J4l2j23L74l39R8K93n10M09j4k68J14J07
6919G5J20k07j08Q9J22k30K76k46J29Oo6m0J87k07J29j69K96J00l97J14K4j26
6941a29L68k85q6L68k12o0k0NK78k5l07J40j15J68p3k31K27q2m6J52L3j29O5P9
6965H3j16J32j16J21Q2o02K89N6JJ05l9r8J15K5k90J16J75j58K82L8o9k48J86
6988G0M5j92J07j21o3J17N2P3P5k62qn6l9J90l4J37M1j05l5o2M1j5r6L10l01N3
7014g8J04O2k23J56l50L19J45p9J19l1p7J06k10jJ42l77J36J25O0l5J39k13o0
$$ plain form
7037 -121 -112 -159 227 182 177 -112 51 81 -104 32 -277 -131 -128 -78 52 114 97 -104 -44 -149 168 -77 -226 -270 -318
7062 -318 -41 -76 67 -350 -79 339 21 57 -20 -6 -87 -133 -18 -33 -330 -25 -114 -258 -156 -288 31 -145 -42
7085 -42 -56 -99 92 -42 -111 60 51 -60 -74 275 -10 -30 -85 93 12 -142 167 -137 116 -12 -35 162 245 109
7109 109 -264 -323 24 34 -61 45 243 -42 2 54 62 64 -51 -11 226 -101 -177 83 -10 -66 31 112 -194 19 -153
7134 -153 28 363 -48 194 96 -157 -6 -196 -100 -201 193 -57 185 72 -35 -129 -107 111 6 39 135 -211
7156 -211 175 99 114 -103 -74 99 -190 118 -193 7 -64 101 -72 102 16 50 90 -30 353 34 26 -184 -102
7179 -102 -76 288 -36 -143 307 269 98 95 -25 219 147 100 159 190 82 -19 -72 -227 77 -145 408 367 -67
7202 -67 7 -114 -77 -94 -96 93 -48 22 -45 174 -12 41 25 -138 21 -46 -78 86 76 134 -76 -283 -84 -20 -207
$$ packed form
7037a21Rm7L86m5nk89J63L0j85J36l09J46LN0J30O2j7k01O0j05L17k45j49m4m8
7062c18K77l5J43m17K71M18l18L6p7J4q1m6J15j5k97L05q9j44J02j32L19j76J03
7085d2j4m3J91j34o9J71rj11j4L49k85k0n5J78q1j54L09l04K53j28k3J97Q3j36
7109A09l73n9L47J0r5J06J98k85M4N2QKj15M0K37l27p6K60r3n6R7Q1l06K13j72
7134a53J81L35m11K42r8k53J51j90R6j01L94k50K42j13j07r4K2K18j05L3R6l46
7156b11L86p6J5k17K9J73k89L08l11K00p1J65j73J74q6L4M0j20L83l19qk10Q2
7179a02K6L64l24j07M50l8j71lj20K44p2m7N9L1j08j01n3j55L04k22N53m1m34
7202f7P4j21L7j7kJ89j41P0o7K19j86N3j6j63J59o7l2J64j0N8k10k07J99O4j87
$$ plain form
7227 -207 69 60 -256 -167 -131 -153 -115 133 -230 165 -219 222 -81 61 88 -66 65 70 -17 -136 58 -26 59 -191
7251 -191 115 20 -110 188 97 122 122 -171 -117 -106 -350 91 50 30 -62 -50 64 177 26 -42 232 -27 -107 93
7275 93 53 104 326 -107 -193 226 158 -16 -103 -97 -78 72 79 -241 319 -478 -94 -87 -92 -116 -131 -88 153 74 -37 101
7301 101 61 -93 -154 75 -139 42 87 -289 45 173 -71 -138 6 -71 73 93 -66 45 90 -242 -20 154
7323 154 103 7 19 96 149 -168 -70 62 -111 -36 80 90 2 -55 -205 202 167 18 91 -239 50 -129 -122 238 -70
7348 -70 5 -158 -80 208 -167 -71 226 -159 -41 230 -97 259 -96 -138 193 -178 95 344 61 303 9 -66
7370 -66 101 109 -103 -75 -65 -42 -46 -100 15 -132 352 -22 64 -65 -92 111 65 -234 60 -19 -147 -7 -142 -101 -150
7395 -150 15 -116 -61 113 120 140 233 122 -6 -23 -46 113 156 152 -116 41 40 -38 -1 -30 26 67 -217 -238 178 -91
$$ packed form
7227b07K76rl16Q9L6k2L8K48l63L95l84M41l03J42K7j54J31Nq7j19J94q4Q5k50
7251a91L06r5j30K98r1K5%k93N4J1k44M41m1k0r2J2J14J13j51o8K74k59q0K00
7275I3m0N1K22m33q6M19o8j74q7OJ9J50Pl20N60p97L84Pnk4j5M3K41p9j11J38
7301A01m0j54o1K29k14J81M5l76L34J28k44o7J44p7J44K0j59J11M5l32K22J74
7323A54n1r6J2P7N3l17R8J32j73P5J16J0q8n7j50M07l5j49P3l30K89j79PL60l08
7348g0P5j63P8K88l75R6K97l85J18K71l27L56l55m2L31l71K73K49k83K42k94p5
7370f6J67Qk12K8J0K3mn4J15j47M84l74Q6j29k7K03m6k99K94p9j28J40j35M1m9
7395a50J65j31N5J74PK0R3j11j28j7k3J59M3mk68J57jp8L7k9N6M1k84k1M16k69
$$ plain form
7421 -91 -135 -241 -2 146 58 -46 96 161 170 -92 34 53 -133 63 154 -83 -13 69 143 335 42 74 -69 31
7445 31 -66 30 90 206 146 -14 -179 -224 8 78 141 235 -178 -148 115 85 -51 147 -127 190 24 8 -108 -74
7469 -74 -142 -76 213 78 -50 50 -95 155 -113 60 81 -86 241 -143 -128 -28 31 39 88 -108 166 41 -101
7492 -101 -48 276 68 75 -249 -98 3 174 143 77 -47 27 23 -49 -190 440 -55 -30 7 -33 105 -182 -22 -177
7516 -177 -60 -242 182 120 38 16 -107 -4 39 -75 381 -42 144 40 109 96 130 112 -85 84 -296 -36 -123
7539 -123 73 -24 -15 -2 -132 -24 -271 -125 128 100 65 -51 110 -85 24 50 135 136 -209 -96 23 23 -24 102
7563 102 83 -4 94 20 136 262 -93 99 289 -79 9 15 -15 52 23 20 -7 -152 -50 174 101 68 -1 261 -189
7588 -189 -211 83 170 55 137 37 142 -250 156 -130 -119 102 6 303 81 -174 -50 215 71 -191 -70 87
$$ packed form
7421i1m4j06K39J48q8j04J42O5Rk62J26J9j86J96R1k37P0Q2P4J92k93L2j43J00
7445C1r7R6O0J16o0j60j65m5K32P0O3R4m13L0K63l0j36J98k74L17j66j6j16L4
7469g4o8O6K89j35j28J00j45K50k68J73K1j67L27l84J5J00N9QM9j96K74j25j42
7492a01N3L24k08Pl24J51J01J71l1o6j24P4mp2j41O30m95K5L7m0J38k87J60j55
7516a77J17j82M24o2q2k2j23J03M3j14M56m23J86j04O9j3L4j8j97J69l80K60q7
7539a23J96r7RJ3j30J08k47J46K53k8l5j16J61j95J09K6Q5Jl45J13J19%m7J26
7563A02j9q7R8p4J16J26l55J92J90l68Q8Ol0O7k9lk7j45J02K24p3l3o9K62m50
7588a89k2K94Q7j15Q2j00J05l92M06k86J1K21r6K97k22k55J24K65j44k62J21J57
$$ plain form
7610 87 -241 188 107 254 79 101 63 21 139 104 60 -49 221 8 32 -16 385 -215 -47 -28 237 -49 -1 -73
7634 -73 81 -65 -107 201 -73 -276 157 -128 23 40 -15 -139 -137 119 -105 -11 302 -57 148 -9 -102 231 135
7657 135 84 81 54 10 187 88 180 -85 -24 143 -18 -127 4 -30 -27 220 -35 72 -103 -97 63 -82 164 -6
7681 -6 117 176 13 -24 87 189 -80 121 -141 -249 60 -169 43 30 -127 34 198 -106 27 -177 126 -175
7703 -175 114 95 183 58 -148 -65 -73 -75 111 167 -166 42 0 -225 373 133 119 120 110 -37 44 -263 105 48 134
7728 134 -202 63 32 -52 129 173 -12 -15 -6 -67 -101 43 -49 -47 41 230 29 -122 54 -52 28 -336 -11 -201 -7
7753 -7 59 113 11 -90 159 11 64 74 97 75 98 -167 -142 -122 -34 -15 115 -247 -137 144 -54 -141 82 99 191
7778 191 -18 -84 -174 -221 -13 -219 -245 -149 -11 -97 -11 37 6 -213 2 256 -126 -137 -129 94 169 85 -98 35 48
$$ packed form
7610H7l28M29q1J47j75K2l8m2J18l5m4j09K70k13K4m8M01o00J68J9K65k86M8p2
7634g3J54j46m2L08k74k03M33k85J51J7n5j24KK56k24R4L13l59K05j57r3L33r6
7657A35n1lk7m4J77r9R2k65O1J67j61j09J31l4LK47k55J07j75OJ60j45K46j70
7681fJ23N9j63l7J11J02k69K01k62j08L09k29K12j3j57J61J64l04J33k04L03l01
7703a75K89j9Q8j25k06Q3qkJ86N6l33K08m2k25N98k40j4Jj0j47Q1l07L68n7Q6
7728A34l36K65l1q4J81M4j85lRo1l4J44r2KQ8J89k01j51J76j06Q0l64L25j90J94
7753gO6N4j02j01K49j48N3J0K3k2K3k65K5K0Q8J9J30l62J10K81j98q7K23J7R2
7778A91k09o6r0m7K08k06k6R6J38q6Q6M8l1k19K15K54l82j1QK23P5q4j83J33J3
$$ plain form
7803 48 -76 -213 -191 -20 -113 101 3 226 -54 -19 -8 -76 -85 -136 51 -180 -49 -12 133 -48 -258 189 -73 225
7827 225 -99 72 88 -54 57 164 -78 -67 126 -96 -175 84 71 -218 -78 -19 -28 89 38 134 -82 79 326
7850 326 -42 -43 159 -100 -106 101 -324 287 -29 8 -21 -81 43 146 -13 14 163 1 31 297 -96 -131 -70 38
7874 38 182 -311 -115 -174 -9 -27 118 46 131 49 125 139 -30 -238 45 43 48 52 32 40 160 -150 -2 77 239 236 76
7901 76 -101 85 -27 208 -82 90 220 -67 -54 -49 57 145 91 20 -55 -337 250 -2 -120 69 -24 -11 183
7924 183 146 157 80 50 7 176 -209 137 -290 -88 -68 161 29 208 38 179 -64 -58 -81 2 -92 -177 -95 218
7948 218 -86 90 201 32 39 83 -29 2 92 146 -17 -61 83 -45 23 8 152 29 24 135 41 39 71 188 -153
7973 -153 -88 -136 -42 131 -57 -7 -61 89 204 -14 -259 -27 80 10 -37 138 -141 -31 -272 -122 129 -10
$$ packed form
7803D8j24j37K2J71r3K14r8K23k80L5J1o8rn1J87k31J31L7J45j81k10M47k62K98
7827B25l24J71J6j42J11J07k42J1J93k22p9K59j3k89J40N9rJ17n1R6k16J61K47
7850C26l68jK02k59oK07m25O11l16L7k9o0J24J03j59K7J49j62L0K66l93l5O1J08
7874C8J44m93J96n9J65j8J45p2Q5q2P6J4j69k08K83kNMk0QJ20l10J48P9J62lj60
7901G6j77J86j12K35k90J72J30k87J3NJ06Q8n4p1p5k82N87k52j18J89r3J3J94
7924A83l7J1p7l0m3J69l85L46m27K02K0K29j32J79j70J41k43Ok3Q3r4q5Q2L13
7948B18l04J76J11j69PM4j12L1R0N4j63m4J44j28O8j5J44j23nJ11r4kL2J17l41
7973a53O5m8R4J73j88N0n4J50J15k18k45K32J07p0m7J75k79J10k41J50K51j39
$$ plain form
7995 -10 -84 -99 -4 -116 66 -154 1 -98 30 -37 -34 -59 -55 -156 48 -42 -12 34 -107 40 -125 31 94 -94 163
8020 163 126 142 120 -106 148 105 116 -39 -56 -44 33 62 28 109 -93 -258 -1 76 -92 -175 44 -74 -74 201 43
8045 43 8 192 -2 -159 -230 -62 -51 -11 -35 213 -29 -258 23 -124 -31 94 132 -43 -16 207 78 -107 74
8068 74 -1 99 77 -2 25 -16 74 -422 -22 -91 37 7 114 194 -83 -205 -104 -45 -157 -281 99 28 -8 137
8092 137 -68 18 -317 -75 135 -13 -70 27 156 89 -95 -111 -196 104 -20 50 -166 94 201 30 -90 -42 566
8115 566 60 152 72 -58 40 -37 153 170 -79 -279 -197 286 -11 227 53 -71 -43 -202 -80 -154 -21 40 -48
8138 -48 116 84 59 126 -18 64 50 -27 31 -151 -175 -191 22 -97 170 180 88 15 46 -167 -35 170 142 -92 -122
8163 -122 4 43 31 -278 220 164 0 61 72 -212 90 129 111 -188 -50 104 -68 243 39 -268 100 214
$$ packed form
7995a0p4j5R5j12J82k20J55r9J28o7Lk5Mj01K04r0L0M6j41J47j65J56O3j88K57
8020A63l7J6k2k26K54m3J1j55j7J2P7K9l4Q1k02j65K57P7j68q3K19j18%K75j58
8045D3l5J84j94j57p1J68J1M0k4K48k42k29K81j47R3J25L8j75K7K23j29j85J81
8068G4p5J00k2p9K7m1R0m96M00o9J28l0J07Q0k77j22J01N9j12j24L80p1l6J45
8092A37k05Q6l35K42K10j48n7R7J29o7j84j6q5L00j24P0k16K60J07j71j20M8O08
8115E66n06R2q0j30R8p7J90J7k49k00Q2M83k97K38j74j24K8j59J22p4J33O1q8
8138d8J64l2k5O7j44Q2j4p7N8j82k4j6K13j19K67J0r2p3L1k13J32K05k8k34l0
8163a22J26L9j2l09M98n6j64O1J1k84L02L9j8k99J38J54j72L11k04l07L68J14
$$ plain form
8185 214 -159 -21 23 196 -50 -115
$$ packed form
8185B14l73J38M4J73k46o5
8191a15
$$ Imaginary data points
##PAGE= N=2
##DATA TABLE= (X++(I..I)), XYDATA
$$ plain form
0 0 0 0 0 0 0 0 0 0 0 0 0 0 7 -8 8 -8 8 -16 16 -22 24 -29 32 -40 48 -55 63 -72 83 -95 109 -123 140 -157
34 -157 178 -199 222 -249 278 -309 344 -382 422 -466 515 -569 627 -691 759 -839 923 -1016
52 -1016 1123 -1238 1372 -1524 1695 -1895 2132 -2414 2759 -3192 3750 -4502 5569 -7201 9983
67 9983 -15601 31280 -163556 -536494 43585 420547 46838 -282139 -8687 216073 2232
78 2232 -145123 11626 80718 66696 83317 -11622 -170237 -72399 205361 178384 -141136
89 -141136 -159714 77613 76411 -74859 -44671 66015 28415 -64603 -36751 -34391 -67179 63708
101 63708 144383 -57800 -204168 -27723 167935 50927 -114713 -9942 88418 -18417
111 -18417 -63897 16496 55138 38448 30926 -8076 -91901 -31768 143682 83653 -109857 -55041
$$ packed form
0@%%%%%%%%%%%%Pj5J6j6J6k4L2l8M6n3O1p2Q8j03J18j35J55j78K04k32K63k97
34a57L35l77M21m71N27n87O53p26Q04q88R81j084J196j318J450j598J762j939
52a016K139k361K610k896L219l590M027m546N173n951O942q252J0071j2770J7184
67I983k5584M6881j94836l72938N80079L76962l73709l28977K73452K24760k13841
78B232j47355J56749O9092j4022J6621r4939j58615R7838K77760k6977l19520
89a41136j8578K37327j202j51270L0188J10686l7600r3018K7852K360l2788J30887
101F3708Q0675k02183j46368J76445J95658j17008j65640J04771R8360j06835
111a8417m5480Q0393L8642j6690p522l9002q3825O0133J75450o0029j93510N4816
$$ plain form
123 -55041 88260 5117 -111568 28392 156973 -43615 -181764 35812 137251 -72755
133 -72755 -125428 101655 135222 -135708 -176024 106093 156628 -60524 -102528 31483 47887
144 47887 -39800 -17936 54523 9584 -19839 24280 -19226 -62419 35850 107558 -1053 -112145
156 -112145 -14793 91373 -3378 -60734 37584 53990 -45789 -62482 29310 47043 -23060 -4465
168 -4465 34646 -34557 -54850 32144 57123 -12438 -40957 14439 13973 -42659 -414 55409 2172
181 2172 -37813 -6600 7865 -15819 966 49039 149 -67520 3283 56446 -22507 -49114
193 -49114 45514 70572 -55776 -95945 52542 99344 -30931 -69305 22316 51840 -19934
204 -19934 -41506 25292 36944 -6575 -9166 -18979 -26096 24209 51447 -7385 -66809 -14037 60816
$$ packed form
123e5041J43301q3143j16685J39960J28581k00588j38149K17576J01439k10006
133g2755n2673K27083L3567k70930m0316K82117N0535k17152m2004J34011J6404
144D7887q7687K1864P2459m4939k9423M4119m3506m3193R8269P1708j08611j11092
156a12145R7352J06166r4751n7356R8318J6406r9779j6693R1792J7733p0103J8595
168d465L9111o9203k0293Q6994K4979o9561k8519N5396m66n6632M2245N5823n3237
181B172l9985L1213J4465k3684J6785M8073m8890o7669P0803N3163p8953k6607
193d9114R4628K5058j26348m0169J48487M6802j30275l8374R1621K9524p1774
204a9934k1572O6798J1652m3519k591r813p117N0305K7238n8832n9424N2772P4853
$$ plain form
217 60816 2766 -59666 5885 51008 -8203 -53100 -9011 37907 7478 -11200 10970 -14222
229 -14222 -28719 21240 40456 -5364 -33748 9246 35782 -16937 -27480 27747 29147 -9598
241 -9598 -19556 -5634 3421 3976 20472 7568 -39789 -17664 33941 8590 -32714 -9749 33779
254 33779 6953 -48705 -13897 40088 11157 -19826 -6823 5035 -2762 -4773 17885 12616 -17172
267 -17172 -663 15512 -6835 -8367 14827 19035 -7980 -21408 7310 10607 -9950 6905 12650
280 12650 -15036 -20957 5826 20775 -9347 -22574 16015 13364 -26360 -16582 19325 21945 -10246
293 -10246 -21679 6789 10133 -4143 4916 3978 -1922 3010 922 -4401 -4126 11761 19358 -13842
307 -13842 -23349 11382 15846 -6117 -11105 5379 10639 -15816 -14042 15599 7173 -9563 -3106
$$ packed form
217F0816n8050o2432O5551M5123n9211m4897M4089M6918l0429j8678K2170k5192
229a4222j4497M9959J9216m5820k8384M2994K6536n2719j0543N5227J400l8745
241i598r958J3922R055N55J6496j2904m7357K2125N1605k5351m1304K2965M3528
254C3779k6826n5658L4808N3985k8931l0983J3003J1858p797k011K2658n269k9788
267a7172J6509J6175k2347j532K3194M208k7015j3428K8718L297k0557J6855N745
280A2650k7686n921K6783J4949l0122j3227L8589k651l9724R778L5907K620l2191
293a0246j1433K8468L344j4276R059r38n900M932k088n323K75J5887P597l3200
307a3842r507L4731M464k1963m988J6484N260k6455J774K9641q426j6736O457
$$ plain form
320 -3106 2157 -2087 -8852 4405 16273 -5811 -11797 4020 3078 1369 2135 2601 2943 -5512 -878
335 -878 3990 -4474 5297 10689 -7335 -11956 -145 11661 2882 -13491 1942 10338 -9787 -9942
349 -9942 5927 10928 -374 -12688 441 7586 -4718 264 6274 853 -1036 -4426 656 4527
363 4527 281 4685 -290 -7782 1704 2375 -382 1704 -1162 -526 -4317 -4611 7347 308 -6859 3493
379 3493 2999 -3911 -7310 1375 15657 906 -14878 -1009 9088 6807 -3414 -7801 6831 8417
393 8417 -4109 -6712 -3573 9347 11116 -9827 -13332 632 9622 5240 -11480 -8171 7784 2257
407 2257 -4978 -4970 -855 7304 1379 -4606 -2617 -3899 6754 11298 -3478 -8237 -1162 9796 9679
422 9679 -8380 -5979 10040 6308 -3216 -8533 -32 11630 133 -8078 -2389 -1874 1537 731 -2002
$$ packed form
320c106N263m244o765J3257J1868k2084n986J5817r42j709P66M66L42q455M634
335h78M868q464R771N392j8024m621J1811J1806q779j6373J5433Q396k0125j55
349i942J5869N001j1302j2314J3129P145j2304M982O010n421j889l390N082L871
363D527m246M404m975p492R486O71k757K086k866O36l791k94J1958p039p167J0352
379C493m94o910l399Q685J4282j4751j5784J3869J0097k281j0221m387J4632J586
393H417j2526k603L139J2920J769k0943l505J3964Q990m382j6720L309J5955n527
407B257p235QM115Q159n925n985J989j282J0653M544j4776m759P075J0958j17
422I679j8059K401J6019l732r524n317Q501J1662j1497q211N689N15L411q06k733
$$ plain form
437 -2002 -737 -7599 -3965 7811 753 -7346 -4772 4173 9870 -5167 -12128 5244 11954 5505
451 5505 -6694 -9777 7335 12898 3835 -4762 -10601 4932 18106 163 -16750 -8466 16462
464 16462 18905 -17596 -26800 8952 24950 424 -27719 -13704 20973 12570 -15003 -14732 1124
477 1124 13508 5093 -11274 -9184 1444 14853 13015 -14734 -17952 12347 25140 2467 -25893
490 -25893 -7127 29424 13083 -21302 -14587 15004 20976 -8998 -21371 4554 12968 -168 -6653
503 -6653 -4887 1264 -745 -1660 5035 -4667 -10237 4176 7552 -2720 -11556 -2012 14862 1406
517 1406 -13384 -146 8502 1504 -4358 1686 8688 -6606 -9509 14268 12097 -13382 -14021 12915
531 12915 22639 -11518 -26056 11437 26494 -4059 -23368 -4862 20109 8040 -14220 -7278
$$ packed form
437b002J265o862L634J1776p058q099K574Q945N697j5037o961J7372O710o449
451E505j2199l083J7112N563r063q597n839J5533J3174j7943j6913Q284K4928
464A6462K443l6501r204L5752J5998k4526k8143J4015L4677q403k7573K71J5856
477A124J2384q415j6367K090J0628J3409j838k7749l218L0299J2793k2673k8360
490b5893J8766L6551j6341l4385O715K9591N972k9974j2373K5925Q414j3136o485
503f653J766O151k009r15O695r702n570J4413L376j0272q836R544J6874j3456
517A406j4790J3238Q648o998n862O044P002j5294k903K3777k171k5479o39K6936
531A2915R724l4157j4538L7493J5057l0553j9309J8506K4971j2069k2260O942
$$ plain form
543 -7278 1628 4149 7028 -3572 -13002 -5485 13234 14747 -17587 -24758 14702 26732 -7282 -29464
557 -29464 -3598 29891 8398 -25129 -10197 16045 14669 -6702 -14407 4175 11982 2874 -649
570 -649 -5475 -2560 7775 8032 383 -10056 -5463 14536 8472 -13717 -11522 7814 14722 -7756
584 -7756 -20633 4255 15240 -5870 -15164 -578 11527 -3521 -15257 5906 12429 -9202 -11310
597 -11310 6873 13851 -4259 -14003 8438 15562 -3415 -7598 2390 9121 5783 -1916 -775 -1312
611 -1312 924 11116 1071 -14317 -3550 12450 7783 -14667 -16551 11060 13225 -11110 -16322
624 -16322 -1264 11615 2791 -12564 -6295 3162 5771 3584 -6596 -6514 6003 9743 3685 -7901
638 -7901 -5435 12489 11981 -3479 -9754 -464 15129 8407 -13081 -8871 8969 12363 -4864 -17460
$$ packed form
543g278Q906K521K879j0600r430P517J8719J513l2334p171L9460J2030l4014k2182
557b9464K5866L3489k1493l3527J4932K6242j376k1371p705J8582P807r108l523
570f49m826K915J0335K57p649j0439M593J9999o064k2189K195J9336O908k2478
584g756j2877K4888J0985k1110r294J4586J2105j5048j1736K1163O523k1631k108
597a1310J8183O978j8110r744K2441P124j8977m183R988O731l338p699J141n37
611a312K236J0192j0045j5388J0767J6000m667k2450j884K7611K165k4335n212
624a6322J5058J2879q824j5355O269R457K609k187j0180Q2J2517L740o058j1586
638g901K466J7924n08j5460o275R290J5593o722k1488M210J7840L394j7227j2596
$$ plain form
652 -17460 827 14742 -2514 -14141 -5063 6728 3333 -9672 -4712 4356 -1682 -2276 809 -146
666 -146 -627 -1183 3992 3536 -4179 1010 5858 1544 1293 173 884 3208 1397 2392 -1151 -4122 4152
683 4152 3382 -5061 -3797 946 3971 -2463 -7989 1602 3148 -3937 -2426 -616 615 -827 -2669
698 -2669 2452 846 -3175 2551 2616 278 172 -734 3387 3075 -1966 318 653 2542 3120 -3827 -2154
715 -2154 3818 1579 -2348 -4622 1112 5606 -4551 -5904 2568 2988 -1172 -4834 -889 5454 -1192
730 -1192 -3552 1385 1339 1713 -913 -1748 2920 874 358 932 -1872 1553 2361 -1964 368 598 50
747 50 232 -2482 839 1198 -3261 362 1413 -1797 -1377 -995 2765 1016 -4626 633 3463 -179 -954
764 -954 -1451 2097 3108 -2148 -133 1155 251 2134 -1138 -1848 1418 38 454 -1106 -2380 1559
$$ packed form
652a7460J8287J3915j7256j1627R078J1791l395j3005M960R068o038n94L085r55
666a46m81n56N175m56p715N189M848m314k51j120P11K324j811R95l543k971Q274
683D152p70q443J264M743L025o434n526R591J546p085J511J810J231j442j842
698b669N121j606m021N726O5k338j06r06M121l12n041K284L35J889N78o947J673
715b154N972k239l927k274N734M494j0157j353Q472M20m160l662L945O343o646
730a192k360M937m6L74k626q35M668k046n16N74k804L425Q08m325K332K30n48
747E0J82k714L321L59m459L623J051l210M20L82L760j749n642N259K830l642p75
764i54m97L548J011n256K015J288r04J883l272p10L266j380M16j560j274L939
$$ plain form
780 1559 -101 -2267 486 -1755 -279 1225 -812 -129 -1924 -417 4174 -1267 -3034 1780 2716 1814
796 1814 -2829 -1636 4936 1144 -2335 -197 387 2579 -53 -2968 633 452 7 280 -3737 -462
812 -462 2058 -1529 -1529 -1643 272 2320 -2543 -1506 1663 -140 1057 135 -561 1584 21 1416 919
829 919 -2123 2448 3098 -1305 -891 123 2665 1265 -4248 -212 2834 -1002 -1387 -2094 -239 1555
845 1555 -2077 -1179 -589 -1336 1618 -388 -2615 565 447 959 -162 -1317 2462 1037 -1328 2395
861 2395 641 -428 956 1127 1982 -1504 -2141 3632 711 -3124 -778 282 1540 -934 -3296 696
877 696 -299 -739 1080 -2578 -1521 1442 647 -231 -2778 351 4030 -941 -1497 1344 722 1184 680
894 680 -155 1003 -1224 2106 3161 -3613 -2044 3052 2462 -1701 -4789 926 4503 -2777 -3354 385
$$ packed form
780A559j660k166K753k241J476J504k037O83j795J507M591n441j767M814R36r02
796A814m643J193O572l792l479K138N84K192k632k915L601j81m45K73m017L275
812d62K520l587%j14J915K048m863J037L169j803J197r22o96K145j563J395m97
829I19l042M571O50m403M14J014K542j400n513M036L046l836l85p07J855J794
845A555l632Q98N90p47K954k006k227L180j18N12j121j155L779j425k365L723
861B395j754j069J384J71Q55l486o37N773k921l835K346J060J258k474k362L992
877F96r95m40J819l658J057K963p95q78k547L129L679m971n56K841o22M62n04
894F80q35J158k227L330J055o774J569N096n90m163l088N715L577p280n77L739
$$ plain form
910 385 715 1225 -1498 -1792 590 194 1321 -555 -2885 1710 1897 -1117 374 611 597 -846 -770 3756
928 3756 -362 -4618 2324 4455 -1577 -4945 -315 6216 -564 -6550 930 3266 -921 -1455 -484 1281
944 1281 -1001 -30 3971 -1784 -4396 3972 5074 -2278 -4771 1112 7304 -493 -5755 999 3093
959 3093 779 -1014 -2441 -64 338 1175 1062 -4899 -2481 4774 1309 -3929 -3806 1435 4991 -1740
975 -1740 -4272 692 2496 3161 -731 -4334 1991 5254 1110 -3199 -2056 5463 3165 -4928 -122
990 -122 3952 -872 -2991 438 3382 -2983 -6247 4368 4145 -7204 -5128 4720 4085 -6151 -6544
1005 -6544 6030 3763 -6529 -683 5183 69 -3767 1857 6736 -2001 -6016 6198 7428 -4584
1019 -4584 -4765 4145 7161 -2396 -6056 2875 3689 -1608 -1298 -1031 -1366 478 354 -283 -4707 -2600 4912
$$ packed form
910C85L30N10k723k94K382l96J127j876k330M595J87l014J491K37j4j443P6M526
928C756m118m256O942K131o032l368M630O531o780n986P480K336m187n34R71J765
944A281k282R71M001n755k612Q368J102p352k493N883O192p797n262O754K094
959C093k314j793j427K377M02Q37j13n961K418P255l465n238J23N241L556o731
975a740k532M964J804O65l892l603O325L263m144m309J143P519k298q093M806
990a22M074m824k119L429K944o365l264J0615k23j1349K076R848o35j0236l93
1005f544J2574k267j0292N846N866n114l836N624M879q737m015J2214J230j2012
1019d584j81Q910L016r557l660Q931Q14n297L10K67l35J844j24o37m424K107P512
$$ plain form
1036 4912 94 -5933 -2078 1995 3426 -1743 -4183 1106 3071 2368 -691 -4552 1990 6814 -79
1051 -79 -4603 -212 6075 2543 -5867 -333 5577 -1063 -2962 1594 1475 -3087 -2890 4689 1020 -8576
1067 -8576 -852 7339 -1436 -7917 -878 7519 148 -8853 1578 7135 -3116 -4929 3375 4722
1081 4722 -2479 -4118 5358 3860 -5345 -770 5280 592 -3088 -692 3478 -166 -3741 2083 1332
1096 1332 -3723 -13 2520 -583 -3193 -581 4041 -823 -3997 1780 1687 -1332 -69 577 97 -577
1112 -577 949 2331 -2940 -1444 4741 529 -3912 -196 3359 1351 -3909 -487 3889 -1800 -2275
1127 -2275 2436 473 -2404 -462 3010 -13 -5169 1403 6020 -2947 -4388 3121 3880 -2172 -4122
1142 -4122 3577 4169 -4900 -1887 4543 364 -2989 -477 3079 -265 -4354 1564 3291 -3748 -1688
$$ packed form
1036D912m818o027L855M073J431n169k440N289J965p03l059l861O542M824o893
1051g9m524M391O287l532q410N534N910o640j899M556j19m562J97P579l669r596
1067h576P724Q191q775o481P039Q397p371r001J0431N557j0251j813Q304J347
1081D722p201j639R476j498r205M575O050m688l680K396M170l644l575N824p51
1096A332n055L710K533l103k610K612M622m864l174N777r3l019J263O46m80o74
1112e77J526J382n271J496O185m212m441L716L555k008n260L422M376n689m75
1127b275M711j963k877J942L472l023n156O572M617q967j441P509P59o052j950
1142d122P699N92r069L013O430m179l353K512L556l344m089N918J727p039K060
$$ plain form
1157 -1688 2804 486 -2769 -1322 3642 370 -4119 1947 3261 -2182 -1168 2144 1372 -1856 -977
1172 -977 3608 -116 -3607 2035 2911 -2211 -2032 1856 2620 -2917 -2980 3154 644 -3674 -91 1745
1188 1745 -566 -1946 -56 2200 -2111 -1837 3107 165 -2532 1201 2138 -92 -1983 1428 3356
1203 3356 -2192 -1445 3794 630 -2689 188 2986 688 -4111 338 3852 -2340 -3201 1789 1357 -1944
1219 -1944 -2286 1548 1382 -3408 -472 2849 -1600 -1559 1308 1551 -502 -1796 2440 1680 -2539 884
1235 884 2644 -420 -908 1088 2131 -985 -2482 2821 1868 -3254 -758 1962 321 -2573 -1064 2314
1251 2314 -556 -3667 1082 1259 -2191 -707 788 685 -1476 -1003 2662 79 -1720 1932 1336 -695
1267 -695 -132 1314 1099 -1569 -22 3316 -1130 -2611 1640 1605 -1692 -2139 856 2093 -2800 -2127 2267
$$ packed form
1157a688M492k318l255J447M964l272m489O066J314n443J014L312p72l228Q79
1172i77M585l724l491N642Q76n122J79L888P64n537o3O134k510m318L583J836
1188A745k311j380J890K256m311K74M944k942k697L733R37k230j891L411J928
1203C356n548P47N239l164l319K877K798k298m799M449L514o192q61M990m32l301
1219a944l42L834j66m790K936L321m449M1K867K43k053j294M236p60m219L423
1235H84J760l064m88J996J043l116j497N303r53n122K496K720j641k894J509L378
1251B314k870l111M749J77l450J484J495j03k161M73L665k583j799L652n96k031
1267f95N63J446k15k668J547L338m446j481M251l5l297m47K995J237m893O73M394
$$ plain form
1284 2267 101 -1894 -423 742 304 -1553 435 1846 -1544 -665 2169 289 -826 419 1587
1299 1587 780 -1570 950 2149 -1897 -616 1627 4 -1402 -662 1976 189 -3074 382 2077
1314 2077 -1890 -1707 648 1229 -850 -2052 1357 1289 -1978 -74 1436 -38 -249 -482 1637 256
1330 256 -1031 1729 520 -1098 679 495 -16 -584 -226 1032 -1090 -1565 1283 -74 -1811 -184
1346 -184 229 74 -1439 -543 1881 -844 -1567 1115 422 -725 -219 447 1306 -758 -146 1991 -474
1363 -474 -716 1232 595 -36 -700 624 1362 -1731 -712 1260 -793 -838 99 311 -159 -1256 160 1021
1381 1021 -1441 -544 1055 50 -429 -243 787 991 -1092 87 1261 71 285 -47 119 908 -193
1398 -193 367 268 -839 522 0 -869 146 -285 -400 -81 -871 398 -808 -1378 820 136 -988 -257
$$ packed form
1284B267k166j995J471J165m38j857J988J411l390Q79K834j880j115J245J168
1299A587q07k350K520J199m046J281K243j623j406P40K638j787l263L456J695
1314B077l967J83K355N81k079j202L409o8l267J904J510j474k11k33K119j381
1330B56j287K760j209j618J777j84n11n68L58J258k122m75K848j357j737J627
1346a84M13j55j513Q96K424k725p23K682o93j147N06O66Q59k064O12K137k465
1363d74k42J948o37o31o64J324P38l093J019J972k053m5R37K12m70j097J416Q61
1381A021k462Q97J599j005m79J86J030K04k083J179J174j190K14l32J66P89j101
1398a93N60r9j107J361n22q69J015m31j15L19p90J269j206n70K198o84j124P31
$$ plain form
1416 -257 672 926 -598 -1322 1572 673 -1021 285 506 764 105 -247 1416 -305 -635 573 236 -112
1434 -112 -384 -363 813 -641 -1205 564 331 -536 -442 -761 704 118 -954 99 -226 228 819 -522
1452 -522 302 235 -220 796 34 -417 577 364 386 28 -1026 701 224 -955 -105 34 495 -57 -1091
1471 -1091 607 408 -1172 -212 -8 85 -410 -726 1168 450 -1166 474 727 11 -313 -778 1664 715
1489 715 -1302 36 1260 222 -701 -574 889 411 -1638 20 896 -403 -843 -480 792 203 -1916
1506 -1916 417 1280 -716 -808 -20 1260 518 -1198 480 1246 -345 -128 285 497 127 -763 654 641
1524 641 -835 142 388 -3 -444 -996 755 336 -1556 -121 251 -166 -355 -650 487 427 -852 351
1542 351 609 -149 -13 -36 889 521 -982 529 1122 -450 -247 28 1093 233 -1213 0 992 -726
$$ packed form
1416b57R29K54j524p24K894q99j694J306K21K58o59l52J663j721l30J208l37l48
1434a12k72K1J176j454n64J769k33q67R4l19J465n86j072J053l25M54N91j341
1452e22Q24o7m55J016p62m51R94k13K2l58j054J727m77j179Q50J39M61n52j034
1471a091J698j99j580R60K04R3m95l16J894p18j616J640K53p16l24m65K442r49
1489G15k017J338J224j038r23J27J463m78k049J658Q76j299m40L63J272n89k119
1506a916K333Q63j996r2P88J280p42j716J678P66j591K17M13K12l70q90J417j3
1524F41j476R77K46l91m41n52J751m19j892J435L72m17j89k95J137o0j279J203
1542C51K58p58J36k3R25l68j503J511N93j572K03K75J065q60j446J213R92j718
$$ plain form
1560 -726 -700 -165 333 -118 -1321 213 921 -991 -417 210 592 181 -853 511 1253 -749 -96 711
1578 711 665 295 -554 817 1149 -504 10 652 -228 -1 -352 2 208 -998 -182 297 -863 -401 -313
1597 -313 -48 30 -1088 -60 382 -341 233 245 422 593 -84 212 645 -292 410 530 277 227 -108 277
1617 277 568 -460 9 469 -474 -77 -417 -178 681 -908 -374 231 -292 -13 -730 -41 319 -727 -393
1636 -393 572 201 156 81 603 843 -397 -174 876 -308 -251 -97 92 654 -449 -158 820 -415 -337 -190
1656 -190 -109 83 -680 -33 298 -349 -253 -12 -232 326 -153 -77 587 -95 -10 500 -302 473 -24 40 238 -62
1678 -62 61 452 -325 117 174 -415 242 -397 -336 62 -334 83 -159 -516 351 -361 -449 359 -167 45 70 25
1700 25 839 -401 -170 749 102 -104 -23 148 714 -213 -448 695 -217 -412 164 -40 118 -698 -727 665
$$ packed form
1560g26K6N35M98m51j203J534P08j912N74O27L82m11j034J364P42k002O53Q07
1578G11m6l70q49J371L32j653N14O42q80K27l51L54K06j206Q16M79j160M62Q8
1597c13K65P8j118J028M42p23N74J2J77J71o77K96M33r37P02J20k53n0l35L85
1617B77K91j028M69M60r43L97l40K39Q59j589N34O05n23K79p17O89L60j046L34
1636c93R65l71m5p5N22K40j240K23J050j184N7J54J89N62j103K91R78j235P8J47
1656a90Q1J92p63O47L31o47R6K41k20N58m79P6O64o82Q5N10q02P75m97O4J98l00
1678f2J23L91p77M42N7n89O57o39O1L98l96M17k42l57Q67p12q8Q08n26K12K5m5
1700B5Q14j240K31R19o47k06Q1J71N66r27k35J143r12j95N76k04J58q16k9J392
$$ plain form
1720 665 -461 -712 -23 -307 -145 -365 -326 456 144 -152 553 39 218 199 -196 524 47 15 337 -406 245
1741 245 324 -482 296 111 -486 -169 -312 103 -17 -798 318 -11 -662 173 -337 -68 131 -595 170 414
1761 414 -488 539 441 -174 333 45 419 383 -408 679 152 -113 385 81 184 199 -506 289 44 -811
1781 -811 -39 35 -149 -130 -532 272 67 -400 170 29 47 193 -186 426 176 -372 524 175 -56 675 -340
1802 -340 337 289 -643 -28 -28 -227 88 -455 -227 163 -384 -297 -372 -79 46 -548 -276 273 -497 -42 311 -54
1824 -54 540 -233 -55 762 -398 -320 331 -231 460 -296 101 905 -313 -150 383 -207 12 -544 -197 313
1844 313 -492 -427 188 -435 189 -81 -285 222 -542 17 675 -279 -93 224 -208 356 -88 100 397 -290
1864 -290 275 53 -232 491 -32 -237 362 -350 -371 42 -326 -56 -402 -480 -24 -402 -360 175 10 639 -132
$$ packed form
1720F65j126k51O89k84J62k20L9P82l12k96P05n14J79j9l95P20m77l2L22p43O51
1741B45P9q06P78j85n97L17j43M15j20p81J116l29o51Q35n10K69J99p26P65K44
1761D14r02J027r8o15N07k88L74l6p91J087n27k65M98l04J03J5p05P95k45q55
1781h11P72P4j84J9m02Q04k05m67N70j41J8J46l79O12k50n48Q96l49k31P31j015
1802c40O77m8r32O15%j99L15n43K28L90n47Q7p5K93J25n94K72N49p70M55L53l65
1824e4N94p73J78Q17j160P8O51n62O91p56L97Q04j218J63N33n90K19n56L47N10
1844C13q05O5O15o23O24k70k04N07p64N59O58r54J86L17m32N64m44J88K97o87
1864b90N65k22k85P23n23k05N99p12k1M13l68K70l46p8M56l78M2N35j65O29p71
$$ plain form
1885 -132 -275 607 -113 -578 615 240 183 -296 -13 892 -43 -373 358 361 242 -29 -84 684 -229 -452 229
1906 229 -121 -168 -148 -329 96 -171 -561 444 -191 -280 9 -236 384 93 -367 415 43 100 383 -16 619
1927 619 60 -320 364 -35 -97 251 -458 424 44 -540 30 -133 -343 -50 -78 125 -164 -832 318 105
1947 105 -407 5 -94 196 -49 -373 648 419 -554 303 261 40 -228 -265 459 8 -568 533 -18 -259
1967 -259 -110 -303 439 -210 -713 214 143 -409 -5 -187 210 -85 -698 337 320 -236 61 226 94 117 -102
1988 -102 324 370 -122 163 -343 370 322 -421 54 146 -519 -39 -216 369 -140 -671 191 364 -488 -87 -62
2009 -62 312 210 -604 421 504 -220 48 233 225 125 -191 205 210 -548 219 396 -290 33 65 353 -136 -567
2031 -567 207 439 -386 36 164 30 -50 -348 96 247 -338 67 100 -203 141 -52 -167 215 -72 221 151
$$ packed form
1885a32j43Q82p20m65J193l75n7m79K83R05r35l30P31Lj19k71n5P68r13k23O81
1906B29l50m7K0j81M25k67l90J005o35q9K89k45O20k91m60P82l72N7K83l99O35
1927F19n59l80O84l99o2L48p09Q82l80n84N70j63k10K93k8K03k89o68J150k13
1947A05n12M12r9K90k45l24J021k29r73Q57m2k21k68l7P24m51n76J101n51k41
1967b59J49j93P42o49n03R27p1n52M04j82L97k95o13J035j7n56K97J65j32K3k19
1988a02M26M6m92K85n06P13m8p43M75R2o65M80j77N85n09n31Q62J73q52M01K5
2009f2L74j02q14J025Q3p24K68J85qj00l16L96Np58P67J77o86L23L2K88m89m31
2031e67P74K32q25M22J28j34q0k98M44J51n85M05L3l03L44j93j15L82k87K93p0
$$ plain form
2052 151 -168 367 -314 117 299 -303 -30 18 5 429 -463 -262 346 -424 -249 45 142 237 -205 -192 451 -99
2074 -99 117 26 -68 213 -381 138 440 -446 -278 552 35 -45 -139 78 288 -559 -86 669 -534 -222 -32
2095 -32 122 -16 -133 307 290 -454 -77 159 -161 3 98 460 137 -308 317 341 -356 330 324 -68 -86 -79 519
2118 519 89 -116 299 146 -463 -81 45 -93 -49 -210 460 5 -357 435 150 -358 242 466 200 -281
2138 -281 43 757 -31 -111 628 21 -366 -107 96 428 -345 -261 604 -181 -174 101 419 -13 -461 -82 397
2159 397 -456 -107 516 -80 12 -29 -10 150 -269 -38 354 -181 8 379 74 -54 117 327 194 -249 178
2180 178 171 -479 -47 48 -287 -162 -250 230 -144 -483 148 357 -360 -307 197 358 -425 -77 537 35 -987
2201 -987 362 445 -196 -37 26 255 -315 -392 484 277 -347 58 12 109 -235 36 635 -33 -455 373 -31
$$ packed form
2052A51l19N35o81M31J82o02K73M8j3M24q92K01O08p70J75K94R7R5m42J3O43n50
2074i9K16r1r4K81n94N19L02q86J68Q30n17q0r4K17K10q47M73P55j203L12J90
2095c2J54j38j17M40j7p44L77K36l20J64R5L62l23m45O25K4o97O86ol92j8PN98
2118E19m30k05M15j53o09L82J26j38M4j61O70m55l62P92k85n08O00K24k66m81
2138b81L24P14p88q0P39o07l87K59K03L32p73Q4Q65p85PK75L18m32m48L79M79
2159C97q53L49O23n96R2m1J9J60m19K31L92n35J89L71l05j28J71K10j33m43M27
2180A78po50M32R5l35J25q8M80l74l39O31K09p17N3N04J61p83L48O14n02j022
2201i87J349Q3o41J59O3K29n70p7Q76k07o24M05m6R7l44K71N99o68m22Q28m04
$$ plain form
2222 -31 -403 -169 237 169 -41 -357 300 -151 -414 485 58 54 29 117 284 -308 -270 301 -103 17 206 2
2244 2 -7 -151 293 -97 -300 1 407 -490 -58 135 -102 -282 -615 151 77 -283 84 417 -81 -180 -190 333
2266 333 355 -517 370 288 -229 252 116 -31 -140 -45 798 -167 -722 -115 6 -247 -137 -125 -27 -81 -144 408
2288 408 -208 -377 482 161 -180 207 192 209 -185 -204 529 -75 -265 307 270 -176 -3 64 260 -262 -160 488
2310 488 -218 -233 12 -129 -55 -135 126 384 -471 -271 169 86 -258 -170 204 -27 -84 -73 514 -78 -187 373
2332 373 1 109 -250 86 306 -430 -56 165 -201 -58 83 -12 -284 -251 154 -122 -595 111 -117 -279 -34
2353 -34 -181 85 -97 -323 501 33 -40 204 -66 18 -51 22 289 -239 -168 639 46 -380 283 275 41 -473 -411
2376 -411 347 -273 -305 271 -15 -198 -308 -15 326 -34 -128 410 -16 -289 194 53 54 -198 -77 533 -100
$$ packed form
2222c1l72K34M06o8k10l16O57m51k63Q99m27mk5Q8J67n92L8N71m04J20J89k04
2244Brj44M44l90k03L01M06q97M32J93k37j80l33P66p4l60L67L33m98r9j0N23
2266C33K2q72Q87q2n17M81j36j47j09R5Q43r65n55O07J21k53J10J2R8n4o3N52
2288D08o16j69Q59l21l41L87j5J7l94j9P33o04j90N72l7m46J73O7J96n22J02O48
2310D88p06j5K45j41P4q0K61K58q55K00M40q3l44Q8L74k31n7J1N87n92j09N60
2332C73l72J08l59L36K20p36L74K21l66J43J41r5k72L3M05k76m73P06k28j62K45
2353c4j47K66j82k26Q24m68p3K44k70Q4o9P3K67n28P1Q07n93m26O63qk34n14O2
2376d11P58o20l2N76k86j83j10K93L41l60r4N38m26k73M83j41Jk52J21O10o33
$$ plain form
2397 -100 -52 205 -59 158 -84 -67 252 -9 121 138 -144 121 -38 -182 -107 20 -188 75 -103 212 83
2418 83 -424 160 424 -250 125 -13 308 -53 -381 252 490 -283 164 76 -86 -72 -687 245 -115 -375 288
2439 288 -63 -291 -116 -126 254 -117 -441 293 345 -258 6 -10 -20 -275 -147 217 88 -36 55 -40 151 126
2461 126 -215 291 24 26 -137 -271 -156 37 2 -39 119 -97 118 -144 -16 24 -118 420 -145 -91 181 -4
2483 -4 -72 101 -200 359 89 -195 205 283 203 -9 26 177 -99 -119 173 -44 -362 -222 -122 -36 -15 2 279
2506 279 127 -426 58 118 -11 373 -106 -68 -126 -537 -91 179 -18 376 96 38 100 -282 24 -48 72 -35
2528 -35 -162 -106 148 -112 -196 -117 -263 -74 -494 38 199 -67 -108 14 -147 217 65 203 126 -10 24 353
2550 353 -83 233 150 -152 187 -172 -8 118 -159 146 6 33 -381 -23 27 -22 137 36 93 -147 32 155
$$ packed form
2397a00M8K57k64K17k42J7L19k61J30J7k82K65j59j44P5J27k08K63j78L15j29
2418H3n07N84K64o74L75j38L21l61l28O33K38p73M47q8j62J4o15R32l60k60O63
2439B88l51k28J75j0L80l71l24P34N2o03K64j6j0k55J28L64j29j24R1r5J91k5
2461A26l41N06k67Kj63j34J15J93l5m1J58k16K15k62J28M0j42N38n65N4K72j85
2483do8J73l01N59k70k84M00P8q0k12L5J51k76k0K92k17l18J40J00Q6K1J7K77
2506B79j52n53M84O0j29L84m79L8n8m11M46K70j97L94k80n8O2l82L06p2J20j07
2528c5j27N6K54k60q4P9j46J89m20N32J61k66m1J22j61L64j52J38p7j36L4L29
2550C53m36L16q3l02L39l59J64J26k77L05j40K7m14L58N0m9J59j01N7k40J79J23
$$ plain form
2572 155 -61 343 -157 195 279 35 175 -1 70 -29 87 46 -30 41 -11 -195 -353 -12 -285 -91 -161 47 204
2595 204 -143 -17 173 -136 -58 113 -271 259 174 12 174 -23 -24 189 146 131 200 -241 -68 147 -19 160
2617 160 32 -108 206 -139 58 -5 -220 42 12 9 -155 164 328 354 71 5 57 -235 -52 71 7 99 5
2640 5 -9 334 280 218 -74 66 79 -123 246 -43 -59 -140 -286 -57 6 -245 35 -111 -54 -231 -109 -135 -85 -79 268
2665 268 217 17 114 190 378 14 -104 -24 -77 -272 324 43 -18 -51 -194 233 37 -50 153 -27 132 59 -364
2688 -364 107 -20 -60 -278 112 104 -142 -63 -11 47 -247 74 222 223 196 -66 -47 84 -273 298 255 -62 -25 -40
2712 -40 246 104 -324 -253 190 11 45 -7 -128 -35 -233 -167 238 -178 89 253 112 204 -41 8 304 67 -139
2735 -139 -22 -40 165 -190 69 167 -50 -188 119 118 7 -259 -21 -66 -267 66 52 -120 129 -50 50 88
$$ packed form
2572A55k16M04n00L52Q4k44J40j76P1r9J16m1p6P1n2j84j58L41k73J94p0K08J57
2595B04l47J26J90l09P8J71l84N30q5j62J62j97jK13m3j5O9m41J73K15j66J79
2617A60j28j40L14l45J97o3k15K62l0lj64L19J64K6k83o6N2k92J83J23o4R2r4
2640Ej4L43n4o2k92J40J3k02L69k89j6q1j46K29O3k51K80j46N7j77J22k6N0OL47
2665B68n1k00R7P6J88l64j18Q0n3j95N96k81o1l3j43M27j96q7K03j80J59p3m23
2688c64M71j27m0k18L90qk46P9N2N8k94L21J48Jk7k62J9J31l57N71m3l17L7j5
2712d0K86j42m28P1M43j79L4n2j21R3j98O6M05m16K67J64j41R2k45M9K96k37k06
2735a39J17j8K05l55K59R8k17j38L07jj11k66K38m5k01L33j4j72K49j79J00L8
$$ plain form
2757 88 -274 36 98 -63 -48 183 -141 516 154 -9 156 95 196 -5 139 328 -163 114 -8 -363 -41
2778 -41 130 -257 70 -169 33 -146 -197 -52 -90 91 102 -93 348 57 64 -76 162 -15 -101 123 37 343 -6
2801 -6 -136 -234 -4 -199 -124 -28 106 -1 -83 -39 39 364 -22 -109 -24 -277 -209 359 68 -46 26 343 153 -78
2825 -78 244 351 92 116 60 93 188 3 59 251 33 26 -121 14 118 10 -170 125 164 -2 -174 168 -332
2848 -332 -116 -12 35 55 -51 68 32 107 3 110 133 68 -330 388 101 3 244 -49 127 20 -322 20
2870 20 4 -48 -43 95 -182 -195 -157 -90 -43 -251 -338 9 175 36 -226 149 -16 -178 -95 281 44 153 147 306
2894 306 249 27 -43 -141 -27 106 -26 224 -183 103 103 -86 -13 -225 -347 -106 76 -320 39 167 -179 217
2916 217 -176 383 -192 94 303 -45 28 -67 21 272 239 252 148 276 -70 70 -100 119 -198 -181 -92 -191 -322
$$ packed form
2757H8l62L10O2j61J5K31l24O57l62j63J65o1J01k01J44J89m91K77j22l55L22
2778d1J71l87L27k39K02j79n1J45l8J81J1j95M41k91Pj40K38j77q6K24q6L06l49
2801fj30r8K30j95P5R6J34j07q2M4P8L25l86q7Q5k53O8N68k91j14P2L17j90k31
2825g8L22J07k59K4n6L3R5j85N6J92k18pj47J35J04j08j80K95L9j66j72L42n00
2848c32K16J04M7K0j06J19l6P5j04J07K3o5l98P18k87r8K41k93J76j07l42L42
2870B0j6n2NJ38k77j3L8O7M7k08q7L47J66j39k62L75j65j62Q3L76k37J09oJ59
2894C06n7k22p0r8J14J33j32K50m07K86%j89P3k12j22K41J82l96L59J28l46L96
2916B17l93N59n75K86K09l48P3r5Q8K51l3J3j04J28l46J40j70K19l17J7Q9r9j31
$$ plain form
2939 -322 -231 -179 -6 -194 -125 141 12 -240 25 100 181 215 -9 572 119 15 -15 -14 -159 -6 122 -123 20
2962 20 -244 -104 429 -190 -127 -172 -89 -225 -176 338 -54 -173 -60 207 -114 229 -130 5 -18 -238 326 -18
2984 -18 -102 125 -226 104 -5 -220 181 -116 143 -400 -80 340 161 0 35 -28 -308 -340 -217 159 40 -79
3006 -79 159 91 -52 -102 -131 270 141 -195 90 56 -218 -128 107 105 -246 -105 -98 -129 -236 -100 263 -125 66 -38
3030 -38 -35 -323 50 -139 -76 -253 61 -122 157 96 -43 61 191 114 -30 256 -65 -31 -65 87 361 145 15
3053 15 151 -48 -4 -389 -2 -23 -159 42 63 66 -44 -292 117 93 -36 -17 -45 -157 -116 239 352 24 23 113
3077 113 58 18 208 -91 -162 125 17 -52 -6 68 94 -169 -5 3 -150 -99 42 90 28 -73 -196 133 -164 -162 -22
3102 -22 64 159 -48 239 90 105 -138 114 -182 -3 -124 277 -97 -100 185 61 4 -166 1 -264 -142 -181 -111
$$ packed form
2939c22R1N2J73j88O9K66j29k52K65P5Q1L4k24N81m53j04l0Jj45J53J28k45J43
2962B0k64J40N33o19O3m5Q3j36M9N14l92j19J13K67l21L43l59J35k3k20N64l44
2984a8q4K27l51L30j09k15M01k97K59n43L20M20j79j61L5o3k80l2J23L76j19j19
3006g9K38o8j43n0k9M01j29l36K85l4k74R0K35kl51J41Pl1j07J36L63l88J91j04
3030c8Lk88L73j89O3j77L14j83K79o1j39J04J30p7j44K86l21L4l4J52K74k16j30
3053A5J36j99M4l85L87k1j36K01K1Lj10k48M09k4j29J9k8j12M1L55J13l28jR0
3077A13n5m0J90k99p1K87j08o9M6P4K6k63J64Qj53N1J41M8o2j01j23L29k97KJ40
3102b2Q6R5k07K87j49J5k43K52k96J79j21M01l74lK85j24n7j70J67k65J22l9P0
$$ plain form
3125 -111 -76 -330 148 174 -207 -94 -164 247 -310 -127 53 -91 90 161 47 -62 -187 -292 -27 157 -247
3146 -247 -111 128 -92 46 13 57 -45 -2 -264 108 -120 21 -399 -216 34 -213 -93 -213 135 80 -44
$$ packed form
3125a11L5k54M78K6l81J13p0M11n57J83J80j44J81P1j14j09j25j05K65J84m04
3146b47J36K39k20J38l3M4j02M3k62L72k28J41m20J83K50k47J20j20L48n5j24
$$ [...]
8191C8
##END NTUPLES=NMR FID
##END=
