##TITLE=1H_Pr 5037-07
 CDCl3, 8 sc, 
 5.07.2021
##JCAMPDX= 6.0         $$ Bruker NMR JCAMP-DX V2.0
##DATA TYPE= NMR FID
##DATA CLASS= NTUPLES
##ORIGIN= UXNMR, Bruker Analytische Messtechnik GmbH
##OWNER= root
$$ XWIN-NMR		Version 3.5
$$ Mon Jul  5 12:05:27 2021 Russian Standard Time (UT+4h)  she@DPX200
##.OBSERVE FREQUENCY= 200.131506
##.OBSERVE NUCLEUS= ^1H
##.DELAY= (6, 6)
##.ACQUISITION MODE= SIMULTANEOUS
##.ACQUISITION SCHEME= undefined
##.AVERAGES= 8
##.DIGITISER RES= 18
##SPECTROMETER/DATA SYSTEM= spect
##.PULSE SEQUENCE= zg30
##.SOLVENT NAME= CDCl3
##.SHIFT REFERENCE= (INTERNAL, CDCl3, 0, 15.7039)
##AUDIT TRAIL= $$ (NUMBER, WHEN, WHO, WHERE, WHAT)
$$ ##TITLE= Audit trail, XWIN-NMR		Version 3.5
$$ ##JCAMPDX= 5.01
$$ ##ORIGIN= Bruker BioSpin GmbH
$$ ##OWNER= she
$$ F:/spectra/data/she/nmr/H-F/1/audita.txt
$$ ##AUDIT TRAIL=  $$ (NUMBER, WHEN, WHO, WHERE, WHAT)
(   1,<2021-07-05 12:03:27.14 +0400>,<she>,<DPX200>,
      <created by zg, POWCHK disabled, PULCHK disabled
       configuration hash MD5:
       00 E9 B6 7A A2 85 ED C7 34 08 36 98 17 FE 4E 26
       data hash MD5: 16K
       D6 31 C1 C4 0C 42 BA 8D BC 18 D9 A8 34 24 1A BA>)
$$ ##END=
$$ 
$$ hash MD5
$$ 03 D2 95 52 5E BB FA 11 5D C1 24 6B 0B 32 88 1D
##$RELAX= 
##$RELAX= 
##$RELAX= 
##$RELAX= 
##$RELAX= 
##$RELAX= 
$$ Bruker specific parameters
$$ --------------------------
##$DU= <F:/spectra>
##$EXPNO= 1
##$NAME= <H-F>
##$PROCNO= 1
##$TYPE= <nmr>
##$USER= <she>
##$AMP= (0..31)
100 100 100 100 100 100 100 100 100 100 100 100 100 100 100 100 100 100 
100 100 100 100 100 100 100 100 100 100 100 100 100 100 
##$AQSEQ= 0
##$AQ_mod= 1
##$AUNM= <au_zg>
##$AUTOPOS= <>
##$BF1= 200.13
##$BF2= 200.13
##$BF3= 200.13
##$BF4= 200.13
##$BF5= 200.13
##$BF6= 200.13
##$BF7= 200.13
##$BF8= 200.13
##$BYTORDA= 1
##$CFDGTYP= 0
##$CFRGTYP= 5
##$CHEMSTR= <none>
##$CNST= (0..31)
1 1 145 1 1 1 1 1 1 1 1 1 1 1 1 1 1 1 1 1 1 1 1 1 1 1 1 1 1 1 1 1 
##$CPDPRG= <>
##$CPDPRG1= <>
##$CPDPRG2= <>
##$CPDPRG3= <>
##$CPDPRG4= <mlev>
##$CPDPRG5= <mlev>
##$CPDPRG6= <mlev>
##$CPDPRG7= <mlev>
##$CPDPRG8= <mlev>
##$CPDPRGB= <>
##$CPDPRGT= <>
##$D= (0..31)
0 1.2 0 0 0 0 0 0 0 0.06 0 0.03 0 0 0 0 0.0002 0 0 0 0 0 0 0 0 0 0 0 0 
0 0 0 
##$DATE= 1625472206
##$DBL= (0..7)
120 120 120 120 120 120 120 120 
##$DBP= (0..7)
150 150 150 150 150 150 150 150 
##$DBP07= 0
##$DBPNAM0= <>
##$DBPNAM1= <>
##$DBPNAM2= <>
##$DBPNAM3= <>
##$DBPNAM4= <>
##$DBPNAM5= <>
##$DBPNAM6= <>
##$DBPNAM7= <>
##$DBPOAL= (0..7)
0.5 0.5 0.5 0.5 0.5 0.5 0.5 0.5 
##$DBPOFFS= (0..7)
0 0 0 0 0 0 0 0 
##$DE= 6
##$DECBNUC= <off>
##$DECIM= 32
##$DECNUC= <off>
##$DECSTAT= 4
##$DIGMOD= 1
##$DIGTYP= 9
##$DL= (0..7)
0 120 120 120 120 120 120 120 
##$DP= (0..7)
150 150 150 150 150 150 150 150 
##$DP07= 0
##$DPNAME0= <>
##$DPNAME1= <>
##$DPNAME2= <>
##$DPNAME3= <>
##$DPNAME4= <>
##$DPNAME5= <>
##$DPNAME6= <>
##$DPNAME7= <>
##$DPOAL= (0..7)
0.5 0.5 0.5 0.5 0.5 0.5 0.5 0.5 
##$DPOFFS= (0..7)
0 0 0 0 0 0 0 0 
##$DQDMODE= 0
##$DR= 18
##$DS= 0
##$DSLIST= <SSSSSSSSSSSSSSS>
$$ [...]
##$SUBNAM2= <"">
##$SUBNAM3= <"">
##$SUBNAM4= <"">
##$SUBNAM5= <"">
##$SUBNAM6= <"">
##$SUBNAM7= <"">
##$SUBNAM8= <"">
##$SUBNAM9= <"">
##$SW= 20.0188882624521
##$SWIBOX= (0..15)
0 0 2 0 0 0 0 0 0 0 0 0 0 0 0 0 
##$SW_h= 4006.41025641026
##$TD= 16384
##$TD0= 1
##$TE= 0
##$TE2= 300
##$TE3= 300
##$TEG= 300
##$TL= (0..7)
0 120 120 120 120 120 120 120 
##$TP= (0..7)
150 150 150 150 150 150 150 150 
##$TP07= 0
##$TPNAME0= <>
##$TPNAME1= <>
##$TPNAME2= <>
##$TPNAME3= <>
##$TPNAME4= <>
##$TPNAME5= <>
##$TPNAME6= <>
##$TPNAME7= <>
##$TPOAL= (0..7)
0.5 0.5 0.5 0.5 0.5 0.5 0.5 0.5 
##$TPOFFS= (0..7)
0 0 0 0 0 0 0 0 
##$TUNHIN= 0
##$TUNHOUT= 0
##$TUNXOUT= 0
##$USERA1= <user>
##$USERA2= <user>
##$USERA3= <user>
##$USERA4= <user>
##$USERA5= <user>
##$V9= 5
##$VALIST= <valist>
##$VCLIST= <CCCCCCCCCCCCCCC>
##$VD= 0
##$VDLIST= <DDDDDDDDDDDDDDD>
##$VPLIST= <PPPPPPPPPPPPPPP>
##$VTLIST= <TTTTTTTTTTTTTTT>
##$WBST= 1024
##$WBSW= 4
##$XGAIN= (0..3)
0 0 0 0 
##$XL= 0
##$YL= 0
##$YMAX_a= 258144
##$YMIN_a= -327779
##$ZGOPTNS= <>
##$ZL1= 120
##$ZL2= 120
##$ZL3= 120
##$ZL4= 120
##$ABSF1= 10
##$ABSF2= 0
##$ABSG= 5
##$ABSL= 3
##$ALPHA= 0
##$AQORDER= 0
##$ASSFAC= 0
##$ASSFACI= 0
##$ASSFACX= 0
##$ASSWID= 0
##$AUNMP= <proc_1d>
##$AZFE= 0.1
##$AZFW= 0.1
##$BCFW= 1
##$BC_mod= 2
##$BYTORDP= 1
##$COROFFS= 0
##$CY= 11.3945322036743
##$DATMOD= 1
##$DC= 2
##$DFILT= <>
##$DTYPP= 0
##$F1P= 15.9154993809931
##$F2P= -4.1035820241983
##$FCOR= 0.5
##$FTSIZE= 0
##$FT_mod= 4
##$GAMMA= 1
##$GB= 0.15
##$INTBC= 1
##$INTSCL= 1
##$ISEN= 128
##$LB= 0.24
##$LEV0= 0
##$LPBIN= 0
##$MAXI= 10000
##$MC2= 0
##$MEAN= 0
##$ME_mod= 0
##$MI= 1.114404
##$NCOEF= 0
##$NC_proc= 0
##$NLEV= 6
##$NOISF1= 3.799351
##$NOISF2= 2.8
##$NSP= 1
##$NTH_PI= 0
##$NZP= 0
##$OFFSET= 15.70392
##$PC= 1
##$PHC0= -11919.42
##$PHC1= 19.20099
##$PH_mod= 1
##$PKNL= yes
##$PPARMOD= 0
##$PSCAL= 0
##$PSIGN= 0
##$REVERSE= no
##$SF= 200.130013532006
##$SI= 16384
##$SIGF1= 3
##$SIGF2= 2
##$SINO= 400
##$SIOLD= 16384
##$SREGLST= <1H.CDCl3>
##$SSB= 0
##$STSI= 0
##$STSR= 0
##$SW_p= 3612.71676300578
##$SYMM= 0
##$S_DEV= 0
##$TDeff= 0
##$TDoff= 0
##$TI= <>
##$TILT= no
##$TM1= 0
##$TM2= 0
##$TOPLEV= 0
##$USERP1= <user>
##$USERP2= <user>
##$USERP3= <user>
##$USERP4= <user>
##$USERP5= <user>
##$WDW= 1
##$XDIM= 8192
##$YMAX_p= 0
##$YMIN_p= 0
$$ End of Bruker specific parameters
$$ ---------------------------------
##NTUPLES= NMR FID
##VAR_NAME=  TIME,          FID/REAL,        FID/IMAG
##SYMBOL=    X,             R,               I
##VAR_TYPE=  INDEPENDENT,   DEPENDENT,       DEPENDENT
##VAR_FORM=  AFFN,          ASDF,            ASDF
##VAR_DIM=   8192,          8192,            8192
##UNITS=     SECONDS,       ARBITRARY UNITS, ARBITRARY UNITS
##FACTOR=    0.0002496,     1,               1
##FIRST=     0,             0,               0
##LAST=      2.0444736,     0,               0
##MIN=       0,             -327779,         0
##MAX=       2.0444736,     258144,          0
$$ Real data points
##PAGE= N=1
##DATA TABLE= (X++(R..R)), XYDATA
0@%%%%%%%%%%%Qj6J6j6K4l2M0m8N6p2Q8j04J20j36J60j91K19k51K88l30L78m29
$$ 0 0 0 0 0 0 0 0 0 0 0 0 8 -8 8 -8 16 -16 24 -24 32 -40 48 -56 64 -72 88 -103 116 -135 153 -177 201 -228
33b28M86n51O21o98P86q81R83j096J220j351J498j660J835k027K236k466K717
$$ -228 258 -293 328 -370 416 -465 518 -578 642 -709 789 -871 964 -1063 1173 -1293 1424
50A424k991L294l631M004m421M889n418O022o719P532q496R666j1116J2965j5420
$$ 1424 -1567 1727 -1904 2100 -2321 2568 -2850 3172 -3547 3985 -4511 5155 -5961 7004 -8416
65h416J8860k4062L2920n1925J64997k02277k44857M26731J08922k87974r2919
$$ -8416 10444 -13618 19302 -32623 132374 -69903 -314760 111971 220893 -67081 -160000
76a60000K58532l074j86539K8630J41482l2904n2652l8812r787P6742R1807r8818
$$ -160000 98532 95458 -91081 -62451 79031 46127 -6525 -45337 -55124 21618 113425 14607
88A4607j50116R0019J74814r6866j25164Q6691N7991q2074p288P7486j1358p0744
$$ 14607 -135509 -45490 129324 32458 -92706 -6015 51976 -30098 -37386 40100 28742 -42002
100d2002K7680J7452l5499O3359L7784j31639m2217J52153O0262j45111o0762
$$ -42002 -14322 3130 -32369 30990 68774 -62865 -105082 47071 107333 -37778 -98540
111i8540J21998K6047q3922J8043M1798k9870j8864Q642J0861K5598J4415o6517
$$ -98540 23458 49505 -34417 -16374 25424 -4446 -23310 -14668 -3807 21791 36206 -30311
123c0311n6045J11585Q1114j39154o4856J34000K6026j19344K3386J21845q0744
$$ -30311 -86356 25229 106343 -32811 -97667 36333 62359 -56985 -33599 88246 7502
134G502j25187J33349J02735j52758n4659J41345M625j31967M5845J35901r2376
$$ 7502 -117685 15664 118399 -34359 -89018 52327 56952 -75015 -29170 106731 14355
145A4355j28794J14545R8124r4813n9775N7301K4831l2437J1370J6686l8573R551
$$ 14355 -114439 106 98230 3417 -56358 943 25774 -6663 4707 21393 -17180 -7629
157g629L4559m3366j357O9630k9073r0292L8919J09129m4819j09683N7021P6055
$$ -7629 26930 -16436 -17793 51837 22764 -67528 -28609 80520 35701 -73982 -16961 59094
169E9094o4581l0323O2878J080o2408Q115O1052j6994l9463K3279k755j8993L5845
$$ 59094 -5487 -35810 27068 28148 -34260 -26145 34907 17913 -21550 1729 -1026 -20019 15826
182A5826J0148m3328r279L6967M097l0451J9845J6626m9300L858N7165j5586m3840
$$ 15826 25974 -17354 -26633 10334 14431 -16020 3825 20451 -28849 -24991 32174 16588 -27252
195b7252J5971K6020k3426o918M3376k0080n3994M4456M1039n1186j7149N0797
$$ -27252 -11281 14739 -8687 -15605 27771 7691 -46303 -1847 39192 -11994 -29143 21654
207B1654m014o0912K7541P5037n1153p2099O0226N2672m8942l3174L7549J7666
$$ 21654 17640 -43272 -15731 59306 8153 -63946 -3720 48952 10 -33164 4385 22051
219B2051l5257M70L0391j2799r276N831j4817J1956L2112j8887m7015J6715O2198
$$ 22051 -13206 -12736 17655 4856 -4420 1411 -13406 -1450 30662 11775 -35240 -18525 43673
232D3673k1258o2169L3637M2207l7953k3032L6954J5992l6586j2223L2650j03
$$ 43673 22415 -39754 -6117 36090 -1863 -24895 12059 28051 -8535 -20758 11892 11789
244A1789j1497J0876j8030j2435L3869J3921l6254j8970L8194J5273m2368K186
$$ 11789 292 11168 -6862 -19297 14572 28493 -7761 -26731 11463 26736 -15632 -13446
256a3446L7323j7038k6901J4608K1369o444j7798K211K081L106J8662j5669k7439
$$ -13446 23877 6839 -20062 -5454 15915 9471 -8327 -6116 -4035 -929 17733 2064 -25375
269b5375K3652K1861k3157j5603K3456J2548l4878k995M1606r693l3107J1687
$$ -25375 -1723 20138 -3019 -18622 4834 17382 -17496 -20491 21115 11422 -21685 -9998
281i998J7993p140q831J0937r04k0667J4939J9940k2166q845J6660N05j0175J926
$$ -9998 7995 855 -7976 2961 2057 -18610 -3671 16269 -5897 -14742 1918 2423 -7752 -5826
295e826J3904p678j6164J4001P610q974M636m201q807J0222J2696q540j8809J2343
$$ -5826 8078 400 -15764 -1763 5847 -3127 1509 -2692 -11499 -1277 11419 2879 -15930 -3587
309c587K0260k2480r537K8587j395k6434J760K7889L89k9188M127K2222r399o505
$$ -3587 16673 -5807 -15344 13243 11848 -14586 -12826 15063 15452 -13736 -9609 12613 3214 -3291
323c291O653q59k091j598L916J630k844L938q249l596J8294j568j7110L302J0431
$$ -3291 3362 2503 412 -1186 2730 4360 1516 5454 -2795 -6391 11903 10335 -6775 -3473 6958
338F958m99r709M631R596j5466k395J8774n234j1879M283O661l806p465J1513
$$ 6958 6459 -3250 1381 10977 -4489 -6884 11890 6656 -5223 -940 5721 1915 -5550 5963
352E963M136j8880K709J5476m637p509j149N490J196n588M544l37m925M379l072
$$ 5963 10099 -8781 -6072 9404 4767 -2742 -3891 1599 2795 -2793 1751 1414 -3511 868 -2204
367b204r72Q650m539q271J881R837K541j5704J235J4826q475p072R245M060p697
$$ -2204 -3176 5474 935 -7336 -5455 4382 6923 -8781 -7546 7280 -1195 -8267 978 5038 -2659
382b659p639J0354Q158j2851j865P193j897P47m94m29J860m069K031J706r82M025
$$ -2659 -10298 56 8214 -4637 -6502 691 -1206 -459 -953 -1382 478 -3591 -1560 146 -836 3189
398C189o563k502R828p92m808j041K315L690n248J525O082q166p52P149j301k688
$$ 3189 -3374 -5876 3952 3160 -1648 -2689 -374 3316 -1932 -407 5675 -2491 -3243 3906 2605 -83
414h3j386M123O15p835O165O765r273l063L987O141J32j1280J748R282j943m390
$$ -83 -1469 2654 3269 -4566 1599 8364 -909 -3972 15 6156 6288 -4992 -3244 6038 4095 -295
430b95m414P070P493j3613m488J3604L985j0159j0926J1765J4638j4899j0898
$$ -295 -4709 2361 9854 -3759 -8247 5357 9342 -817 -11743 22 14660 -239 -11137
443a1137J1010P865n193j0161M467J0886p315o544L739L936L374q089m764Q613
$$ -11137 -127 7738 2545 -7616 -3149 7737 422 -6122 -2383 1553 4927 -3162 -7926 687
457F87K870k627n295k091R279K6p534J465K366K127k273m780O250J020m437J268
$$ 687 3557 930 -4365 -6456 2823 2849 -4685 -3220 -854 1273 -1000 -5780 470 1490 -2947 -1679
473a679j888K750L465m203j131j782M109O490q674m681P438M171k867p978L415
$$ -1679 -3567 -817 2648 -1555 -2686 -4468 -359 6131 -2543 -7224 214 4385 1518 -6460 -3045
488c045J1181p277q053O721N502j307p970K97Q866j807k173q70m242O359N937
$$ -3045 8136 859 -7194 -473 5029 3722 -4248 -3951 4915 3108 935 65 -4177 2182 8119
503H119o695p520L656J4070m656j9444R592J8786q708j8937M675K3044l448k5676
$$ 8119 1424 -6096 -2440 11630 6974 -12470 -2878 15908 7200 -11737 -7062 15982 12534 -13142
517a3142N254K0536j630j5311n453J4122P671j2026o647M451R558K380j6537l800
$$ -13142 -7888 12648 11018 -4293 -9746 4376 12047 21 -6626 -2175 7383 9763 -6774 -10574
531a0574J8565N664j6688j3382J8000J8876k1233j8682J9580J6527j4133j9284
$$ -10574 7991 13655 -3033 -16415 1585 20461 -772 -19454 126 16653 2520 -16764
543a6764J2265K0335j4163j6293J1721J1461n494j1372K388J0577l281m175Q17
$$ -16764 -4499 15836 1673 -14620 -2899 8562 3068 -8304 -5916 4661 1380 -2795 -1978
556a978k930M584L617n496l974K788Q741m191j2027R394R463j0465o155P929O309
$$ -1978 -4908 -324 3293 -2203 -6177 -3389 5352 1161 -10866 -1472 7991 -2474 -8629 -700 5609
571E609p745o094J1600k43j1698Q013P994j0173p672J2378J0980j8152r775K3396
$$ 5609 -2136 -8230 3370 3127 -8571 -558 7436 -2737 -10409 1969 12949 -5203 -14978 8418
585H418M400k1759k563J9152M489j9440l834J9519k32j3043J940L905K204k2k606
$$ 8418 12818 -8941 -11504 7648 12137 -7303 -11137 8382 8150 -4893 -2953 952 3156 3134 528
600E28k943p98J0514J469j8165K530J9338l179j9142n75K2824J480k5790M30K2901
$$ 528 -2415 -3213 7301 8770 -9395 -6865 12473 9294 -9848 -10423 12401 13881 -11909 -11479 11422
615A1422M99j7615n734J5963Q369j5512o092R850N662l292r629J170J0719j75
$$ 11422 11921 -5694 -11428 4535 12904 -2608 -8700 1150 6812 3520 -6109 -4939 5780 5605
629E605p351n652N730J2011p974j3984P692J3721l760j7248L038K0104o643j8384
$$ 5605 -1746 -7398 -1668 10343 2369 -11615 -3923 9798 6038 -11210 -8172 11932 5289 -13095
643a3095Q157J5214o630j5049P251J4736j1128j0071J3384L145j1366l88J0969
$$ -13095 -4938 10276 3646 -11403 -4152 10584 -544 -10615 2769 5914 -5452 -5840 5129
656E129p42j3501N078J3363r450q650Q692O000n757o275N860N248o246o16K038
$$ 5129 4387 -9114 -4036 9327 -123 -8773 -81 5919 162 -6113 -253 4995 -1251 -1867 171
671A71k153M606N66o371m20O562M067r734n391J3658K636j2360j314Q408N056
$$ 171 -1982 2624 3190 -3181 -3601 2961 7028 -2706 -8097 5561 8197 -4163 -5477 2931 7987
686G987q540o126Q945M147n370l416j27O509J834p789j456M650M260k433q525
$$ 7987 -553 -6679 2266 6413 1043 -2373 -2500 4009 5843 -1946 -3402 1248 5508 3075 -5450
701e450L467Q792k903p036k143Q669N692j2098n550J1875O107r748j0201J0106
$$ -5450 -1983 6809 3906 -3130 -5273 3396 9088 -3010 -8560 3315 9422 -326 -10527 -421
715d21J2424j2883r995J1789P411q223q995P439R025q884m666N463K226p92l316
$$ -421 12003 -880 -10875 914 8325 102 -8893 -1454 7571 -1313 -5979 -516 1710 918 -2398
730b398j201L983k7q30k447q12O367k069n722M164K206j872j980J25L906k410
$$ -2398 -3599 384 357 -473 -2920 -3732 2635 566 -5156 -992 1214 -658 -2638 -2513 1393 -1017
746a017j966M082k394j334L173n47j399j266K903K338n601Q19M926k804j459M58
$$ -1017 -2983 1099 -1295 -2629 544 -3 -1402 -2668 235 2573 -3028 -2209 2717 -87 -1546 -1088
762a088J455J713l546M45K439j214N56j095m60L414j985j716K241K97Mj671L32
$$ -1088 367 2080 -1466 -1021 1418 204 760 -335 -795 2619 634 -1082 1159 1456 1460 -211 121
779A21K954k901p67L261j855l13O58J06L61k012J852J447l752J466J730k061L08
$$ 121 3075 174 -593 2668 813 500 1158 1264 1625 -387 1465 2912 -840 626 2356 295 603
796F03J32O97k14k245K660k03k056J963r75m61J434j719M71P6n1J296k991J055
$$ 603 735 1432 1218 -1027 1633 1430 -626 1337 362 -99 1335 -384 87 163 112 1408 -1583 -528
814e28K821l606k77J821M53n31k724J836K781l779N77J248q80P10j524M89J269
$$ -528 2293 -1313 -1590 231 684 153 -2571 -735 2046 -1733 -1156 92 -788 -78 -1602 -1113 156
831A56j491J214j051p64L386k321j269K003l87M06j042p96L253k260k24J451r49
$$ 156 -1335 -121 -1172 -1936 1450 -871 -2140 -137 -524 -118 -1160 -1956 1297 -963 -1187 264 -685
848f85P13J10j553J775o40r5R70j843K053j36j953J982l25o01J015r88P71l50
$$ -685 28 138 -1415 360 -280 -375 595 -1248 805 669 -1284 698 373 -228 787 -201 570 220
866B20n83K380k025r34K851o29j188n14Q09J995k602r22L402j210j000O9p2K127
$$ 220 -363 2017 -8 -942 1909 1280 92 -422 387 2382 -220 -1142 2260 1050 50 119 47 2174
884B174k119j008J961l20R5q50j366L542r84k598J371J059K26k361p73M173j665
$$ 2174 55 -953 1008 688 783 -67 -1433 2109 1125 -1473 -102 957 1183 -1178 -1951 2222 557
901E57k992K386N74k98j461n04K752j012j471J090q43J078K99k206J529O78j076
$$ 557 -2435 -49 525 227 -1234 -1738 1014 2 -1469 -379 -1222 -144 155 -2051 -522 156 -920
918i20L24j043K097j15k800K019P38j159O27p88P69j54p25J682j740k95L092j736
$$ -920 -596 -1639 458 343 -2457 -438 300 -859 -232 -1020 -251 -405 -1130 552 -1188 -1483 1609 -127
936a27j493J865O02p1k333P44L063k225j274K078k07P26j512m44K122n72m65k81
$$ -127 -1620 245 847 776 -1557 -813 2250 25 -1249 829 622 1348 -164 -608 1514 942 477 196
954A96o29L190j863k334K723L42m57j343L44K161j792j069K926j716r64J799n93
$$ 196 -433 2757 894 -1440 1283 1625 1168 -175 169 2330 538 -531 2395 679 -285 1514 921
971I21k70o76J203J093l573R15K935k025q32K63P20Q69k082M3R07m48J339k089
$$ 921 651 -25 1178 2271 -1302 -387 2548 523 -309 -46 674 1543 -539 -496 411 -37 1302 -787
989g87j051L842p97l024J42K403J703m367j250N075j194k615M78Q12J387j557
$$ -787 -1838 2004 1207 -1817 -1675 728 2431 -1936 -3186 1889 695 -1920 -1442 -630 757 -800
1005h00j166J454j15P54p50k317L250P65l270P56J189N18j588q61L188j728j824
$$ -800 -1966 -512 -627 127 -623 -2940 310 1075 -2195 -1439 -250 268 -1320 -2181 1007 -721 -2545
1022b545L627j060k696K255K036j294l601K387M244m725j938M911O7k859n28K471
$$ -2545 1082 22 -2674 -419 1617 323 -3278 -891 3353 -1372 -3310 1601 1668 -1191 -1719 752
1038G52Q48k826J096J729l094K095J604l379PK695J305l875j593N467K81m943
$$ 752 1600 -1226 -130 1599 -1495 600 2204 -1175 -1168 1527 2832 -1043 -2636 2831 3112 -1831
1054a831R28K858j7j567j694K559K48r55L26j826J559K112k704j293J922J469
$$ -1831 -903 1955 1938 371 -1323 1236 1484 529 855 -971 588 2700 -4 -1297 625 2094
1070B094q30l109J437K728j155j337j329J237L944l603l901L869L864k869n625
$$ 2094 1264 -1845 -408 2320 1165 -172 -1501 -264 3680 77 -3824 45 3909 1040 -4585
1085d585L229P109n815n354O270K846n000k331M002K220n060Q87L730l940l0L712
$$ -4585 -1356 5753 -62 -5416 854 3700 -1300 -3631 371 2591 -2469 -1582 2148 -1792 -1822 1890
1101A890j854l252K462L865l284m763O225K446o962N01N234j187m180J417M609
$$ 1890 36 -3216 -754 3111 -173 -4936 1289 3735 -3227 -2726 2508 1321 -2859 -1442 3167
1116C167l756k871O031q11n236K627M044k300m102K965M490m580l088N239M22
$$ 3167 -589 -3460 2571 1760 -3476 -849 3195 895 -3207 -242 4248 -332 -3420 1819 2241
1131B241k162j239J121K143j658r54N49M3J717q08k437K295N78j017o3p51J128
$$ 2241 79 -1160 -39 2104 446 -508 41 84 1801 993 -1444 851 1429 412 349 -402 726
1148G26L44p78N8j685K660K190n389o40N867n78n118l72O115k45p371K597N696
$$ 726 1070 292 350 -1335 1325 3515 -1874 -2514 3353 2775 -2343 -2715 3400 3155 -4216 -1619 4077
1165D077l987k749K784J570k611m38L243k344l032O010r76n887K812N193l293
$$ 4077 90 -2659 125 1695 -916 -1354 1889 -455 -3487 2523 1547 -4340 -1528 3665 372
1180C72n666M330O242p130l858P898O55n883J2M691n79m334K192L407m080m41
$$ 372 -5294 -964 5278 -1852 -5710 2188 2843 -3040 -3028 1663 1084 -3250 -1058 2349 -1731 -2172
1196b172L621j956j524J652J334j531j357K886o50k528K436R67k642Q86J169m86
$$ -2172 1449 -507 -2031 -379 955 -576 -1933 953 303 -2225 211 1178 -1464 -578 591 105
1212A05j184O26K161k439o96L434j844r87J715n47k77J57P91q01r51K621m1m009
$$ 105 -1079 -453 1708 -731 -1427 2007 163 -824 891 344 67 224 1015 214 -737 1884 1843 -2166
1230b166K469K482k933j554K898J658l493j043M734j498l630K976J638k960l64
$$ -2166 303 2785 -148 -1702 1196 2854 -639 -1682 3052 1554 -2076 900 2538 -422 -786
1245g86K777l17l648J961L760m731j359M592n91l390Q46L106j142l539L035J747
$$ -786 1991 1674 -1974 -13 3747 -984 -2343 2249 1658 -1732 -886 2220 1078 -2461 574 2321
1261B321l985R24K467k327n69J518Q58k487n17L976k042l489M225P54l486K16
$$ 2321 -1664 -740 1727 -600 -1169 349 1207 -1280 -1797 2179 137 -3352 873 1627 -1859 -1643
1277a643K538L06l734J292L337k856j522L155o30j812P33J357j052r86J900L7
$$ -1643 895 1201 -2533 -1241 2096 -760 -2282 873 243 -1569 -836 521 -531 -1517 383 420
1293D20k677K644J005l060Q47K121r71k155J079L103k828j984M203m33l215J461
$$ 420 -2257 387 1392 -1668 -821 1300 329 -1826 -747 2356 -472 -2456 1747 1314 -1901 -440
1309d40J979j175j738J402J996l204M32K883k231r48J839j37j241J38K030p65
$$ -440 1539 364 -1374 28 2024 -1180 -748 2135 -96 -1044 795 658 -583 -445 1585 820
1325H20k280K369R28l138J573J546j602j235J558J698l062p16L943j448l119K460
$$ 820 -1460 909 1837 -1301 272 1818 216 -1019 539 2237 -825 -1541 2402 954 -2165 295
1341B95J663k199j116K082J063l301Q16K327k193o11K037m66j149L17J514j422
$$ 295 1958 -241 -1357 725 1788 -1513 -697 1630 -563 -1174 863 397 -752 -435 1079 -343
1357c43j672K986l38k945K039J683k323m62J553J039k497j60L228k092j953L010
$$ -343 -2015 971 633 -2312 -273 1410 -913 -1375 178 1217 -1280 -1440 1788 -304 -2257 753
1373G53k49j523k59J488N35k324O42K487k384k5J902j466j81O82N47j059l66J910
$$ 753 504 -1019 -1278 210 745 -1579 -937 1550 -834 -859 1043 -423 -604 78 625 -434 -800 1110
1391A110o85j785K065L77k080K28J893k55j954M69K572k422o98K803o47j781P30
$$ 1110 425 -1360 705 1082 -998 -770 1123 868 -1086 -617 1955 -467 -1165 1638 991 -790 -60
1408f0J219l58j810J693P86j968L72J538j408l8J061n48m02j05J357r55j607K918
$$ -60 1159 801 -1009 684 1470 -498 -126 1412 4 -34 1027 479 77 -28 1329 374 -1233 1685
1426A685n45k092R49J472r36j493P54K204k320q66K566q94j514Q69P33m94j213
$$ 1685 1140 -952 -3 1469 533 -960 -206 1998 -322 -1188 1378 484 -1030 -161 572 78 -1135
1443a135J319N60j967R80R18j578M0J276p59m22k0J346r71j015J830n3k011J252
$$ -1135 184 744 -1223 -243 675 -903 -863 413 -346 -768 -788 558 -413 -1428 402 349 -1662 -410
1461d10O69r07k22J62R12j203m65J914q23n01R25j66k06j86K81N72j215R81M47
$$ -410 259 -648 -870 -708 204 -999 -1464 450 -373 -874 51 -115 -321 -507 -226 346 -869 112 559
1480E59j929J526L51j173K96O71Q4q52Q7J715j348j134J907K25j506L57N76M32
$$ 559 -1370 156 507 -666 -370 301 385 -467 -380 1335 -13 -1147 760 985 -521 -164 412 844
1498H44j212J75J729j512n63J423k51l73k02M7L16q29J020L59j468P41Q27r23
$$ 844 -368 -193 1536 24 -539 884 633 260 58 105 421 -408 612 971 -497 244 1071 148
1516A48M4j35R77q34o79J432o04j039J274j05p27J94K80J08o51m13J602j014j62
$$ 148 192 57 1034 200 -479 953 349 -690 584 479 -248 -54 226 334 -317 -730 872 -142 -304
1535c04O74n52N58o12k94P91k62l15n3j24J197q24r51J294K5n08l63J42J067q63
$$ -304 370 -182 376 -236 -530 261 -1 -316 -369 -493 704 -120 -1071 223 248 -260 -623 -481 586 -277
1555b77r96J731k85p66M26J06n1k48l1R38j027j65J272q63o3K00R0K72o19K45
$$ -277 -1273 458 173 -593 -167 -61 -112 -360 -391 547 -480 -645 627 -236 -299 -99 -9 263 -356 -111
1575a11O21r33M88L88q98O69j85k0J2k47P20J2j073J063j0m36N7l26J381o63j042
$$ -111 510 -423 65 453 -445 224 39 19 31 -216 504 516 -557 506 496 60 117 -209 1172 509 -533
1596e33J185j03l06j70p0J304j055n77P81r8n81M65m53O70k81l97R84j013k08
$$ -533 652 549 243 73 3 1307 252 -325 456 358 -223 242 -211 459 178 -219 765 -248 -456
1615d56R37m06j08j75q3J033j008n21J412n83n08L39o9M84r08N7Q22n37j77K14
$$ -456 481 75 -33 -208 -291 742 -266 -787 625 42 -466 -127 -196 288 -620 -563 259 -278 -455 -241
1635b41k94K48k59K85K73q60O22N19j051L17O23n34k09m98J665l60j429J029N27
$$ -241 -535 -287 -546 -261 12 -848 -226 293 -758 -441 182 -352 -561 -1059 606 246 -1183 -154 373
1654C73q26J36K27O43p47o77J743j79j394N56O35m50l51o1J485j275n31J604p10
$$ 373 -453 -317 -90 553 -194 -871 872 693 -701 -145 490 40 -311 -372 1113 -162 -693 911 201
1673B01l29L6J53N44q83Q8J330r52j74J85O0R6l80K20L47p84N19O48j213L83L77
$$ 201 -128 -92 61 605 -278 -190 1140 188 14 199 259 355 -25 195 542 -242 277 925 -288 95 472
1694D72L02l63o52O68M20j322N78O42o07j71j48P20p7o75M75K33p27M4K84K46
$$ 472 774 411 -241 427 847 -475 103 745 138 -33 -181 539 462 -213 262 495 -232 -188 96 342
1714C42p61l99J521n32j088P97N20m70q31P24Q85j400k18J133p3q46M87M9J27
$$ 342 -419 -818 703 171 -917 -120 400 -70 -901 -177 708 -692 -910 223 150 -696 -209 -160 -33
1733c3o30P1Q68p83N9L61k42j31J78N6J5m81O81L56j137Q00J06m22M4MO55k54
$$ -33 -663 -592 276 -507 -448 -87 -329 -460 -282 -226 -211 -692 -11 345 -792 8 114 -308 -264 -260 395 141
1755A41o69P23K38j101O51J55J35j71j76P37k88m76P4L26J00l33K8L84J8p02O00
$$ 141 -528 195 433 -668 -17 138 273 102 -74 663 375 -101 -27 299 399 66 94 478 496 -206 394
1776C94k11J04n40K95M95m11l75O07n7l35M58k67K91m98J56O44o48k53N50m91
$$ 394 183 287 -253 42 537 126 -249 358 301 -34 424 157 448 -50 106 750 102 -151 399 -92
1796i2L95j18j41K44o02N29n5o22M80K94q76K51L74J91k18n45M97J32p56M21K51
$$ -92 303 185 44 288 -314 215 160 -462 18 312 -564 -313 61 252 34 -511 -14 118 -638 -217 34
1817C4k72Q0j55N49k84l45M32Lm06K48k17K08r9j70N09k51k82M30j53J23j31n3
$$ 34 -238 -158 -313 236 -48 -393 39 42 -364 -116 -333 -125 -224 -394 115 -136 -418 12 -141 -18 -149 -202
1839b02N85l90J02J96n23L12j3m81O21N0k00jk6N18l13m82M64j71j16N91o87L60
$$ -202 383 -7 95 291 -232 80 67 -414 207 257 57 56 30 548 235 -247 217 46 -70 521 -166 194
1861A94K49n10M99l89Q9M57q34P52j56m31L96j28J10j23l18J029n47o58P83j39
$$ 194 443 -67 432 43 132 589 -245 507 351 -80 316 188 298 175 -143 886 339 -319 464 325
1881C25m57JL10J83m12k29Q02m72n21O36Oj47n5l53N34l30J21J94m35K63K80q71
$$ 325 -132 -131 179 362 -50 -279 523 51 -470 166 172 25 -30 -383 151 -179 -58 136 -299 -36 244 -627
1903f27N01R0l71J44j72M31n6n53N51o6n38M61j12m9J09j00P4J13j88J70l70K68
$$ -627 -126 -36 -407 -263 -435 -4 -60 -613 -62 -128 -666 -205 -317 -366 -257 -357 -283 -170 -358 -188 -558 -290
1925b90J24q9J60j89J3J31m79P38q5o05R04r7l21J45k63O55l21l90Q31l4p30K38
$$ -290 -166 -255 -95 -284 -271 -140 -619 119 34 -571 333 236 -85 60 -203 452 131 -259 572 538 -192 46
1947D6J60j74N0j18K90k5m88P02k66o0R8k36M80j43k55L06k38M6O9l25L81n0q0
$$ 46 206 32 82 -36 254 229 -259 443 177 117 215 -21 459 316 61 367 129 175 244 -81 300 250 170
1970A70K47l3j24M6l64N28k73n29P11k02J44l05l63O91m4n68L01k32J55K32q13
$$ 170 417 384 260 306 -58 470 197 -332 379 177 321 16 -347 344 300 -268 33 -199 -44 188 -625
1991f25N70K86m88j0J45K59j16n40M04Q8j44J3l07O15J8q87P73o3l66K88K9k8
$$ -625 -55 231 -257 -267 -122 137 21 -519 -115 -27 -171 -158 -465 150 168 -719 54 -9 -375 -87 -58 -86
2013h6j57k41R00k51p41O70m14L21k48O5L84j24n46P39k89p8L73m62K86j89k8
$$ -86 -243 -484 416 165 -576 94 -320 1 -247 -182 202 78 -468 271 -18 -96 277 -185 101 -88 -116
2034a16L66n37L04L84n34N01k4l69K60j64j15M77q93P80k24m6M4O4o8m0k31L95
$$ -116 250 -287 17 401 -133 368 344 -25 235 71 -44 433 -460 320 96 50 94 158 90 50 -181 214
2056B14q0j80J66m47P04r4n71L84L76q87M86kJ29j00o97P56J03n87M75R2l62J7
$$ 214 134 -46 120 -327 377 283 -288 96 472 -415 71 69 198 98 -599 157 260 -327 148 240 -122 -105
2078a05j18L97k99k45M19M1m58L4o5N11k27j78L39k64j4L75l90K33J74o29M82
$$ -105 -223 174 -125 -370 49 90 -368 -334 -399 112 -115 -293 46 -218 -232 143 -247 -14 160 -469 13
2099A3p1n3K64j77j60J64n4R1l39K94J63k30M04k25k17J60k1J83O0n82L24K23
$$ 13 -58 -111 153 -24 -184 -20 -74 17 -322 -28 135 -95 309 84 -133 27 6 189 249 -333 -9 214
2121B14k70J91J05N4k72k06L86o2j94J34L36k71j25j11O31k34o17P21j58k61J74
$$ 214 -56 135 240 294 22 -184 202 140 -54 80 416 145 20 -91 540 306 -311 410 252 -9 165
2142A65N3M24r16J86M40m29N5K99k31J23r6nj5m2q9K66k35K22R3m14K86m01K95
$$ 165 218 642 -274 -88 352 -77 -22 277 46 169 73 68 53 11 -78 188 -47 175 268 -146 140 -261 34
2165C4K57o34N03J30m15J90j28J50k70j89M44k77k16N29J14k17l19j23M59J1n29
$$ 34 291 -343 160 290 -125 65 -63 87 -183 -372 72 -205 -421 108 222 5 -314 -437 22 33 -496
2186d96L06K12k68J86k49N66l06l12N63j86k75j78L77K30k42k99O86l87l55L70
$$ -496 -190 22 -246 -60 -309 257 -49 -361 202 16 -259 -437 -60 170 -72 -371 315 -72 -427 -57
2206e7J45n9l32K64K66m85K35K83l8l50J68J36M8j37r9M63o89J55M88l97n1N21
$$ -57 88 29 -303 -39 227 -258 -23 260 222 -128 40 176 224 87 -12 451 -238 -83 405 8 -43 478
2228D78j44q8k69J96O1l94L79K4o4q3r1L87l24m05M98r3j32j4R4K62l57j85M58
$$ 478 334 246 -23 173 234 -160 219 243 179 96 5 392 68 -337 161 68 -64 -78 16 278 -79 -264 194
2251A94Mm26J98N1K01m94J98oK68l1j70R6l2J40m98M85j26k10J53k24Q4K05l25
$$ 194 198 -228 -30 21 222 -272 -74 -80 188 157 -13 83 51 191 -307 178 52 -158 -5 -229 -145 60 -265
2274b65J9K94l92M41k48l65P45m62P9J25k1J91l27M09jo49N41K31m19J11k90L77
$$ -265 -246 48 -344 97 -151 -516 229 -233 -154 -29 -50 141 -186 223 222 -427 114 345 -74 37 -253 124
2296A24j86j61N73k18l32j95M65J09o2k89L75p4n05P63m48L21j02k53N07k93n7
$$ 124 -62 -223 350 132 -200 -395 70 179 117 -172 203 129 -376 387 -61 260 158 -95 412 119 62
2317F2K47l19N6j3j54J33R4p4Q1J1j31J78k77N34l63l63L72J9r9K35o6j50J01
$$ 62 309 -10 46 33 -121 12 106 32 113 124 -7 171 -106 428 65 -298 74 93 -6 229 163 13 114
2340A14j66L38n97L64J68l87J09K00l99J81K01J4k63m20M31J53l04j8M83l84k63
$$ 114 -52 286 -311 53 221 -166 -57 143 -256 -75 126 140 -123 -543 -112 41 -263 -281 202 -182 -445
2361d45j08P98k94l74K15J99l27nK42n9m4p4Q8J39k02K87k95J62j27O5n1Q7N9
$$ -445 -553 245 -49 -423 -208 -9 -336 -341 -99 -158 -202 -276 -188 -49 -251 36 -259 -97 -224 -159 -210 -123 -64
2384f4J74n23L29K86m91J76M24k03k2k65M10j21m98P11l12o1J29QK78l53jK40
$$ -64 110 -413 -84 202 -289 -113 311 108 86 -179 231 110 -388 323 11 -50 79 87 365 12 11 251
2406B51k52K7K00n00L56L24m53P2k65O65m87k0N08k1o11J19M37j35j63r7K21J30
$$ 251 -1 26 226 -274 82 406 -47 25 -240 425 -62 -82 426 405 -206 -87 350 215 52 -45 176 306
2428C06m77N84m04l77N92m75J46Q3n1K07j18j74L71n37L13J26k60J85m22K71k96
$$ 306 -171 413 9 -368 224 -251 -105 -22 -73 134 16 -158 213 -324 -11 115 -145 40 -382 -111 -407
2449d07M61o4J27m58L57O1j82P3J91r4j16l76N38j67k33M07k24J6on3J7r3K72
$$ -407 54 -10 117 -341 16 77 -105 -32 159 65 -51 -427 111 -56 -289 118 -106 -90 -96 -149 -132 -225 47
2472D7K20o96N19J6l15K5K80K2k94O0L63r8k60M60O2m03J09J06l17J33r9J50J97
$$ 47 267 -429 90 106 -209 -184 96 118 -176 -116 247 149 -111 349 411 8 117 223 -94 39 -60 90 287
2495B87o39M68j74L8m5K5J63q5K12Ln01R7N29m46n4L87k51J18l68N12r8m61M29
$$ 287 -352 116 -58 -20 -65 -40 123 38 250 253 -248 -151 378 -68 -122 265 14 132 -236 276 178 -283 146
2518A46m6l94J70L75j98j50j2J27k16J90M1j27k8Q9J5n1j63L93r5j50j14Q9j57
$$ 146 100 -294 -124 251 53 -97 -109 18 -198 -8 33 -94 -122 -33 -18 -69 -232 161 66 -84 -198 -109 -266
2541b66m4L65j68m2l2K30n7r4K59J31n36J96J93r7Kj92L70n95J91N27n37J27M17
$$ -266 -310 55 -113 -155 -187 43 -14 -108 151 282 -254 -58 135 38 40 -152 218 -377 -186 341 -196 -69 348
2564C48l27n3M2m5K03j83J96L1k71rK47k55J35N4n9J01k71N14n3k71J97n0l03
$$ 348 21 -32 10 -35 168 -15 181 212 -59 -68 179 -76 59 113 54 155 -116 398 345 74 271 221 -82
2587h2J83K99j30q7J50j60K4j71K12m39K79J78o8j64k43K7K59k12M64o3m31J1
$$ -82 101 400 270 183 333 173 197 26 238 -201 78 256 188 24 -219 -192 67 -145 319 256 -175 -164
2609a64M18k34l1P0K43l26j51L22L1l64L48k21n7N8pO0j92L68j11j33J0n2J04
$$ -164 254 20 -11 59 302 -24 -175 147 178 -186 162 -59 -116 -58 -65 -5 -197 171 60 -73 -63 -115 -11
2632a1n4r4L45k19k36J22K94k60MK21l44KJ63R7k26j0j9J34n9L18j97p4L67k99
$$ -11 -65 -159 186 -33 -269 -147 147 -113 -109 112 -232 -230 -67 30 -196 -206 -225 -91 -150 168 -29 -103 264 -35
2656c5Q7j85j62M64n49K24L88n18K16O8J32k68k04N87p6l11L06p7O2j23K37l86
$$ -35 52 -133 -295 169 -380 -156 232 -286 -70 -2 130 -138 -342 245 169 -142 164 87 149 26 263 -123
2678a23K19P0J47l35j02M80j71k72M14l29K23p9J57j85j94OM5j57L24o9L66k79
$$ -123 96 166 313 -22 -124 356 185 -87 327 -2 221 142 299 114 -80 -74 -29 -186 138 69 435 156
2700A56k04Q4O5p8P5k81K19J67n43M61J8k49P2J30N1l35L48j17J27k50M0j23J40
$$ 156 -48 36 101 23 98 -183 36 203 -340 121 139 -110 -38 92 143 -192 156 39 166 -84 -44 -167 -27
2723b7o1P4K5j37k27J24L00k93J9j5J63Nl5kj12j5J88o1j24K06L5J0k0r0M3J55
$$ -27 -88 -14 11 -126 -353 -229 71 -222 -203 -218 -55 -50 -85 -87 -199 -214 -26 -87 -211 -5 30 40 20 -70 -27 128
2749A28k5J17n50M78j27J29j60K4j46J20P5r5L54j80Nj82K49k17L37j13k01j63
$$ 128 103 220 -330 148 21 150 -10 14 -132 -12 63 -32 322 142 147 -35 214 -3 334 221 20 -143
2771a43J56o1J70r3j75J33K14k84L49l72K26j87q2J28J3Q9J26k42J54Q8n12L67
$$ -143 13 -48 122 29 -146 -13 201 -83 266 -106 120 -67 -149 -21 -8 81 207 -35 119 207 -305 62
2793F2k64J74L4rk58N79k03r7K24k62P5p5n9J54m11L44j41MJ99k50O0K4j94K68
$$ 62 -202 -28 6 -3 -261 318 115 18 242 -20 55 -20 -79 75 -336 8 -133 -129 70 -180 -120 -96 -290 -22
2817b2O3k17J03LM4L84o72L97j56k01L46m02J37J82m4k9K01k17J1M8NK36l09Q
$$ -22 41 -176 -73 -70 -26 358 -314 83 -73 -274 72 -330 -193 -11 -55 -84 117 -100 -89 -41 -36 200 -109 -101
2841a01q7Q0K54O6k95J24j92J71m6q7M30j41l62L29q3K58p2j79m1q1K51J20l97
$$ -101 -188 -108 146 212 -83 41 -151 20 -26 -113 317 176 -186 143 60 318 246 67 26 -55 196 316 -81
2864h1J13l2K38j02p5l00O17k76o9k19L50m2m3Q8p3l8J06M1j97K44k84K65l00
$$ -81 32 0 238 136 61 -239 378 102 33 -186 164 122 79 167 94 56 162 203 6 250 -34 231 -69
2887f9N2j85L07k78L65m1k46R3l5j37J69J69r8p1m5R9k36J67O3k71r3M19j86q9
$$ -69 -17 -202 105 -173 192 151 -95 -2 -37 -174 -5 164 66 -5 -50 49 -187 -20 43 -228 -321 98 -88 -177
2911a77j66j7M78l44Q0j32J28J47k65K43K04k31J6n4N4K19p3Q7j14j66P9R2j77
$$ -177 -343 -360 118 -226 -146 -278 -150 -3 -268 -25 179 -52 -36 -90 -36 183 110 197 83 -83 -4 88 -89
2934h9J26o0rm5k55K55j9J76O3k2J64k25o4K3q0J67M9k37k2J25p7J0o8J98m7K38
$$ -89 37 -23 -32 -77 -332 -77 -96 80 143 121 285 60 -4 19 -61 106 155 -82 -104 21 -56 -46 -114 84 37 275
2960B75l08L69m81J23p0L53j28j63J70n8j13K2k52JK97o5J8J3k19M66L7l58k0
$$ 275 -33 336 -145 -22 -92 261 133 -30 140 82 -31 -9 -261 -260 37 -28 -10 3 -216 250 287 -71 -91
2983i1J0J01j44r5m3K71K4j09J2l4J70q3q7L68j22l23J45L29k48k06K1J34k42
$$ -91 -81 20 -124 -219 -262 9 33 -76 -64 -98 72 -11 -98 270 148 -175 -30 299 51 -155 -134 0 -242
3006b42K03q3k70M11MQ0pj31Q3k31K2K09M1k0n6k0K1m8J5K40l11K14J4R6k22p1
$$ -242 -39 -122 -392 19 23 103 96 -35 48 -183 -161 48 89 69 13 -7 14 -34 -19 221 -90 124 138 234 12 -59
3032e9PJ01K10k13J0J05o0n7J49LR9k43L3n5L13m43K47j09K50j69m91M56k0k71
$$ -59 -52 49 259 46 56 161 101 44 193 196 295 52 85 30 343 -100 147 38 288 119 -372 84 64 -207
3056b07K04M92q22L54p0l4K56k13R5q3j58N5L08j71M8l06L50j81K01j24q5K97
$$ -207 -3 489 -333 21 -49 -83 173 -40 55 -28 -186 -131 177 6 54 -252 98 -83 118 -6 -91 206
3078B06l54R8K2L02k13M3k27J21j77Q1n2r4J24K49m7m00J14J4O7J94r1j45j56
$$ 206 -148 -50 -28 274 61 104 -123 -2 -179 -98 -150 -244 -120 129 82 -318 -204 -190 -123 71 -20 -165 -321
3101c21J64Q5n3m5k5P9kJ27k9K48o20M09Q9j23j3R2k77N33m67K93J37l67p9M57
$$ -321 -157 -72 -125 -170 -195 -116 -118 9 -20 228 -392 17 106 -17 -30 62 -215 318 -149 144 281 -86 -165 292
3125B92k61n3J28p8lK3J18k05L20j0k58K89k35J4LQ2j76J79J42J2k30k56K61n9
$$ 292 31 -22 106 28 25 48 166 -39 281 271 13 302 67 81 84 166 -10 169 311 323 93 -163 98 39
3149C9j5j14J82J89m45K15J23J00m04K55J0l1Q3j62L06L0n03P6Q3j08K3K8k39
$$ 39 24 -90 92 281 -164 51 174 274 -130 125 135 104 187 25 331 361 -142 -66 17 -91 -68 -40 -279
3172b79K2oM04k62O8J25j96j51K99J25r1k29l6J37Q7n9K70j96o8k61K77K34m13
$$ -279 -257 -263 141 -121 -53 72 -124 -275 24 149 58 -171 -207 -70 17 -42 228 32 -36 -297 -20 214 -199
3195a99K10N4k65J67n0K5J20j06N1j26J41o5l6Q4J12l72K55j28r3K92Q1j12O6
$$ -199 11 65 -200 -33 -83 -58 62 -44 7 -119 22 -43 -79 5 117 -255 0 -128 -221 71 152 40 106
3218A06L1L0J58m86J79j35j37L26k8l3L26k60J24l65L35J41l85q5K55qj89J13
$$ 106 137 167 325 -161 18 -117 -254 72 44 11 337 77 201 -164 171 312 -73 -158 97 89 -100 13
3240A3m3J36k67J63M11k93l47J39j74K46j73M3L03k78K62p3N8j03k24L14l38K05
$$ 13 -30 106 -161 2 413 120 -227 -88 -262 -16 -189 -146 157 -121 141 68 126 23 -201 113 -225 -20
3262b0L5k0Q4j76J71k17K73j79kr1K02j4k22K31l29J66O8J44j35J77n14K30J14
$$ -20 15 -5 79 -97 74 -143 130 -49 -51 -142 60 46 -176 55 -274 -108 -40 104 -31 146 -368 -138 -24
3285b4N9j34k6p2k6O6p4M45k09o6j40J99j26P6N8K89k26m5j47JK29k6J98j31l06
$$ -24 35 -99 -125 -197 -223 -157 -231 214 5 -61 -201 -2 -128 -52 6 295 69 24 -123 -122 107 81 279 148 -158
3310a58K75k92J53J3k2j53K81r8J31j01L6p4J93k04J39K34l36J45q4k5J93r0k0
$$ -158 117 -175 -22 -9 -31 -184 97 -1 130 29 65 -9 184 -20 119 353 17 162 78 53 246 156 136
3333A36Q8k19Q9K90l26j83L05o0L5J69l61j06J96j89K46Lm8j12j02J70m1J68k36
$$ 136 224 5 94 384 58 -125 180 120 155 324 -37 -143 53 -136 110 113 65 -47 -149 21 -20 148 -88
3356h8K79l58J32j8K0J16j2m5rL4J27l63J69j37O5j44J50k9K49o3k61M17l22m9
$$ -88 191 -167 -35 -53 -33 83 71 26 17 51 178 -185 -16 -153 -88 -232 -82 -111 138 75 -186 231 -91 -140
3380a40RJ94k0P0o1lq5o4J08K9K8N3j61J07j97K13M25p76M13k24n3J20r0L01l8
$$ -140 -131 63 43 113 52 49 -36 -100 8 37 65 118 -43 64 -133 80 505 -271 142 -82 -135 -15 -105 196 158
3405A58n54L97k32J19Q9j2J28Q3j91j77J87O4rq2m5K05j99K13J9j99K43j5j85
$$ 158 -396 1 -231 -112 -23 -35 93 176 -15 -192 -5 59 50 -32 -77 128 -71 142 161 -38 205 190 5
3428EJ17l7j68R4J0J7l86M21o0l38K33R5Qk47R5l2J57j3j12J3K53r4K8j11Ql5
$$ 5 122 85 -83 11 21 38 -348 73 13 -325 -92 3 11 -236 -141 -173 -16 -29 -141 -128 125 31 59 -52 -44 -79
3454g9j70N09o30K58K75j98p7K89l00m8Q6o8n4J02J69j27Q1J7q4r4n3K13R6l7
$$ -79 -249 260 -370 -112 163 -35 -112 177 -123 -171 -85 -153 -207 -105 64 -63 18 35 -49 -143 -196 17 113 76
3478G6J27M1j88K86l01j21K4j1l9J64j27L78j16k52K75jl39J38j20M1J47k44K96
$$ 76 203 244 56 342 41 -80 -56 -67 -106 58 -69 309 193 -59 216 215 -124 14 -106 -65 82 -162 134
3501A34o1O1r8J29j24J23j41L0j88J43L05m80J97K61l23J66n2K44m09J17J40o4
$$ 134 73 134 36 165 41 164 23 53 -135 8 313 -167 30 291 -32 134 82 326 -83 34 174 110
3523A10j28K25j08O3j05R1K7n46Q5J29k6J42l27M34J35j82j31K4K1m3P5k02O1
$$ 110 -18 207 99 162 57 148 175 -371 -286 -157 -183 -41 -368 66 201 19 -112 -88 -67 -110 -35 -237 -176
3546a76m8J81J72l09J3L70k48K19m10j54M7L06k61K91J7n9L1j30J58k1k58J93
$$ -176 -224 -43 129 -180 -167 203 -45 174 -236 -390 -343 -37 -298 -7 10 -49 -18 -148 10 -11 -269 -76
3568g6l8k5L32l09J34k62K58L7p0J33R0l86J57l8K33p7k07M48l10j22N20l64K09
$$ -76 -114 -139 193 -116 18 -244 14 51 -19 114 204 -182 -25 -63 170 93 -114 334 24 -98 422 58 267
3591B67j67P8pk52jL75m05J38j07K32k70J2K30J03j01N8j53j19J53J13k74n4M9
$$ 267 100 178 171 -81 -82 293 -112 26 -81 151 -119 -107 123 226 125 183 30 -89 64 177 -97 -151 -102
3614a02l43N52m5j60o7p7M58l35J84%k5K12m3j14p8J08j13R3k01j0M9m7K14l97
$$ -102 -445 107 62 -98 -165 -242 216 -119 65 65 40 252 209 95 17 125 12 105 -96 -106 -57 -104 110 -287
3638b87J43J53k31L21r5Q7J47k64j32J3RK14j2l7J30k44j0J72k37K61J29k82j0
$$ -287 -144 9 -222 99 4 91 238 -26 -158 -145 -136 78 66 29 159 -85 -95 77 -160 101 230 -52 -62
3661f2m12M02j08L22m90L91j44R7J33k9J82k08L01l09j09J41J14m40M86j63O1
$$ -62 -474 -72 -180 142 -348 43 -101 -4 129 100 282 74 375 66 -43 98 212 -228 258 95 156
3682A56J09k85J53j60J84k49L01j59o1k87J93R4P4k35J87KO3r8Q6K58n70R9M0
$$ 156 265 -20 133 -27 157 -92 209 50 -11 -298 -105 -11 63 -172 15 17 80 -18 68 326 -244 -145 -105
3705a05K63N2m65J85k62K02j15J81M2o3J22m9j79K20M1k63j06M03l7N3l69J59
$$ -105 158 210 -255 -70 -332 -130 -245 -64 -22 -85 37 -12 -191 29 70 -193 -299 104 67 120 -249 -90
3727i0P9P3j8o5k3J26q5j2J08j84K68k51p6K09l38L05j17Nj2L3K62j45p8k59L70
$$ -90 -11 62 44 -21 -44 82 -3 -15 93 -91 177 -74 -150 59 -279 26 -91 -86 -98 -65 197 52 -26 -285 85
3752H5l62L89q8L6j8M2j73M57j76l4j12K02m3P9l73M16j88k63K37k15m4J80ML06
$$ 85 -277 112 24 60 42 84 -89 368 192 158 46 248 205 284 -89 327 139 -124 113 -102 -146 34 38 344
3776C44l72j54J55L2K3k30l3K37KR9n0k75N29j69j85kk96L28O4j53MM85k15r6
$$ 344 -28 -182 -27 5 28 -202 -235 2 4 103 53 -222 307 138 -47 -49 -345 -17 47 -106 -102 383 168 72
3800G2r4J67q9o7K56l19N8p4k59L21J25j84J54j29J55p3K23k90J48l66J77N5J04
$$ 72 -22 145 56 -11 245 -74 -16 -90 -349 -28 97 -87 67 -62 93 20 243 -47 101 -265 -88 -33 71
3823G1J07l05j72N94l36K3J05j73R8l7J2j21K20j90J17k10J94k97L35K0k79K99
$$ 71 178 -127 -299 295 -41 -18 87 -86 12 -25 -13 -134 86 -104 13 -197 -3 -300 35 55 -224 75
3845G5J69k05J00l96P9M03k80K90L3m45K69k9l9k03L94k76J87j5m4j35K39j32
$$ 75 244 39 139 -257 -178 225 -55 235 268 -177 92 63 24 -179 215 -61 126 111 67 -68 171 39
3867C9P6q9j70L20L2k68p5L56l42K21K2j63L10j13M6k68R6o4J69p5l5J22l14L73
$$ 39 115 26 -144 176 208 -60 -135 221 -121 100 122 -41 269 156 202 -66 30 -34 135 60 25 147 -167 206
3891B06j97j64j4J97K07l99M8p9j01L19N4k43N9J80k19K14m8Qk25L73k32J3N1
$$ 206 9 -155 -169 28 235 -164 -116 -195 -296 23 77 -166 -107 73 -146 68 20 28 -197 176 -56 -43 8
3914Hj56j19K87m8j4j58L12j88J79k7J7k08j00J90j98M2J82j7L1N2j54O5J95m4
$$ 8 -148 -267 20 -28 -42 -200 112 -76 103 76 93 -115 -215 -25 -223 -181 1 -16 15 67 -87 -22 173 129
3938A29o7p7M0r6L58k28l7j18K57k12K13J4j12J01n1N7R2l86K51l5j17J97j21
$$ 129 62 -15 25 -71 287 59 22 -96 161 -51 162 176 64 165 114 171 263 -123 128 93 -24 173 52
3961E2l06O48k51j37J48j54mL3k8j71J52p2K08m58N02k90J59m5j65J56q7L0J65
$$ 52 -254 394 143 6 154 0 -4 29 1 -170 -18 -90 118 -340 162 -128 31 -14 -179 -23 -110 -80 85
3984H5j84j27M61j40j97j04J75L35l57p8J97j07J22j77L28k44m5O6j18j87J98
$$ 85 -99 -226 235 95 -102 -206 -31 304 -53 -131 66 -41 81 -96 232 -12 -57 9 -109 -296 -98
4005i8p0K58n7l57O1k85J62N06O6m17K66j36M5p2K00j70j09J6L14k58K03Q5n5
$$ -98 -168 90 33 -324 -263 -548 -386 120 186 -231 35 -101 -56 -128 72 -98 -207 -191 123 -135 68 153 98
4028I8j06O07p04J17o4j08K01R0p7J89j00k11J97ok29J81K4K1k25K03J9k6j51
$$ 98 -8 599 -105 12 -52 -160 41 131 54 243 143 -68 129 123 -106 75 99 120 -105 98 117 91 -60
4051f0j34K68M38n11j58L54L0k73Q9Qm6r5R4m6k20L40j08K51k78j02K87J30n37
$$ -60 -194 74 512 1 -157 197 227 -46 43 51 5 -90 4 -42 -262 78 -30 221 -57 -159 128 258 -279
4074b79M08j86J70p6j52k30O8L13j26On3K63j50Kn8N8q8J23k01M50l61L10l57
$$ -279 129 -57 113 37 -115 -345 -277 36 -90 -84 -137 126 -24 -22 -80 -22 -110 13 -188 262 -99 211 -146
4097a46K51j56j16L8j7N6k05J90j40L91j96J70j64r3K30j30J60L30m48qK80m98
$$ -146 105 -51 -167 -129 -146 -90 -295 -105 -245 146 -50 120 -44 -137 93 -37 123 453 5 -3 277 -221
4119b21M27j19K16k16q6l5j0k04J73j05J05J33r7p2N7K88n24N36j87o0K53j83
$$ -221 206 87 303 87 1 -34 -44 -248 -75 -180 -75 58 -39 -111 -54 234 -290 246 59 -1 252 69
4141F9J09j27k44M84k57j6j4j70L03J0n0j90rL58l68l0R1J04K6K0j03o9j82M20
$$ 69 178 51 -193 291 34 18 4 -166 137 147 97 -93 -102 256 -112 -142 -51 53 79 99 -4 -73 -255 165
4165A65k28J02k31K37M9j64l8R5L67k24j79R3P2j44l92M55L8j98J0J16l66O86
$$ 165 -63 39 -192 45 94 -70 -108 -13 354 130 -49 44 116 -28 -420 35 73 -125 -115 1 -365 321
4187C21j21l87J77O4J15k23L7K10l9L4j37l38K72J58k38K7J92j14k46L12m3j87
$$ 321 200 -187 -10 54 169 -54 -17 193 154 188 51 -287 -15 143 -95 -68 124 10 -236 76 33 -154
4209a54L70k63O1k74M91k05J08N7q3J63l3k10k06J06J21o0J4M81n66J16n5LK94
$$ -154 216 -47 14 -260 231 26 134 191 108 271 238 28 -178 -72 49 -11 3 484 -82 34 -21 -18 276
4232B76l37n6m1J22K9J00L7j23K30m7k04L3J28j1j63qJ20k12LJ33k6j50J7Q6J49
$$ 276 -61 -117 -158 -36 -7 93 130 7 237 190 -14 19 147 136 -27 -35 85 -127 -124 9 -17 -167 -150 -64 85
4257H5nl29K56k48K44k37R5L9l1p4j4K66J9k78J39l1j59L72l07K10J78j61k2J3
$$ 85 80 -249 7 -241 3 -234 -139 -100 -131 -205 -219 47 66 -212 -73 -104 -263 109 -198 12 190 29 7 20
4281B0JQ3r0j30J2J10J27M6l00J83j58J45p2N9J23j76n8K26L3l61K78l15OK41
$$ 20 21 104 14 -116 -104 6 133 179 -121 62 -96 49 -23 36 159 -17 -75 151 184 -177 101 -214 -208 33
4305C3k14J50J33rj14j66O3K76j58L56o0l29J1M6k2K55j97J37p7p7Q2k83K25L2
$$ 33 -181 -31 102 93 -21 -187 -124 152 -6 350 290 -39 -28 18 -4 251 54 191 114 37 119 -164 61 93
4329I3l44J26J57J54P7m72K26j36p3K26Q2m56J89J48k00p4Q4N8j25o6K86J15k25
$$ 93 -251 -125 32 186 263 -209 17 -119 -192 34 116 -340 -151 -3 -203 -277 -193 -135 -260 -326 -40 75 -150
4352a50L19m59M18r8oJ49k77j8j7J76J28k52K05pJ9l32j2L48j54Qm1O6N3M0L2
$$ -150 169 -290 128 30 24 173 -104 -122 -139 37 165 -87 118 111 130 -202 -214 134 -20 -12 -53 13 66 106 138
4377A38k81qo6J25K90L7j41J7l9j95M42k91r0N3j19K85l91K38K21j21L6j52R5
$$ 138 -143 -151 -217 -92 198 235 94 111 72 -123 319 28 -62 -9 -128 157 -234 4 225 104 140 -12 83
4400H3Pj03K37J06l54o3J53m2k2N1N5l09Q6Q1J00J91j82j30J5K70m07N23m24J4
$$ 83 90 -13 224 330 -24 -87 66 24 2 53 108 -201 -115 -34 66 257 75 -55 -40 230 -177 346 -78 -64
4424f4J03p9J17j45K11k18K07o3q8j86K46l09j58K39K79m4J09l03r6K50kj08k29
$$ -64 39 -40 77 -68 143 -75 132 69 -19 -205 41 -268 -426 -187 92 48 157 -146 -242 8 6 -102 -331
4447c31JL56J05l50K55k15O2j17rN7J87O2j29j42k0L23o5j51o1J75J57k05o5m8
$$ -331 -330 26 131 -219 36 -179 -117 -234 -243 -186 1 63 -66 -208 -228 95 30 -121 -182 -7 150 -55 -120 -168
4471a68J11J63l51J32J89j88J86o9q6K26k25O8J94k34J13k23j3J53R5RL5o9Q3
$$ -168 -57 106 -245 -113 76 -112 74 5 -81 145 -80 -12 182 -52 61 -162 -175 -22 73 82 117 48 131
4494A31k07J73M6j91J06J3q1K13k19J68K43j82j60o5J79j09K70k83J65k71J7K27
$$ 131 -76 97 143 -48 58 71 -10 203 -16 152 395 213 53 -12 167 58 328 45 210 -61 -44 183
4516A83k34l05K71k49K82Q8j97j23L42J5j68L1Q9j4l08K28J7N0k8j31O2K49j74
$$ 183 -51 -356 -85 -334 -52 36 -161 -284 58 73 -95 -64 25 11 -297 -69 -52 -2 -30 -161 -99 150 -24
4539b4q2K29j74P9q6J66j30Nj16J95j28L7KK20l27k1j9k3J92l66J02L29o7J32
$$ -24 -106 123 -51 28 -58 108 -22 -17 -133 62 -66 -29 -27 193 -134 -155 -174 -197 -5 -371 -269 60 -7 125
4563A25l1O4l5l84K53k4J74p6K62l35J75k96Q2K63l05L29j93r6L01m05M42k08
$$ 125 94 158 123 -261 -8 -32 142 66 328 -7 168 -128 -46 217 -88 241 48 -48 253 -152 290 82
4585H2l77J60K30j61J12n1J47j53j6p3P1K00j10k11J22O5K15k88J12k51J52k53
$$ 82 -295 -135 95 -66 46 -5 142 -11 -27 -100 -29 171 61 -150 -28 37 252 -36 76 -175 -23 -276
4607b76M02j61j22J24J85m76L69j31k1J31k53L31l28N30l79J75j19J33m20Q1K61
$$ -276 126 -35 -157 -33 152 -324 45 -86 -107 24 -229 102 -226 304 -75 100 -19 114 -306 -225 36
4628C6l35K08L1M3j18K4m8N7K9P4J3J73m21J20K93q4n0j19k1O1J05o3j53K41j52
$$ 36 -299 -91 -60 -17 -135 -111 -159 -102 -73 1 14 187 -234 -114 179 95 45 -74 -95 -34 71 8 -145 96 -56
4653e6J54k59K71l31P2K07p1K44k18j72o5M43j86L4j02n7J66K65q9k7n4j67J92
$$ -56 98 -161 110 -221 -149 58 -13 231 13 -159 -224 219 33 67 -35 -92 74 339 250 223 169 2 194
4676A94j90k14J90L06o6k95j9L28j72o2N4k71L39j01O2K15m64J35l7p0L21j98
$$ 194 4 -210 -20 286 220 -75 -94 234 62 0 54 -217 122 21 83 298 -166 -31 -68 -138 183 -15
4698a5n1J95j37L7J37l72R2M44l23J3j37m0J22k94O98n81PJ77J15r7j2o5Q5j15
$$ -15 -66 129 -8 29 166 -206 -114 330 7 20 -117 -157 -35 -329 369 -212 -205 -28 87 -10 -22 -87 -2 -117
4722a17j51K29QJ66j22j25K06k00L4J66j80o9K10p7K9kj66L12l88J76K22k29M90
$$ -117 -268 -39 -31 135 13 -112 94 -106 -72 94 -86 -155 55 -22 7 5 -161 151 -237 -61 161 -68 422
4745D22m70O7O5l24O04k89J14k62L40j81L0J06j37k24K83k3j18k65K53O7JP4N
$$ 422 -48 19 84 -240 364 75 189 -73 267 86 116 222 85 -139 144 121 3 -262 -9 58 59 133 138
4768A38k6K1O3k47J64j25p7P0p3L58l77P7J1O4l0j89M14j43n0k52N8M88l38o0
$$ 138 112 133 196 -51 113 -12 -89 -19 -92 266 -111 -34 -23 41 11 -178 236 93 43 -209 -151 337 -1 -61
4792f1L0j39K72j41Q0O0k09J16L7m8r8K73k57l4O5L0l7R7j5K44l49j4p4N5J83
$$ -61 -31 -170 102 -39 41 101 -108 8 45 -3 -101 172 -85 -119 -54 -24 -61 36 21 265 -84 -98 -172 -117 66
4817F6M2l19nK18J7j90J17M77m18k26J89p0%l8J89l26O55j59k43K05j13o7j5M0
$$ 66 108 -211 -216 2 19 -171 -54 423 5 -221 -32 -102 -102 -140 49 -277 378 219 -24 181 68 1 -14 26
4841B6j25k09K65j94K35j91K14M6j34L52l6l83K84r9k47K62Nl13L10J12r6p4P0
$$ 26 -99 -308 -43 -237 -2 -193 21 67 -67 285 249 -134 150 51 -196 66 71 -242 68 180 84 10 80
4864H0j05K9Q8J56n7l26K90k81m2n0K86K18k68J7K5k00L1J78k56r2L49o5R9j32
$$ 80 -25 4 92 248 191 -135 155 -126 -168 -218 68 286 18 35 60 -140 -109 69 -187 -279 70 5 104 -28
4888b8J70l55o0L19j45Q2k5J3J22j05Q3j92nQJ76j35K24k23L7K89k81M0K3K29
$$ -28 142 -213 -273 46 -99 -17 -42 -29 93 -12 71 -121 -126 -118 58 -77 147 -76 -39 250 -31 9 32 261
4912B61k49k92j4M48k08K4K77j90n9O3J8pj95N4L3l9n0O6J24R8l5j81K85j41P0
$$ 261 12 -280 -294 154 -54 -30 247 57 -2 61 79 72 -123 -69 -36 -75 -125 -59 65 163 128 -53 232 91 161
4937A61k3p8nK1j46K56k22k10M58j99K08l36N4R6j87J79L3l12N62j48j78M8K6
$$ 161 138 60 55 76 -70 186 -36 -246 212 13 221 -115 -61 35 -152 27 60 -252 310 162 -16 32 58
4960E8q4K9k4j00Q0o0K10j68J50k24Q6R4l62K99J41k24J37J8l7L07o92QL47o3
$$ 58 -26 3 -21 -121 -41 -101 109 -59 91 -133 -47 47 -315 -16 125 -99 38 56 19 326 -366 -358 -11 -74
4984g4J13j15j25J22LJ3k6l9j78K45k3k7pm0L74l01l0mM4n0k7P2p5L8K01m19K29
$$ -74 39 -76 -201 -79 -76 -63 -89 -128 -306 -61 -84 -111 -118 -158 216 -85 -115 -119 -75 -125 -152 -80 -155 -117 84 -335 -106
5011a06j1n1O0K79j97M1K65m90L40K4j29JJ08j08J10j17L29m55o5J50m9L46k62
$$ -106 -117 -168 -108 171 -26 15 280 -210 130 154 25 26 134 26 136 19 348 -107 -172 -22 -71 275 13
5034A3J69j56J1J10k97M37j45l6j31Q1j88L2K70N3j22j84K13K47l25J50R4k53
$$ 13 182 26 37 147 -150 287 142 106 -25 56 -132 -100 170 223 101 -83 130 377 52 202 296 43
5056D3n3J52l3K50p8l69L50m55M21m14J13Q5Q8j18K06J33j26p40M73j28j21L70
$$ 43 -10 142 109 359 281 -88 262 -193 228 -186 -73 12 100 -18 188 321 195 -545 -72 -200 -321 49
5078D9p4k02M39j61j94k4J81J9Pj42j1J68r7j18J28L7MK96j37j21l8o1l09M67
$$ 49 -25 -227 212 51 -143 -167 14 33 40 -102 -113 55 -42 -160 -32 5 9 305 168 47 9 -52 -361 106
5102A06j02n5O5l6J28j3O6l55J51Q9j43L14p5j2k70L84Qn07K98L59m59L4R5k9
$$ 106 4 -51 14 -22 106 93 159 -196 -45 44 -99 215 140 128 -142 242 250 -257 41 400 -59 -25 70 41
5126D1j7M7k74J14N8rL59l25L97p93O29l02J86K8j22j05j51P9M41l05J33l3j24
$$ 41 24 71 -203 -89 -31 -40 319 -6 391 -402 227 -75 111 139 17 -88 -239 -160 281 -24 109 76 -48
5149d8J23L1j14J58l8l80N21k46j95J10J73k09J00J19l41J36j53M60l51J97p8
$$ -48 75 106 -8 150 112 -268 253 7 -188 -78 95 -114 -14 105 -236 -100 -253 207 -144 53 -25
5170b5j29M07k62J8j56J60Q2M9j23L3l1l7p9l8q1j1J01K29j13j37N11n44OJ29
$$ -25 -154 253 -9 9 -147 13 95 144 21 54 23 -14 -93 -131 -212 -223 -122 107 -6 -143 368 -176 -170 -41
5194d1Lj45P5K91p8k68L45N1k78k5k7N1K54j05k23K19R9j60J00j67M4J51q4J98
$$ -41 -38 -183 -108 183 105 -163 182 233 -45 -70 -97 -46 208 103 -120 99 198 38 138 -29 15 166 82 280
5218B80k99O8Q0O4k77j1M8J71k17L40p4m85K67r9J55J52j14q7L85m55J30m5l2
$$ 280 -19 49 129 193 -84 -95 -47 124 -93 247 173 -312 -45 -144 11 163 49 -38 347 -108 22 -23 -55
5241e5L69l28K47j54j83Q7r9J88k92P2L96o94L74J13J2j65p3k60M63N5K6K19k28
$$ -55 314 -14 233 79 -104 -17 -116 72 -220 -148 248 -446 -72 41 53 -112 -185 -445 18 73 99 318 90
5264I0k03n6J2J93q6j7l1M25o08K61P3m8R9r6q2M02m38J42j43N8L1r1K51m16J47
$$ 90 -113 -169 -157 36 -50 -67 -98 327 -281 -20 53 5 104 8 -74 328 -110 32 -111 -53 -22 -113 138 -278 -131
5289a31K56lj30p9J52R7p5j00o1K15k3j29k7KK19j62J31q3J27r7p4P9k13J85J1
$$ -131 125 122 -8 -87 65 162 87 -13 -74 141 118 -11 -38 -36 183 21 152 69 196 99 25 104 -109 76 87
5314H7j35O2J83l40J34RJ5L6Q7r4R9m30L64l59L73j59Q7m6q3J40m5J40m73M12
$$ 87 -48 14 197 -143 -9 0 15 51 138 44 143 -287 77 -282 91 -68 19 -27 -110 30 -15 125 -348 64
5338F4j29o3M71m87Q6Q0k68L08k90R7J06j23j68O3M8K30j45k0K44j85k3K60j13
$$ 64 -65 -128 343 -144 -58 22 -246 62 -228 -131 -25 -148 -316 -253 -205 25 -120 -140 104 -81 -104 156 43
5361D3oj26k1N0l6j66J06J78l7Nk08K04o5J75q7j69M1J80o7L12l28K31j30rj66
$$ 43 37 -89 -110 -60 -96 -262 -156 22 -15 -10 -218 -14 -79 96 9 -160 -119 61 -6 306 -22 209 79 70 -96
5386i6J43j85K87k47Q8o2L78j34l48L67k63J83J04l40J22J35k06J96%k01J21r8
$$ -96 47 -138 149 -98 -10 -72 306 172 -176 191 -72 111 215 -125 -3 132 -74 122 122 -79 42 -56
5408e6j14L59j87k21M31l07J1K90p8o8k0L3R5j16m6L9o5mj63L91j33j98K21k99
$$ -56 -170 189 2 -219 212 -95 -84 206 128 60 40 73 168 52 6 45 -20 -24 -187 204 71 -127 94 -205
5432b05J12j05J23j5M0j4L9l2K2K7j19q5J98o8j7J08J4q7J8j14J70j88L53k57
$$ -205 -93 -198 -75 -90 -50 -64 -25 -57 -35 -8 -127 -212 -14 -82 -99 9 23 -64 -46 -160 10 -178 175 -82
5456h2r8L22n03L98m34N4L01P9j65M4J3J79L06j82k81j21K02K4j94J15J88m2j78
$$ -82 -180 142 -361 37 -397 -343 -42 37 -128 -84 -71 108 414 232 -49 -170 32 56 -138 -23 165 123 -55
5479e5L9M1m42M87j73O1O0J4m2R6R1k84J80o5J0l03J87J8J44n2J6j84J71J4j35
$$ -55 -16 25 -417 70 -103 -42 18 32 -10 86 177 -107 73 8 18 -285 -98 -80 64 12 28 -156 15 29 -106
5504a06mQ4j20J03P0k2N6J81n16Q9J38N2K34j33K68k83j56K13k02j14M4p6J05
$$ -106 -110 -26 -146 -43 27 5 61 242 -274 -185 -47 5 239 106 374 91 -65 148 -54 -168 -124 -200 -95
5527i5J12j24j16J29jN7o8K1j6K06r6j13r6M00k06P0j97K38JJ5l73J32j4J61M5
$$ -95 17 -107 -223 -94 -95 -38 -106 -85 -101 105 9 -104 -200 200 -6 64 -133 105 106 121 -252 -120 -134 27 72
5552G2J1j27m9j13L21j96J97j95K2J06m7k1k7JK98l72L48j8l40M35m21RJ22Q5
$$ 72 83 -44 -93 -206 115 -81 116 -79 -57 49 2 -19 -46 -45 253 -119 229 211 -129 306 -115 -106 16 101
5576A01J0Qj0n2R3n3j33J72k61K58j52O2j09j47j2j5KK98qj66L92k68j30K47J6
$$ 101 111 119 109 57 150 97 -36 136 -125 133 -19 43 -66 -213 -225 -240 -238 60 52 -114 278 10 -120 127 143
5601A43Jk55K66k39q7J52l5J71k65J70K7J45m6j85J29l28L80k17J42k45K34n9
$$ 143 144 -111 155 -84 -171 -19 -54 117 -148 22 49 194 148 -37 92 -236 144 -73 69 -176 58 -1
5623aj88J04j21K52j18j40O1k3Q0j29M52j72j88L33k63kR3M4j72J65K5K31k46
$$ -1 -189 -85 -206 46 -72 -212 -151 -174 -94 -223 229 57 -131 202 -61 -63 30 74 -98 67 92 323 77
5646G7j18L2j15J62K78l18K23k76K12k64O0J83l10L13J6J24m71K41j87J48K8o2
$$ 77 -41 -9 -124 38 316 -2 221 -55 157 -107 -47 136 -174 139 155 279 -192 49 -138 10 38 -24
5668b4L69j45r2p9k09q0L67j12Kj3J82j31L79p8l91M7k8j0k5P8K06J67l79m05
$$ -24 345 200 108 29 -180 -260 107 -5 -3 -16 166 35 414 336 -55 -8 -36 -46 -71 7 213 380 1 -404
5692d04N59p6j70j42O05k95L8l02L47l29m3j5P3q1j40M32pj61J55j37K14j22k08
$$ -404 155 79 -91 -233 372 77 115 -187 160 -169 -212 -227 -154 -235 -375 57 50 -111 44 -93 121 -1 -209
5715b09L19p1n4l6J49j10j60K20K4j17P4r0P0j27J37o2M1K36k84K37k22K58o9
$$ -209 110 39 -15 -51 98 -12 -172 48 72 -45 29 -61 9 -118 19 -43 -2 234 -50 187 -35 223 154
5738A54Q6l92L67j83j77N74o80L79J6k93j3K33q6qq5L30l02K27k83O9M4k6j48
$$ 154 240 -152 215 32 -145 429 -251 128 144 -149 -162 71 -15 -23 -108 222 -80 147 -136 -67 -23 -49 -197
5761a97O3J39j71M08k18j10lj3L97k59j73J07K3p1J26k15J25L43m54K88m38K24
$$ -197 -134 5 -166 242 24 -86 -89 -102 295 36 -137 -30 -7 -78 48 -167 -42 301 -153 135 -303 -79
5783g9J06k17J24K8m2J82k94J72R3Km7j28n3J50k5J04k6m50L91J77m32R5J76n5
$$ -79 27 -190 -66 -38 -80 102 -192 -20 73 75 28 -100 -153 -3 -28 76 50 -400 -9 168 -264 -169 7 -48
5807d8j37q4J54L27k91L2j77J49m9J04N8l43L77K2k47L19k64N1l16K88J82j42
$$ -48 -185 -269 -115 212 -79 -47 -224 -75 -124 -20 38 -305 72 94 -153 166 -98 -47 -363 -75 107 -35
5829c5K51k80K02j6j49J44k59J4K53J1o4j01k3P7J48J25l96N4J23k07J19N1m3
$$ -35 216 -64 138 122 -27 117 -142 -128 125 136 72 -29 -52 25 173 298 -98 -44 79 -128 -9 42 -1
5852aK13o0p9j53L12k41k12L20k68L71k22j95j18K56J66k92M49k23m02M04K3p9
$$ -1 212 152 73 -80 232 -9 -221 99 -169 202 -20 -215 -333 -77 89 -203 246 23 -379 25 48 -31
5874c1l8rJ38k17M29k61QJ61J32l92j2j30J27J62k12J91Jl02M31k08q3j5M3K4
$$ -31 -69 -78 60 -157 272 11 19 180 312 -80 -92 -222 -95 67 -145 46 47 -255 176 -32 -115 -130 -87 -63
5898f3R4q8r0J26k50K42M8J8J79k27q4l3J12O2l05N4k1K30K28k11j58K34k11p
$$ -63 31 -57 -147 -21 -271 -29 19 37 216 -11 -95 -128 -16 46 -259 -205 -226 4 232 21 -137 97 -114 -121
5922a21j62J43J89j9m9R0r0J41P1J9J4m41L03K06m34J89j63K00J67l53J22l3J63
$$ -121 -283 -140 49 30 -19 71 -19 122 193 212 226 -215 88 294 -140 49 -114 86 253 -100 22 -11 152
5945A52O8k5q4j53K77k40j95J28J95j55l1L5n1M0L45m21K44j08k07J56j58K56
$$ 152 220 195 111 -42 235 -5 -200 -72 123 -32 -63 -28 -79 -39 306 -115 129 21 -186 -30 -188 68
5967F8J3o0j17J63n2N2K43k96Q9k22j33O1L54j55pk22L74m20L45n7l62M97j61
$$ 68 81 21 -96 67 15 67 310 14 103 -119 -252 -191 163 8 1 -221 153 -267 78 21 -341 156 -5
5990ek37M43k16p7o0J20p5j51K72L9pJ93O1l87L33j01j30K0j31P2jM7L2J4O7L
$$ -5 -242 201 -15 -92 -152 -32 -107 -258 14 53 46 239 300 -87 246 145 15 35 -96 -24 -25 22 54 68 135 138
6016A38l15L74j35j60L72j98J09k76R4K76k29r9K07j83PJ45j96J77j63K7J29n5
$$ 138 -177 197 62 -98 274 76 185 -91 3 279 50 -49 158 -25 -18 127 -69 108 -55 -28 101 46
6038D6r4lM3j48J78m1j01J69N7j10O3q4j32J67j41J33l9k62J50J57R2N9j68J61
$$ 46 -48 -51 -8 -156 22 -19 -120 49 106 -4 59 -25 -157 10 -131 2 -37 -299 -149 8 100 159 -9 152
6062A52l48jJ27K66m51Q4j8J26j02n7K67j46K37m3N5k13Q8j54o0J71L9qmJ90m32
$$ 152 -196 -197 -70 196 -255 -171 -189 -63 -165 -222 45 -101 136 93 148 -65 23 -131 -191 -20 19 11 7 197 -235
6087b35L15J00k54J68o6Q8l8k31N4j01M09q9p9m1j27L2l3M8L36k11r5J65O0n11
$$ -235 80 180 -74 94 28 116 78 -153 -99 -200 209 120 41 0 -127 -95 -128 -80 256 45 -50 115 175 -336
6111c36M40J23o6j90j42M50j80k28J65O1p4j62J82J08j63J68K32l88O2M2M8j40
$$ -336 104 227 161 -29 -171 279 99 -129 36 97 23 -139 43 151 -12 156 388 0 62 104 152 12
6133A2K90j66o0k00j24L64j59L25j01j30k6j40J08J77R4k09o3J42j50j71J63J09
$$ 12 302 136 76 -124 -248 116 -43 282 181 51 25 -115 -7 170 264 55 -8 134 -16 -187 -24 85
6155H5k44P5K7J7L5j3J06k98J90j05J6J93kk14l9J53L50l39l06L48j84J17j73
$$ 85 -159 -84 -57 -40 -5 -18 88 -210 -20 -125 -109 84 82 -132 -171 -18 332 -7 -313 35 -149 -32 -205
6178b05J24J38k08M53l33P1k90J3J05L67k79j66K21j17L49l42K73l21J03O6m0
$$ -205 -81 57 -151 302 -31 40 -250 -237 -132 235 -44 -210 11 -106 243 -99 174 -147 -44 22 -18
6199a8M13m02J31q6pJ87j91j13Q4N8n4R1j58J65Q1j54K2j15P7J70m53K59K75l50
$$ -18 395 -7 124 38 31 218 27 -86 -2 56 2 93 -65 100 181 27 49 -66 11 181 -272 -13 262 -88
6223h8L03m5m71Q3J76J36M2r2q2J22k9P3j83j05J89j68K66k44K2K10m12K02M76
$$ -88 215 170 -301 -218 -42 94 136 44 -38 84 55 128 -55 -160 29 -139 127 -117 -95 115 -297 -95 381
6246C81l85j16J46j32O4j15J46j03j07N0Q7mqJ13r2J07n0J52j62M7k83J14O3M3
$$ 381 -4 -120 26 -106 -42 -157 -11 -114 -221 -171 -84 -88 -96 17 -75 32 -18 134 -28 19 -264 -150 -87 -44
6270d4o7j89M28k38O9J30oL4O3j09j07N8j08J66Q0k40R0K5K15j82p2Q3J63l7l04
$$ -44 -111 -300 128 -110 -41 89 83 117 180 71 -36 22 -86 80 160 -80 10 35 250 68 -4 79 242 205 -99
6295i9R4m5J53j17P0K23m9m58L37k99o6K48r4J62k3o4k38L33l37L54k12P5j50
$$ -99 -5 -50 103 -14 56 279 230 -228 109 -190 -256 -8 -102 60 37 -27 -265 68 -269 85 -127 -52 -202
6318b02M5J37K2j07K05j51K56K0k67j81K25j7o8j21L52p6n4j36K89k88J05l0j0
$$ -202 -157 -20 2 -105 100 -51 205 225 -42 -223 2 -15 -83 -204 148 72 18 -118 171 -117 -12 -42 -52
6341e2r1k37J25L74k16M7Q8j89J36k50K96j65m2j33K23K8R6P6l50J93jJ31j67
$$ -52 -143 -380 -255 119 -97 -50 38 -151 -15 -265 31 -134 -176 -309 -86 -58 38 114 -236 -43 -44 87 -80
6364h0k29K65N2J57k91j55O4l08M09j7M5l1N9K47l22K89k36lq6J59l0P5K12q7
$$ -80 -309 -44 8 165 -126 -281 -217 -525 -116 -133 -88 -119 -60 187 -135 154 -82 -85 -171 -12 -42 33 245 158
6388A58L5n5J39k63L15l41K0J75l38M24k20lQ1k44K05j73K16J97j75j29j09j37
$$ 158 193 138 277 14 329 -12 8 183 -155 269 49 46 127 -117 88 -85 131 328 153 24 -85 -222
6410b22K59J0q2J40j93j3J78Qk2K33l46o1k32K03K38J71k0j72j90M0n7J56n8J7
$$ -222 37 47 -35 105 -88 -101 77 85 63 296 -50 -111 -343 -140 98 269 249 77 -113 -73 -130 26 -32 -15
6434a5J20j3q9J01j1r3o9K39q9K52n10Q9p1M7J3K9p0N2J37n3q1r1m1J23K73j15
$$ -15 105 92 3 104 93 0 -69 170 81 333 -177 -88 -159 -112 -99 -70 -140 -88 49 -4 -85 -176 -217 -94 179 64
6460F4O1p6j94J42J78j85O9j57Q7M57k74r0J45o4p4m3j24%K16N3l64L30j63J0
$$ 64 125 49 -145 -3 175 -10 59 -98 -11 446 172 82 227 163 89 46 -78 -78 138 191 -173 157 -6 4
6484Dk7q4K21j50n4J30O9M1l83L88j54M5K79m75R3K21l33J93m5K63k35m7jJ5J20
$$ 4 -23 -107 114 -36 -90 40 109 150 -233 155 1 46 325 -150 -57 164 -169 24 -21 242 7 -40 -41 -26 94
6509I4l05J53L44m88M14j24k15M1J14o4r6K45k02J05P7r0m6J57j08M0j06L08l68
$$ 94 -211 -58 286 -202 212 88 -127 -86 28 -36 -132 113 -89 16 93 3 -43 114 6 46 -60 248 -120
6532a20M14l10P6p4R9j86pK54j63J28l26M06n4J16j02r1R3k27J8N2k1R0J38j97
$$ -120 294 -16 60 -14 85 -101 -108 146 -17 111 -215 191 137 253 151 60 153 -74 -56 -4 -25 65 203 6
6556FJ1J25n96M75K36k73J12k39J30J46R6k56L12j06kJ2n4J27n30K28K04o0k0
$$ 6 17 142 -454 21 257 -16 96 -143 -13 133 229 -27 285 179 177 189 135 262 -268 -40 164 104 84
6579H4j1j62j2j63J16M18l58J55o0J8J02j72J1r9L22J70k69o6Q4j40k07K05L2
$$ 84 73 -89 -101 -264 -148 270 -88 67 7 25 127 -45 -34 -133 189 359 90 24 108 -32 -239 -34 -2
6602bQ6l78K5J98k3L4K14k73qn0o2L83j44J38r7J20j1j26j68L61k13M0K64l1l52
$$ -2 84 -294 -269 -71 -94 -60 154 -119 -127 -177 -239 144 0 138 41 161 150 24 -144 217 4 44 308 277 -75
6627g5J32j87J53J27j72M5N0j43J88k43J76P9j47M6k5P1J87j79n0j73L00k77J6
$$ -75 57 -130 23 150 -22 23 73 -70 118 -125 51 130 -17 29 4 75 262 83 33 -140 160 -117 -101
6650a01L72l14j80K76q9j11K74k30O1J58m50L26j92M48k40J56r6j91O2j07L72
$$ -101 271 -43 -223 53 -36 -147 127 -103 -42 116 -334 -8 -200 248 8 164 68 -123 -61 -168 204
6671B04lj56M8j66K02j7Kl10J44Or4O9K05r7k08J02J3O1p8Q2J36j76o3l4J84j6
$$ 204 201 45 93 -73 129 112 114 -196 -52 -46 -140 -71 134 37 -171 -69 -56 5 -73 9 145 -31 -94 -128 56 40
6697D0j83J51O6J46k23J7K7k8j40L16k37J70k20K22m4l2k16K06K65k50r6m3OK5
$$ 40 -143 8 74 220 -3 14 41 13 -127 189 -48 122 -98 124 80 48 -168 38 303 53 -43 -86 -80 -55
6721e5L0P1N2m6K4lJ01k79Q0K66j70J56j35Pj37P6o9R0l64L00L23m00Q1L83l69
$$ -55 -25 46 98 52 76 73 174 -105 -25 241 71 227 92 99 -38 38 -31 59 -305 -5 318 -82 -1 382 13
6746A3k28l8K66J10n0r9J01N1k03M8J0j58N25m18mK2L65j70o2q3n3P9l62N41r1
$$ 13 -215 -253 13 123 73 -26 75 126 -77 -29 -19 -177 348 -70 -74 -52 313 143 81 -2 -55 24 -338 203 112
6771A12J00l82K06j04k59K91k08K37Q1j93J66k14o5L01j74%J31J62k45j98J78
$$ 112 212 -170 36 -68 -327 -36 -244 -7 74 -119 47 -167 -232 69 -105 -105 26 188 -57 -255 -77
6792g7K68j52j60MJ65j14k5Q8r3p9J18J69j35L25o11J31R5k3J59j83m1K09M8j
$$ -77 191 39 -121 -117 48 -66 -91 -3 -96 -175 -57 112 -23 302 -309 -178 -83 -106 53 -130 -171 38 86 85
6816H5K06m67K25k01O5L32k80q3M26m60j05K01K68j65j5q7J24R9n7j59j41L20
$$ 85 291 -176 49 -152 -87 245 -35 -118 308 -152 -257 -56 212 47 32 -55 69 168 111 -48 -189 131
6838A31j93r5L02k00o4K94r4M0k02mP9j19J71j57K22j84K51k76P9j60J97J93n67
$$ 131 -62 -157 145 -55 -119 175 81 121 -81 -85 -6 -125 46 -111 111 -73 178 -98 -19 -179 18 211 -356
6861c56L77j3l22N14j02k70J93r1J92j99J60k01M7Q8m2j42J08J56k24J30l8J77
$$ -356 21 8 -314 200 98 -172 21 -70 122 -77 83 -118 -71 17 -25 -167 -59 97 -127 3 -35 142
6883A42j94L18m61L95j43k58J02J98J4o2k7q9r0J44K93j55Pk27R2J5O1J02r3k20
$$ 142 -52 266 -195 200 57 -201 -99 99 113 51 24 -65 -155 -11 282 127 134 -93 -1 14 75 177 84 -136
6907a36K98j49n3K43j90R8l02L22j81j75J53M4N4N5m4l4J29j2lj7p4J19k43J67
$$ -136 162 13 -40 203 13 111 -191 131 -50 -225 -72 -28 26 81 37 3 132 120 117 100 26 145 -98 69
6931F9m8j53K62r4j75K22j85J27j02L41m05J02rj16L88l25J50l78P12k83n2R9
$$ 69 21 -132 130 36 -139 83 -102 25 -77 264 -141 -39 -48 -164 224 -101 49 -329 383 100 48 147
6953A47k5k45J91k58J47J39k29J51K93l87R4m8q1k0L9K36j06N3j61L12k43J03
$$ 147 122 -123 68 -190 -43 96 -133 18 311 -76 18 -30 -111 -131 -92 144 38 91 -70 242 -1 102
6975A02o1k15J18m0l8P1N4k9l0P3M8L2j05L5L01q3l9m5J06J18k63p5N6k31j35
$$ 102 41 -174 -56 -96 -134 -63 -9 -38 -68 5 53 85 -20 15 316 233 194 149 255 373 110 35 91 -140 -275
7000b75M9jL16o4Q2P7l78K29j23qP4J39O8m57M15O5l04j00K45K7j37nJ99j33o5
$$ -275 -226 -227 89 25 107 184 -194 35 -88 -96 -22 117 185 -272 143 208 -96 -196 49 76 -61 -66 133 0 -65
7025f5J34l3L94m21k1N2m9L27k56J19k92J48N3j68M2O1j33k77L06K81l11R1M8
$$ -65 69 36 430 9 -12 40 -9 318 62 181 -111 37 90 -78 -36 25 -108 -385 -79 202 -109 -18 30
7048C0Q9p7j8r0OQ0N8o6k93K12kM5J19m5j34K35K70k61j32Oj24N6K0N8R0r7J20
$$ 30 119 42 24 -66 -60 20 78 12 -281 -69 -71 -26 93 48 -86 149 419 158 26 32 -92 -36 -16 42 132 35 155
7075A55j97n3J42k1nL8n8j52J95J99k99J18O9k75K28p1R4j3K07l04k91M42J15
$$ 155 -42 -95 47 26 21 59 1 -151 44 243 -56 62 131 -144 84 13 107 94 301 -3 -294 148 263
7098B63l97J57m0K89m23M42J9n20L11M6R9l37K15k86k6m3L10l59M04J66n42K48
$$ 263 -134 23 -17 272 -151 291 310 -210 101 147 246 -91 124 -162 -188 -231 79 -280 124 290 -252 -4
7120dk7R3p9K26o9N4l30J15L2Q1o7j31K26j52L6Q6J13k79P5j28R8p1J40n7J03
$$ -4 -31 62 -17 209 140 194 -136 -21 11 92 25 -106 120 -32 4 90 203 -76 -1 -129 -31 -102 38 -19 84
7145H4j04k01L37q8k01J39j02P5k19K62K5k5P3k5m2j63K53j20J62p0j01J57q3
$$ 84 -20 -221 116 28 -173 -34 -136 -61 -280 -18 7 -18 55 30 -12 -175 78 -42 120 50 -51 106 23
7168B3k8K02k41K68j13j98J89k54L17l12L26j60L6J37l59K75j29J01j47j5k11
$$ 23 -5 197 -44 224 111 -87 102 -152 165 -147 179 19 55 192 -167 108 -21 80 -67 -82 -293
7189b93M37J6j24o2J60m67L47O3j85P7J10j56M4j16j0M8J22O0o0K64k32J10j44
$$ -293 144 160 36 -26 134 -333 14 77 -108 -31 79 -77 -33 -149 -159 -111 11 71 11 275 43 153 9
7212IP2l21O06m04n3J10k26N37k63j0R6p2J0k32J39J79l44j56J73K5K2O9k2JK6
$$ 9 81 -240 366 -38 -91 19 -207 330 67 57 153 81 91 -141 -2 177 -167 -323 -150 -125 -103 -34 -56 -55 -29
7237b9p4Q6m38O60k51k1K58l94K36kJ9P5k02RJ55m44M78K0k22M8n7k9L2J71j42
$$ -29 -103 -17 -455 205 -46 -67 191 -203 33 31 50 125 -77 -68 87 -357 121 141 -81 -33 -90 -119 -87 84 -58
7262e8J67p4l4M3k70L70k80K52k70J95J15m79K63R6L1l75O40k20k02J45j80J70
$$ -58 109 35 1 44 -226 144 -136 116 -154 41 156 -323 -60 36 67 -308 332 112 -90 55 -125 45
7284D5NJ60p3k00j43K84J22j6m21J94k9J65PO9K11k59j51P1J33q9j34J9K49O5
$$ 45 50 210 137 -63 -206 78 200 184 -237 -43 -72 93 100 169 380 121 -30 41 174 85 -49 -30 219 284
7308B84n35J59K13m86L6N47l24Q8M1j70n3l0J13L35l22J26K2K56j13k18L1k39
$$ 284 -251 -92 121 -365 -329 218 -106 -18 23 -147 -200 -230 -117 218 -104 22 44 300 187 -31 0 -239
7330b39J91R0%L9k74j72M72J15m76J59K40j28j99J87L5N2j21J28m8j04R6M0L4
$$ -239 -48 42 42 81 -193 -365 107 222 -254 -95 145 17 -182 5 40 92 -29 99 51 -53 43 83 117
7353A17L9j23O8k81K79j06K0j89J25J58k54n4K48K28l93K09OmJ9l10L09mn2k71
$$ 117 156 33 101 -180 99 -7 13 -176 -51 107 -147 -201 47 275 -118 91 97 93 112 -198 111 107 55 -216
7377b16K63p9J6j94l7L83m2l4j65p7K89m1m6k4m1j46k07J54K68M5j43L80j27l64
$$ -216 47 -32 -16 -210 -247 136 94 60 -105 -182 107 66 20 -4 -45 -191 -398 -244 24 69 -74 306 179 -185
7401a85O2P6q8J26J0J94m36J01j30J23L38l30J96%K37k01k85J57k7J91k97P2J65
$$ -185 -123 -47 -135 -9 1 195 -241 -140 -270 -147 191 -139 57 57 294 93 -192 -35 -62 129 -168 -96 69
7424F9M2j66J24n0K19j34j08l7J95m0j46Q4j86J60R9j45k31J06J66p4J36jj18
$$ 69 111 -55 69 19 238 104 -4 -41 154 114 -32 52 -134 26 125 -20 -251 -145 21 -53 83 82 -36
7447c6K8j25j07J59Po0J14m7l2j04L85m62K56j50J53J49j43l6p5K27j87K76k51
$$ -36 -8 -133 -240 -81 -74 -134 -20 -67 -99 -203 182 -280 -24 -174 -21 128 -15 -51 -126 101 -86 190 -61
7470f1k58K08j65K94J34k10K19l71j7L27j09n4J46j20J56l54L75j41l11N46k79
$$ -61 -319 -111 -276 18 152 -58 161 -210 -227 100 -9 -63 83 -37 119 -235 140 -1 -312 234 -45
7491d5L21J20m63k9L7k0K46l5j87n2K08k5k40M75j25n22K26%K13k15R9R8r8l31
$$ -45 276 396 -67 -96 -59 -79 167 132 -55 -107 101 76 -164 311 186 -336 -110 -110 103 -112 -13 85 -13 -344
7515c44K76L73m89L42l34J22J17q3k13M37l48o7N7J82m9K2j2J03j97q3J27L7M36
$$ -344 -68 305 -184 158 -176 -54 63 -20 -233 204 -144 -211 -154 28 -21 1 -11 92 -105 -188 -61 -24 412
7538D12m93M6j62L25R7q2j6N7k60O4rM1O9K7j43k47L47k74J27n7J61J33l21L17
$$ 412 -81 -35 -197 128 225 143 127 184 -76 -12 -21 20 89 116 -27 -274 73 -201 -74 -131 30 163 -158 159
7562A59k10Q2R8k92L44j6Qk17j84K79o7N5J23J41j75l2j22kJ22q7Pr0J79M2Q6
$$ 159 -51 31 129 -163 181 165 173 -44 -228 51 -16 39 162 303 128 96 -26 -28 94 7 14 -76 103 145 231
7587B31l25J66k21m1j9K15K48k88J64p4O5M9j91r3J85J46l86J49k29L35m0o2j37
$$ 231 -94 72 -149 -190 -209 6 254 -34 130 56 121 170 -21 -114 71 217 -169 -20 -249 86 46 -16 -153
7610a53J96K72m43j21QJ00L13j87k5K00k08J50m2k7q1J79j69O4J90l91K17j58
$$ -153 43 315 -128 -249 -241 -141 172 -15 -40 160 -48 102 60 33 -48 131 -38 26 216 -175 42 -116
7632a16J42K2J87Ol40rM0K08k33k7J91j04r8%r7K77L2m0o2K69j25j94l6Q4K3k88
$$ -116 26 48 235 241 -99 -108 -68 140 -93 -120 71 -33 -131 -131 -228 49 81 41 -21 248 123 -71 -107 -23 0 -288
7658b88J42r1L75j79k00L00j41J54j3J51q1k19K04l84K30M09p18M62m5k75J60
$$ -288 -146 -237 138 -41 -241 59 -82 72 59 210 129 -90 114 -270 -40 369 -349 113 68 -207 -47
7679d7j9J39J14k03p7Q3L66o4l76K33m53J23K51N9k30k69K19l1K71j92N1J83l47
$$ -47 -66 73 187 -16 -93 -10 356 292 -84 149 -304 -181 70 129 -101 -370 -151 -182 89 -103 -52 131 -216
7702b16Q8L6R9j77K66j44J7Pk07K68P9l22L01k02J05q0J48K26l04Q9j13J60p2
$$ -216 -128 -92 7 -170 96 -48 -31 -24 -231 37 116 -206 95 -107 -2 -82 66 292 -12 77 -36 124 52
7725E2q5j16K67q7L51l97K88J03m59J11J11k04J04r9K36j95q0K82j50r0Onq2J07
$$ 52 -33 -149 118 31 382 -15 273 376 -83 28 139 -65 39 -60 176 -19 -99 183 33 -57 -51 -56 -138 -31
7749c1J49j74M8Jl7K3K35j90J14j05K4O3J10j31j94J33P5j87K18k7j84K07n7k07
$$ -31 118 -56 -8 -7 -44 -21 214 24 138 33 57 120 230 99 -95 38 113 -74 144 117 -67 140 83 -124
7773a24K94j96K39n8j68J5j29K24n5m9R9k19j04K52K14l82M5Q6O7o2j51K34n4
$$ -124 170 -26 213 155 -13 2 -127 97 42 -7 92 -127 -231 21 235 -147 -102 -16 51 -11 -162 72 18
7796A8K26j52k8j31o4J34r9J66k28L14l0k32J23j29P2J09k1P7q5m1k3J73k12p7
$$ 18 244 92 64 -67 -131 3 -96 70 -158 156 126 -106 17 -112 -40 69 48 125 40 -1 -24 149 -63 -140
7820a40J90l1j49J63j64K22k89K54J76k52J01Q2j60J3j20P6k4m1j12J17P8J6n4
$$ -140 50 19 -130 33 -131 91 -198 56 232 -20 81 163 3 16 -104 -28 -52 -93 -205 -88 -10 6 -48
7843d8K26l95K60j55Kj3L0K31k47K20Qk49l0J29M8Q6K6k51K64j61J70o8j42J4
$$ -48 178 -217 43 -112 -110 -123 -93 138 -109 111 119 -130 -160 -31 17 103 129 -122 142 -19 151 83 -59 -45
7867d5J69j94j1K63j28O7L29l17j51j85J17J63k73N43m75M8k06N14k20r5L20k09
$$ -45 124 -70 -81 182 54 121 450 133 -18 -203 -86 77 -196 347 -128 -80 -286 228 8 -87 233 24
7889B4K05k69K43j18j94J34M9m1p8K20j14k06J92p5J30J01n2j96J2J19K7K1n1
$$ 24 229 -40 203 85 -109 25 74 33 -45 175 61 -145 47 -28 102 203 151 -45 -33 86 113 134 83
7912H3jj77J14K17j98R7j64rJ48k71M11j42k96L85m46N92o02L49j13kl7Jo1J66
$$ 83 82 -95 19 236 38 135 -29 -38 110 -161 250 108 -188 197 -249 343 -259 90 -23 -25 -62 -61 -122 44
7936D4j02K41m40j1K31Q0n3J88j90p9P7n0K43k17O9J5n8k1J16j79K8O8Q9n01K25
$$ 44 -58 183 -257 -268 -37 43 -10 178 -12 -91 -14 -64 179 -38 31 46 -12 -33 83 -96 -68 0 89 -412 -187
7961a87j71J80J8L09j06lj88J73k83L09K3M8Pk41mK61l88J90n7K9J37M2Q1l98
$$ -187 -358 -178 -160 149 43 40 -148 25 -258 51 74 122 129 -112 -116 145 -243 -53 -110 -81 56 98 179 -219
7985b19J56o2K19j78J93L6l02K04r3R3j5l95M72P8k58L1J35L67l00l49L23k68
$$ -219 -63 -125 94 -84 109 145 -157 47 -46 47 32 -363 109 187 -71 -40 95 462 162 -187 136 -132
8007a32K21j67M8O7k96M01L4R4m56R6J98r8k63J28N0N7J80o1l9J41j61L7oj10
$$ -132 89 -78 -30 37 -259 142 176 270 -186 -90 108 10 -253 -125 -75 -18 162 101 62 203 42 79 73 -37
8031c7m6J53P0l40J98Q1k17J77k5l0P9K83m17J30k01L1Q7j00j6J34n5N4M3r2J82
$$ -37 -83 70 140 -200 -2 79 -138 39 14 -16 63 346 -71 59 -142 -111 -24 -124 -140 -6 -61 -7 36 -56 126
8056A26m79L23K74m7J42k83j78l1K39j86N2Mo8J6Q6J74k69M08o0l81J24J32j80
$$ 126 -353 -30 244 197 339 56 -122 -153 86 -100 -48 -44 -112 -96 -10 164 -105 303 243 -138 -14 118 -62
8079f2l09L11nK42j62N2n3Q1J37l24p1K17j06k49N53j87MM4Q1K7j86j42mJ82L7
$$ -62 -371 -60 -65 177 15 67 14 95 232 -92 -163 54 -52 -301 252 65 69 113 194 221 35 -107 -111 71 108
8104A08L6p5j12r5r5K05P2k82L8J48N1j29J00k63M16j52J99j06J15k88n4K15k89
$$ 108 144 69 -43 -138 -233 -28 44 -238 -200 -52 -1 -130 -30 -293 123 -29 170 64 179 -109 -163 52 -237
8127b37K01J81k05L19k75K32j77K23j05l32K93k33J33j9J35M4j4r9k64K02M7K
$$ -237 -36 145 -60 259 -16 216 39 262 157 -175 118 -115 18 -1 134 178 164 65 -199 3 50 52
8149E2L3J5j12j37L73l51M1M3J30k2m25L17r7J60Q1K3Ok3j40k7P1M4n4j75K10
$$ 52 85 100 -12 -149 224 -127 -86 -43 87 65 -360 -43 -140 20 101 124 130 107 -33 -60 11 55 1 -174 36
8174C6k40J51j43%J62L5r2k7J02k02M24j17o0K5O8r5j20
$$ 36 -204 -53 -196 -196 -34 1 -91 -118 -16 -218 206 89 29 54 122 27 -93
8191i3
$$ Imaginary data points
##PAGE= N=2
##DATA TABLE= (X++(I..I)), XYDATA
0@%%%%%%%%%%%%%qJ6j6J6j6K4l2L2m0M8n6O4p2Q8j01J15j33J51j70J92k18K47
$$ 0 0 0 0 0 0 0 0 0 0 0 0 0 0 -8 8 -8 8 -8 16 -16 16 -24 24 -32 32 -40 48 -53 62 -71 80 -90 102 -116 131
35A31k78L11l46L86m32M80n32N91o55P24p99Q80r69J068j177J294j425J573j736
$$ 131 -147 164 -182 204 -228 252 -280 311 -344 380 -419 461 -508 560 -617 677 -748 825 -911
54i11J919k127K365k640K960l339L798m366N091o049P375r336J2521j8543L3618
$$ -911 1008 -1119 1246 -1394 1566 -1773 2025 -2341 2750 -3299 4076 -5260 7261 -11282 22336
69B2336j36285k13830M33566J52357l41983j13339K77953L8218k17557J6756J70390
$$ 22336 -113949 -327779 105787 258144 -83839 -197178 80775 118993 -98564 -81808 88582
80H8582m2812r4542l379K3355N9985N2684r3523j21946R2555J72100r4678j55223
$$ 88582 45770 -48772 -52151 -28796 31189 83873 -9650 -131596 -39041 133059 38381 -116842
92a16842R1732R2144q4553k7764P8740l171p7627K0057M9796l1989K1189L7846
$$ -116842 -25110 67034 -17519 -45283 33457 30286 -47341 -27284 22512 -9477 11712 49558
104D9558j02283l7579J46799N1633j50776o4161J35456M7452j04854j308O1564
$$ 49558 -52725 -90304 56495 108128 -42648 -106809 28647 76099 -28755 -30063 31501
115C1501k8673k7146K2305J5303P675j534m4196l5220Q9696P3317j29179p7194
$$ 31501 2828 -24318 -2013 13290 20965 19431 -24765 -59985 29711 103028 -26151 -103345
127a03345J39966M6838j25487k168J18467n1401j25551J09902J17898j47877q0566
$$ -103345 36621 83459 -42028 -44196 74271 22870 -102681 7221 125119 -22758 -103324
138a03324J49489K9050j35343K0724J32705p0109j35018J07715J15877j09513
$$ -103324 46165 75215 -60128 -39404 93301 23192 -111826 -4111 111766 2253
148B253p9085P6513M1639m2907p003K4542k7749n595M1076k6541k0379N7588j6009
$$ 2253 -76832 -319 41320 -1587 -8590 15952 -11797 -17392 23684 -2857 -23236 34352 18343
161A8343q0319L6192R9970m1064j13079N0053R6522o1999n3110O4576J2537o2113
$$ 18343 -61976 -25784 74186 33122 -79957 -29904 66618 4619 -48491 16085 28622 -33491
173c3491M802O2850j2360n3771K1451J9345k2435K2439J3747m2908q716M0944
$$ -33491 -28689 34161 21801 -31970 -10519 8826 -13609 8830 22577 -20331 -29047 11897
185A1897Q696l3871N522K4960l5414o317N6714j1299n2375J6489L5322j7737j7424
$$ 11897 20593 -13278 -7756 17204 -18210 -24527 32187 20888 -31487 -14998 20324 2587 -14837
198a4837L3272n661n1461L3961N0500n0174k9055N0803O572n4727J5506O8953
$$ -14837 18435 12774 -38687 -4726 45774 -4400 -33455 17348 23920 -30807 -15301 53652
210E3652l9798p6332N8724O3316n6190m2045M1952K5865l5990q871L4909q645
$$ 53652 13854 -62478 -3754 59562 3372 -38673 3279 29144 -6846 -15717 19192 10547
222A0547k1571J1665l548L302K4446j7338l9625J7676N5636j7633o5026K6910
$$ 10547 -11024 641 -2907 395 24841 7503 -32122 -14446 41190 23557 -41469 -14559
234a4559N3706l7127l1396L7531J7782l6247j5111L5973O517k4162O395l852j2839
$$ -14559 39147 2020 -29376 8155 25937 -10310 -25421 10552 17069 -7093 -698 -4550 -17389
247a7389K8207J2237l5869j6716L6574J8828m0698p689M1004j1039l2187J7320
$$ -17389 10818 23055 -12814 -29530 7044 25872 -14826 -22515 18489 7450 -24737 -7417
259g417K3128j0143k0366L467J1746k42Q932q927k5772K1139K5779k4065j8087
$$ -7417 15711 5568 -14798 -11331 415 173 9105 178 -25594 -4455 21324 -2741 -20828
272b0828K2270J4061k8625q463M0803m122l9348J2503K5683r639j2309P913M754
$$ -20828 1442 15503 -13122 -21585 19218 15096 -24252 -11749 13934 4295 -8014 -101 4653
285D653j5731P407K2339j9890j4686K0463M273j2472O16J1730m185j6195J1598
$$ 4653 -11078 -3671 18668 -1222 -15908 4555 8828 -3644 -3028 8702 4517 -11678 -80
298h0J3673j3411m61K223p414Q590J0401r362j5488R034K1524j7252j6084K6588
$$ -80 13593 182 -279 1944 -5470 3120 13521 4159 -11329 -2295 19229 1977 -14107 12481
312A2481L026k7779K840K6182M17k9280P38K7235p773j4052Q379J183l796P8K397
$$ 12481 15507 -12272 -9432 16750 17167 -12113 -11375 15860 8087 -5965 2414 3597 -199 -121 2276
327B276K406m470R86k097m753J4030J186j9421L232J3002j332r468R39J0234j0344
$$ 2276 4682 212 1198 -899 -5652 8378 9564 -9857 -6625 6377 5045 -4423 -3484 6750 -3594
342c594o688J8865k659j5847N200Q574l376p423P167O382j6042o86J8595n058
$$ -3594 -10282 8583 5924 -9923 -4723 3851 475 -6948 219 6601 -9441 -10127 8468 3410
356C410j0851J586N674K268n902J281L638o132L410J555l951P066k526q637L804
$$ 3410 -7441 -5855 -181 2087 -3815 -2534 1104 -5028 -1618 -63 -4014 3052 526 -8111 -4307
371d307Q785J122j2678k000J6770n057j1535R959M836q203n235Q416R120j2489
$$ -4307 4478 5600 -7078 -9078 7692 2635 -8900 1059 5895 -2308 -7543 873 9993 -2496
385b496n081J0968j034k337Q59j293J961k151L09L830k674J196k208m361R357
$$ -2496 -7577 3391 2357 20 879 -414 1547 -604 -295 3535 861 2057 -151 -4512 4845
400D845Q16p605N91K690K937l525k224O747n338l808Q561r04m968O12J896J911
$$ 4845 5661 -1944 -1353 1337 4274 749 -1475 5272 -66 -3874 4687 3783 -1185 -573 1323 3234
416C234o284K704P696q897m301P014L719j393r007N54J0904k928o535j235N019
$$ 3234 -3050 -346 7350 -1547 -5848 1166 4885 3492 -5515 -4961 5943 3015 -3520 -4755 264
431B64O639j0808n902J4507L140j2156p093J0333J3553j3767j3011J3746Q317
$$ 264 6903 -3905 -9807 4700 7840 -4316 -11409 -1076 12477 -1290 -14301 -555 7762
444G762p318q670L548J1478o050r295O700M328J6n533m890R399L586n877l432
$$ 7762 444 -8226 -4678 6800 750 -8545 -1845 2483 2499 -3034 -7924 1475 5061 -816 -4248
459d248k98P658J904r646K027M275J98j579l865M544L144n898J005J067L01L958
$$ -4248 -4546 3112 5016 -4630 -2603 1672 1870 291 -3574 970 4114 -1784 -779 288 589 4547
475D547m510k129K085J961M600o580n886R195L702n211n445K218J0526n604r807
$$ 4547 37 -2092 -7 1954 6554 -26 -5912 3283 6985 1774 -3671 -1453 9073 3469 -6338
490f338P869O023l968o758L52Q960j166n686J258k089L640N713p856n904M933
$$ -6338 1531 7554 3586 -3172 -2820 6140 4974 -712 546 -1543 2097 7810 -46 -5950 -1017
505a017J0193l114j7715O764J9810j0024j8215O366K0308l100k5483M343K4191
$$ -1017 9176 6062 -11653 -4889 14921 4897 -13318 -6952 13356 10256 -15227 -10884 13307
518A3307m533j7775j797J4186P150j4053o995Q841O811Q8j3257m017J8522M286
$$ 13307 8774 -9001 -10798 3388 10538 -3515 -10510 -1669 5142 5230 -8027 -12044 6478 10764
532A0764j7881q796J6471J6625j9682j9639K1790J6972j6817j7729J2621K0266
$$ 10764 -7117 -15913 558 17183 -2499 -22138 -348 16624 -193 -17922 -5301 14965
544A4965j3198j8866J3944J3082q074j0856K569J2050k505p738K416L14K089M167
$$ 14965 1767 -17099 -3155 9927 1853 -9003 -6434 5616 3111 -4627 -2211 -1897 192 4359
558D359n984l357M653N571k560j1048P151J1252j0765p015R148O165p080o663
$$ 4359 -1625 -4982 -329 5242 2682 -8366 -1215 10037 -728 -7743 1405 7570 490 -6173
572f173R504L456j2363M699J0084r569p304J0903R328j4779j1143K1345P525k3534
$$ -6173 3331 6787 -5576 -877 9207 -362 -7666 3237 12565 -2214 -13357 7988 15513 -8021
586h021k832K0362L371j9162m407J9902J293j6561J741P882K23j702k675j436
$$ -8021 -10853 9509 12880 -6282 -10689 9213 10506 -6055 -4314 3568 3791 2089 -586 -2022
600b022N54O474J917j5073N00J9126l579j8881J287K0765J513k4963p98K5083
$$ -2022 -1468 5006 6923 -8150 -7650 11476 7897 -10984 -9697 11068 12581 -12382 -13180 11903
614A1903q07j9939k997J6474P424j6557p098J3174N232o255p967J932J0876r62
$$ 11903 11096 -8843 -11840 4634 12058 -4499 -11597 1577 6809 554 -7413 -5481 5395 4433
628D433r199k219O282R162o900j3910Q717J3670o050j4649K511J9256m203k0604
$$ 4433 -4766 -6985 -703 8459 1559 -12351 -3634 10036 3986 -10663 -8152 11104 6901 -13703
642a3703Q260J6847p761j4385O233J5323q791j3009J3255O031j2540j066J0693
$$ -13703 -5443 11404 3643 -10742 -4509 10814 2023 -10986 2269 8300 -4240 -5306 5387
655E387P6j2051K253J4388p427j1486R745P115p662n516N481O322o472l063N073
$$ 5387 5463 -6588 -4335 10053 2626 -8860 885 8000 338 -5178 303 6625 153 -2910 2163
670B163j942K033J496o304Q0O641J339p143n543J2091M057j3659j714J0594K599
$$ 2163 221 2254 3750 -2554 -2474 4167 5506 -1637 -7180 4911 8968 -4691 -6405 4189 6788
685F788p800o261Q950N490q238k841J909M886J562p603j521O111K279l044o227
$$ 6788 -1012 -7273 1677 7167 -1071 -3912 -2003 2883 4445 -3158 -4679 1432 3711 667 -5560
700e560K381Q941l621q037J095P077L853j0309n835J2560N278j0634p450R314
$$ -5560 -3179 5762 2141 -5896 -4801 2276 6129 -4180 -10015 2545 7823 -2811 -10261 -947
714i47J1244j2061j0941J2855Q153r506q182P515R536q301p410P752L131k951
$$ -947 10297 -1764 -12705 150 8303 -1203 -9385 -1870 7666 -635 -8045 -293 2838 -113
728a13k211p34L693Q02k364n63q49M640L1o288L108L931l063j606R40L119j417
$$ -113 -2324 -3058 635 1437 -927 -1490 -2339 2301 2332 -3956 -848 3083 20 -1586 -646 2473 1056
745A056l344M281n80k952L834l85k292K70J746K123m330j375O089k120l229K155
$$ 1056 -2288 1993 1413 -1539 2295 1910 -382 -112 1634 3757 -573 -1948 4141 2021 -1208 947
761I47P27R50k173r35L230j439l41R2j543L416j418k710K326O28q51p30l60K800
$$ 947 1674 2624 451 -484 2746 1307 966 1058 -485 2931 1513 -1197 1129 1757 906 176 -184 2616
779B616j979j983L146q60j754J541m75K26j177K57K271l126K4K970k598k02O07
$$ 2616 637 -1346 1800 940 -814 727 252 478 -699 -442 1829 -1297 -1273 1697 -901 -1103 -496
796d96K15L87k096J380J589k770J047O38j431J732j313l69J299q56R31j477k19
$$ -496 -281 106 -1990 -610 979 -1791 -744 -106 -1537 195 -1118 -1487 -188 -1044 -113 -1590 -1809
813a809L406k858j834L339m18n36j371R00K866k992j222L016j057j77J70p08K358
$$ -1809 1597 -1261 -3095 244 -174 -710 -2081 -1181 1685 -1307 -2529 487 -570 -747 -577 -1285 1073
830A073j484q7O46j246K267l77k724K578N07r28Lo85J969l49k220K320n12o84
$$ 1073 -411 -498 148 -1098 1169 792 -1932 646 1153 225 228 -457 1512 1163 -1057 1263 751 67
848F7J162j572J327K77j200R21p33M04J251k520J140P10j333J248o65k53R57j370
$$ 67 1229 -343 984 1261 61 982 249 653 1904 -616 524 1234 -99 1149 484 231 1188 -182
866a82J660p38k018K944m58k144P21P67R48j886j447L341l35k553R73p7J315j039
$$ -182 1478 740 -1278 1666 1208 -936 -215 552 1500 -386 -1833 1508 1173 -1380 -407 -484 831 -208
884b08j831K466J31j176j5j190K575J66l483J655J697n59j436j177L565j90l801
$$ -208 -2039 427 558 -618 -633 -1823 752 918 -2565 -910 787 228 -1208 -2385 1180 990 -2811
901b811J864J572p06j042l94K511j53k669J762r6k91J096j912Q94J230j211K07
$$ -2811 -947 625 -81 -1123 -1517 994 841 -1828 -66 -162 -453 643 -1269 -375 855 -356 -149
918a49n49J001Q24k584J370J573j957P43K02l5R65j413R45l54j359K948j142j999
$$ -149 -698 303 1127 -1457 -87 1486 -471 272 474 439 1404 -9 936 582 -777 2171 1029 -970
936i70J864Q18p04j240j52L208j678k259J899N58k78o10j176K409k17j744M78
$$ -970 894 1712 1008 -232 -384 2824 1146 -1113 786 1344 1066 456 -720 1689 1472 -272 206
953B06l10J835p50l084K521J480k408j47K94J974j291k368L277o93k603K585m19
$$ 206 -104 1731 981 -2103 418 1898 -510 -657 -363 1611 320 -2048 1229 536 -2067 518 99
970I9r92K5N51J165k645j28L306j748j566J236L42O12j659m46J779l46o0m33j805
$$ 99 -893 -868 -317 848 -1797 -1925 1381 -367 -1933 -697 -355 257 -1402 -1848 -69 -415 -475 -908 -2713
989b713L257M85l696N16K460J067k984j880M866J31m153J089J777M06p11j895
$$ -2713 544 1029 -2667 -2151 309 1376 -1608 -3488 1378 1509 -2644 -1555 222 628 -83 -1978
1005a978J951N19o05J00j530J840J983l590J43K510n51j384n46K396o2l023K920
$$ -1978 -27 492 -113 -13 -1543 297 2280 -1310 -1167 1343 792 -592 -1138 1258 1196 -1827 1093
1022A093Q04l340J952J786j472k472J428M403l901l445N406O75l652m80K404R53
$$ 1093 1897 -1443 509 2295 823 -1649 -221 4182 281 -3164 2242 2917 -735 -1215 1189 2142
1038B142k435K5K552k555L64K416l160n16L124L96k700k199M630J283n519K30
$$ 2142 -293 -268 2284 -271 93 2509 -651 -1167 1957 2353 -347 -2546 2084 3367 -2152 -1922
1054a922M261r77k008r19K223J144k203k17J32K08K300k681j813L246J47q69k124
$$ -1922 2339 1362 -646 -1565 658 1802 -401 -618 -486 -278 2022 -659 -2472 774 921 52 -2072
1071b072O39L247j455k015K76P88K775k333m118L742L658l018m308K666O636n139
$$ -2072 -1433 1814 359 -1656 -1380 -592 2183 -150 -4268 -526 3132 114 -4194 -1528 5108 -31
1087c1o338O787L934n664k683M234K808m385j216M754k309k092M182j298l481
$$ -31 -6369 418 4352 -1312 -3995 239 3047 -1338 -2554 2200 -109 -2201 1981 683 -2798
1102b798K480L273k502m711N356L847p487l22O268j178m354P96M556k563l703
$$ -2798 -318 2955 453 -4258 1098 4945 -2542 -2864 3404 2226 -2128 -1332 3224 661 -3042
1117c042N113R87n899K172M273k711l524K190M935l947m153N235J563m047o26
$$ -3042 2071 3058 -2841 -669 3604 893 -2631 -441 4494 547 -3606 1629 3192 -855 -1481
1132a481J600J689j291j851J443P1L94n9k019J459J502k110K56M60k18Q05p95
$$ -1481 119 1808 517 -1334 109 180 574 515 -1504 -45 1457 -653 -397 63 -155 650 -145
1149a45k17p45R48K400l848k015O146m08n484K61N438M24p228J409P103l743m062
$$ -145 -362 -1107 -159 2241 -1607 -3622 2524 2116 -3368 -3107 2331 2755 -4473 -3064 4039 296 -3766
1166c766L385J577k169r71K463k29l561M694N61n786J886N468l077n076L656O214
$$ -3766 -381 1196 -973 -1944 519 290 -3271 1423 1984 -3802 -1916 3552 475 -4601 -945 5269
1182E269n954n127P870K182p131K6N317k23m804R09M909l431j799L803q99k106
$$ 5269 -685 -5812 2058 4240 -2891 -2865 2452 2229 -2575 -1666 3243 -188 -1987 1816 917 -1189
1198a189J396J191j219q86J845Q86l406J898K045l251O39J737r18q73K35J964
$$ -1189 207 1398 179 -707 1138 2024 -1382 516 2561 -690 -51 1686 768 -105 130 2094
1214B094j434j933L067l82k310K113k49q57M02N50o96j052J740R60l852J446L785
$$ 2094 660 -1273 1794 1412 -898 1215 966 109 511 1061 365 -687 1053 2013 -1839 -393 3392
1231C392l825j918L327J412k921j892M365km888K757K393l039q28K718j20k847
$$ 3392 -433 -2351 976 2388 -533 -2425 1940 1938 -2950 -193 2200 -839 -1667 1051 931 -1916
1247a916M62M109l229l031M768M39m209Q46L419j150l739J953L700m069r27L954
$$ -1916 -1454 2655 -574 -3605 1163 1602 -2607 -1761 1658 508 -3231 -1278 2422 -1647 -2574 1380
1263A380j708j786J959J018j819q86L071q88l693L553K235m298O9K890R7l276
$$ 1380 -328 -2114 -155 863 -956 -1842 1229 341 -3352 201 2436 -1862 -1793 1097 1194 -2082
1279b082O23L893k223k517L508J35k543J080R10m85j148J388O13k418J519J846
$$ -2082 -1459 2434 211 -2306 1202 1337 -1206 -126 784 299 -849 539 1152 -1266 253 2099
1295B099k987L34K265q49k091J066K373j894k533L745Q42m076J369K292j173j744
$$ 2099 -888 -554 1711 862 -1229 -163 2210 316 -2217 1528 2370 -1706 -337 1955 782 -962
1311i62J259J735k176j021L212j530j926K385Q0j625J04J477j83k666K126J671
$$ -962 297 2032 -144 -1165 2047 517 -1409 976 1056 -569 -465 1012 829 -1837 289 1960
1327A960l667P74K536j600j368J537J650k564j283L928p25l908K237K455k268
$$ 1960 -1707 -933 1603 3 -1365 172 1822 -742 -2025 1903 1178 -2730 -493 1962 -306
1342c06j584J923J522k761m01K888j645j376K337m77j020M53J058m72j876K071
$$ -306 -1890 33 1555 -1206 -1607 1281 -364 -1740 597 120 -900 -447 611 139 -1737 334
1358C34Q57l143J311K207k135r01J665J043j899q33L090j077k630K886R44k360
$$ 334 1191 -1952 -641 1566 -569 -1470 195 1238 -661 -1494 1596 519 -2111 775 1719 -641
1374f41J47J227L74j631m20K771j711j383K292n98r90N79M81l44r36J917J2k290
$$ -641 -494 733 1107 -524 -944 1827 116 -1267 1025 427 -563 16 497 153 -783 1134 1146 -1144
1392a144J626J517k592K08J526l45j531K08K471j468k230K658M56k363Q73J006
$$ -1144 482 1999 -593 -385 1141 796 -735 -527 1944 476 -1754 904 1360 -1003 -130 876
1408H76n23j062Q11J462j974n60K118q33j273J525k89o49o0J119n40j935K217
$$ 876 353 -709 102 1564 -410 -970 1148 315 -958 567 278 -371 -431 688 148 -1787 430
1425D30M76k476R97J667j434r60O71J861k003j536L161j34k385J142R98q96q26
$$ 430 906 -1570 -573 1094 -340 -1300 -629 1232 -771 -2307 854 720 -1665 -523 475 -421 -1247
1442a247O98J055j150m90J920j585l86J590o80p72P62O65k78j451J511P13k376
$$ -1247 -549 506 -644 -1134 786 -799 -1185 405 -275 -1047 -285 380 102 -1349 162 875 -1501
1459a501J271J035j097k67O90O63j051n66J707l40j107J014N6m68M3K54L60o06
$$ -1501 -230 805 -292 -559 131 794 -257 -823 884 544 -563 451 507 39 82 336 696 90
1477I0N9R29j517O13Q99j184K66M07Q3n90k31J198j81j990J696O28j514K68O78
$$ 90 149 1078 -439 174 1073 -111 155 562 645 55 -176 1022 841 -1149 547 1175 -339 -71 607
1496F07L80j409K2J743r37q72J094j31q65N88j1r0l08j21J229j456O4J383j182
$$ 607 987 -422 -400 1343 406 -466 628 497 -368 220 209 119 -189 -310 919 -537 -473 910 -272
1515b72k21Q71l45l32l58R43J70j396R35L43j103O78k08K90k89p53J279l92r44
$$ -272 -493 378 33 -299 -657 286 456 -940 -5 338 -765 -87 -295 -5 -294 -1047 232 -160 -1104
1534a104J244k22j18n0o78R29j8m68M38o41Q05L6j221Q32Q42r57J73O6P75p92
$$ -1104 140 -82 -200 -250 -928 1 -17 -485 -47 -688 117 153 -1068 -236 606 -351 -178 -112 663 -129
1554a29m45J111J34j343P47N6J23k36k11Q17q84k66J352p21n48O47m5N88p45l7
$$ -129 -574 537 671 -672 75 131 254 18 -193 624 -260 -526 826 105 -443 204 159 747 2 -35
1574c5P99o47l06R15r07L54J62jJ11n06L25J88p97M15K91l28k13J39N46o7j416
$$ -35 764 117 -189 726 -181 173 335 334 445 -61 264 452 -345 70 361 33 -180 -41 505 438 -978
1595i78R35P09r42L9m7O60l48q04R43J94j143M57K38l8L0q67J175l32q06J282
$$ -978 -43 666 -276 -237 -284 376 28 -776 167 361 -782 -325 -87 -125 -95 -962 213 -119 -925 357
1615C57m20o33K50J88O41q06p51J620k56j033M85M34K20o28m26J085l53o17N99
$$ 357 -63 -696 -446 -258 383 -423 -1174 446 190 -843 -358 76 296 -332 -758 327 -26 -643 -44
1634d4k33K25J39O3l2m34L01J034j490J28R79k82l44m38Q36M57j714Q04J116j133
$$ -44 -277 -52 87 150 118 -316 -15 1019 -471 -343 636 354 10 -428 408 865 -849 -45 1071 -62
1654f2n3L79O26n27j035J432M11j715O63J012o36n04o3J250q40j102J273M24j115
$$ -62 -115 264 890 363 -672 760 1171 -544 119 1131 495 -9 -72 1178 338 -764 509 933 -182
1673a82K93J82N42o67n88J203l43n71O74k49l13J46k53M31m73j80J067q95k15
$$ -182 111 293 835 168 -420 783 440 -131 543 294 -19 127 -126 305 -168 -348 719 -176 -391
1692c91O08o40M76n36K61O52j156J51J053m83l41J06K24K17j284J155L96j413
$$ -391 217 -423 53 -483 -222 430 -726 -575 478 -5 -346 -240 -16 201 -1083 72 468 -945
1710i45O07J39J41l85m73J147Nj521J063O20p84o62P64P25q31n89J123R2r53K36
$$ -945 -338 -199 -58 -443 -916 231 236 -1285 -222 398 -386 -1048 -284 441 -390 -979 144 236 -717 -481
1730d81N84K45p98K63Q02o93n84J215n89j91J95K53j4n52L11N38r36J12J172j043
$$ -481 103 348 -450 -187 615 -78 -662 553 -36 -227 -32 221 207 -345 -34 504 -432 -320 852 -191
1750a91oN33J95K1q89J127k31p30K87L59j34k13j6K48J6o76N05K49l24J73j66
$$ -191 -197 336 531 552 -337 790 559 -171 116 475 341 128 112 360 376 -300 205 454 130 303 137
1771A37P9O0n32M95n5m59L93j20L79R2o74K54K39m65L77j20k38P0j31M00l69m12
$$ 137 216 276 -256 239 184 -275 118 -2 377 469 -205 49 288 -177 200 80 -158 -88 -219 181 -188 -600
1793f00P38k18k40J27R2K75l74j57P44o38j14R72r92O0O1O9J59o94M61P14j322
$$ -600 138 -80 -320 -193 -101 174 -200 -357 387 -251 -365 607 -385 -325 -264 -195 -36 -730 -269 445 -877
1814h77O75N29m42k9K01K44n4o65N78J84o50M27o6j13K25m64N15J98l74Q6K01
$$ -877 -202 327 -115 -144 57 301 247 -418 160 344 -306 121 55 -58 167 -297 218 416 42 128 329
1835C29L5Q6k56pP7J00Jj87M19j18p25O04j90m62K15J35J98P1n82K26L52o48N07
$$ 329 364 450 194 187 264 364 365 178 597 479 -246 358 168 -294 -79 56 254 325 -257 -31 321 -327 180
1858A80k7l84K52J10J79k65%K64p12K29P11j003J98O76l70l09K1L59L76j134M21
$$ 180 153 -231 21 131 310 45 45 309 -403 -174 537 -466 -268 408 38 -271 -250 109 485 -649 -228
1879b28O95j055M88J92k07Q4q02Q98J57r15P49q4k07L56o12N61j59k53K96j37
$$ -228 467 -588 -100 92 -115 -31 -833 65 222 -693 56 -28 -235 121 -491 70 -89 -342 -46 -183
1899a83j47M01m96J69K90l30K24k54K08K56p20M82L44n12N71k32L2k9j47L85j94
$$ -183 -330 71 -425 -256 34 -296 -72 -326 -118 138 -582 -100 244 -268 303 71 103 74 -73 312 118
1920A18l05O2K06q6K35k82K06L27l32M21l80pL54o97K02M49l64L2l1K44N6n33
$$ 118 -187 -125 81 -5 230 -52 154 481 149 570 190 183 537 -160 42 491 127 159 128 372 428 -105
1942a05L49O11j141L88M81j80l69j57N80N5o90N40k59Q0J12j25p0l4k77L55K5
$$ -105 244 855 -286 102 583 403 34 -123 457 512 -178 362 103 183 295 170 100 66 -211 144 169
1963A69k90J37m52N05O9o41M65Pj07P7k99L87j21m18O07J1l18J9n7J99j1l43L26
$$ 169 -121 16 -436 69 138 -503 -38 -31 -138 -61 -360 27 -94 -512 95 106 -212 -193 -250 -51 -62 -405 -79
1986g9K7J08J78n83K02P6k07J89J47M4k4m06L19L13n85K52J65j32K05n20L45L63
$$ -79 -52 56 234 -349 -147 -71 -278 -89 58 102 78 -328 -9 304 -281 -29 136 4 209 -311 34 397
2008C97p23K01L12l77K23J05J90N7n85L02J38m49M2J66J97q0k69K44K55j03q9
$$ 397 -326 -125 187 -190 33 138 328 385 -200 102 240 -209 -167 -1 196 116 -153 91 346 243 154
2029A54j00J13J37m54J79m3N6M59p09L53N7k41j41K51k55N10m75J90K07j35k77
$$ 154 54 167 304 -150 29 -14 42 501 -208 145 202 -39 -180 71 -184 326 -149 41 248 113 -164
2050a64J90M7L9l43j14O97l63k95J35J43k59pL43l1l55j75L85L29l82l14M42L59
$$ -164 26 73 112 -231 -345 352 -11 -306 -171 -28 -287 -294 49 18 -337 -512 -127 202 -180 -494 -52 307
2072C07j035M48O32p79K27M1M1L26o25L47P4j98J30L45m69J68k76J17L67k03J39
$$ 307 -728 -280 352 -427 -200 -159 -118 208 -417 -70 4 -194 -64 281 -188 -20 -296 -179 188 -15 124
2093A24M0k05K24k99L01k46K5K44k73J27L55m81L71r2q4J04l48L19q2p2o3K36
$$ 124 164 -41 183 -116 185 -61 -36 208 -65 62 417 -64 307 215 131 235 -113 206 124 52 -11 225
2115B25J57pKm45O41n25o8N22j68m91j26O67J2n78K79K73k44Q0o2L78k47o26N03
$$ 225 382 375 377 -68 573 48 -20 502 334 -157 -283 384 396 -182 97 370 126 206 144 522 275 -351 152
2138A52J54n07J3o4J58J73k52N46r6n24N5Q5k79L58k02K98j54l4J3N1k23M40l48
$$ 152 306 -201 -188 -252 -94 79 -173 373 277 -247 -192 -107 -386 -28 -230 68 -86 -120 -107 -56 -279 161 -187
2161a87k3J50J22q5n29O20o0j65j16L07k88Q3j58K18L26m77j36L92j14rj28L77
$$ -187 -210 -60 62 -23 -552 68 8 -157 -273 34 -254 -171 -329 -111 215 -262 -398 -6 -120 -129 -257 120
2183A20J2l07J10K77m60J70k31O02j39k90K71L01n21o1L76JJ55m37M80k97j55
$$ 120 132 -175 -65 212 -248 -78 -309 293 154 -136 135 436 -85 -146 230 231 386 -51 429 132 -23
2204b3QL39j21L6k10J86n5j58R6Q0p7M9j34O3K42l66M49l72m16P68o19k4L72j96
$$ -23 -15 324 203 239 29 215 160 2 98 178 101 150 16 79 321 -45 404 32 -384 384 -235 -259 113 -83
2228h3J08r9K2K07j78k0L33l03K37j75q1J89o67L89N59p74J71R3n4J9l72L20L20
$$ -83 25 -74 -52 155 -23 -43 290 -13 224 49 -32 157 -510 -121 438 -336 -165 -72 -126 -107 -479 -159 161
2251A61o41N91O8m87L16n59P17r9l29L41j55L1J17k38L04j22k69K67j37k2L41
$$ 161 -480 111 179 -308 8 -551 166 67 -262 79 -76 -45 72 -166 138 16 -253 14 -123 -145 196
2272A96j30m4k11j3M31j31j13K09n4j50K04l50K95j76j37N10m67J48L55l73k32
$$ 196 66 22 -189 -202 229 98 -15 194 140 -10 194 -156 139 -37 -174 336 -131 17 372 -1 -233
2293b33L19K49l0n05M56K4l47j26N21l84J15QL32j47p60N50K83o06L33k98K92
$$ -233 86 335 305 -200 256 280 -67 -193 328 -56 59 67 399 252 -508 42 325 -281 52 -246 46
2314D6L09k32J5k34J54K30l74J86P7k66l8J44q8L3m89M01N45p33L88L8n63K84
$$ 46 355 123 138 -96 58 288 -86 100 177 -89 -127 17 -71 -38 -527 -126 419 -314 74 112 -451 -167
2336a67K5J29l00j99N12l22K30N0k43J10J96k32q8o4K31N3j39QN99o93n9N41m16
$$ -167 -142 -13 -313 -512 0 -322 -92 -42 -285 -175 21 -211 -299 -363 -132 -79 -218 -210 389 -304 -363 178 -238
2359b38J53k35O20m34k9J76L18n21o2J27J33j49O5L84q2k78L35n3n60N01l9M6
$$ -238 -85 -320 300 -134 -163 13 331 -190 -252 -125 8 -141 -76 308 226 -52 283 230 -330 171 132 178
2381A78jJ33r8k11J63R0k90k41Q98o20J0K05n1L78r09N31M16n66K80R3m21K2J50
$$ 178 177 310 212 1 164 254 -36 -277 621 1 11 216 165 543 -366 165 581 15 295 388 -33 -11 139
2404A39K32k10m35P67l92k89L30j77m83O62J07k71l00K17M31q20L09N18m14j80
$$ 139 371 161 -274 493 101 -188 142 -35 -518 144 251 -20 -320 -103 328 -492 -183 335 -79 -259
2424b59J66N09o34l68N94L59p91L00J12k48j28K80K3l1l0J33j96k6K15k91J80
$$ -259 -93 416 -218 -586 8 367 -424 -124 -12 -260 -388 -108 -85 -116 -146 -13 -209 -235 -20 -311 -131
2445a31J27k45K35k80J32M03o96L03L06k61R6L2j9P9Ln5k86QK77j22QM88o51J42
$$ -131 -4 -249 -14 -294 -162 241 -455 -152 154 -107 -11 21 2 81 84 29 -257 -249 28 -94 -86 402 -249 -107
2469a07M5L7L14m75K30L58n02J07L59l40j16M6p0M23k35J97R9p18K39K07Q0k64
$$ -107 -62 -25 289 -186 44 402 -100 7 366 26 -90 -44 -114 309 74 271 370 -348 -109 98 178 -86
2491h6j0K05L8k92L02J56n32K58J27j40J17k39K69Nk45K27k88M3J35n9J3J58Q5
$$ -86 -96 109 147 -145 157 313 -219 39 166 26 143 -96 173 178 -67 160 -128 -85 50 -9 4 162 247
2514B47J50m34k6K64k84m4M33l95k8l26L72K36k97L9k2p4m2J80o7K46j00M3j56
$$ 247 397 -37 -63 201 -83 -127 306 -89 -117 -443 -71 165 -132 -93 -115 -189 -231 -51 -118 128 28 71 -85
2537h5J99L8m99J79K85k59n2N23j96j72k37M76l8m19N52k7k69j40J57j39N96m34
$$ -85 114 152 -347 -168 117 -142 -194 329 133 -39 -276 200 162 -257 295 268 -1 -141 16 -123 473 39
2559C9j8M8j50J2M1J24n8K49K03l88J08N7k07k56O88m86K0P7M8j03j6J79q4k47
$$ 39 21 69 -81 -69 -28 96 38 287 490 102 210 267 60 -196 492 6 26 103 151 48 32 211 127 -120
2583a20R3M7j06J91J28k72N2O9p7j48j3L92j60J10j0j90j50R4P5Qk64K98L94p50
$$ -120 -27 20 -86 105 233 -39 13 82 5 -143 -156 236 76 186 176 -14 -164 -70 5 13 -251 47 441 -309
2607c09Q1K65k85K0N1P9R5k86L40M7l49L45l58L68j79k31L36k71j24M11j61j90
$$ -309 -228 37 -248 -228 -177 -98 -3 -289 51 98 -251 94 -264 104 -75 -306 30 -241 -365 46 -115 -305
2629c05M93j66N1J47j91l6j88l1L37m10M6L67k00L6m8J75K5k58J95q6N1RJ85l06
$$ -305 188 22 73 220 29 -7 -195 -226 111 -299 -253 114 -86 -50 -98 77 102 -156 39 -47 4 13 198 -108
2653a08L99m19N13j39q5n1k23K24L17n00Q2M04jk92m5M45k23j75J40j53n4r0M8
$$ -108 291 -128 385 246 161 110 -113 111 428 -72 10 414 413 121 76 521 298 123 263 110 56 -34 14
2676A4P3P6m3nm6J89j6j97L1j36K1J70l69M20J27l88m4J36k32qM38l82K98k53
$$ 14 87 163 120 115 69 258 242 45 76 -60 -39 131 -238 182 309 -79 -123 13 -219 -227 211 -171 127 -126
2700a26O4K18k02M5O1j38p4K5m5L89m32k09O09n07L24j67J17L1k25J26nJ23k8
$$ -126 -62 156 -46 -1 60 -78 -152 -127 -172 217 -215 -424 185 -322 2 -165 -48 -17 -242 -116 -121 2 -26
2723b6j80P8Jj52M16J27m95j30J38L40j55k4L45k71j16J17J30M8l9j20j19K12
$$ -26 -206 -128 -127 -279 137 264 -231 -361 -223 117 -38 -62 283 12 -104 13 143 191 152 32 -87 125
2745A25M0k04P4k37O12o03K60k24o6L04l73L30K46m71K88K82k62k60j83M22K66
$$ 125 165 -39 35 -202 410 -193 67 -157 -223 81 -292 38 284 -187 101 383 121 -139 -322 100 366
2766C66k60j44P0o1K2k5j81L10Kk22J49K3j41o5J8j11L1j22J65k00K49J30O9j05
$$ 366 106 -38 32 -29 -7 -32 -213 97 99 -123 26 49 -92 -157 -139 -250 -219 -341 -176 -376 -127 3 72 -33
2790c3j72QJ83rJ85m18K73j21QQ2j18j36K82m0j32J90k15K33jJ04l55K10P2m66
$$ -33 -205 -197 -14 -23 162 -256 17 -104 -96 -14 -132 -268 14 -26 -158 32 -183 50 49 153 -202 8 80 -386
2814c86K13K15m5r7P2K11j09Q6j90j01K88j37J41l9j96J39P0n1R8j77r2L44k69
$$ -386 -173 42 -3 -100 -28 183 74 160 -30 -131 157 20 161 122 -74 65 135 84 182 5 -87 257 -12
2837a2J49l28M25j03j70N4K4J26J2j13j08K40k58K82k38J5J04k56J84J99k10j08
$$ -12 137 -191 234 131 -39 15 39 165 177 64 -44 196 -62 220 -18 -3 101 -155 29 228 18 -90
2859i0m0k3J49r5PJ92p3j85K76j56J17k15K29l6k5N0r5l32M35k27j18L35l34M47
$$ -90 -130 -153 -4 -99 -92 100 27 -158 118 -38 79 -136 93 57 32 82 -13 -345 90 -137 -255 80 -254 193
2883A93l24j24J59p3K2K44l99K34j4k08N2K05p0L74k99j3o2M2j2k19L43J34k73
$$ 193 -131 -255 -96 -169 -147 97 -302 -68 -82 -290 -238 -33 -103 271 -28 -41 -103 -61 -73 -292 51 185 -88
2906h8J33j82k8K9l1ll3nJ59J29k60M32q5k31K23q7l2K9k72J27n9J71J44j86K04
$$ -88 45 -137 -165 -136 -167 -170 -203 -208 -49 80 -180 252 167 -64 159 72 40 69 -203 -76 -135 36 180 -6 198
2931A98k01R9k15K20l1O9o4l2K5j40j9r8K24J57m13J03k5K02J05k94k6M24l42
$$ 198 -3 96 -119 101 70 139 75 43 68 -72 -91 -189 35 192 -221 -118 -143 59 164 -130 -156 268 -74
2954g4L3m3J25l42J66j68L97k8p1J31j36J53l68K98m5j04L18l29Q2j34J81q7j91
$$ -74 -41 -84 41 -301 -135 -303 94 66 -5 126 -10 143 -225 73 28 -76 242 -87 -5 -139 42 -45 -236
2977b36M1PL26j75r8J96j72J49q0j23L84k62KJ26j42J18L6j61R8o1M7j4K00j72
$$ -236 -195 -188 138 -37 -135 61 -111 38 -42 -165 219 -43 -41 85 -57 61 97 -64 34 -27 20 6 206 34
3001C4k57K62j64Q0r3oK38j54J52oj34M23k26k09J17j10K12o0l1J34M3k01M8O1
$$ 34 -223 39 -125 -45 -138 -144 94 -60 92 86 -48 375 149 -60 57 -53 159 99 68 202 245 44 92 153
3025A53j09M8P7n88M77j08j99L74Q0j27M1m99N89n0j55p4q9J26j44K76n9n9k46
$$ 153 44 92 169 -419 58 -50 -249 125 205 78 119 -380 209 159 4 -70 -159 -33 -177 99 40 -19 -265
3048b65J55j69J99o6J2J97o1j91L63l69q0L18o4J24k28p7J41r5Q0n0m6k8M14j90
$$ -265 -110 -279 -80 -146 -134 63 2 -189 174 -195 -275 43 -21 103 -125 -202 -61 -156 -76 -126 -172 -200 214 24
3072B4O4r1k13P6M0J99J5j23Q1j36n5J53j24J01OJ35q7k40R2L1r4J84k5Q2j28
$$ 24 88 -3 -216 -140 -100 99 114 -9 72 -64 -119 34 -90 11 17 152 65 -175 -83 -52 -146 38 13 95 -33
3097c3K21O8j99q1k4K42l50j14K22J82k74L10r1K29k11K68p2k31j99J62O0J04
$$ -33 188 256 57 -24 -48 194 -156 -270 -48 134 -140 170 79 308 97 365 293 62 -137 25 85 189
3119A89N6K86m33l11N37j02l72K64J21o5k00l15O38k50n7k18K49k3%j84K01n2
$$ 189 245 531 98 -213 324 222 -150 114 235 170 -30 -345 293 43 -14 -232 17 -6 -6 -190 11 -41
3141d1J2L37l02J65l54K35j21J07j8k63K94L2L8k36K09j95J06J50j47m7pL8j81
$$ -41 -29 308 6 171 -183 52 -69 38 20 -243 51 83 121 -115 94 -101 5 155 8 -39 -46 -8 -189
3164a89p8K91J9k4j31qj81M4K62j44K53n7k1j72K99k5Jj65O2P7j35O3j53J19R5
$$ -189 -267 24 43 19 -112 -120 -301 -257 5 -139 114 57 36 -136 163 138 139 -26 36 113 -22 41 -112 7 102
3189A02k71K56l9q6R7R0l9m35L27K55k9j15j10k2M27n43j27K53n2l21M76k95P7
$$ 102 -169 87 48 -38 59 149 110 -325 2 257 228 113 3 -19 408 -135 -262 -9 -61 -382 94 -201 -124
3212a24K20k61M2q7J00K24j59p0K36k22K57j56J80k15k97L94mR5q3J09k4j88j22
$$ -124 96 -165 -123 -210 -110 114 -45 -115 121 -101 156 0 180 -35 -332 62 58 153 70 179 155 -33 -155
3235a55J56M2k04J33j63J37k03Q0M33n10R8J41K0R6L3j85J53j48R4j8l32K45j27
$$ -155 1 43 -161 -28 -191 -54 -257 -177 256 -254 -156 -15 5 101 134 -51 102 -46 48 30 -302 -57 -184
3258a84rR0N7j74K21j39J52j94J2K29k82J22J95p1Q4J30n39K95P0m4N08o50M07
$$ -184 -193 -103 -46 -220 1 -138 14 -180 -168 61 -221 -99 96 25 109 239 -300 -5 65 21 529 -121 286
3281B86k17l7j68LK38J14l71J99K2J19j50K3j50J44k4q9K76j71P4j83Q4J16N1
$$ 286 69 32 -136 -133 105 219 -152 47 69 188 38 61 -89 55 31 -58 218 47 121 -62 22 138 189
$$ [...]
8191A30
##END NTUPLES=NMR FID
##END=
