##TITLE=1H_Pr 5024-Ac
 CDCl3
 8 sc, 
 14.12.2021
##JCAMPDX= 6.0         $$ Bruker NMR JCAMP-DX V2.0
##DATA TYPE= NMR FID
##DATA CLASS= NTUPLES
##ORIGIN= UXNMR, Bruker Analytische Messtechnik GmbH
##OWNER= root
$$ XWIN-NMR		Version 3.5
$$ Tue Dec 14 11:40:47 2021 Russian Standard Time (UT+4h)  she@DPX200
##.OBSERVE FREQUENCY= 200.131346
##.OBSERVE NUCLEUS= ^1H
##.DELAY= (6, 6)
##.ACQUISITION MODE= SIMULTANEOUS
##.ACQUISITION SCHEME= undefined
##.AVERAGES= 8
##.DIGITISER RES= 18
##SPECTROMETER/DATA SYSTEM= spect
##.PULSE SEQUENCE= zg30
##.SOLVENT NAME= CDCl3
##.SHIFT REFERENCE= (INTERNAL, CDCl3, 0, 15.7039)
##AUDIT TRAIL= $$ (NUMBER, WHEN, WHO, WHERE, WHAT)
$$ ##TITLE= Audit trail, XWIN-NMR		Version 3.5
$$ ##JCAMPDX= 5.01
$$ ##ORIGIN= Bruker BioSpin GmbH
$$ ##OWNER= she
$$ F:/spectra/data/she/nmr/H-F/1/audita.txt
$$ ##AUDIT TRAIL=  $$ (NUMBER, WHEN, WHO, WHERE, WHAT)
(   1,<2021-12-14 11:39:33.23 +0400>,<she>,<DPX200>,
      <created by zg, POWCHK disabled, PULCHK disabled
       configuration hash MD5:
       00 E9 B6 7A A2 85 ED C7 34 08 36 98 17 FE 4E 26
       data hash MD5: 16K
       46 17 E7 B2 22 7E EC C9 A2 82 1F CC 3F 95 3E E7>)
$$ ##END=
$$ 
$$ hash MD5
$$ 30 40 29 79 A8 99 FB F7 F2 1D 42 8E EE 1F 37 7E
##$RELAX= 
##$RELAX= 
##$RELAX= 
##$RELAX= 
##$RELAX= 
##$RELAX= 
$$ Bruker specific parameters
$$ --------------------------
##$DU= <F:/spectra>
##$EXPNO= 1
##$NAME= <H-F>
##$PROCNO= 1
##$TYPE= <nmr>
##$USER= <she>
##$AMP= (0..31)
100 100 100 100 100 100 100 100 100 100 100 100 100 100 100 100 100 100 
100 100 100 100 100 100 100 100 100 100 100 100 100 100 
##$AQSEQ= 0
##$AQ_mod= 1
##$AUNM= <au_zg>
##$AUTOPOS= <>
##$BF1= 200.13
##$BF2= 200.13
##$BF3= 200.13
##$BF4= 200.13
##$BF5= 200.13
##$BF6= 200.13
##$BF7= 200.13
##$BF8= 200.13
##$BYTORDA= 1
##$CFDGTYP= 0
##$CFRGTYP= 5
##$CHEMSTR= <none>
##$CNST= (0..31)
1 1 145 1 1 1 1 1 1 1 1 1 1 1 1 1 1 1 1 1 1 1 1 1 1 1 1 1 1 1 1 1 
##$CPDPRG= <>
##$CPDPRG1= <>
##$CPDPRG2= <>
##$CPDPRG3= <>
##$CPDPRG4= <mlev>
##$CPDPRG5= <mlev>
##$CPDPRG6= <mlev>
##$CPDPRG7= <mlev>
##$CPDPRG8= <mlev>
##$CPDPRGB= <>
##$CPDPRGT= <>
##$D= (0..31)
0 1.2 0 0 0 0 0 0 0 0.06 0 0.03 0 0 0 0 0.0002 0 0 0 0 0 0 0 0 0 0 0 0 
0 0 0 
##$DATE= 1639467572
##$DBL= (0..7)
120 120 120 120 120 120 120 120 
##$DBP= (0..7)
150 150 150 150 150 150 150 150 
##$DBP07= 0
##$DBPNAM0= <>
##$DBPNAM1= <>
##$DBPNAM2= <>
##$DBPNAM3= <>
##$DBPNAM4= <>
##$DBPNAM5= <>
##$DBPNAM6= <>
##$DBPNAM7= <>
##$DBPOAL= (0..7)
0.5 0.5 0.5 0.5 0.5 0.5 0.5 0.5 
##$DBPOFFS= (0..7)
0 0 0 0 0 0 0 0 
##$DE= 6
##$DECBNUC= <off>
##$DECIM= 32
##$DECNUC= <off>
##$DECSTAT= 4
##$DIGMOD= 1
##$DIGTYP= 9
##$DL= (0..7)
0 120 120 120 120 120 120 120 
##$DP= (0..7)
150 150 150 150 150 150 150 150 
##$DP07= 0
##$DPNAME0= <>
##$DPNAME1= <>
##$DPNAME2= <>
##$DPNAME3= <>
##$DPNAME4= <>
##$DPNAME5= <>
##$DPNAME6= <>
##$DPNAME7= <>
##$DPOAL= (0..7)
0.5 0.5 0.5 0.5 0.5 0.5 0.5 0.5 
##$DPOFFS= (0..7)
0 0 0 0 0 0 0 0 
##$DQDMODE= 0
##$DR= 18
##$DS= 0
##$DSLIST= <SSSSSSSSSSSSSSS>
$$ [...]
##$SUBNAM2= <"">
##$SUBNAM3= <"">
##$SUBNAM4= <"">
##$SUBNAM5= <"">
##$SUBNAM6= <"">
##$SUBNAM7= <"">
##$SUBNAM8= <"">
##$SUBNAM9= <"">
##$SW= 18.0517287032376
##$SWIBOX= (0..15)
0 0 2 0 0 0 0 0 0 0 0 0 0 0 0 0 
##$SW_h= 3612.71676300578
##$TD= 16384
##$TD0= 1
##$TE= 0
##$TE2= 300
##$TE3= 300
##$TEG= 300
##$TL= (0..7)
0 120 120 120 120 120 120 120 
##$TP= (0..7)
150 150 150 150 150 150 150 150 
##$TP07= 0
##$TPNAME0= <>
##$TPNAME1= <>
##$TPNAME2= <>
##$TPNAME3= <>
##$TPNAME4= <>
##$TPNAME5= <>
##$TPNAME6= <>
##$TPNAME7= <>
##$TPOAL= (0..7)
0.5 0.5 0.5 0.5 0.5 0.5 0.5 0.5 
##$TPOFFS= (0..7)
0 0 0 0 0 0 0 0 
##$TUNHIN= 0
##$TUNHOUT= 0
##$TUNXOUT= 0
##$USERA1= <user>
##$USERA2= <user>
##$USERA3= <user>
##$USERA4= <user>
##$USERA5= <user>
##$V9= 5
##$VALIST= <valist>
##$VCLIST= <CCCCCCCCCCCCCCC>
##$VD= 0
##$VDLIST= <DDDDDDDDDDDDDDD>
##$VPLIST= <PPPPPPPPPPPPPPP>
##$VTLIST= <TTTTTTTTTTTTTTT>
##$WBST= 1024
##$WBSW= 4
##$XGAIN= (0..3)
0 0 0 0 
##$XL= 0
##$YL= 0
##$YMAX_a= 129641
##$YMIN_a= -168989
##$ZGOPTNS= <>
##$ZL1= 120
##$ZL2= 120
##$ZL3= 120
##$ZL4= 120
##$ABSF1= 10
##$ABSF2= 0
##$ABSG= 5
##$ABSL= 3
##$ALPHA= 0
##$AQORDER= 0
##$ASSFAC= 0
##$ASSFACI= 0
##$ASSFACX= 0
##$ASSWID= 0
##$AUNMP= <proc_1d>
##$AZFE= 0.1
##$AZFW= 0.1
##$BCFW= 1
##$BC_mod= 2
##$BYTORDP= 1
##$COROFFS= 0
##$CY= 11.3945322036743
##$DATMOD= 1
##$DC= 2
##$DFILT= <>
##$DTYPP= 0
##$F1P= 2.36226072786647
##$F2P= -0.459571619588291
##$FCOR= 0.5
##$FTSIZE= 0
##$FT_mod= 4
##$GAMMA= 1
##$GB= 0.15
##$INTBC= 1
##$INTSCL= 1
##$ISEN= 128
##$LB= 0.24
##$LEV0= 0
##$LPBIN= 0
##$MAXI= 10000
##$MC2= 0
##$MEAN= 0
##$ME_mod= 0
##$MI= 1.114404
##$NCOEF= 0
##$NC_proc= 0
##$NLEV= 6
##$NOISF1= 3.799351
##$NOISF2= 2.8
##$NSP= 1
##$NTH_PI= 0
##$NZP= 0
##$OFFSET= 15.70392
##$PC= 1
##$PHC0= -15872.22
##$PHC1= 10.8008
##$PH_mod= 1
##$PKNL= yes
##$PPARMOD= 0
##$PSCAL= 0
##$PSIGN= 0
##$REVERSE= no
##$SF= 200.130013532006
##$SI= 16384
##$SIGF1= 3
##$SIGF2= 2
##$SINO= 400
##$SIOLD= 16384
##$SREGLST= <1H.CDCl3>
##$SSB= 0
##$STSI= 0
##$STSR= 0
##$SW_p= 3612.71676300578
##$SYMM= 0
##$S_DEV= 0
##$TDeff= 0
##$TDoff= 0
##$TI= <>
##$TILT= no
##$TM1= 0
##$TM2= 0
##$TOPLEV= 0
##$USERP1= <user>
##$USERP2= <user>
##$USERP3= <user>
##$USERP4= <user>
##$USERP5= <user>
##$WDW= 1
##$XDIM= 8192
##$YMAX_p= 0
##$YMIN_p= 0
$$ End of Bruker specific parameters
$$ ---------------------------------
##NTUPLES= NMR FID
##VAR_NAME=  TIME,          FID/REAL,        FID/IMAG
##SYMBOL=    X,             R,               I
##VAR_TYPE=  INDEPENDENT,   DEPENDENT,       DEPENDENT
##VAR_FORM=  AFFN,          ASDF,            ASDF
##VAR_DIM=   8192,          8192,            8192
##UNITS=     SECONDS,       ARBITRARY UNITS, ARBITRARY UNITS
##FACTOR=    0.0002768,     1,               1
##FIRST=     0,             0,               0
##LAST=      2.2672688,     0,               0
##MIN=       0,             -168989,         0
##MAX=       2.2672688,     129641,          0
$$ Real data points
##PAGE= N=1
##DATA TABLE= (X++(R..R)), XYDATA
$$ [...]
$$ plain form
1891 152 244 238 -405 427 153 -607 397 -424 -219 21 -631 163 138 -540 199 -195 -422 362 -297 294 143
1912 143 -308 577 298 -159 208 8 347 395 -260 546 183 -133 236 -15 -131 196 -517 259 27 -516
1932 -516 -23 -176 -136 -58 -525 -31 104 -469 19 117 -318 229 -136 190 383 -84 413 270 62 259 -98
1953 -98 265 588 -642 112 277 -132 158 -385 -89 513 -559 -72 222 -396 118 -356 -462 270 -220 -342
1973 -342 411 -445 -21 190 -187 494 -179 19 508 -257 319 23 -266 347 -413 -471 444 -162 -167 142 -413
1994 -413 228 -466 -461 80 -423 -434 -148 -383 118 -127 -385 378 39 -97 277 -84 378 19 -326 478 -296
2015 -296 -233 527 -28 560 43 -431 431 -308 -376 58 -383 313 45 -594 74 -55 -361 19 -50 240 -42
2036 -42 -418 459 209 -260 577 85 38 294 -189 587 194 -163 436 -13 -129 265 -347 265 360 -413 46
$$ packed form
1891A52R2oo43Q32k74p60J004q21K05K40o52P94k5o78P39l94k27P84o59N91j51
1912A43m51Q85k79m57L67k00L39M8o55Q06l63l16L69k51j16L27p13P76k32n43
1932e16M93j53M0P8m67M94J35n73M88R8m35N47l65L26J93m67M97j43k08J97l57
1953i8L63L23j230P54J65m09K90n43K96O02j072M87K94o18N14m74j06P32m90j22
1973c42P53q56M24K11l77O81o73J98M89p65N76k96k89O13p60n8R15o06nL09n55
1994d13O41o94NN41n03j1K86k35N01k45k58P63l39j36L74l61M62l59l45Q04p74
2015b96O3P60n55N88n17m74Q62p39o8M34m41O96k68o39O68j29l06L80o9K90k82
2036d2l76Q77k50m69Q37m92m7K56m83P76l93l57N99m49j16L94o12O12R5p73M59
$$ plain form
2057 46 -143 -313 -152 -685 44 91 -603 -56 -83 -50 259 10 92 418 -386 29 170 -48 298 -255 107 561
2079 561 -277 236 228 -305 225 -332 31 315 -688 -91 208 -605 -55 -207 -233 509 -441 -34 397 -398 129
2100 129 -24 -114 389 -169 -106 669 -86 261 -7 49 511 -317 -163 354 -239 -246 77 -282 370 -415 -579 264
2122 264 -474 -155 135 -446 134 -252 -140 451 -83 -36 189 -112 175 -126 -236 434 88 -161 344 -41
2142 -41 398 204 -345 501 -244 -505 301 -183 -116 -78 -399 281 -350 -75 -82 -256 104 112 -313 205 121 -131 237
2165 237 44 -10 58 -411 570 15 -193 396 -208 46 334 -254 366 288 -420 173 -181 -320 111 -611 -134
2186 -134 95 -418 25 158 -324 201 -238 241 351 -493 16 415 -348 296 37 -7 588 -160 440 163
2206 163 -129 226 -72 -130 88 -304 -109 274 -453 -160 -136 -348 183 -349 -193 492 -302 -29 74 -74 45
$$ packed form
2057D6j89j70J61n33P29M7o94N47k7L3L09k49Q2L26q04M15J41k18L46n53L62M54
2079E61q38N13qn33N30n57L63K84j003N97K99q13N50j52k6P42r50M07M31p95N27
2100A29j53r0N03n58O3P75p55L47k68N6M62q28J54N17n93pL23l59O52p85j64Q43
2122B64p38L19K90n81N80l86J12N91n34M7K25l01K87l01j10O70l46k49N05l85
2142d1M39j94n49Q46p45k61Q06m84O7L8l21O80o31K75pj74L60Qm25N18q4k52L68
2165B37j93n4O8m69R81n55k08N89o04K54K88n88O20p8p08N93l54j39M31p22M77
2186a34K29n13M43J33m82N25m39M79J10q44N09L99p63O44k59m4N95p48O00k77
2206A63k92L55k98n8K18l92J95L83p27K93K4k12N31n32J56O85p94K73J03j48J19
$$ plain form
2227 45 -127 -71 540 -216 259 148 -64 228 19 -37 317 121 -14 292 -88 188 -182 -356 236 -375 -187
2248 -187 90 -285 210 -74 -123 322 -184 -261 168 -133 324 67 -161 483 8 -252 547 0 383 49 -509
2269 -509 408 -11 -473 311 -322 -110 127 -272 289 -297 -396 246 -34 -34 -150 -191 193 153 -420 43 -44 168
2291 168 221 -160 333 170 -173 290 316 -24 381 -170 180 343 -292 -146 16 -333 -19 -339 -74 35 -652
2312 -652 268 -20 -207 255 -556 -125 211 -259 238 251 -101 155 5 53 498 -576 394 445 -234 66 21
2333 21 -160 277 -458 90 146 -477 -354 -59 -44 258 -312 -37 264 -352 171 53 -44 171 -345 -23 572
2354 572 -148 142 203 -121 465 94 -127 368 -45 199 267 -201 -243 -129 -216 223 -373 -460 44 -444 -109 -223
2376 -223 -117 375 -52 -304 208 -41 217 114 -2 532 -88 -177 310 19 80 -39 -300 396 188 -268 314
$$ packed form
2227D5j72N6O11p56M75j11k12K92k09n6L54j96j35L06l80K76l70j74N92o11J88
2248a87K77l75M95k84m9M45n06p7M29l01M57k57k28O44m75k60P99n47L83l34n58
2269e09R17m19m62P84o33K12K37l99N61n86r9O42k80%j16m1L84m0n73M63q7K12
2291A68N3l81M93j63l43M63K6l40M05n51L50J63o35J46J62l49L14l20K65J09o87
2312f52R20k88j87M62q11M31L36m70M97J3l52K56j50M8M45j074R70N1o79L00m5
2333B1j81M37p35N48N6o23J23K95J5L02n70K75L01o16N23j18r7K15n16L22N95
2354E72p20K90O1l24N86l71k21M95m13K44O8m68m2J14q7M39n96q7N04m88L35j14
2376b23J06M92m27k52N12k49K58j03j16N34o20q9M87k91O1j19k61O96k08m56N82
$$ plain form
2397 314 -95 -66 44 -421 274 26 -506 3 -5 -97 90 -210 212 -74 -335 613 -239 -392 154 30 349
2418 349 205 -97 403 309 -211 196 -250 31 270 -141 140 154 -217 52 -165 7 -131 -670 -257 -247 -178
2439 -178 -51 -30 28 238 -159 367 299 -503 361 120 164 171 -317 148 378 -270 379 224 -142 384 -600 -131
2461 -131 116 -353 -72 -35 -327 31 -501 48 -120 -87 -246 157 -113 -55 -281 83 526 10 14 210 43 352
2483 352 126 -53 430 -149 -206 71 -380 279 -25 -365 237 -391 -367 298 -304 -57 33 -163 198 -391 -355
2504 -355 198 -164 81 262 -131 265 -70 -301 260 -67 157 178 -261 206 -22 -404 277 -131 -184 -85 -272
2525 -272 -200 -133 -179 179 -124 -269 144 -134 365 127 -357 277 -221 -202 -83 92 240 295 -104 275 108 -15
2547 -15 317 -41 430 146 -271 84 35 -586 -52 -389 20 96 -380 -56 106 -321 318 -61 24 123 -525 115
$$ packed form
2397C14m09K9J10m65O95k48n32N09qr2J87l00M22k86k61R48q52j53N46j24L19
2418C49j44l02N00r4n20M07m46K81K39m11K81J4l71K69k17J72j38n39M13J0O9
2439a78J27K1N8K10l97N26o8q02Q64k41M4Pm88M65K30o48O49j55l66N26r84M69
2461a31K47m69K81L7k92L58n32N49j68L3j59M03k70N8k26L64M43n16MJ96j67L09
2483C52k26j79M83n79n7K77m51O59l04l40O02o28K4O65o02K47R0j96L61n89L6
2504c55N53l62K45J81l93L96l35k31N61l27K24K1m39M67k28l82O81m08n3R9j87
2525b72P2O7m6L58l03j45M13k78M99k38m84O34m98J9J19J75J48N5l99L79j67j23
2547a5L32l58M71k84m17L55m9o21N34l37M09P6m76L24J62m27O39l79Q5R9o48O40
$$ plain form
2569 115 298 -204 267 86 218 370 -27 117 181 -387 404 101 -170 188 -425 29 269 -511 -93 247
2589 247 -2 124 -203 84 304 -250 -55 178 -267 -25 -138 -36 202 -281 101 218 -65 169 86 -91
2609 -91 379 -114 -102 240 -31 33 20 -343 286 -358 -142 115 -386 -298 28 -94 251 -240 -207 180 -160 16
2631 16 235 -218 350 -50 -280 511 -107 6 315 -310 161 305 -220 60 -229 -218 357 -286 -50 -25 -531
2652 -531 209 -44 -54 67 -155 -29 318 -209 188 20 3 -64 -168 129 323 -139 59 420 -167 215 37
2673 37 -6 -68 2 346 338 -351 212 -151 -67 94 -343 129 214 -362 178 -89 -151 121 -541 255 163 -100 142
2696 142 20 -39 460 -63 152 241 -152 46 317 161 -34 59 -38 214 -415 -5 241 -236 1 -156 -106 266
2718 266 -68 -414 172 -128 -18 -4 36 297 -375 111 205 -103 78 139 71 277 -241 46 356 -62 79 -15
$$ packed form
2569A15J83n02M71j81J32J52l97J44O4n68P91l03k71L58o13M54K40p80M18L40
2589B47k49J26l27K87K20n54J95K33m45K42j13J02K38m83L82J17k83K34q3j77
2609i1M70m93J2L42k71O4j3l63O29o44K16K57n01Q8L26j22L45m91L3L87l40J76
2631A6K19m53N68m00k30P91o18J13L09o25M71J44n25K80k89J1N75o43K36K5n06
2652e31P40k53j0J21k22J26L47n27L97j68j7o7j04K97J94m62J98L61n87L82j78
2673C7m3o2P0L44qo89N63l63Q4J61m37M72Q5n76N40k67o2K72o62P96r2k63K42
2696A42j22n9M99n23K15Q9l93J98K71j56j95R3r7K52o29M10K46m77K37j57N0L72
2718B66l34l46N86l00J10J4M0K61o72M86R4l08J81O1o8K06n18K87L10m18J41r4
$$ plain form
2740 -15 -168 286 -157 -20 176 -18 -60 -73 -73 253 -195 -191 319 -198 -51 -5 2 120 -172 -44 365 -69 -134 111
2764 111 -18 299 -67 -80 83 5 -242 61 -305 -72 -212 -345 336 -93 -334 109 -198 -98 -78 -262 184
2785 184 -63 -436 158 -354 20 94 -263 551 168 -154 301 -82 87 156 -302 311 374 -126 206 -56 32
2806 32 6 -92 72 100 -319 139 -70 -187 200 -171 -41 323 -57 39 308 -70 346 116 130 105 -248 -43
2828 -43 219 -81 298 -190 67 295 -298 36 79 -95 -213 -113 -80 199 -258 -101 436 -272 -25 -46 -312
2849 -312 238 -96 -111 286 -232 -22 303 -80 418 -352 -155 321 -98 81 149 -251 -62 -100 -107 107 -187 -269
2871 -269 61 -250 -159 -342 -87 182 -152 -237 153 -292 21 -19 -449 434 -104 288 121 -66 116 19 -62 530
2893 530 154 14 370 7 -124 109 -243 132 -22 -416 87 -223 -70 -165 -418 273 -390 -87 228 36
$$ packed form
2740a5j53M54m43J37J96j94m2j3%L26m48MN10n17J47M6PJ18k92J28M09m34o5K45
2764A11j29L17l66j3J63p8k47L03l66K33j40j33O81m29k41M43l07J00K0j84M46
2785A84k47l73N94n12L74P4l57Q14l83l22M55l83J69O9m58O13O3n00L32k62Q8
2806C2k6r8J64K8m19M58k09j17L87l71J30L64l80R6K69l78M16k30J4k5l53K05
2828d3K62l00L79m88K57K28n93L34M3j74j18J00L3K79m57J57N37p08K47k1k66
2849c12N50l34j5L97n18K10L25l83M98p70J97M76m19J79O8m00J89l8pK14k94q2
2871b69L30l11R1j83K55K69l34q5L90m45L13m0m30Q83n38L92j67j87J82r7q1N92
2893E30l76j40L56l63j31K33l52L75j54l94N03l10J53r5k53O91o63L03L15j92
$$ plain form
2913 36 -13 298 -247 290 240 -185 343 203 28 190 -312 -16 283 -230 21 154 -7 -30 -138 59 -47
2934 -47 -294 365 86 -179 266 -165 57 190 -92 29 458 65 224 -93 -165 287 -36 144 330 26 292
2955 292 -51 -172 243 -159 -58 45 -201 -140 -236 -175 111 -217 17 27 -248 -55 -41 -221 331 -221 -245 199
2977 199 -53 99 285 -36 -96 44 109 480 -82 6 305 -156 -82 31 -54 199 -230 59 -8 -135 122 -134
2999 -134 -11 260 -125 -154 301 -341 -40 187 -37 273 17 -69 185 35 219 18 -372 285 -112 -198 353
3020 353 -154 68 188 -76 412 -60 -24 242 -92 -100 155 -139 427 -41 -258 106 -95 -173 -51 161 36
3041 36 62 16 -70 72 74 203 -152 143 163 -427 430 177 -85 185 -51 16 219 -314 46 -16 -271 10 -367
3064 -367 -207 -50 -281 257 98 -380 331 -155 159 241 -225 28 128 -81 113 52 -57 218 -61 -124 212
$$ packed form
2913C6m9L11n45N37n0m25N28j40j75J62n02K96K99n13K51J33j61k3j08J97j06
2934d7k47O59k79k65M45m31K22J33k82J21M29l93J59l17p2M52l23J80J86l04K66
2955B92l43j21M15m02J01J03k46O1r6O1K86l28K34J0k75J93J4j80N52n52k4M44
2977A99k52J52J86l21o0J40O5L71n62Q8K99m61P4J13q5K53m29K89o7j27K57k56
2999a34J23K71l85k9M55o42L01K27k24L10k56q6K54j50J84k01l90O57l97q6N51
3020C53n07K22J20k64M88m72L6K66l34qK55k94N66m68k17L64k01p8J22K12j25
3041C6K6m6q6J42KJ29l55K95K0n90Q57k53k62K70k36O7K03n33L60o2k55K81l77
3064c67J60J57k31N38j59m78P11m86L14Q2m66K53J00k09J94o1j09K75k79o3L36
$$ plain form
3085 212 -224 -33 70 74 112 -65 77 191 -146 0 260 -72 235 292 -224 218 -146 158 5 -65 -51 -53 -124
3108 -124 270 -144 -40 274 -38 17 -74 -223 371 37 -46 178 -331 204 -131 -271 65 -25 -359 83 -137
3129 -137 -99 -60 -170 416 29 -138 423 -73 59 22 -111 337 -22 -190 241 -243 118 79 -250 183 -74
3150 -74 -210 208 93 -173 -13 -253 -29 -114 -188 333 -238 -88 147 -2 66 -6 23 192 -48 -42 281 -19 309
3173 309 96 -431 19 49 -251 210 134 69 45 -433 106 220 -164 236 61 -11 56 -387 114 82 -127 191
3195 191 53 156 173 -41 177 215 -216 257 206 49 216 -173 -127 301 -176 -110 114 -38 -30 -41 -78 338 -134
3218 -134 26 -63 -133 71 -189 -145 157 -138 -278 291 -275 151 131 -90 83 50 259 92 103 220 -30 -59
3240 -59 154 -208 -239 329 -316 -285 78 -47 164 -288 -307 -104 125 171 49 -75 86 -32 -236 298 -87 79
$$ packed form
3085B12m36J91J03ML8j77J42J14l37J46K60l32L07N7n16M42l64L04j53p0J4kp1
3108a24L94m14J04L14l12N5r1j49N94l34q3K24n09N35l35j40L36r0l34M42k20
3129a37L8L9j10N86l87j67N61m96J32l7j33M48l59j68M31m84L61l9l29M33k57
3150g4j36M18j15k66J60k40K24q5p4N21n71J50K35j49O8p2K9J69k40OL23l00L28
3173C09k13n27M50L0l00M61p6o5k4m78N39J14l84M00j75p2O7m43N01l2k09L18
3195A91j38J03J7k14K18L8m31M73n1j57J67l89M6M28m77O6K24j52Qj1l7M16m72
3218a34J60q9p0K04k60M4L02k95j40N69n66M26k0k21J73l3K09j67J1J17k50k9
3240e9K13l62l1N68o45L1L63j25K11m52j9K03K29M6j22j24J61j18k04N34l85J66
$$ plain form
3262 79 12 62 289 16 48 427 -149 -40 172 -230 176 20 -214 458 -445 -200 -43 -205 -149 -212 -496 174
3284 174 -166 26 118 -50 121 82 -103 298 270 -135 358 31 99 94 -125 303 142 -384 102 46 -54 82
3306 82 -154 176 104 -471 365 -58 -67 205 -310 15 29 -47 79 204 -108 367 -305 111 389 -133 205 -62
3328 -62 25 276 -205 -29 208 -101 -85 -125 -58 125 -184 -14 165 -152 -34 40 -129 146 -141 -243 59 -253
3350 -253 40 189 -155 208 -184 14 316 -163 -21 140 96 36 190 -150 339 -134 124 212 -175 15 -106
3371 -106 -181 148 -98 -252 127 -216 -424 111 -14 76 34 -372 271 215 -17 466 -37 89 7 -142 268 98
3393 98 -91 79 -151 71 -208 -227 70 -148 -67 113 -45 -4 -72 -269 117 -187 -299 295 -234 77 190 -91
3415 -91 284 82 -122 187 115 376 335 -111 499 134 -116 120 102 -26 -36 -156 41 -81 -183 37 35 -169
$$ packed form
3262G9o7N0K27k73L2L79n76J09K12m02M06j56k34O72r03K45J57j62N6o3k84O70
3284A74l40J92R2j68J71l9j85M01k8m05M93l27O8nk19M28j61n26M86n6j00J36
3306H2k36L30p2n75Q36m23rK72n15L25J4p6J26J25l12M75o72M16K78n22L38k67
3328f2Q7K51m81J76K37l09J6m0O7J83l09J70J79l17J18P4j69K75k87j02L02l12
3350b53K93J49l44L63l92J98L02m79J42J61m4o0J54l40M89m73K58Q8l87J90j21
3371a06p5L29k46j54L79l43k08N35j25R0m2m06O43n6k32M83n03J26q2j49M10j70
3393I8j89J70k30K22k79j9K97k18Q1J80j58M1o8j97L86l04j12N94n29L11J13k81
3415i1L75k02k04L09p2K61m1m46O10l65k50K36j8j28j0j20J97j22j02K20kk04
$$ plain form
3437 -169 -6 -96 137 13 -452 428 216 -35 255 57 108 336 -66 98 53 -345 174 -169 -13 230 -183
3458 -183 146 17 -49 90 -52 185 88 -236 -170 0 -181 -40 61 -179 258 -263 -55 157 -45 53 196
3479 196 57 101 73 -120 230 -78 19 84 -97 188 -147 -78 24 -109 -107 94 -253 406 -94 -144 375 -399 -47
3502 -47 81 -174 278 110 25 445 131 -234 175 106 321 123 -220 203 77 -128 137 -198 -56 63 50
3523 50 231 11 -165 302 -293 -83 48 -142 162 73 -259 73 -196 -19 141 -140 200 -16 -99 382 126
3544 126 -170 216 -198 173 -7 -193 139 -33 83 249 -103 170 -51 -126 85 -33 -71 -70 -378 -44 125
3565 125 -289 148 184 -111 225 -173 -26 92 -160 223 181 -118 145 34 -4 284 -171 19 118 -294 6
3586 6 -43 -340 72 -370 2 84 -52 53 83 -136 55 -363 160 161 -10 -82 -164 -89 69 -44 -176 368 -24
$$ packed form
3437a69J63r0K33j24m65Q80k12k51K90j98N1K28m02J64m5l98N19l43J56K43m13
3458a83L29j29o6J39j42K37r7l24O6J70j81J41J01k40M37n21K08K12k02R8J43
3479A96j39M4k8j93L50l08R7O5j81K85l35O9J02j33KK01l47O59n00n0N19p74L52
3502d7J28k55M52j68q5M20l14l65M09o9K15j98l43M23j26k05K65l35J42J19j3
3523E0J81k20j76M67n95K10J31j90L04q9l32L32k69J77J60k81L40k16q3M81k56
3544A26k96L86m14L71j80j86L32j72J16J66l52K73k21p5K11j18l8Jl08L34J69
3565A25m14M37L6k95L36l98J47J18k52L83m2k99K63j11l8K88m55J90R9m12L00
3586Fm9k97M12m42L72Q2j36J05L0k19J91m18N23Jj71p2q2P5J58j13j32N44l92
$$ plain form
3609 -24 245 244 -204 185 49 -293 110 -5 -187 35 -158 -127 57 -296 103 88 -309 132 -198 110 -109 -78
3631 -78 94 31 -131 -99 -11 173 -71 64 208 -157 -86 228 -122 -70 199 -258 164 -33 -60 77 150 67 22
3654 22 -243 206 8 -176 162 16 -358 153 -83 130 101 -30 311 -159 344 88 -363 81 147 -56 -61 -27
3676 -27 9 99 -146 -10 -16 -426 85 -3 -55 63 -90 50 116 62 43 161 -162 129 -137 156 114 -5 5 487
3700 487 -35 68 -116 -24 320 -286 275 90 -120 123 -165 -19 175 -356 184 -47 -198 69 174 -217
3720 -217 276 -159 -122 331 68 -30 51 0 159 -100 -80 245 -108 69 239 -152 184 -175 -319 138 -55 125
3742 125 14 -173 136 -79 -35 118 -125 -27 141 -260 11 -119 -240 238 116 -103 141 54 279 10 -276
3763 -276 270 236 -137 222 81 29 227 -208 3 -56 -103 90 0 -100 141 -229 248 -214 -262 125 -10 -96
$$ packed form
3609b4K69jm48L89j36l42M03j15j82K22j93L1J84l53L99j5l97M41l30L08k19L1
3631g8J72o3j62L2Q8J84k44J35J44l65P1L14l50N2K69m57M22j97k7J37P3q3m5
3654B2k65M49j98j84L38j46l74N11k36K13k9j31L41m70N03k56m51M44O6k03nL4
3676b7L6R0k45J36om10N11q8n2J18j53J40O6n4j9J18l23K91k66K93m2j19J0M82
3700D87n22J03j84R2L44o06N61j85k10K43k88J46J94n31N40k31j51K67J05l91
3720b17M93m35L7M53k63r8Q1n1J59k59K0L25l53J77J70l91L36l59j44M57j93J80
3742A25j11j87L09k15M4J53k43R8J68m01K71j30j21M78j22k19K44q7K25k69k86
3763b76N46l4l73L59j41n2J98m35K11n9m7J93r0j00K41l70M77m62m8L87j35q6
$$ plain form
3785 -96 -253 -142 -111 -42 -190 228 352 -73 63 71 315 65 -378 185 90 -27 194 -110 109 24 -96 9
3807 9 180 -239 49 75 76 53 -154 -89 398 -72 -36 144 -7 216 4 199 64 8 93 8 108 138 -173 118
3831 118 228 -254 272 348 0 270 -17 -38 128 -408 154 -55 -164 255 -218 121 -25 -83 118 -166 -70
3852 -70 80 158 -39 43 -75 15 513 -334 272 -39 -60 360 -268 -252 323 -113 123 -154 -89 59 26 -303 135
3875 135 -242 25 -168 -117 331 -42 -105 94 -160 -83 56 -346 -48 -5 -174 346 -38 90 -210 12 321
3896 321 114 -204 189 -190 -165 71 -276 -71 -310 -338 373 -166 -373 -31 -30 -25 -249 -118 217 -290 -21 258
3918 258 -41 312 150 -38 166 123 -58 78 7 -33 -165 -304 156 -69 -258 243 -57 -37 70 -127 -13
3939 -13 -92 -252 160 -116 -254 290 -34 121 95 -51 58 34 56 222 32 -14 398 -459 228 223 -112 92 11
$$ packed form
3785i6j57J11L1O9j48M18J24m25J36QK44k50m43N63r5j17K21l04K19q5j20J05
3807IJ71m19K88K6Jk3k07O5M87m70L6J80j51K23k12J95j35n6Q5q5J00L0l11K91
3831A18J10m82N26P6l48K70k87k1J66n36N62k09j09M19m73L39j46n8K01k84R6
3852g0J50P8j97Q2j18R0M98q47O06l11k1M20o28J6N75m36K36k77O5J48l3l29M38
3875A35l77K67j93N1M48l73o3J99k54P7J39m02K98M3j69N20l84J28l00K22L09
3896C21k07l18L93l79K5K36l47K05k39k8P11n39k07L42JNk24J31L35n07K69K79
3918B58k99L53j62j88K04m3j81J36p1m0j32j39M60k25j89N01l00K0J07j97J14
3939a3p9j60M12k76j38N44l24J55k6j46J09k4K2J66j90m6M12q57O87nl35K04q1
$$ plain form
3962 11 9 19 -314 -203 73 -230 215 -142 -298 105 -370 146 170 44 42 -106 108 199 -235 20 103 -105 16
3985 16 9 -8 74 -53 12 220 -70 73 213 140 82 -17 -163 194 -170 10 46 -81 -125 -226 -129 128 -207 20
4009 20 -67 -48 89 202 -131 11 -141 -122 87 -25 29 -34 -6 198 -161 -180 98 -140 47 -248 -281 -6 114
4032 114 -247 157 21 346 -120 -271 147 19 -125 216 17 -143 -30 -37 295 260 -68 81 51 44 10 -134
4054 -134 339 116 -320 -1 -50 -166 56 -324 -20 83 -124 -21 -44 10 129 -66 270 -43 -197 -35 237
4075 237 61 180 -198 44 222 -257 357 225 95 31 110 -156 89 -283 -132 42 -256 285 220 7 -8
4096 -8 -65 -185 -182 -84 -94 221 -149 240 -415 13 216 -113 180 83 -9 168 66 -322 202 -66 -178 -69 -239
4119 -239 125 -168 -191 199 -253 48 225 48 20 -391 -41 203 -107 -104 117 -58 39 -149 -419 374 -49 -78
$$ packed form
3962A1kJ0l33J11K76l03M45l57j56M03m75N16K4j26kj48K14R1m34K55Q3k08J21
3985A6pj7Q2j27O5K08k90J43J40p3n8r9j46L57l64J80L6j27m4j01R7K57l35K27
4009B0q7J9J37J13l33J42j52J9K09j12N4o3K8K04l59j9K78k38J87k95l3K75J20
4032A14l61M04j36L25m66j51M18j28j44L41j99j60J13pL32l5l28J49l0pl4j44
4054a34M73k23m36L19m9j16K22l80L04J03k07J03k3N4J19j95L36l13j54J62K72
4075B37j76J19l78K42J78m79O14j32j30o4P9k66K45l72J51J74k98N41o5k13j5
4096hn7j20LR8j0L15l70L89o55M28K03l29K93r7r2J77j02l88N24k68j12J09j70
4119b39L64k93k3L90m52L01J77j77k8m11L50K44l10LK21j75R7j88k70P93m23k9
$$ plain form
4141 -78 191 -108 192 80 -283 139 -290 -222 173 -2 226 79 -422 259 -11 -314 85 -263 -30 120 -119
4162 -119 50 -15 -153 2 122 -333 -3 32 33 174 -240 125 -17 146 14 -112 68 57 -100 163 -2 -225
4184 -225 191 -396 -49 -69 -205 85 77 -240 318 -122 23 72 -213 160 153 103 148 -108 -126 301 -198 202 233
4207 233 -84 211 30 -25 214 -292 -34 13 -33 53 -74 -88 -66 -273 -94 119 -301 -253 105 76 -144 -127 104
4230 104 331 -97 -147 81 91 113 -176 21 166 -170 -42 -6 -57 -54 -56 -194 148 99 -343 361 -133 93 30 69
4254 69 140 -241 -213 330 167 -186 -310 40 283 -33 -160 74 -102 162 95 -142 9 141 -153 -111 -136 -290
4276 -290 28 -82 55 -263 -130 -33 -328 -19 8 -3 68 94 -267 -71 -185 199 180 -245 417 -110 228 229 -176
4299 -176 -22 -73 -22 93 -101 -193 113 115 -29 -54 -46 187 -74 -267 36 47 -143 118 -354 209 -40 91 166
$$ packed form
4141g8K69k99L00j12l63M22m29O8L95j75K28j47n01O81k70l03L99l48K33J50k39
4162a19J69o5j38J55J20m55L30L5JJ41m14L65j42J63j32j26J80j1j57K63j65k23
4184b25M16n87L47k0j36K90ql17N58m40J45M9k85L73pn0M5k56j8M27m99M00L1
4207B33l17K95j81n5K39n06K58M7m6Q6j27j4K2k07J79K13m20M8L58k9k20J7K31
4230A04K27m28n0K28J0K2k89J97J45l36J28L6n1Lkj38L42m9m42P04m94K26o3L9
4254F9P1l81K8N43j63l53j24L50K43l16j27K34j76K64o7k37J51J32k94M2k5j54
4276b90L18j10J37l18J33R7k95L09K7j1P1K6l61J96j14L84j9m25O62n27L38Jm05
4299a76J54n1N1J15j94r2L06Kj44k5QK33k61j93L03J1j90K61m72N63k49J31P5
$$ plain form
4322 166 212 -49 377 -26 -25 266 -16 56 352 20 158 165 143 150 -257 123 177 -116 253 -170 171 286 -407
4345 -407 30 261 -113 -166 62 -62 293 -207 -204 226 -98 181 275 -15 207 -16 67 492 -119 114 98 16
4367 16 15 223 -80 146 -162 17 309 -86 -18 -347 168 -102 84 -57 77 185 17 180 -267 295 -152
4388 -152 17 285 120 99 -141 -68 145 -19 -79 -37 229 -13 -35 -129 97 -18 -183 30 -14 -175 -52 -8 24
4411 24 -67 -190 132 -209 -108 99 31 253 293 -121 196 18 82 53 -28 -1 -49 30 -86 4 -185 -132 -244 143
4435 143 -21 -199 -87 -3 -203 305 39 0 -117 -243 -48 191 -263 165 -56 -75 111 -94 216 260 42
4456 42 17 223 -30 299 -392 381 167 3 472 29 -148 117 -166 170 300 -139 -47 -120 -34 -220 -199 -27
4478 -27 107 -147 -78 53 114 169 -244 -114 22 -93 -131 103 -92 194 24 52 56 -111 -113 -30 78 -179 -58 -223
$$ packed form
4322A66M6k61M26m03JK91k82P2K96l32J38Pk2Pm07L80N4k93L69m23L41J15o93
4345d07M37K31l74n3K28j24L55n00LM30l24K79R4k90K22k23Q3M25o11K33j6q2
4367A6jK08l03K26l08J79K92l95O8l29N15k70J86j41J34J08j68J63m47N62m47
4388a52J69K68j65k1k40P3K13j64o0M2K66k42k2r4K26j15j65K13m4j61J23M4L2
4411B4r1j23L22l41J01K07o8K22M0m14L17j78O4k9q1K7m8P9j16R0j89N3j12L87
4435A43j64j78J12Q4k00N08k66l9j17j26J95K39m54M28k21j9J86k05L10M4k18
4456D2k5K06k53L29o91P73k14j64M69m43j77K65k83L36J30m39R2p3Q6j86K1J72
4478b7J34k54O9J31O1N5m13J30J36j15l8K34j95K86j70K8Mj67kQ3J08k57J21j65
$$ plain form
4502 -223 159 -155 -196 135 -71 41 -76 -8 -70 -90 -255 130 -21 -51 116 -199 308 69 -85 292 -27 -65
4524 -65 49 -273 57 -32 -260 302 -142 -8 -96 -227 220 12 -101 191 -140 -124 79 143 33 -33 148 260
4546 260 -37 -249 285 -23 321 103 36 -3 137 -378 257 -33 -63 172 -198 27 -99 -223 159 115 -118
4567 -118 68 -222 39 -70 -242 146 60 55 -41 -272 123 97 -97 290 261 -52 14 15 -40 109 -37 148 59 91
4591 91 140 -258 -31 77 -279 218 355 -244 141 -142 -35 258 -172 -52 151 -156 179 59 141 220 -139
4612 -139 25 236 -70 169 84 145 252 -68 -60 294 -249 53 58 -212 -77 -153 12 130 89 -151 26 -82 214
4635 214 -211 6 187 -153 185 185 -133 188 148 -36 197 73 -116 96 -180 79 -65 -83 121 -51 -92 -20
4657 -20 -235 -65 27 -49 303 97 -215 -23 -81 153 45 -166 -9 231 -19 156 -13 238 148 -164 41 210
$$ packed form
4502b23L82l14m1L31k06J12j17O8o2k0j65L85j51l0J67l15N07k39j54L77l19l8
4524f5J14l22L30q9k28N62m44J34q8j31M47k08j13K92l31J6K03O4j10o6J81J12
4546B60k97k12N34l08L44k18o7l9J40n15O35k90l0K35l70K25j26j24L82m4k33
4567a18J86k90K61j09j72L88q6nr6k31L95k6j94L87k9l13O6Jn5J49j46J85q9L2
4591I1M9l98K27J08l56M97J37n99L85k83J07K93m30J20K03l07L35j20Q2P9l59
4612a39J64K11l06K39q5O1J07l20QL54n43L02Nk70J35p6J65J18m1k40J77j08K96
4635B14m25K17J81l40L38%l18L21m0j84K33j24j89K12k76K59j44j8K04j72m1P2
4657b0k15J70R2p6L52k06l12J92n8K34j08k11J57K40k50J75j69K51r0l12K05J69
$$ plain form
4679 210 -113 142 155 249 -12 -385 -74 23 -82 78 -37 -50 -142 -210 12 -127 -151 75 287 23 104 -169 -66
4702 -66 97 -195 -28 78 -17 300 -126 -59 -152 48 354 68 -221 139 -128 -52 -56 -277 140 55 47 -210 3
4725 3 -229 223 48 44 53 -152 194 202 108 102 -61 -118 149 146 48 197 -61 176 53 130 244 -143 -117 -40 -159 284
4751 284 -230 -166 113 -50 204 151 -72 99 107 -68 219 36 -106 130 40 3 59 133 227 156 6 363 -70
4774 -70 67 66 219 197 -140 -186 52 63 33 126 -391 -72 111 -193 -105 -80 77 -74 -263 108 104 -208 84 -139
4798 -139 122 185 40 99 -10 -20 189 129 103 -18 -250 -227 78 -195 163 -75 -101 61 -112 32 -15 -121 203
4821 203 -99 -79 47 -169 166 203 -87 114 -46 -406 416 40 198 161 -400 -34 179 -190 -3 -189 -44
4842 -44 -87 -144 -310 15 27 -135 78 -159 -79 -84 18 155 56 -6 28 167 -51 -239 332 325 -76 50 -75 -11
$$ packed form
4679B10l23K55J3R4k61l73L11R7j05J60j15j3r2o8K22j39k4K26K12k64Q1k73J03
4702f6J63k92J67J06r5L17m26O7r3K00L06k86k89L60k67P6mk21M17q5qk57K13
4725Ck32M52j75mRk05L46Qr4oj63n7K67lr8J49k58K37j23P7J14l87K6P7j19M43
4751B84n14O4K79j63K54n3k23J71Qj75K87j83j42K36r0l7N6P4R4p1j50L57m33
4774g0J37jJ53k2l37m6K38J1l0R3n17L19J83l04Q8K5J57j51j89L71ml12K92k23
4798a39K61O3j45N9j09j0K09o0k6j21k32K3L05k73L58k38k6J62j73J44m7j06L24
4821B03l02K0J26k16L35L7k90K01j60l60Q22l76J58l7n61L66K13l69J87j86J45
4842d4m3n7j66L25J2j62K13k37Q0nJ02J37r9o2L4J39k18j88N71pm01J26j25O4
$$ plain form
4866 -11 274 115 -116 156 13 -50 -173 -272 149 -131 -92 165 -220 -19 166 -165 16 -219 -59 120 -145
4887 -145 25 100 -14 157 -69 -298 102 -86 -207 58 -248 6 -126 -303 91 -45 -254 -59 -130 -55 127
4908 127 -99 161 -32 0 135 -162 276 -101 161 -57 119 -21 144 -60 -76 47 -111 117 37 -83 166
4929 166 -44 -138 190 -27 -84 292 -65 139 52 -134 134 195 -39 14 -236 42 -60 -200 226 242 68 170
4951 170 -33 -85 172 40 -9 -91 130 71 68 267 -34 3 -7 -273 102 119 -136 118 114 -79 -15 -262 -241 -7
4975 -7 -309 -157 252 -183 54 17 60 53 -196 -77 327 -53 125 32 113 122 -129 209 86 -147 45 194 -337
4998 -337 175 213 -29 234 -87 108 189 2 -187 -72 104 194 -122 76 151 -154 150 10 -53 289 -169 -153
5020 -153 276 -48 -53 119 -44 -113 -29 210 132 -33 -49 137 120 262 -32 -205 -42 7 -210 -81 -118 213 162
$$ packed form
4866a1K85j59k31K72j43o3j23r9M21k80L9K57l85K01J85l31J81k35J60J79k65
4887a45J70P5j14J71k26k29M00j88j21K65l06K54j32j77L94j36k09J95p1P5J82
4908A27k26K60j93L2J35k97M38l77K62k18J76j40J65k04j6J23j58K28q0j20K49
4929A66k10r4L28k17n7L76l57K04q7j86K68O1k34N3k50K78j02j40M26J6j74J02
4951A70k03n2K57j32m9q2K21n9lJ99l01L7j0k66L75J7k55K54mj93O4k47K1K34
4975gl02J52M09m35K37l7M3pk49J19M04l80J78r3Q1Rk51L38j23k33J92J49n31
4998c37N12L8k42K63l21J95Q1j87j89J15J76R0l16J98P5l05L04j40o3L42m58J6
5020a53M29l24nJ72j63o9Q4K39p8j65j6J86j7J42k94j73J63M9k17J29l7L31n1
$$ plain form
5043 162 -142 219 -127 -60 79 66 92 -62 23 387 -26 -22 16 104 60 169 -155 62 -109 -55 17 31 -13 -207
5067 -207 -192 49 180 64 -80 -160 137 178 -281 229 -41 -168 -58 126 50 98 -171 -158 324 -112 178 -54
5089 -54 -163 200 12 44 1 -241 -159 70 -158 104 -69 56 235 -136 189 -103 -89 -94 -113 256 150 -60 -23
5112 -23 -6 -67 142 114 -151 -140 -133 -14 -44 105 -4 -261 90 -75 -288 106 167 15 271 -136 -162 16 -98
5135 -98 67 82 -61 -19 -101 -26 278 7 -1 455 -189 36 155 24 -9 0 -70 236 -1 8 192 38 23 -110 -40
5160 -40 35 -224 -25 -51 -300 -238 -14 20 -162 -295 109 131 -74 44 128 -13 429 23 6 -103 -157 122 -228
5183 -228 -124 3 115 -264 -71 48 45 87 -104 -90 232 -203 100 -2 21 -14 208 -41 113 -243 110 -10
5205 -10 -40 -76 -259 -126 199 -116 4 51 -109 10 -89 125 10 -222 61 20 25 -129 -247 41 398 -235 43
$$ packed form
5043A62l04L61l46O7J39j3K6j54Q5L64m13ML8Q8m4J09l24K17j71N4P2J4m4j94
5067b07J5K41J31j16j44q0K97M1m59N10k70j27J10J84p6M8k69J3M82m36K90k32
5089e4j09L63j88L2m3k42Q2K29k28K62j73J25J79l71L25k92J4nj9L69j06k10L7
5112b3J7o1K09k8k65J1PJ19l0J49j09k57L51j65k13L94O1j52K56m07k6J78j14
5135i8J65J5j43M2q2P5L04k71qM56o44K25J19j31l3Rp0L06k37RJ84j54j5j33P0
5160d0P5k59J99k6k49O2K24L4j82j33M04K2k05J18Q4j41M42m06j7j09n4K79l50
5183b28J04J27J12l79J93J19lM2j91J4L22m35L03j02K3l5K22k49J54l56L53j20
5205a0l0l6j83J33L25l15J20M7j60J19r9K14j15k32K83m1Nj54j18K88L57o33K78
$$ plain form
5228 43 -10 271 10 67 24 153 -7 -83 121 154 235 22 72 99 -10 -85 179 -96 124 -134 -110 181 -194 -100
5252 -100 229 58 -230 -124 -19 401 -15 194 176 103 -67 -134 53 38 129 -229 309 -236 -12 9 -97 -11
5274 -11 -116 -281 48 -53 -217 -25 -59 262 -46 -62 132 -10 -172 51 84 113 -172 -108 152 -157 227 210
5296 210 -176 210 103 -140 273 46 155 56 7 219 -16 41 108 94 -338 -63 -67 59 -91 -255 -44 -21 -62
5319 -62 -236 -173 -109 -92 -324 150 51 -161 -68 9 114 45 -116 -112 249 101 -232 40 23 18 -14 345 96 -224 -146
5344 -146 -34 183 -259 -114 51 -57 -241 -424 -57 -126 -226 -31 -11 181 11 182 51 125 194 107 -83 141
5366 141 -18 148 -104 -211 26 -22 72 43 -135 -30 146 -127 245 62 117 199 -370 -134 196 -335 -306 167
5388 167 24 -38 -92 -80 162 -80 74 -10 165 -48 21 -201 143 -116 -214 29 -2 -12 193 -9 -59 -306 100
$$ packed form
5228D3n3K81k61N7m3J29j60p6K04L3Q1k13N0K7j09p5K64k75K20k58K4K91l75R4
5252a00L29j71k88J06J05M20m16K09j8p3j70o7J87j5R1l58N38n45K24K1j06Q6
5274a1j05j65L29j01j64J92l4L21l08j6J94j42j62K23L3K9k85O4K60l09L84j7
5296B10l86L86j07k43M13k27J09r9m9K12k35N7O7j4m32K75mJ26j50j64K11K3m1
5319f2j74O3O4J7k32M74r9k12R3P7J05o9j61ML61j48l33K72j7nl2L59k49l20P8
5344a46J12K17m42J45J65j08j84j83L67o9j00J95K0J92j70J71j31P4O9q7j90K24
5366A41j59J66k52j07K37m8R4k9j78J05J76k73L72j83N5Q2n69K36L30n31K9M73
5388A67j43o2n4J2K42k42J54q4J75k13O9k22L44k59r8K43l1j0K05k02n0k47M06
$$ plain form
5411 100 -150 226 103 -106 73 -13 -123 85 52 -29 53 -31 18 263 -47 -272 446 129 -137 166 -21 83
5433 83 -100 -27 319 -278 49 103 -149 72 104 -232 181 -22 9 154 -50 51 127 -352 69 218 -68 -55
5455 -55 -70 61 158 -117 527 -110 -44 276 -155 209 -88 -182 -101 3 -210 13 29 -78 100 -286 15 -158
5477 -158 -166 -35 -10 -75 -77 -134 -131 12 117 96 106 -39 74 -99 -35 190 -384 51 4 161 158 -293 -8 166 -154
5502 -154 -290 2 -86 294 -43 -235 -46 117 -52 -123 -72 -175 -42 -238 150 126 166 34 119 115 265 -6 -30
5525 -30 81 16 53 141 161 3 -101 431 32 -68 55 53 33 37 -206 130 -244 3 128 8 -40 10 -73 228
5549 228 179 39 -149 -248 79 149 73 123 -107 -74 7 -133 -77 -14 -11 19 81 -206 96 94 179 5 -328 222 -56
5574 -56 -81 3 -7 -97 357 -47 -117 37 51 132 301 87 -29 -193 -127 -89 -400 -92 26 -77 -110 -89 -210 186
$$ packed form
5411A00k50L76j23k09J79q6j10K08l3q1Q2q4M9K45l10k25P18l17k66L03j87J04
5433H3j83P3L46n97L27N4k52K21L2l36M13k03L1J45k04J01P6m79M21J49k86J3
5455e5j5J31R7k75O44o37O6L20m31L64k97r4Q1J04k13K23J6j07J78l86L01j73
5477a58qJ31K5o5kn7LJ43J05k1J0j45J13j73O4K25n74M35m7J57lm51K85J74l20
5502a54j36K92q8L80l37j92J89J63j69p1N1j03J33j96L88k4M0j32Q5mJ50k71k4
5525c0J11o5L7Q8K0j58j04N32l99j00J23kk0Mk43L36l74K47J25j20m8N0q3L01
5549B28m9j40j88r9L27P0p6N0k30L3Q1j40N6O3LL0O2k87L02kQ5j74l33N50k78
5574e6k5Q4j0r0M54m04p0J54J4Q1J69k14j16j64O6L8l11L08J18j03l3K1j21L96
$$ plain form
5598 186 -13 -175 -150 -175 145 76 -291 171 -4 -50 211 -164 76 -6 -48 158 -102 21 42 103 90 -73 -26
5621 -26 44 2 -157 8 -146 59 53 -2 -293 -65 -216 41 -235 -181 238 -129 142 131 75 310 44 -114 197
5644 197 -137 22 40 140 87 -161 -107 -1 24 102 -6 -155 23 89 -27 -47 -367 -29 146 70 -24 205 -32
5667 -32 24 -42 7 67 56 255 -3 -24 208 67 -163 -61 -45 97 104 -74 -75 -151 6 146 -203 172 37 -158
5691 -158 24 -79 -85 98 92 155 17 0 -43 48 -71 -22 -158 58 52 44 154 206 -203 18 217 -129 -28 -230 87
5716 87 -58 -195 -23 -302 -11 138 -204 357 107 -201 18 26 -139 93 -95 -24 -184 -182 148 -69 27 335
5738 335 14 -53 116 59 124 163 -89 -139 31 -234 54 -101 -90 -14 39 186 -15 -151 3 -147 21 110 -24
5761 -24 214 35 58 25 -295 240 151 242 94 -189 -232 13 -233 -15 114 -102 -17 138 -40 -83 -89 -66 60 -224
$$ packed form
5598A86j99j62K5k5L20o9l67M62j75m6K61l75K40q2m2K06k60J23K1O1j3j63M7
5621b6P0m2j59J65j54K05on5k91K28j51K57k76N4M19l67K71j1n6K35k66j58L11
5644A97l34J59J8J00n3k48N4J06K5P8j08j49J78O6j16k0l20L38J75p6r4K29k37
5667c2N6o6M9O0j1J99k58k1K32j41k30J02J6J42Pj78jp6J57J40l49L75j35j95
5691a58J82j03oJ83oO3j38j7m3R1j19M9j36K16oqJ10N2m09K21J99l46J01k02L17
5716H7j45j37J72k79K91J49l42N61k50l08K19Qj65K32j88P1j60KL30k17R6L08
5738C35l21o7J69n7O5L9k52n0J70k65K88j55J1P6N3J47k01j36J54j50J68Q9j34
5761b4K38j79K3l3l20N35q9R1j48k83m3K45k46K18J29k16Q5J55j78m3oK3J26k84
$$ plain form
5785 -224 -112 501 -235 -5 -241 -32 198 75 -191 -83 95 252 89 -23 202 -199 -216 279 -26 148
5805 148 113 106 -26 -31 37 74 30 -58 -134 26 -71 -125 -157 -57 189 279 103 -5 55 21 66 -168 30 -96 21 203
5831 203 35 -95 -241 257 96 28 -69 -124 14 124 -71 130 117 110 268 -78 -126 2 38 -51 -215 -70 128
5854 128 -64 -193 217 -82 143 72 -145 152 -25 275 102 -162 94 161 -68 193 -53 159 122 2 -53
5875 -53 295 73 201 -61 -31 -51 -342 23 113 -44 212 -176 -60 54 -78 97 18 52 82 45 -72 171 -188
5898 -188 186 311 83 -67 465 -10 84 -21 -87 -61 2 -3 116 -260 101 -263 45 -58 -114 -15 21 -60 -139 -45
5922 -45 238 200 -269 -65 23 -27 210 231 -242 93 208 -22 44 139 -71 -130 -65 -155 66 71 93 -11 119 10
5946 10 10 108 0 -44 -104 -203 -108 -6 -170 203 -56 56 141 -3 37 233 -43 169 92 -94 6 71 -69 147
$$ packed form
5785b24J12O13p36K30k36K09K30j23k66J08J78J57j63j12K25m01j7M95l05J74
5805A48l5pj32nO8L7m4q8p6J60r7n4l2J00K46R0j76j08O0l4M5k34J98j26J17J82
5831B03j68j30j46M98j61o8r7n5J38J10j95K01j3pJ58l46m8J28L6q9j64J45J98
5854A28j92j29M10k99K25p1k17K97j77L00j73k64K56O7k29K61k46K12l7j20n5
5875e3L48k22J28k62L0k0k91L65R0j57K56l88J16J14j32J75p9L4L0l7j17K43l59
5898a88L74J25k28j50N32m75R4j05o6K6O3nJ19l76L61l64L08j03n6R9L6q1p9R4
5922d5K83l8m69K04Q8n0K37K1m73L35J15k30O6R5k10n9O5r0K21NK2j04J30j09
5946A0%R8j08m4o0r9R5J02j64L73k59J12Q5j44M0J96k76K12p7j86J00O5j40K16
$$ plain form
5970 147 -152 71 -40 86 52 -34 -240 -39 -154 15 8 -13 15 95 -128 149 124 -97 -86 -209 102 24 -181
5993 -181 79 -23 -28 -98 -197 25 -41 -46 7 -149 -182 -111 -290 21 -167 -313 -309 -181 126 166 -57 123 326 -65
6017 -65 200 45 137 22 176 61 345 -223 41 55 -66 81 90 79 -49 -180 -172 53 -49 -175 81 -53 -94
6040 -94 -34 184 -107 -92 135 -99 99 -73 78 -9 -70 -14 48 458 72 175 -221 -36 155 -39 66 154 71
6063 71 -12 -170 43 -53 -221 -220 -67 -91 84 38 -262 17 171 -211 31 132 67 82 -195 -58 -88 -150 -10 129
6087 129 21 74 -69 255 -229 69 17 53 32 72 -126 25 238 31 21 197 -116 85 -56 153 -68 41
6109 41 220 -87 23 192 158 -33 65 73 147 107 -86 -94 5 -121 -34 -170 -59 196 190 127 10 -102 291 -84 -145
6134 -145 -89 222 189 -36 31 192 -23 -71 80 56 150 80 -36 -52 -12 -68 90 -86 44 -145 202 191 -70 67
$$ packed form
5970A47k99K23j11J26l4q6k06K01j15J69pk1K8Q0k23K77k5k21J1j23L11p8k05
5993a81K60j02np0r9K22o6nN3j56l3P1j79L11j88j46MJ28L07M0k23J80K03l91
6017f5K65j55R2j15J54j15K84n68K64J4j21J47Rj1j28j31QK25j02j26K56j34m1
6040i4O0K18k91J5K27k34J98j72J51q7o1N6O2M10l86J03l96J85J91j94J05Q8q3
6063G1q3j58K13r6j68JJ53k4J75m6l00K79J54l82K42J01o5J5k77J37l0o2J40J39
6087A29j08N3j43L24m84K98n2L6k1M0j98J51K13k07j0J76l13K01j41K09k21J09
6109D1J79l07J10J69l4j91R8QP4m0j93qR9j26Q7j36J11K55oo3j17j12L93l75o1
6134a45N6L11l3k25O7J61k15m8J51k4R4p0j16j6M0n6J58j76J30j89L47j1k61J37
$$ plain form
6158 67 -83 -12 14 -188 -139 138 -91 17 136 53 162 -51 72 2 175 -89 9 -148 -14 156 -124 1
6180 1 13 -56 74 -72 -209 55 -3 -13 37 -44 -36 143 -177 -159 -311 61 -50 -74 69 -32 -90 169 143 95 117
6205 117 -113 105 -224 94 94 27 83 54 -9 -44 8 24 -100 -70 45 -20 -19 130 117 -136 137 -255 -315 131 -125
6230 -125 42 157 -319 66 95 -162 77 -83 43 88 -61 -163 44 -81 -1 60 -7 228 -79 107 -144 -55
6252 -55 -55 -197 -43 -137 -166 108 -48 154 -136 -150 54 -21 -218 329 2 -91 -88 126 82 166 -174 145 162 98 24
6277 24 -252 -51 42 88 116 93 -251 72 27 -80 62 -39 56 54 -33 55 61 129 218 -107 -86 18 -142 -103 35 -53
6303 -53 321 -26 22 132 -184 145 -85 -124 94 -220 -170 -83 -76 -207 154 -102 156 0 -238 -62 176 37
6325 37 -252 31 168 45 -109 -16 42 157 159 -142 186 339 125 -160 -57 -54 205 45 154 -9 -186 134
$$ packed form
6158F7j50P1K6k02M9K77k29J08J19q3J09k13J23p0J73k64R8j57J34J70k80J25
6180AJ2o9J30j46j37K64n8j0N0q1QJ79l20J8j52L72j11k4J43j01n8K59k6m8K2
6205A17k30K18l29L18%o7N6k9o3l5N2J6j24L0J15o5JJ49j3k53K73l92o0M46k56
6230a25J67J15m76L85K9k57K39j60J26M5j49j02K07j25Q0O1o7K35l07J86k51Q9
6252e5%j42J54r4k9K74j56K02k90j4K04p5j97N47l27r3LK14m4Q4l40L19J7o4p4
6277B4k76K01R3M6K8k3l44L23m5j07J42j01R5kq7Q8OO8Q9l25K1J04j60L9J38q8
6303e3L74l47M8J10l16L29k30l9K18l14N0Q7Pj31L61k56K58j56k38J76K38j39
6325C7k89K83J37j23j54R3N8J15Kl01L28J53k14k85J03LK59j60J09j63j77L20
$$ plain form
6347 134 123 -234 -151 125 -7 -104 -39 291 167 -113 89 -93 67 27 83 -42 60 -189 135 247 79 -25
6369 -25 -11 -17 -107 -55 11 -56 315 -17 21 31 -150 -57 -37 -101 -115 33 54 95 -59 126 -69 48 104 14 -147 -3
6395 -3 166 -24 -117 -76 -32 213 53 59 270 356 379 75 -170 0 -100 -73 -177 -14 -63 165 35 -29 -27 -220 -181
6420 -181 -59 -23 186 3 75 317 -90 -18 85 179 188 -73 124 -15 25 -56 -91 -267 -91 0 -12 -80 155 -67
6444 -67 -50 -119 -44 296 -135 280 -119 -40 126 -188 -144 48 -95 -216 -40 127 61 -37 284 -126 13 -15 -22 80
6468 80 271 -81 146 13 -146 95 -111 201 59 95 52 -214 7 256 -68 46 271 15 66 219 -161
6489 -161 -66 135 -109 191 -23 11 189 -109 116 -279 -105 193 -167 -181 109 -195 -116 61 -224 62 -101
6510 -101 -45 54 -184 -39 59 90 -57 -10 126 141 -31 -125 -15 -34 10 -15 5 87 62 18 103 -209 -7 206 -159
$$ packed form
6347A34j1l57Q3K76j32r7O5L30j24k80K02j82J60m0N6j25J02k49L24J12j68j04
6369b5J4or0N2O6o7L71l32L8J0j81R3K0o4j4J48K1M1j54J85j95J17N6r0j61J44
6395cJ69j90r3M1M4K45j60OK11Q6K3l04k45J70j00K7j04J63m9K28j30o4Kj93L9
6420a81J22L6K09j83P2K42m07P2J03R4Rk61J97j39M0q1l5j76J76R1j2o8K35k22
6444f7J7o9P5L40m31M15l99P9J66l14M4J92j43j21J76J67o6r8L21m10J39k8pJ02
6468H0J91l52K27j33j59K41k06L12j42L6m3k66K21K49l24J14K25k56N1J53l80
6489a61R5K01k44L00k14L4J78k98K25l95J74K98l60j4K90l04P9J77k85K86j63
6510a01N6R9k38J45R8L1j47M7J36J5j72r4J10j9M4k5K0Q2k5m4Q5l12K02K13l65
$$ plain form
6535 -159 120 -151 -107 -282 -13 -96 28 -34 188 -168 -120 32 -66 -167 113 -106 -22 -88 -219 318 -151 103
6557 103 -4 -179 -83 -165 -305 70 -122 -34 18 -96 -28 125 -178 24 3 -163 -32 -88 -7 114 -94 -136 -170
6580 -170 -152 90 -36 169 132 -80 -142 134 -151 71 0 -11 6 -38 103 239 -137 286 118 100 22 249 -18
6603 -18 136 -175 118 -53 -176 106 -183 -22 91 9 -36 60 117 -160 -173 41 159 -48 173 96 96 109 67 -80
6627 -80 -50 -103 -112 -164 -131 56 222 -179 -1 -49 96 -23 66 171 50 36 105 -25 216 273 -206 135 17 -91
6651 -91 46 -126 189 196 -69 -37 -97 -114 9 -5 421 -54 -2 -108 187 -86 -39 30 -18 209 -82 -121 -48 31 41
6676 41 -18 -134 136 52 30 7 131 106 80 166 -13 -161 -40 137 -113 -102 6 -129 92 -51 24 39 -46 17
6700 17 31 -160 -62 -1 51 196 173 -255 199 -91 10 -84 84 36 97 91 -40 -116 32 55 -291 97 63 -222 70
$$ packed form
6535a59K79k71M4j75K69q3J24o2K22l56M8J52r8j01K80k19Q4o6j31N37m69K54
6557A03j07j75R6q2j40L75j92Q8N2j14O8J53l03K02k1j66J31n6Q1J21k08m2l4
6580a70J8K42j26K05l7k12o2K76k85K22p1j1J7m4J41J36l76M23j68j8p8K27k67
6603a8J54l11K93j71j23K82k89J61J13q2m5R6N7k77j3K14J18k07K21p7%J3m2j47
6627h0L0n3rn2L3J87J66m01J78m8J45j19Q9J05j21j4O9j30K41N7m79L41j18j08
6651i1J37j72L15Pk65L2o0j7J23j4M26m75N2j06K95k73M7O9m8K27k91l9P3P9J0
6676D1n9j16K70q4k2k3J24k5k6Q6j79j48J21J77k50J1J08j35K21j43P5J5q5O3
6700A7J4j91R8O1N2J45k3m28M54k90J01r4J68m8O1oj31p6J48K3l46L88l4k85K92
$$ plain form
6725 70 42 -46 18 -285 -237 -174 -137 11 179 -122 66 -62 219 67 -35 63 28 17 -132 -120 -93 43 -7 -56 123
6750 123 291 30 27 -127 -115 -135 -38 110 -73 92 -20 143 59 34 52 -213 143 38 146 -77 259 153 216
6773 216 455 154 98 -167 59 -174 34 180 78 -32 88 23 -189 174 -36 -87 -107 125 142 -85 173 -110
6795 -110 -174 -17 205 73 89 51 -41 144 72 -74 -37 85 276 -52 64 55 -22 -354 290 21 77 204 -3
6818 -3 -25 72 -94 -15 -144 -70 100 87 255 -66 -17 10 -85 -55 -59 66 -162 -59 -107 -51 181 55 141 -163 -23
6843 -23 206 -34 218 54 142 -44 79 -133 115 363 15 119 -59 82 16 -168 -176 60 21 -170 -133 113
6865 113 10 301 193 -231 94 -185 -127 248 -6 -12 -49 -61 204 -26 -149 -9 -21 -140 -111 -179 -58 156 -86
6888 -86 202 -32 166 283 -116 -29 151 97 142 -52 115 194 67 -80 79 23 36 112 -56 93 -62 5 -97
$$ packed form
6725G0k8q8O4l03M8O3L7J48J68l01J88j28K81j52j02R8l5j1j49J2K7J36n0m9J79
6750A23J68k61lj54J2k0R7J48j83J65j12J63q4k5J8k65L56j05J08k23L36j06O3
6773B16K39l01n6k65K26k33K08J46j02j10J20o5k12L63k10n1k0K32J7k27K58k83
6795a10o4J57K22j32J6l8r2J85p2j46L7J22J91l28J16rp7l32O44k69N6J27k07
6818ck2R7j66P9j29P4J70j3J68l21M9K7r5L0mJ25k28J03m8N6K32j26Q6l04J40
6843b3K29k40K52j64Q8j86J23k12K48K48l48J04j78J41o6j84qK36l9j91L7K46
6865A13j03K91j08m24L25k79N8L75k54ol7j2K65k30j23J40j2j19K9o8J21K14k42
6888h6K88k34J98J17l99Q7J80n4M5j94J67P9j27j47J59n6J3P6j68J49j55O7j02
$$ plain form
6911 -97 41 101 -91 30 88 -144 -171 -25 23 164 47 -113 -50 -75 -49 177 150 62 88 28 -17 -20 -215 -103 -63
6936 -63 146 246 -186 -59 -9 -16 88 90 -11 -112 -179 -108 -190 -169 -25 -103 101 -29 -209 -83 144 198 -65 37
6960 37 -10 97 29 22 -74 68 100 130 92 77 6 -201 299 54 -51 -240 -234 -20 -128 -50 64 93 60 106 -70 177
6986 177 151 109 143 118 204 133 312 163 -110 -65 -10 -101 -42 21 -138 21 -174 -2 7 19 4 -54 28 -114 -73 43
7012 43 145 16 -84 114 91 166 120 -158 146 143 -136 173 -7 111 65 -72 -2 -101 29 200 -108 -62 160
7035 160 -211 -191 -29 -264 -126 106 -90 139 -112 103 169 -230 49 -138 58 -211 -125 -16 -82 48 198
7056 198 45 38 30 159 -148 138 -60 -172 -10 23 -132 287 -116 -5 -81 -130 106 126 -189 36 -124 66 118
7079 118 -237 229 61 -111 53 -7 19 53 -56 193 -118 216 -216 -49 68 59 46 -99 -9 36 65 -162 107
$$ packed form
6911i7J38O0j92J21N8k32k7J46M8J41j17j60O3k5K6K26k7q8K6o0m5lj95J12M0
6936f3K09J00m32J27N0pJ04Kj01j01o7P1q2K1J44p8K04j30j80J26K27N4k63J02
6960C7m7J07o8pr6J42L2L0l8j5p1k07N00k45j05j89OK14j08P8J14K9l3M6j76K47
6986A77k6m2L4k5Q6p1J79j49k73M5N5r1N9O3j59J59j95J72RJ2j5n8Q2j42M1J16
7012D3J02j29j00J98k3P5m6k78L04lk79L09j80J18m6j37P0r9J30J71l08M6K22
7035A60l71K0J62k35J38K32j96K29k51K15O6l99K79j87J96k69Q6J09o6J30J50
7056A98j53pqJ29l07K86j98j12J62L3j55M19m03J11p6m9K36K0l15K25j60J90N2
7079A18l55M66j68j72J64o0K6L4j09K49l11L34m32J67J17rj3j45R0M5K9k27K69
$$ plain form
7102 107 -13 -79 92 15 -44 -139 -3 -39 246 56 112 -9 56 -25 154 113 131 -153 -34 -83 -262 67 -22 -46
7126 -46 -28 -1 -58 -60 52 328 -143 249 48 -128 34 235 99 -182 96 -81 -121 23 -24 74 65 212 -3 -25
7150 -25 236 83 -77 -36 -110 54 109 -127 169 -362 -127 207 -158 122 166 -209 143 91 -85 9 8 -48 176
7173 176 -199 0 3 88 243 -25 -2 -32 61 18 12 -28 -111 -191 -125 105 -99 -148 -11 -44 -119 -33 -98 106 -87 147
7199 147 128 -54 136 -18 139 103 -97 -22 5 -124 -49 -134 -234 -27 55 28 -92 309 295 -22 -98 -46 -120 -143
7223 -143 18 12 -256 103 -217 11 52 107 -52 -85 -37 -165 -227 -21 -85 -153 62 -15 -8 9 56 96 48 23 34 93
7249 93 -248 217 -103 -41 37 -221 -73 -134 -37 -33 -37 -185 83 51 170 125 -157 281 -104 168 -165 -10 138 134
7273 134 19 -66 -163 -55 110 141 134 -30 -246 73 -66 85 204 -169 95 -13 -62 284 -123 -76 14 75 46
$$ packed form
7102A07j20o6J71p7n9r5J36l6K85j90N6j21O5q1J79m1J8k84J19m9j79L29q9k4
7126d6J8K7n7kJ12K76m71L92k01j76J62K01j36k81K78j77m0J44m7R8rJ47k15k2
7150b5K61j53j60M1p4J64N5k36K96n31K35L34l65K80M4l75L52n2j76R4jn6K24
7173A76l75J99LQ5J55k68K3l0R3m3om0q3q0O6K30k04m9J37l3p5Q6o5K04j93K34
7199A47j9j82J90j54J57l6k00P5K7j29P5q5j00K07Q2k7j20M01j4l17p6N2p4k3
7223a43J61ok68L59l20K28M1N5j59l3M8j28o2K06o4o8K15p7PJ7M7M0m8k5J1N9
7249I3l41M65l20O2P8k58J48o1R7Mmj48K68l2J19m5k82M38l85K72l33J55J48m
7273A34j15q5r7J08J65L1pj64k16L19j39J51J19l73K64j08m9L46m07M7R0O1k9
$$ plain form
7296 46 -13 -19 -17 -223 107 171 -94 195 190 46 290 65 311 171 -117 74 202 62 -58 114 -46 127 113
7319 113 -183 68 185 -2 13 139 -62 20 -3 10 72 -127 1 -32 99 -8 128 114 -131 -36 -101 -176 145
7342 145 138 -61 -68 -138 -185 111 -68 255 221 -205 23 -111 18 330 95 120 -95 -76 -64 -77 -99 11 135 30
7366 30 134 -48 182 -1 172 31 -8 -115 71 74 -320 -27 -188 97 -122 -128 -129 -137 -121 35 -21 201 133 -187
7390 -187 31 -29 -97 150 -171 49 -69 56 -208 -138 87 149 -86 -98 -44 -69 26 96 181 -124 88 -18 -150
7413 -150 -119 -202 -144 212 170 -84 -39 -46 -216 -47 232 123 145 -97 105 -179 93 242 43 99 21 369 182
7436 182 47 -97 -47 -223 -3 -278 -69 41 200 15 -12 -9 4 41 -160 33 77 37 -103 -207 -103 68 35
7459 35 194 123 66 144 -5 -53 -79 -51 154 -107 48 -20 -71 -141 -95 -119 -200 -58 114 -13 29 -165 -151 87 77
$$ packed form
7296D6n9oKk06L30O4k65K89nj44K44k25K46j40k88J91J28j40j20J72j60J73j4
7319A13k96K51J17j87J5J26k01Q2k3J3O2j99J28l3J31j07J36j4k45R5o5p5L21
7342A45pj99pp0m7K96j79L23l4m26K28j34J29L12k35K5k15J9J2j3k2J10J24j05
7366C0J04j82K30j83J73j41l9j07J86Ll94K93j61K85k19ojqJ6J56n6K22o8l20
7390a87K18o0o8K47l21K20j18J25k64P0K25O2k35j2N4k5R5P0Q5l05K12j06j32
7413a50L1q3N8L56m2k54M5pj70J69K79j09K2k42K02k84K72J49j99N6p8L48j87
7436A82j35j44N0j76K20k75K09J10J59j85k7LJ3L7k01J93M4m0j40j04J04J71l3
7459C5J59p1n7P8j49m8k6K8K05k61J55o8n1p0M6k4q1J42J72j27M2j94J4K38j0
$$ plain form
7484 77 -39 -51 0 88 -12 112 0 -47 77 66 -138 183 107 -2 52 -27 302 207 -174 71 29 260 -48 -316
7508 -316 -213 33 -244 31 -82 128 113 -126 38 3 258 15 -27 -45 -12 162 36 39 66 -212 -10 -56 188
7531 188 3 -88 206 -17 -227 -62 -135 -199 -232 74 -333 -2 -128 229 -354 73 -217 -402 -43 -161 222
7552 222 89 -55 47 177 -7 83 -137 -41 110 -187 -221 140 -137 -217 22 -22 -49 -78 0 15 -13 169 -31
7575 -31 -1 -111 -70 75 -57 168 -86 -165 -66 248 56 -76 123 165 -235 -95 -49 -17 -21 -49 80 223 57 -90
7599 -90 -73 -108 -307 -80 162 -5 -53 -85 186 19 -107 268 100 83 -238 -62 -54 -56 -308 -198 62 -11 -10 -128
7623 -128 16 -27 -217 -129 59 -82 -16 22 129 -62 100 103 63 59 24 -64 -77 -161 -297 -160 119 -228 -24 99
7647 99 201 107 -41 -138 -204 165 117 106 120 -280 6 137 -15 75 31 53 -126 2 56 159 -138 81 138 88
$$ packed form
7484G7j16j2N1Q8j00J24j12m7J24j1k04L21p6j09N4p9L29r5l81K45m2K31l08k68
7508c16J03K46k77K75j13K10j5k39J64l5K55k43m2j8L3J74j26LK7k78K02m6K44
7531A88j85r1K94k23k10J65p3o4l3L06m07L31j26L57n83M27k90j85L59j18L83
7552B22j33j44J02J30j84R0k20R6J51k97l4L61k77q0K39m4k7k9P8J5k8J82k00
7575c1L0j10M1J45j32K25k54p9R9L14j92j32J99M2m00J40M6L2mk8J29J43j66j47
7599i0J7l5j99K27K42j67m8l2K71j67j26L75j68j7l21J76Qkk52J10K60p3Jj18
7623a28J44m3j90Q8J88j41O6L8J07j91J62Lm0ml5q8j3q4j36J37K79l47K04J23
7647I9J02r4j48r7o6L69m8j1J4m00K86J31j52R0m4K2j79J28N4J03k97K19N7n0
$$ plain form
7671 88 -121 -203 40 104 -209 -78 307 34 101 108 36 -234 -174 -290 -76 -133 272 -65 -59 -105 -54 99 -150 187
7695 187 304 71 -121 241 -192 107 56 41 69 144 128 83 -294 -170 -21 0 -114 -29 -45 -41 -8 17 54 159 -116
7720 -116 -57 -64 10 -62 13 32 -109 -209 -120 -133 234 170 145 224 30 41 -243 25 144 -42 39 132 -183 -44 143
7745 143 163 139 23 -122 205 -111 -110 -157 124 73 -69 -153 119 196 -146 -72 100 -146 209 -2 -318 73 0
7768 0 -88 -425 264 144 -223 255 -132 9 112 70 120 -196 -180 -57 -164 59 -211 159 37 -1 8 -36 -101 -172
7792 -172 26 -256 223 124 159 -17 144 430 -26 39 129 184 3 15 -10 178 12 110 129 -98 100 -40 -20
7815 -20 46 339 -173 -204 93 136 -165 -258 -91 131 -10 64 102 142 -56 89 228 -105 -68 -37 -187 24 182
7838 182 286 -255 171 -129 85 -39 -111 -249 -258 -122 -81 -86 -233 -10 115 324 84 28 128 19 -43 4 -74
$$ packed form
7671H8k09q2K43O4l13J31L85k73O7Pp2k70O0j16K14n7M05l37Om6N1J53k49L37
7695A87J17k33j92L62m33K99n1j5K8P5j6m5l77J24J49K1j14Q5j6ML3K5L7J05k75
7720a16N9pP4p2P5J9j41j00Q9j3L67o4k5P9j94J1k84K68J19j86Q1R3l15J39J87
7745A43K0k4j16j45L27l16Jm7K81n1j42q4K72P7l42P4J72k46L55k11l16L91p3
7768@q8l37O89j20l67M78l87J41J03m2N0l16J6J23j07K23k70L70j22l8Rm4o5p1
7792a72J98k82M79r9L5j76J61K86m56O5R0N5j81J2k5J88j66R8J9k27J98j40K0
7815b0O6K93n12l1K97M3l01r3J67K22j41P4L8M0j98J45J39l33L7L1j50K11J58
7838A82J04n41M26l00K14j24p2j38rJ36M1nj47K23J25K09k40n6J00j09o2M7p8
$$ plain form
7861 -74 -220 198 -118 176 131 -2 -61 154 143 142 97 127 115 -8 -33 -205 196 242 -23 -201 -21 89 -11 113
7885 113 33 46 90 -59 -113 56 -74 -97 -104 -222 100 -83 194 161 -24 71 82 31 122 -20 129 -27 175 345
7909 345 -193 160 209 142 100 -145 114 17 23 -70 -125 174 -100 59 16 -67 21 -129 -197 62 23 165 -85 155
7933 155 10 -32 161 158 78 97 19 68 -165 15 113 -134 -7 -86 -126 335 355 -47 -107 144 37 119 -290 -80
7957 -80 -6 -265 69 43 73 247 -112 -137 191 19 -91 -96 -157 21 -235 -27 -117 -128 6 -50 -43 49 23 -171 -91
7982 -91 -259 2 130 155 -37 -129 124 -5 -10 -199 -127 76 -108 -91 -33 32 -192 -71 -60 -249 -64 29 0 -45
8006 -45 -261 36 -132 61 -7 141 101 -62 290 130 79 -138 -128 51 175 0 -77 60 40 6 7 -31 -97 -164
8030 -164 91 -116 -59 150 -102 17 6 -88 -75 -95 4 33 128 3 -192 -165 -7 222 -69 22 10 -50 -108 49
$$ packed form
7861g4j46M18l16K94m5j33n9K15j1jm5L0j2j23k5j72M01M6k65j78J80J10j00J24
7885A13q0J3M4j49n4J69j30k3pj18L22j83K77l3j85R5J1n1R1j42J49j56K02J70
7909C45n38L53M9o7m2k45K59r7Or3n5K99k74J59m3q3Q8j50o8K59l9J42k50K40
7933A55j45m2J93lq0J9p8M9k33J80R8k47J27p9m0M61K0m02o0K51j07Q2m09K10
7957h0P4k59L34k6L0J74l59k5L28j72j10no1J78k56K08r0j1J34n6PR2k6j94Q0
7982i1j68K61J28K5j92r2K53j29nj89P2K03j84J7N8O5k24J21J1j89J85R3k9m5
8006d5k16K97j68J93o8J48m0j63L52j60n1k17J0J79J24j75p7J37k0l4Jl8o6o7
8030a64K55k07N7K09k52J19j1r4J3k0R9K9R5j25j95K7J58K29k91R1j2o0n8J57
$$ plain form
8054 49 1 11 161 10 35 263 -145 140 3 120 176 -134 -203 -171 115 146 -100 -66 -53 -5 -3 295 -47 -49 83
8079 83 70 -74 -60 -111 87 75 -79 40 -78 210 -4 178 208 22 -93 146 93 152 -9 -64 69 -232 -97
8102 -97 14 -104 -99 36 95 71 162 -124 67 -103 -193 -195 115 127 228 -41 -21 -8 66 -4 22 -53 -4 -45 70 -185
8128 -185 139 -68 -91 38 57 183 69 81 -166 5 -41 -66 166 75 126 -88 -37 -123 -190 -69 164 -29 -3 161
8152 161 49 31 31 330 90 -18 17 25 -165 14 -158 293 -179 -226 3 -188 -102 -1 -151 177 60 -305 136
8175 136 -131 -280 255 -37 -116 92 -176 147 -95 -339 -63 5 -59 -61 -133 -39
$$ packed form
8054D9m8J0J50j51K5K28m08K85j37J17N6l10o9L2K86L1k46L4J3M8KK98l42kJ32
8079H3j3j44J4n1J98j2j54J19j18K88k14J82L0j86j15K39n3N9j61n5J33l01J35
8102i7J11j18NJ35N9k4R1k86J91j70r0kL10J2J01k69K0J3P4p0K6p5M9m1J15k55
8128a85L24k07k3J29J9J26j14J2k47J71m6k5K32r1N1k14N1q6o7J21K33j93K6J64
8152A61j12j8%K99k40j08L5Qj90J79j72M51m72m7K29j91Q6J01j50L28j17l65M41
8175A36k67j49N35k92p9K08k68L23k42k44K76O8o4kp2R4
8191c9
$$ Imaginary data points
##PAGE= N=2
##DATA TABLE= (X++(I..I)), XYDATA
$$ plain form
0 0 0 0 0 0 0 0 0 0 0 0 0 0 0 0 0 0 8 -8 8 -8 8 -8 16 -16 16 -24 24 -30 32 -39 41 -48 56 -63 70 -79 89 -99
38 -99 109 -123 135 -150 166 -185 203 -226 249 -273 302 -331 366 -402 442 -491 542 -600 669 -748
58 -748 841 -951 1085 -1256 1474 -1766 2181 -2811 3878 -6002 11825 -59904 -168989 47454
72 47454 129641 -6008 -76664 -1814 33299 -1666 7877 13724 -40791 1071 60645 -489
84 -489 -50803 -4308 46888 17817 -51948 -22233 41698 19939 -25820 -33711 5522 38518 -2829
97 -2829 -27140 -10973 -12167 9828 27846 -975 -21251 -12220 17863 18439 -13211 -3847 1795 -8843
111 -8843 24476 23384 -21579 -20763 12583 25806 -6094 -25667 11304 11120 -15716 743 7633
124 7633 -2265 -6758 -9458 2118 -3465 -4770 16415 -4288 -23541 5178 21426 6070 -23254
$$ packed form
0@%%%%%%%%%%%%%%%%Qj6J6j6J6j6K4l2L2m0M8n4O2p1Q0q9J04j19J33j49J68j88
38i9K08k32K58k85L16l51L88m29M75n22N75o33O97p68Q44r33J033j142J269j417
58g48J589j792K036k341K730l240L947m992O689r880J7827p1729j09085K16443
72D7454Q2187j35649p0656P4850L5113l4965R543N847n4515M1862N9574o1134
84d89n0314M6495N1196k9071o9765K9715O3931k1759m5759p891L9233L2996m1347
97b829k4311J6167j194K1995J8018k8821k0276R031L0083N76l1650R364N642j0638
111h843L3319j092m4963Q16L3346J3223l1900j9573L6971j84k6836J6459O890
124G633r898m493k700J1576n583j305K1185k0703j9253K8719J6248j5356k9324
$$ plain form
137 -23254 -16601 24609 13785 -8964 6085 1593 -6977 3474 10300 4945 -17357 -6896 24113
150 24113 5166 -10965 -999 -7464 -5306 3078 4048 -10 -13872 -794 13213 -8199 -7049 6299
164 6299 -1567 -4817 -5449 5356 13951 -4013 -6077 3071 5189 11741 -4879 -15167 6787 12441
178 12441 5352 -1647 -8998 1678 2411 -3325 2209 -5319 -2991 4092 -6523 172 5039 -6230
192 -6230 -4787 -4214 2235 8476 -4249 -4093 -635 624 12974 -265 -12402 4925 8603 2811
206 2811 -1191 -2002 6522 -1320 -4546 8841 521 -6097 -1082 -3516 4196 2902 -6522 -691 -2798
221 -2798 -3502 1200 -3368 990 -611 -5379 6954 2652 -5254 1115 -2719 1729 7371 1126 1659
236 1659 -2879 -641 9484 313 -2884 -61 -4605 6011 5426 -6405 -1929 -39 1154 -537 -8660
$$ packed form
137b3254O653M1210j0824k2749J5049m492q570J0451O826n355k2302J0461L1009
150B4113j8947j6131R966o465K158Q384R70m058j3862J3078J4007k1412J150J3348
164F299p866l250o32J0805Q595j7964k064R148K118O552j6620j0288K1954N654
178A2441p089o999p351J0676P33n736N534p528K328P083j0615O695M867j1269
192f230J443N73O449O241j2725J56L458J259J2350j3239j2137J7327L678n792
206B811m002q11Q524p842l226J3387q320o618N015k434P712j294r424N831k107
221b798p04M702m568M358j601m768J2333m302p906O369l834M448N642o245N33
236A659m538K238J0125r171l197K823m544J0616n85j1831M476J890J193j691q123
$$ plain form
251 -8660 1071 2825 -6830 -214 867 616 2290 -7298 -1121 6036 -871 1995 -14 -734 5713 521
267 521 2478 2394 -6548 3253 6672 -1081 1796 -2635 -856 3083 -4082 -250 -174 -4685 2250 -1285
283 -1285 -2726 1038 -6111 -734 3672 -2664 944 -1330 -1582 4459 -2099 697 5193 -1758 1084
298 1084 417 642 7381 -2077 -3370 5159 337 649 -1606 -3973 4237 -1175 -2612 2366 -4610 -1996
314 -1996 159 -3383 2489 -2294 -4371 3667 -1481 -1585 1296 -1925 3103 92 -1210 6171 -821
329 -821 -1270 4146 -436 3067 1386 -2412 3892 -135 -1916 2122 -2767 539 -284 -4455 3188 -1167
345 -1167 -5914 645 -1094 766 37 -5116 1721 1276 -2119 2396 -865 1232 3537 -3066 2597 2700
361 2700 -2930 3225 1923 1291 2167 -3224 1756 1331 -3865 2569 33 -2566 812 -3484 29 1346
$$ packed form
251h660R731J754r655O616J081k51J674r588O177P157o907K866k009p20O447n192
267E21J957q4q942R801L419p753K877m431J779L939p165L832P6m511O935l535
283a285j441L764p149N377M406o336L608k274k52O041o558K796M496o951K842
298A084o67K25O739r458j293Q529m822L12k255k367Q210n412j437M978o976K614
314a996K155l542N872m783k077Q038n148j04K881l221N028l011j302P381o992
329h21m49N416m582L503j681l798O304m027j781M038m889L306q23m171P643m355
345a167m747O559j739J860p29n153O837m45l395M515l261K097K305o603N663J03
361B700n630O155j302o32Q76n391M980m25n196O434k536k599L378m296L513J317
$$ plain form
377 1346 -5630 -152 729 -1347 622 -3424 819 3141 -3364 2065 2505 -2074 2000 -473 1918 4498
393 4498 -1890 925 2476 -495 2867 -1563 -1464 2601 -2700 667 2490 -4000 -1695 -1469 -700 1837
409 1837 -4308 -1763 2151 -2151 548 -1154 -2297 3367 -1091 -381 4134 -974 533 895 -56 4152
425 4152 -567 -374 3656 -2002 796 2812 -1255 738 -2365 -2008 3340 -1517 -2713 -925 -1774 2975
441 2975 -1498 -4370 1372 -1796 -420 2722 -1366 971 125 -1626 4324 439 -498 1827 -985 3106
457 3106 2109 -1938 2608 -432 -2019 3027 -240 -555 -1313 -3341 2448 -373 -3428 628 -2384 -827
473 -827 666 -2783 1891 185 -3976 1432 1239 1765 638 -3823 2281 3699 -204 2442 -1088 -759
489 -759 3842 -280 1223 54 -3317 2536 1609 -1388 -996 -3860 969 1885 -4463 -72 646 -2460
$$ packed form
377A346o976N478Q81k076J969m046M243K322o505N429M40m579M074k473K391K580
393D498o388K815J551k971L362m430R9M065n301L367J823o490K305K26P69K537
409A837o145K545L914m302K699j702j143N664m458P10M515n108J507L62r51M208
425D152m719J93M030n658K798K016m067J993l103L57N348m857j196J788q49M749
441B975m473k872N742l168J376L142m088K337q46j751N950l885r37K325k812M091
457C106r97m047M546l040j587N046l267l15p58k028N789k821l055M056l012J557
473h27J493l449M674j706m161N408j93N26j127m461O104J418l903K646l530L29
489g59M601m122J503j169l371N853r27k997L92k864M829R16o348M391P18l106
$$ plain form
505 -2460 47 -2111 817 2450 -3460 -367 1182 159 3136 -541 -472 2439 -828 3530 3068 -3356
521 -3356 -540 1524 2726 2341 -4841 -1282 2892 -1055 268 -2762 -2814 2355 -1951 -1202 1348 -2629
537 -2629 -823 -663 -469 2799 -1710 -853 2635 -1695 1315 3053 -660 1359 -1144 677 4844 -1347
553 -1347 -1198 820 -204 2702 -1040 -2206 1473 -2941 -813 2730 -2088 -1949 -2312 -1198 3427 -1518
569 -1518 -2668 574 -874 2765 511 -2955 2289 731 -523 2521 14 1319 808 -1665 3022
584 3022 869 -1072 1573 -2075 -240 1656 -1474 492 -1890 -3275 2092 494 -1589 -1456 -2801
599 -2801 2200 763 -2763 1390 -350 -1352 1996 -357 1904 1124 -2498 2618 2298 390 1113 -2456
615 -2456 1200 3417 -1570 721 -375 -2030 1415 -806 -261 157 -3509 272 314 -1760 534 -2386
$$ packed form
505b460K507k158K928J633n910L093J549j023K977l677O9K911l267M358m62o424
521c356K816K064J202l85p182L559M174l947J323l030n2N169m306P49K550l977
537b629J806J60J94L268m509Q57L488m330L010J738l713K019k503J821M167o191
553a347J49K018j024K906l742j166L679m414K128L543m818J39l63J114M625m945
569a518j150L242j448L639k254l466N244j558j254L044k507J305n11k473M687
584C022k153j941K645l648J835J896l130J966k382j385N367j598k083J33j345
599b801N001j437l526M153j740j002L348k353K261p80l622N116l20j908P23l569
615b456L656K217m987K291j096j655L445k221N45M18l666L781M2k074K294k920
$$ plain form
631 -2386 -813 1606 -2214 828 1858 -1974 458 673 1618 2402 -2459 530 2734 -475 2093 365
647 365 -1514 1248 -702 853 1548 -3310 -884 684 -70 639 -3575 -1416 2145 -2002 -631 181
663 181 -1526 1514 -1147 -894 2244 -476 176 864 -307 3328 198 -1203 2168 -786 726 2507
679 2507 -910 -8 -694 -145 2466 -1960 -1978 719 -1384 450 -845 -2442 1242 -1373 -1711 1839 -661
696 -661 -533 -864 -540 3186 -126 -1079 2164 109 768 1418 -727 1870 673 -937 1880 142 -11
713 -11 224 -1935 1555 222 -2101 622 -1489 -1172 997 -1556 -271 -709 -2126 1661 142 -831 652
730 652 -718 1672 1598 -1723 1651 1109 -602 1563 319 1534 761 -1980 1383 987 -1208 559 -1323
747 -1323 -115 992 -2202 69 53 -2482 82 -663 -49 601 -2430 427 1341 -1290 869 -141 -416
$$ packed form
631b386J573K419l820L042J030l832K432K15R45P84m861K989K204l209K568j728
647C65j879K762j950J555O95m858K426J568p54P09m214K159L561m147J371Q12
663A81j707L040k661K53L138k720O52O88j171L635l130j401L371k954J512J781
679B507l417R02o86N49K611m426j8K697k103J834j295j597L684k615l38L550k500
696f61J28l31L24L726l312r53L243k055O59O50k145K597j197j610K817j738j53
713a1K35k159L490j333k323K723k111L17K169k553J285m38j417L787j519r73J483
730F52j370K390p4l321L374n42j711K165j244J215p73k741L363l96k195J767j882
747a323J208J107l194K271j6k535K564p45O14O50l031K857R14k631K159j010k75
$$ plain form
764 -416 2092 -347 1125 1400 -1241 1264 827 -139 1583 -1547 560 1842 -1674 164 342 -1345
780 -1345 253 -1741 -723 1182 -2364 -651 424 -826 1110 -1634 -880 2354 -1016 104 1512
795 1512 -492 1197 18 247 2539 -979 173 2006 -689 951 308 -1026 1471 -996 -943 933
811 933 -1314 -285 -543 -1367 1408 -1747 -1790 1199 -1184 -111 358 -1116 1395 -271 -738 2029 -230
828 -230 527 1098 -552 2243 443 -1219 2239 97 -558 713 -957 701 -377 -1871 1303 -1098
844 -1098 -1226 -83 -1705 524 -41 -2450 949 -24 -1288 835 -816 708 498 -1354 2012 765
860 765 -958 1426 156 1038 1412 -1291 1255 1032 -1090 953 -556 -185 509 -2078 614 345 -2190
877 -2190 348 -455 -1024 752 -1635 211 899 -1337 1026 388 -292 985 -1077 1023 2125 -1193
$$ packed form
764d16K508k439J472K75k641K505m37r66J722l130K107J282l516J838J78j687
780a345J598j994J018J905l546J713J075j250J936k744P54L234l370J120J408
795A512k004J689j179K29K292l518J152J833k695J640o43j334K497k467N3J876
811I33k247J029k58q24K775l155m3K989k383J073M69j474K511j666m67K767k259
828b30P57N71j650K795j800j662L458k142o55J271j670J658j078j494L174k401
844a098j28J143j622K229n65k409L399r73j264K123j651J524k10j852L366j247
860G65j723K384j270Q82L74k703K546k23k122K043j509L71O94k587K692k69k535
877b190K538q03n69J776k387J846O88k236K363o38o80J277k062K100J102l318
$$ plain form
893 -1193 579 1090 116 1072 -744 181 1180 -1358 336 451 -1213 492 -1296 -634 1235 -1801 -830
910 -830 373 -1257 191 -803 -483 1207 -1497 134 1598 -748 801 214 -328 1979 -287 -168 1669
927 1669 -497 729 581 -248 1607 -1332 -1099 1862 -802 -552 -604 -1426 1079 -911 -1350 864 -861
944 -861 -29 394 -1038 996 -375 -973 1758 32 -131 1081 -160 1306 256 -439 1911 -455 -373
961 -373 1095 -133 790 -238 -1614 1026 -130 -1205 427 -1418 -25 -226 -1357 1442 -823 -1769
977 -1769 914 -448 305 721 -1381 1268 1066 -421 1576 -130 401 1118 -453 1412 473 -1345 1111
994 1111 -1 -360 683 -1278 387 185 -1722 609 -651 -1056 -45 -1478 481 893 -1700 302
1010 302 574 -270 1194 -884 146 1238 -654 1243 821 -637 1119 -144 432 1626 -974 41
$$ packed form
893a193J772N11r74R56j816R25R99k538J694J15j664J705j788O62J869l036R71
910h30J203j630J448r94L20J690k704J631J464k346J549n87n42K307k266J19J837
927A669k166J226j48q29J855k939K33K961k664K50n2q22K505j990m39K214j725
944h61Q32M23j432K034j371n98K731j726j63J212j241J466j050o95K350k366Q2
961c73J468j228R23j028j376K640j156j075J632j845J393k01j131K799k265r46
977a769K683j362P53M16k102K649k02j487J997j706N31P17j571J865r39j818K456
994A111j112l59J043j961J665k02j907K331j260m05J011j433J959M12k593K002
1010C02K72q44J464k078J030J092j892J897m22j458J756j263N76J194k600J015
$$ plain form
1026 41 521 -593 564 -1251 -821 634 -1575 -331 534 -1657 242 -574 -686 1217 -1012 -371 780
1043 780 -689 942 465 -471 1540 -789 32 2033 -323 284 428 -130 1628 -661 -725 999 -1032
1060 -1032 -32 317 -1012 643 -1032 -1182 1392 -878 -751 165 -994 866 -378 -669 1331 -453
1076 -453 -129 1093 -124 932 57 -615 2040 227 -710 841 -243 723 -55 -890 1450 -550 -1403
1093 -1403 550 -491 -40 -472 -1560 557 205 -1239 706 -637 -69 724 -660 1311 433 -1287
1109 -1287 1563 491 368 794 -628 1125 484 -843 1356 15 -707 400 -764 719 193 -1712
1125 -1712 63 -257 -648 235 -1096 -244 429 -1211 350 197 -1101 1015 -413 235 1162 -828 615
1142 615 1000 -264 1097 -54 106 1212 -952 758 1041 -1078 -96 -141 -511 759 -1435 -674 220
$$ packed form
1026D1M80j114J157j815M30J455k209J244Q65k191J899q16j12J903k229O41J151
1043G80j469J631m77r36K011k329Q21K001k356O07J44n58J758k289o4J724k031
1060a032J000L49j329J655j675j50K574k270J27R16j159J860j244k91K000j784
1076d53L24J222j217J056q75o72K655j813r37J551j084R66p78q35K340k000q53
1093a403J953j041M51m32j088K117l52j444J945j343N68P93j384J971q78j720
1109a287K850j072j23M26j422J753o41j327K199j341p22J107j164J483n26j905
1125a712J775l20l91Q83j331Q52O73j640J561j53j298K116j428O48R27j990J443
1142F15L85j264J361j151J60J106k164J710K83k119R82m5l70J270k194P61Q94
$$ plain form
1159 220 -1191 163 -273 -861 730 -971 -225 1117 -918 21 395 -31 1010 -321 2 1131 -577
1176 -577 538 724 -449 889 -359 -419 1476 -706 -524 63 -596 539 -798 -881 661 -1224 -464
1193 -464 700 -1024 413 -241 -593 1289 -81 -359 848 -354 1010 394 -251 1396 -80 -464 1051
1210 1051 245 182 96 -452 972 -219 -1004 533 -855 -411 -23 -1091 264 -253 -1441 594 -385 -394
1228 -394 233 -739 811 258 -748 1330 117 -149 1132 -295 927 553 -988 954 618 -206 446
1245 446 -889 317 305 -1124 332 -185 -1187 314 -652 274 89 -1350 411 338 -695 528 -617
1262 -617 173 781 -1005 655 963 -529 691 207 366 708 -787 663 829 -640 531 -405 -522
1279 -522 670 -1021 78 739 -1213 -237 -233 -322 374 -1275 -135 755 -935 244 426 -502 950 -355
$$ packed form
1159B20j411J354m36n88J591j701P46J342k035R39L74m26J041j331L23J129j708
1176e77J115J86j173J338j248o0J895k182J82N87o59J135j337q3J542j885P60
1193d64J164j724J437o54l52J882j370k78J207j202J364o16o45J647j476l84J515
1210A051q06o3q6n48J424j191p85J537j388M44L88j068J355n17j188K035r79r
1228c94O27r72J550n53j006K078j213k66J281j427J222l74j541J942l36q24O52
1245D46j335J206j2j429J456n17j002J501r66R26j85j439J761p3j033J223j145
1262f17P90O08j786J660L08j492J220m84J59L42j495J450J66j469J171r36j17
1279e22J192j691J099O61j952R76Mq9O96j649J140Q90j690J179J82r28J452j305
$$ plain form
1297 -355 532 1377 -664 176 521 30 923 -390 -160 1192 -654 105 568 -714 205 -710 -587 778
1315 778 -1034 -703 305 -854 68 -409 -924 1077 -260 -387 1122 -482 251 247 -128 1487 10 -325
1333 -325 1098 -284 442 546 -525 884 -101 -745 925 -376 -486 -72 -983 362 -345 -1022 505
1350 505 -597 -366 447 -570 603 325 -774 907 164 -220 627 -252 740 382 -765 863 382 -448
1368 -448 569 -181 257 196 -847 546 10 -656 200 -943 -140 242 -1037 317 7 -981 401 42
1386 42 -60 296 -726 661 685 -513 832 33 10 839 -234 485 836 -670 321 246 -395 378 -963
1405 -963 242 522 -1013 103 -99 -970 231 -716 -191 333 -1188 -156 127 -397 577 -365 -34 1123
1423 1123 -281 283 1003 34 415 43 -40 830 -535 90 784 -532 174 -204 -695 592 -696 -474
$$ packed form
1297c55Q87Q45k041Q40L45m91Q93j313K30J352j846P59M63j282R19r15J23J365
1315G78j812L31J008j159R22m77n15K001j337j27J509j604P33ml75J615j477l35
1333c25J423j382P26J04j071J409r85o44J670j301j10M14r11J345p07o77J527
1350E05j102K31Q13j017J173k78j099J681p43l84Q47q79R92l58j147J628m81q30
1368d48J017p50M38o1j043J393n36o66Q56j143Q03L82j279J354l10r88J382l59
1386D2j02L56j022J387K4j198J345p99k3Q29j073P19L51j506R91p5o41P73j341
1405i63J205K80j535J116k02q71J201r47N25N24j521J032K83n24R74r42L31J157
1423A123j404N64P20r69L81l72q3Q70j365O25O94j316P06l78m91J287j288K22
$$ plain form
1441 -474 333 -745 -44 -42 -441 510 -204 -426 691 -389 333 144 -327 693 78 -254 1077 -239 55
1460 55 175 -117 1003 -67 -712 576 -270 -173 218 -854 -47 -246 -768 426 -300 -486 -6 -537 323
1479 323 188 -815 892 55 -400 786 164 515 74 -387 922 241 -505 676 -252 346 282 -687 375
1498 375 -83 -936 164 -258 -362 -337 -970 305 3 -940 170 -323 -139 300 -657 694 517 -411 610
1517 610 440 64 639 -317 497 1029 -703 547 361 -238 479 -374 225 387 -807 48 297 -281 16
1536 16 -778 -372 262 -1028 -15 168 -699 380 -429 -224 924 -249 303 657 -138 428 -20 -154 752
1555 752 -550 -1 550 -546 27 -103 -337 392 -872 -689 609 -657 14 -84 -656 245 -354 -292 588
1574 588 -315 -90 591 153 924 -118 -98 1358 -277 -31 429 -501 664 -192 -214 437 -217 -322 263
$$ packed form
1441d74Q07j078P01Kl99R51p14k22J117j080P22j89m71J020o15l32J331j316K94
1460E5J20k92J120j070o45J288q46R7L91j072Q07j99n22J194p26j86M80n31Q60
1479C23j35j003J707q37m55J186o22L51m41m61J309o81p46J181r28N98o4r69J062
1498C75m58q53J100m22j04K5o33J275l02r43J110m93J84M39r57J351j77r28J021
1517F10j70l76N75r56Q14N32j732J250j86n99P17q53N99J62j194Q55K49n78K97
1536A6p94M06O34j290J013J83q67J079q09K05J148j173N52L54p95N66m48j34R06
1555G52j302N49N51j096N73j30k34P29j264J83J298j266O71r8n72R01n99O2Q80
1574E88r03K25O81m38P71j042K0J456j635K46M60r30J165q56k2O51o54j05N85
$$ plain form
1593 263 -400 89 -106 -878 499 -552 -536 75 -508 199 -137 -655 830 -103 -444 673 -196 348 472
1612 472 -478 735 345 -432 713 91 185 243 -565 369 147 -895 249 -101 -201 180 -994 72 281
1631 281 -728 257 -179 -180 322 -368 325 280 -716 498 279 256 664 -9 218 633 -514 569 461 -375
1651 -375 182 -387 -44 435 -963 44 169 -865 7 -361 -401 195 -925 6 231 -610 18 -80 -93 595
1671 595 -349 0 567 -148 212 69 212 715 -345 21 817 -405 86 193 -218 452 -612 -275 276
1690 276 -518 -125 -75 -535 300 -561 -206 758 -465 -143 490 -155 423 -66 -52 769 60 240 354 -147
1710 -147 354 114 -264 980 -185 -167 310 -344 162 -393 -475 391 -335 -726 142 -330 -170 -118 -683 553
1730 553 -184 -397 458 -359 326 100 -208 805 396 -607 545 46 -34 105 -244 206 -27 -502 494
$$ packed form
1593B63o63M89j95p72J377j051J6O11n83P07l36n18J485r33l41J117q69N44J24
1612D72r50J213l90p77J145o22R4N8q08R34k22j042J144l50j00L81j174J066K09
1631B81j009R85m36jN02o90O93m5r96J214k19k3M08o73K27M15j147J083j08q36
1651c75N57n69L43M79j398J007J25j034Q72l68m0N96j120R31K25q41O28r8j3O88
1671E95r44L49N67p15L60j43J43N03j060L66P96j222M91J07m11O70j064L37N51
1690B76p94L93N0m60Q35q61L55R64j223L22O33o45N78m89J4Q21p09J80J14n01
1710a47N01k40l78J244j165J8M77o54N06n55q2Q66p26l91Q68m72J60N2n65J236
1730E53p37k13Q55q17O85k26l08J013m09j003J152m99q0J39l49M50k33m75R96
$$ plain form
1749 494 -78 -383 -167 -694 198 -366 -833 50 -115 -269 168 -301 255 83 -711 527 163 -234 706 236
1769 236 666 526 -555 451 329 -451 536 -135 -85 114 -486 181 129 -529 33 -314 -202 92 -684 -41
1789 -41 371 -484 -55 -188 -109 712 -486 255 602 -538 276 269 -2 664 -228 195 545 -304 124 157 -300
1810 -300 298 -430 -262 439 -419 -277 89 -199 79 -366 -405 201 -476 -291 324 -419 662 105 -337 711
1830 711 -274 -276 514 -55 271 17 -50 676 -222 -180 671 -371 128 -88 -467 401 -374 -805 154 -235 52
1851 52 34 -529 293 158 -344 458 -176 71 -34 -319 444 165 -433 616 23 41 415 8 531 121 -360
1872 -360 237 -18 -234 212 -288 44 48 -537 183 -223 -557 186 -414 103 56 -656 131 218 -303 407 -182
1893 -182 278 345 -401 508 301 -108 233 -10 67 431 -367 231 158 -385 61 -196 -260 247 -488 -79 345
$$ packed form
1749D94n72l05K16n27Q92n64m67Q83j65j54M37m69N56j72p94J238l64l97R40m70
1769B36M30j40j081J006j22p80R87o71N0J99o00O67n2o58N62l47J12K94p76O43
1789d1M12q55M29j33P9Q21j198P41L47j140Q14pk71O66q92M23L50q49M28L3m57
1810c00N98p28J68P01q58J42L66k88K78m45l9O06o77J85O15p43J081n57m42J048
1830G11r85kP90n69L26k54o7P26q98M2Q51j042M99k16l79Q68p75m31R59l89K87
1851E2j8n63Q22j35n02Q02o34K47j05k85P63k79n98J049n93J8L74m07N23m10m81
1872c60N97k55k16M46n00L32Mn85P20m06l34P43o00N17m7p12P87Q7n21P10n89
1893a82M60O7p46R09k07m09L41k43P7L64p98N98p3n43M46k57o4N07p35M09M24
$$ plain form
1914 345 -563 225 -202 -248 251 -399 49 366 -300 339 201 -163 701 -386 216 495 -214 310 419 -226
1934 -226 274 -153 28 172 -723 -263 29 -349 -57 -292 -305 341 -452 -122 234 -321 -22 71 -13 498 -421
1955 -421 86 573 8 253 206 0 616 26 -95 528 -153 -72 -11 -479 196 -253 -426 598 -192 -171 225
1976 225 -402 94 -170 -388 304 -101 -287 141 -206 218 127 -247 384 121 37 139 -8 391 -11 -299 700
1997 700 -252 -345 232 -417 62 -107 -559 350 -101 -653 91 -28 -112 19 -391 167 139 -455 460 -108 190
2018 190 421 -355 343 353 25 326 74 108 366 -373 291 260 -515 18 -73 -168 160 -428 -186 3 -521 157
2040 157 271 -453 436 -364 161 352 -460 354 366 -249 312 -27 74 502 -393 137 361 -129 139 -32
2060 -32 -231 365 -305 -78 212 -378 -239 -156 -377 268 -545 -242 425 -235 71 15 -84 555 -267 -152 545
$$ packed form
1914C45r08P88m27m6M99o50M48L17o66O39j38l64Q64j087O02K79p09N24J09o45
1934b26N00m27J81J44q95M60K92l78K92k35j3O46p93L30L56n55K99R3q4N11r19
1955d21N07M87n65K45m7k06O16n90j21O23o81Q1O1m68O75m49j73J024p90K1L96
1976B25o27M96k64k18O92m05j86M28l47M24r1l74O31k63q4J02j47L99m02k88R99
1997G00r52r3N77o49M79j69m52R09m51n52P44j19q4J31m10N58k8n94R15n68K98
2018A90K31p76O98J0l28L01k52L4K58p39O64l1p75N33r1r5L28n88K42J89n24O78
2040A57J14p24Q89q00N25J91q12Q14J2o15N61l39J01M28q95N30K24m90K68j71
2060c2j99N96o70K27K90n90J39Q3k21O45q13L03O67o60L06n6r9O39q22J15O97
$$ plain form
2081 545 -87 103 267 -122 538 -138 -313 638 -456 -240 287 -236 224 -359 -441 277 -296 -331 -27 -573
2101 -573 259 -53 -545 385 -116 -159 5 -452 436 27 -349 555 -196 -99 290 169 107 213 -31 475 206
2122 206 -461 349 -434 -168 307 -307 43 -62 -513 27 -383 -238 -103 -650 268 226 -447 169 -107 46
2142 46 270 -442 349 322 -210 543 331 -86 225 -199 -46 427 -710 157 42 -442 71 -124 -105 28 -273
2163 -273 29 76 -308 -67 -42 44 371 -272 57 386 -206 438 -246 -55 471 -359 123 668 26 129 39
2184 39 152 450 -385 -87 526 -247 -68 49 -172 132 -584 -169 437 -418 -164 64 -26 459 -120 -325 574
2205 574 -61 307 262 194 454 -153 -276 338 -137 -239 93 -171 229 60 -368 184 -287 -443 127 -535 177
2226 177 121 -604 271 -263 -251 332 -195 99 -19 -166 812 26 -49 481 -284 231 59 -253 308 -166 -239
$$ packed form
2081E45o32J90J64l89O60o76j75R51j094K16N27n23M60n83q2P18n73l5L04n46
2101e73Q32l12m92R30n01m3J64m57Q88m09l76R04p51R7L89j21o2J06k44N06k69
2122B06o67Q10p83K66M75o14L50j05m51N40m10J45J35n47R18m2o73O16k76J53
2142D6K24p12P91k7n32P53k12m17L11m24J53M73j137Q67j15m84N13j95J9J33l01
2163b73L02M7l84K41K5Q6L27o43L29L29n92O44o84J91N26q30M82N45o42J03r0
2184C9J13K98q35K98O13p73J79J17k21L04p16M15O06q55K54K28r0M85n79k05Q99
2205E74o35L68m5o8K60o07j23O14m75j02L32k64M00j69m28N52m71j56N70o62P12
2226A77n6p25Q75n34J2N83n27K94j18j47R78p86p5N30p65N15j72l12N61m74p3
$$ plain form
2247 -239 337 -29 9 27 -517 268 -10 -413 -155 -51 -205 -3 -97 183 223 -220 168 85 74 46 -127 448
2269 448 411 -317 334 3 -70 361 -254 -3 60 -357 268 108 -218 107 -433 -77 145 -780 -204 67 -527
2290 -527 99 -158 180 357 -501 33 346 -489 214 77 377 276 -218 209 388 -348 248 84 -159 204
2310 204 -252 169 121 -142 18 -243 -299 250 -112 -349 199 -240 -89 46 -247 363 -128 34 469 -235 52
2331 52 304 -22 365 -31 -152 688 -18 -117 262 -119 121 -270 -139 283 -313 -504 332 -147 -193 20 -392
2352 -392 220 -351 -199 307 -130 145 54 -200 333 74 -115 552 2 112 241 -186 366 -130 -172 49 -187
2373 -187 -167 130 -272 88 72 -399 421 33 -265 268 -467 -41 -185 -464 364 17 -426 291 43 232 167
2394 167 -335 298 229 -58 329 151 125 568 -222 120 229 -504 177 -101 -338 -94 -464 -50 84 -381 212
$$ packed form
2247b39N76l66L8J8n44P85k78m03K58J04j54K02r4K80M0m43L88q3j1k8j73N75
2269D48l7p28O51l31p3M31o15K51O3m17O25j60l26L25n40L56K22r25N76K71n94
2290e27O26k57L38J77q58N34L13q35P03j37L00j01m94M27J79p36N96j64k43L63
2310B04m56M21m8k63J60k61n6N49l62k37N48m39J51J35k93O10m91J62M35p04K87
2331E2K52l26L87l96j21Q40p06r9L79l81K40l91J31M22n96j91Q36m79m6K13m12
2352c92O12n71J52N06m37K75r1k54N33k59j89O67n50J10J29m27N52m96m2K21k36
2373a87K0K97m02L60j6m71Q20l88k98N33p35M26j44k79Q28l47m43P17k48J89o5
2394A67n02O33o9k87L87j78k6M43p90L42J09p33O81k78k37K44l70M14J34m65N93
$$ plain form
2415 212 -241 -144 76 -403 41 194 -236 207 168 129 477 -137 116 434 -256 172 170 258 333 -365 -65 263
2437 263 -391 -85 107 -250 -112 -245 -274 501 -215 -158 220 -141 199 -141 68 514 -100 151 409 15 405
2458 405 -60 -36 767 -80 -156 343 -309 69 -234 -318 356 -263 -118 313 -348 67 -117 -112 301 63 -223 53
2480 53 3 -133 -46 -245 365 -62 -33 261 98 48 209 -399 249 139 -169 105 137 -66 80 -568 89 -126
2502 -126 -240 314 -162 -298 -14 -354 81 121 -274 186 -97 -245 47 7 -55 264 -285 301 13 -25 294
2523 294 109 184 132 -242 335 119 -349 5 -207 -26 119 -97 53 123 -280 -49 -11 -325 251 -281 57
2544 57 170 -291 154 224 -97 419 -158 190 285 -149 115 240 -238 205 -18 -214 425 -404 -92 -51 -169
2565 -169 -43 -171 -393 312 -285 -112 400 -430 10 -293 -315 253 -170 -207 203 48 138 -37 199 655 -90
$$ packed form
2415B12m53R7K20m79M44J53m30M43l9l9L48o14K53L18o90M28kQ8P5o98L00L28
2437B63o54L06J92l57J38j33k9P75p16N7L78l61L40l40K09M46o14K51K58l94L90
2458D05m65K4Q03q47p6M99o52L78l03q4O74o19J45M31o61M15j84NM13k38k86K76
2480E3n0j36Q7j99O10m27K9K94j63n0J61o08O48j10l08K74L2k03J46o48O57k15
2502a26j14N54m76j36K84l40M35M0l95M60k83j48K92m0o2L19n49N86k88l8L19
2523B94j85P5n2l74N77k16m68L54k12J81J45k16J50P0m03K31L8l14N76n32L38
2544E7J13m61M45P0l21N16n77L48R5m34K64J25m78M43k23j96O39q29L12M1j18
2565a69J26j28k22P05n97J73N12q30M40l03k2N68m23l7M10j55R0j75K36M56p45
$$ plain form
2586 -90 19 197 -243 94 149 -75 224 -89 24 160 -157 -124 -233 -314 313 -75 -240 187 -399 -262 -256 -157
2608 -157 236 79 -71 417 -3 -124 202 -67 161 139 -105 402 113 -256 367 -177 87 -152 -285 240
2628 240 -229 -246 202 -182 233 313 -238 178 18 -191 -56 -95 -23 199 1 147 184 -25 424 -148 -9 238
2650 238 -270 77 214 -374 179 -30 197 -45 -69 235 157 -560 -33 -62 -228 312 -216 -116 298 -469 -73
2671 -73 29 -234 229 -316 149 327 -249 117 385 -281 143 135 79 -43 -297 62 126 -158 -164 -158 -129 207 -295
2694 -295 -179 200 -365 80 -429 -460 112 -263 -10 468 -326 -178 -229 86 122 -183 185 460 -9 165 341
2715 341 -56 499 -33 -135 175 -164 -184 -204 -232 -74 -165 -185 79 54 -177 27 28 -196 136 -222 271 88 156
2738 156 180 -183 142 285 -25 473 136 -26 306 -217 48 42 -289 198 42 -234 -25 -51 -313 -98 -245
$$ packed form
2586i0J09J78m40L37N5k24K99l13J13J36l17L3j09q1O27l88j65M27n86J37OR9
2608a57L93j57j50M88m20j21L26k69K28k2k44N07k89l69O23n44K64k39j33N25
2628B40m69j7M48l84M15Q0n51M16j60k09J35l9P2K22j98J46L7k09M49n72J39K47
2650B38n08L47J37n88N53k09K27k42k4L04p8p17N27k9j66N40n28J00M14p67L96
2671g3J02k63M63n45M65J78n76L66K68o66M24qn6j22k54L59O4k84oOK9L36n02
2694b95J16L79n65M45n09l1N72l75K53M78p94J48n1L15L6l05L68K75m69J74J76
2715C41l97N55n32j02L10l39k0k0k8J58r1k0K64k5k31K04Jk24L32l58M93j83O8
2738A56K4l63L25J43l10M98l37j62L32n23K65ol31M87j56k76K09k6k62K15j47
$$ plain form
2759 -245 267 -88 -320 180 -307 16 234 -186 105 257 -77 114 32 31 170 -116 48 259 -289 468 180
2780 180 -257 -67 -360 -112 -1 -239 -11 51 -276 -34 -373 -127 139 -119 118 365 243 46 212 278 42
2801 42 -248 82 314 -213 -60 122 5 406 -176 228 -57 -147 -21 -89 -102 141 -582 -358 182 -47 27 -62
2823 -62 7 421 -64 -181 234 175 137 137 -139 225 12 3 466 67 167 259 -412 75 -41 -374 275 -309 -86
2846 -86 -71 -257 -56 -233 -472 286 -138 -270 -12 -65 43 -75 -185 262 -164 -260 237 104 97 81 -209 124
2868 124 21 -23 218 -83 215 81 -236 179 -44 -444 43 -219 -31 -158 -301 50 114 -243 130 -89 -248
2889 -248 -5 -270 547 85 -438 158 -99 -54 32 -16 -21 463 -353 233 95 -54 86 -217 13 104 -295 -106
2911 -106 99 -464 -61 -181 -88 193 -289 4 49 -208 78 -171 167 293 -535 180 121 7 -7 -154 13
$$ packed form
2759b45N12l55k32N00m87L23K18m20K91J52l34J91q2jJ39k86J64K11n48P57k88
2780A80m37J90k93K48J11k38K28O2l27K42l39K46K66k58K37K47j22j97J66O6k36
2801D2k90L30K32n27J53J82j17M01n82M04k85r0J26o8j3K43p23K24N40k29P4q9
2823f2O9M14m85j17M15n9l8%k76L64k13rM63l99J00R2o71M87j16l33O49n84K23
2846h6J5j86K01j77k39P58m24j32K58n3J08j18j10M47m26r6M97j33pj6k90L33
2868A24j03m4K41l01K98j34l17M15k23m00M87k62J88j27j43L51O4l57L73k19j59
2889b48K43k65Q17m62n23N96k57M5Q6m8nM84q16N86j38j49J40l03K30R1l99J89
2911a06K05n63M03j20R3K81m82K93M5k57K86k49L38J26q28P15n9j14j4j47J67
$$ plain form
2932 13 -56 -347 41 -5 -292 -1 -87 -240 124 -154 -129 107 -169 -191 134 -125 190 -158 -264 138 13 -175
2954 -175 137 -67 249 -266 -50 533 23 131 -5 -307 230 -303 -87 219 -369 71 178 35 -22 -184
2974 -184 -137 232 -386 -76 -37 -47 131 -341 -134 302 139 -176 50 40 162 92 -193 190 -190 -251 135 25
2996 25 -30 105 -65 21 -95 -401 -27 -193 -175 58 -335 190 -35 -463 151 84 -119 265 -94 86 189 -214
3018 -214 339 -62 108 243 12 152 144 -148 -25 268 -305 -49 -169 13 86 -338 74 27 -65 23 -64 -42 197
3041 197 -499 -52 90 -183 46 -145 55 217 -259 62 361 109 137 202 -237 351 -175 207 165 -107 -6
3062 -6 -201 -262 190 -157 -35 214 -291 40 250 -21 -34 -134 86 57 -307 -166 99 -187 193 251 -34 503
3084 503 -135 24 224 -282 37 61 29 103 -249 -201 76 -385 126 -345 -447 243 -327 -16 122 -88 21
$$ packed form
2932A3o9k91L88m6k87K91q6j53L64k78K5K36k76k2L25k59L15l48j06M02j25j88
2954a75L12k04L16n15K16N83n10J08j36l02N37n33K16L06n88M40J07j43n7j62
2974a84M7L69o18L10L9j0J78m72K07M36j63l15K26j0J22p0k85L83l80o1L86j10
2996B5n5J35j70Q6j16l06L74j66J8K33l93N25k25m28O14o7k03L84l59J80J03m03
3018b14N53m01J70J35k31J40qk92J23K93n73K56j20J82P3m24M12m7r2Q8q7K2K39
3041A97o96M47J42k73K29j91K00J62m76L21K99k52K8O5m39N88n26L82m2k72J01
3062fj95o1M52l47J22K49n05L31K10k71j3j00K20k9l64J41K65k86L80N8k85N37
3084E03o38J59K00n06L19K4l2P4l52M8K77m61N11m71j02O90n70L11J38k10J09
$$ plain form
3105 21 -91 -53 208 -90 -462 51 47 -64 238 -1 210 170 -73 225 74 231 -66 -309 217 -321 -284 70
3127 70 -121 -361 47 7 -149 28 -294 156 76 -135 175 -232 200 219 -287 203 258 -307 375 -79 -40 445
3149 445 8 135 74 -213 220 99 -62 173 -235 64 39 92 -59 3 -98 222 -333 50 215 -235 92
3170 92 40 -174 101 -337 75 174 12 86 154 17 107 -216 -71 311 -173 38 28 -188 1 -365 -380 416 -284
3193 -284 -45 -30 -187 10 -92 -44 -33 -342 -85 375 44 94 -78 -242 341 -18 -312 404 -88 435 30
3214 30 -127 443 -22 16 215 -130 -72 20 -154 468 -42 -254 252 -197 -306 197 111 150 -65 -83 387 -47
3236 -47 -42 229 -35 -120 259 -282 556 -160 -146 267 -63 8 -149 -370 234 -191 -238 62 -329 -28 -77 -263 221
3259 221 30 -209 12 29 238 60 -65 159 95 -107 100 44 2 308 68 213 173 -225 142 83 -158 249
$$ packed form
3105B1j12L8K61k98l72N13mj11L02k39K11m0k43K98j51J57k97k43N26n38L7L54
3127G0j91k40M08m0j56J77l22M50q0k11L10m07M32J9n06M90N5n65O82m54L9M85
3149D45m37J27o1k87M33j21j61K35m08K99k5N3j51O2j01L20n55L83J65m50L27
3170I2n2k14K75m38M12R9j62P4O8j37R0l23J45L82m84K11j0k16J89l66j5P96p00
3193b84K39J5j57J97j02M8J1l09K57M60l31N0j72j64N83l59k94P16m92N23m05
3214C0j57N70m65L8J99l45N8R2j74O22n10k12N06m49j09N03q6L9k15j8M70m34
3236d7NK71k64q5L79n41Q38p16J4M13l30P1j57k21O04m25m7L00l91L01m9j86M84
3259B21j91k39K21J7K09j78j25K24o4k02K07n6m2L06k40J45m0l98L67n9k41M07
$$ plain form
3281 249 -207 184 173 -236 -125 24 -231 72 -105 -24 253 -532 234 248 13 -103 -123 -41 222 -123 72 318
3303 318 -268 -13 -109 -66 271 -254 99 19 -199 157 -210 -178 398 -397 -172 121 -1 65 69 5 362 -301 47
3326 47 162 -181 54 150 -35 367 -259 279 310 -156 72 138 106 186 50 -143 193 -30 -202 -108 -516 229
3348 229 -20 -13 85 -53 64 106 47 101 -28 -84 467 84 -60 158 75 206 83 -235 171 -6 -19 247 15
3371 15 255 -107 -169 163 -6 -361 219 -75 8 -11 -383 317 -366 -424 19 43 -137 185 -306 6 386 -247
3393 -247 161 46 -21 124 -258 347 186 -280 -21 101 1 389 -207 13 157 -385 -81 -45 -162 -13 -290
3414 -290 -262 255 -349 90 23 -220 257 -8 -155 337 -127 133 391 -21 245 -105 102 309 -125 110 115
3435 115 -244 -119 -18 -166 268 -284 -91 120 -535 -254 -50 -110 80 -162 85 457 -407 80 0 -213 461
$$ packed form
3281B49m56L91j1m09J11J49k55L03j77Q1K77p85P66J4k35j16k0Q2K63l45J95K46
3303C18n86K55r6M3L37n25L53q0k18L56l67L2N76p95K25K93j22O6Mo4L57o63L48
3326D7J15l43K35R6j85M02o26N38L1m66K28O6l2Q0j36j93L36k23j72R4m08P45
3348B29k49PR8j38J17M2n9N4j29n6N51l83j44K18q3J31j23l18M06j77j3K66k32
3371A5K40l62o2L32j69l55N80k94Q3j9l72P00o83n8M43K4j80L22m91L12L80o33
3393b47M08j15o7J45l82O05j61m66K59J22j00L88n96K20J44n42L04L6j17J49k77
3414b90K8N17o04M39o7k43M77k65j47M92m64K60K58m12K66l50K07K07m34K35N
3435A15l59J25J01j48M34n52J93K11o55K81K04o0J90k42K47L72q64M87q0k13O74
$$ plain form
3456 461 16 80 306 -314 178 39 -157 49 -91 -91 400 -213 -64 187 -70 204 -93 -89 43 -63 -262 283
3478 283 -157 48 -102 -287 268 93 -112 191 -40 242 81 -125 439 187 22 10 246 -96 60 -97
3498 -97 226 -95 -139 137 -292 123 121 -196 -54 0 -187 114 -243 -233 54 -394 212 93 -59 -17 -50 -21 284
3521 284 62 7 227 -36 145 -94 -78 188 -145 -85 67 -321 24 158 -143 33 -85 -140 121 -50 -55 309
3543 309 -14 16 -252 215 282 -211 70 313 -259 151 145 275 239 -261 120 64 -101 -4 -228 89 98 -193 42
3566 42 48 -247 -80 -33 -156 158 -279 42 114 -181 -78 -59 -103 78 -104 -217 581 -159 86 53 180 283 -8
3589 -8 -54 204 -46 -50 243 -256 -26 -51 -30 37 -164 -487 306 -165 19 -65 -81 170 110 -458 290 -205 -319 -220
3613 -220 -69 -3 270 -202 206 86 26 -9 -208 158 -78 -276 333 -65 -74 11 -253 -157 135 -182 169 -6
$$ packed form
3456D61m45O4K26o20M92j39j96K06j40%M91o13J49K51k57K74k97MJ32j06j99N45
3478B83m40K05j50j85N55j75k05L03k31K82j61k06N64k52j65j2K36l42J56j57
3498i7L23l21m4K76m29M15kl17J42N4j87L01l57J0K87m48O06j19j52M2l3K9L05
3521B84k22n5K20k63J81k39J6K66l33O0J52l88L45J34l01J76j18n5K61j71nL64
3543C09l23L0k68M67O7m93K81K43n72M10oJ30l6n00L81n6j65R7k24L17Rk91K35
3566D2Ok95J67M7j23L14m37L21P2k95J03J9m4J81j82j13P98p40K45l3J27J03k91
3589hm6K58k50mK93m99K30k5K1O7k01l23P93m71J84q4j6K51o0n68P48m95j14R9
3613b20J51O6K73m72M08j20o0l5j99L66k36j98O09l98rQ5k64R6K92l17L51j75
$$ plain form
3635 -6 49 -9 -263 19 -116 -284 90 -97 127 267 -66 159 -34 -225 65 168 -198 229 -23 186 158 -376
3657 -376 215 166 -76 68 -86 -102 75 -395 -19 171 -341 148 132 -13 -30 -244 256 203 -79 88 21 111
3679 111 -35 -142 116 67 -193 155 60 -146 50 -259 157 71 -223 -68 -120 -79 293 -377 -67 285 -127 -14
3701 -14 199 -263 215 45 -14 229 68 111 158 -57 356 -144 -25 295 -89 -85 -110 84 181 -15 -68 -42 -55 90
3725 90 201 -263 92 -130 -70 133 -74 -280 41 -61 51 176 92 57 -112 -340 273 104 -89 64 -76
3746 -76 190 -77 87 98 -246 21 -240 -238 -7 -134 -333 108 75 -290 100 -107 155 158 -427 170 218 -141 197
3769 197 -113 -9 310 -171 -122 91 -8 164 -242 -89 -4 -343 116 -78 -248 203 -170 -315 -248 -75 -239
3790 -239 28 -427 57 -23 5 207 92 -12 99 -91 -93 -154 101 196 -180 157 215 -230 157 187 -52 253 -395
$$ packed form
3635fN5n8k54K82j35j68L74j87K24J40l33K25j93j91K90J03l66M27k52K09k8n34
3657c76N91m9k42J44j54j6J77m70L76J90n12M89j6j45j7k14N00n3k82J67o7R0
3679A11j46j07K58m9k60L48r5k06J96l09M16q6k94J55n2M1L72o70L10L52m12J13
3701a4K13m62M78j70n9K43j61M3M7k15M13n00J19L20l84Mk5J94R7j96n3K6j3J45
3725I0J11m64L55k22O0K03k07k06L21j02J12J25q4l5j69k28O13j69j93J53j40
3746g6K66k67J64J1l44K67k61KK31j27j99M41l3l65L90k07K62Ln85N97M8l59L38
3769A97l10J04L19m81M9K13r9J72m06J53Q5l39M59j94j70M51l73j45O7J73j64
3790b39K67m55M84q0K8K02j15j04J11j90ko1K55R5l76L37N8m45L87L0k39L05o48
$$ plain form
3813 -395 -99 136 -341 -43 -54 -187 203 -199 -32 99 -292 14 230 51 152 -97 51 199 141 -91 359
3834 359 -161 150 83 -22 98 -111 -111 247 -23 300 162 -223 156 -156 -281 270 -212 -97 74 -152 267
3855 267 -102 -157 91 -46 -239 -29 -225 194 75 -87 529 -161 -86 -34 188 190 258 -137 374 -6 -166 -6
3877 -6 -100 23 40 -93 137 18 -165 97 6 160 -128 -31 30 -63 -407 -57 3 32 236 -217 239 -78 39
3900 39 326 93 158 168 -260 120 176 -200 194 -128 -107 77 -242 -109 146 -146 109 -37 -198 -204 -172 -17 217
3923 217 110 167 -41 63 74 -83 252 173 -117 250 -26 26 299 66 -83 384 -473 15 29 46 -175 -91
3945 -91 -390 -39 -110 -246 403 -314 176 306 -72 167 36 73 244 -190 176 -155 -44 200 163 105 41 23
3967 23 -181 144 -39 121 -6 -63 22 -253 -75 -154 -24 183 -46 -130 197 -22 -247 -48 18 -151 227 -66
$$ packed form
3813c95K96K35m77K98j1j33L90m02J67J31l91L06K16j79J01k49J48J48n8k32M50
3834C59n20L11o7j05J20k09%L58k70L23j38l85L79l12j25N51m82J15J71k26M19
3855B67l69n5K48j37j93K10j96M19j19j62O16o90P5N2K22KO8l95N11l80j60J60
3877fr4J23J7j33K30j19j83K62r1J54k88R7O1r3l44L50O0K9K04m53M56l17J17
3900C9K87k33O5J0m28L80N6l76L94l22K1J84l19J33K55k92K55j46j61oL2J55K34
3923B17j07N7k08J04J1j57L35p9k90L67k76N2K73k33j49M67q57M88J4J7k21Q4
3945i1k99L51p1j36O49p17M90J30l78K39j31L7J71m34L66l31J11K44l7n8o4j8
3967B3k04L25j83J60j27n7Q5k75J78p9J30K07k29q4L27k19k25J99O6j69L78k93
$$ plain form
3989 -66 58 -83 -115 53 3 88 84 -215 244 80 -78 58 -49 94 104 -281 148 203 31 4 15 108 131 -42
4013 -42 -269 33 -146 45 190 85 225 -30 117 138 -138 108 207 -102 -33 114 153 120 -313 -46 81 -78
4035 -78 135 -258 -70 91 -242 -282 -101 -266 102 -121 95 100 -63 19 183 -233 -115 -64 -134 81 -15 297 15
4058 15 -38 35 -128 50 -36 -269 -112 -77 -134 -199 -184 -234 18 -265 230 -100 -151 131 -33 89 271 -154 -120 296
4082 296 -161 -13 128 -136 -3 -149 -129 235 -6 -110 194 -67 116 -115 -55 414 -181 -55 122 27 252
4103 252 -30 -166 -21 57 -64 96 -70 146 -52 110 146 214 -129 71 -37 219 -72 -225 93 136 -242
4124 -242 -201 -142 74 -208 -20 99 -170 -23 -178 -2 -30 -21 -241 -6 181 -319 51 -324 -44 277 90 195
4146 195 66 -331 -5 -14 -270 99 -54 125 226 -279 -62 91 -230 166 -98 -71 63 -315 144 -69 -197
$$ packed form
3989f6J24j41l2J68n0Q5mk99M59j64j58J36j07J43J0l85M29N5j72k7J1R3K3j73
4013d2k27L02j79J91J45j05J40k55J47K1k76K46R9l09O9J47L9l3m33K67J27j59
4035g8K13l93J88J61l33m0J81j65L68k23K16Nj63Q2J64m16J18N1p0K15r6L12k82
4058A5n3P3j63J78q6k33J57L5n7o5J5n0K52k83M95l30n1K82j64J22J82m25L4M16
4082B96m57J48J41k64J33j46K0L64k41j04L04k61J83k31O0M69n95J26J77r5K25
4103B52k82j36J45P8j21J60j66K16j98J62L6O8l43K00j08K56k91j53L18M3l78
4124b42M1N9K16k82J88J19k69J47j55J76k8Rk20K35J87n00L70l75K80L21j87J05
4146A95j29l97L26rk56L69j53J79J01n05K17J53l21L96k64K7J34l78M59k13j28
$$ plain form
4167 -197 -165 11 -12 174 -224 131 147 -425 63 -161 142 307 -96 163 186 -269 -28 80 227 -171 -207 -106
4189 -106 208 -161 -15 -25 -74 173 -305 -62 -51 -112 -230 72 -64 49 0 14 15 36 -243 359 -166 55 69
4212 69 38 203 -92 235 -58 260 149 -157 -7 453 -287 -351 185 -219 33 -201 -370 204 -312 -113 134
4233 134 -206 -28 143 90 144 -7 -237 400 79 147 86 14 207 -29 34 283 -129 -119 63 -296 204 -118
4255 -118 -159 80 92 -55 -63 -23 159 -158 79 185 -72 146 -176 -162 179 337 -305 378 149 -179 180 -190
4277 -190 183 8 -80 112 112 74 -93 -171 -75 -26 -208 129 150 68 166 139 -119 0 -153 -110 129 -43 199 -109
4301 -109 176 154 -59 37 240 -183 174 -59 32 180 -230 284 134 -49 67 -55 -102 35 -21 -68 67 -265
4323 -265 -203 44 -152 154 10 41 89 -34 120 -120 19 171 -170 172 353 -221 37 231 -7 -17 205
$$ packed form
4167a97L2J76k3J86l98L55J6n72M88k24L03J65m03K59K3m55K41J08J47l98l6J01
4189a06L14l69J46j0m9K47m78K43J1o1j18L02j36J13m9J4JK1k79O02n25K21J4
4212F9l1J65k95L27k93L18j11l06J50M60p40o4N36m04K52k34j69N74n16J99K47
4233A34l40J78J71n3N4j51k30O37l21O8o1p2J93k36O3K49m12J0J82l59N00l22
4255a18m1K39J2j47qM0J82l17K37J06k57K18l22J4L41J58o42O83k29l28L59l70
4277a90L73j75q8J92%l8j67p8R6M9j82L37K1q2R8k7k58J19j53M3K39j72K42l08
4301a09K85k2k13R6K03m23L57k33R1J48m10N14j50j83J16j22m7J37n6m7J35l32
4323b65O2K47j96L06j44L1M8j23J54k40J39J52l41L42J81n74K58J94k38j0K22
$$ plain form
4344 205 -307 166 -170 -107 48 -280 -20 24 -158 256 -124 -122 212 -494 98 82 15 325 -47 -207 158 -2
4366 -2 -15 -122 -140 341 108 -351 234 62 -25 41 -107 61 43 -179 -14 -218 88 -255 14 216 30 -254
4388 -254 114 -263 -72 81 -31 29 -28 -107 223 175 139 26 63 136 129 -156 -62 61 -166 147 -253 -84 188
4411 188 -165 156 -284 -323 21 -21 -283 -124 58 -159 -1 -231 80 -128 139 123 -321 -3 -38 103 137 -106
4433 -106 -100 61 51 83 140 -16 -115 -4 37 196 -141 -82 179 -63 -118 114 -187 159 -85 -40 202 -331 -46
4456 -46 122 -33 123 66 44 240 105 19 281 25 19 -166 152 344 -40 -14 222 -112 -51 -149 70 -6 -65 31
4480 31 -197 -311 -67 116 -359 169 -175 -179 115 36 142 284 216 288 -40 -125 233 63 -40 157 141 7 29
4503 29 -100 393 -155 44 -72 69 306 94 147 172 -59 -4 -194 -148 63 151 6 235 47 1 162 -29
$$ packed form
4344B05n12M73l36O3J55l28K60M4j82M14l80KL34p06N92j6o7L10l72j60L65j60
4366bj3j07j8M81k33m59N85j72q7O6j48J68j8k22J65k04L06l43K69K02j86k84
4388b54L68l77J91J53j12O0n7p9L30m8l6j13L7P3pk85R4J23k27L13m00J69K72
4411A88l53L21m40l9L44m2k62J59J82k17J58k30L11k08K67j6m44L18l5J41L4k43
4433a06OJ61j0L2N7j56r9J11M1J59l37N9K61k42n5K32l01L46k44M5K42n33K85
4456d6J68j55J56n7k2J96j35q6K62k56oj85L18J92l84K6K36l34O1r8K19p6n9R6
4480C1k28j14K44J83m75N28l44mK94p9J06J42o8P2l28q5L58j70j03J97j6j34K2
4503B9j29M93n48J99j16J41K37k12N3K5k31N5j90M6K11Q8j45K29j88m6J61j91
$$ plain form
4525 -29 15 3 -318 243 113 -259 -101 -362 47 211 -253 -191 78 -225 -66 -17 -333 -280 -275 -36 230 -456 206
4548 206 444 -14 319 2 69 298 22 -10 -306 -60 -72 -232 -26 210 -227 -69 72 -108 20 -39 -16 -19
4570 -19 -520 138 37 5 95 -83 -270 -101 -150 -233 104 -32 53 -133 -60 158 -150 -93 254 136 133 193 -27 174
4594 174 -110 -54 413 -143 -78 176 19 152 -278 -80 107 -66 -78 -224 -23 60 -12 -365 -33 52 23 156
4616 156 -18 87 39 -63 38 -27 -12 29 32 -92 -47 -178 173 -327 246 70 -194 1 104 -69 151 -40
4638 -40 -290 -154 0 104 170 -350 94 -153 -86 45 -89 -32 211 -11 1 96 -189 226 36 -114 -19 -55 -195
4661 -195 95 -249 96 -117 4 -23 -369 62 -123 -58 142 62 -140 -44 -229 84 61 47 170 125 -199 11
4683 11 53 -11 209 -80 162 -9 -10 -84 -148 -401 -31 -278 12 -26 -272 83 -90 -41 -107 -122 -81 96 -172 39
$$ packed form
4525b9M4j2l21N61j30l72J58k61M09J64m64O2K69l03J59M9l16N3NK39K66o86O62
4548B06K38m58L33l17O7K29k76l2k96K46j2j60K06K36m37J58J41j80J28n9K3l
4570a9n01O58j01l2R0j78j87J69m9q3L37j36Q5j86P3K18l08N7L47j18lO0k20K01
4594A74k84N6M67n56O5K54j57J33m30J98J87j73j2j46K01Q3p2l53L32Q5k9J33
4616A56j74J05m8j02J01o5J5M1Lj24M5j31L51n00N73j76k64J95J03j73K20j91
4638d0k50J36J54J04O6n20M44k47O7J31j34N7K43k22J2R5k85M15j90j50R5l6j40
4661a95K90l44L45k13J21k7l46M31j85O5K00q0k02R6j85L13k3j4J23m5l24K10
4683A1M2o4K20k89K42j71jp4o4k53L70k47K90l8k46L55j73M9o6j5M1J77k68K11
$$ plain form
4707 39 289 -256 64 -129 -36 192 31 254 17 -6 -28 110 -237 111 -14 -157 -109 -147 -15 -59 -61 -12 -314
4730 -314 -83 -114 -178 -159 327 -152 89 -60 -468 32 -161 115 -105 -238 269 -100 -89 -9 38 62 -32 -172 144
4753 144 -98 -31 112 -90 -304 -15 13 136 -16 6 1 -199 8 54 -272 62 -8 -202 70 243 74 -24 -17
4776 -17 176 -122 -145 -35 -51 154 -109 -30 42 209 -12 164 -253 -298 127 -225 15 165 -231 -102 64 224
4798 224 113 -99 141 212 -102 32 54 -53 60 -30 123 86 -103 206 296 148 -154 62 74 240 -274 -110
4820 -110 20 -131 43 -71 -160 90 -51 151 42 -336 113 109 -65 267 -138 -57 239 -212 -116 50 -165 -9
4842 -9 -156 -105 68 100 -201 160 -158 -9 -133 63 180 91 -275 -50 -60 25 -7 -73 158 -392 -6 58 -205
4865 -205 156 361 -19 122 -145 89 194 30 -118 174 -63 183 -94 54 302 -190 1 61 -176 75
$$ packed form
4707C9K50n45L20j93R3K28j61K23k37k3k2J38l47L48j25j43M8l8J32m4kM9l02
4730c14K31l1o4J9M86m79K41j49m08N00j93K76k20j33N07l69J1Q0M7K4r4j40L16
4753A44k42O7J43k02k14K89K8J23j52K2nk00K07M6l26L34p0j94K72J73j69r8P
4776a7J93k98k3J10j6K05k63P9P2J67k21J76m17m5M25l52K40J50l96J29J66J60
4798B24j11k12K40P1l14J34K2j07J13r0J53l7j89L09R0j48l02K16J2J66n14J64
4820a10J30j51J74j14q9K50j41K02j09l78M49mj74L32m05Q1K96m51R6J66k15J56
4842ij47N1J73L2l01L61l18J49j24J96J17q9l66K25j0Q5l2o6K31n50L86O4k63
4865b05L61K05l80J41k67K34J05j64j48K92k37K46k77J48K48m92J91O0k37K51
$$ plain form
4885 75 -21 -16 202 -16 -22 -75 -82 34 116 -280 118 267 99 295 -45 61 174 -25 309 129 121 1 -67 99
4909 99 -96 -214 141 -58 -132 142 13 -140 -38 -266 278 -85 -21 111 44 -12 272 -96 75 53 196 150
4931 150 -107 -178 200 161 168 136 -145 95 -27 -26 121 -139 -12 -135 -216 -6 -94 -140 112 -145 93 -71 -91 184
4955 184 -140 61 127 -4 160 144 -90 -38 177 16 -31 -65 115 -12 -111 -45 168 -113 -30 -347 112 165 147
4978 147 -115 66 -254 160 -56 -197 289 -3 50 317 102 102 41 -239 58 -109 -84 164 -6 57 -23 -19 337
5001 337 38 -102 -16 -148 -53 308 -84 -158 -134 -125 -50 -96 12 168 16 277 -179 -49 270 25 -69 43 84
5024 84 333 -151 4 21 118 55 131 -224 144 -22 -126 84 -103 178 20 11 -88 -109 -137 136 101 33 193 -66
5048 -66 166 111 -132 144 -224 -148 88 254 179 58 17 201 325 -40 95 -37 11 104 107 5 37 -200 -70
$$ packed form
4885G5r6NK18k18on3pJ16Q2l96L98J49j68J96l40J06J13j99L34j80qj20o8J66
4909I9j95j18L55j99p4K74j29j53J02k28N44l63O4J32o7n6K84l68J71k2J43m6
4931A50k57p1L78l9Pl2k81K40j22JJ47k60J27j23q1K10q8m6K52k57K38j64k0K75
4955A84l24K01O6j31J64j6k34N2K15j61m7l4J80j27r9O6K13k81Q3l17M59N3j8
4978A47k62J81l20M14k16j41M86k92N3K67k15%o1k80K97j67K5K48j70O3q0ML56
5001C37k99j40Q6j32R5L61l92p4K4RP5m6J08J56j52K61m56J30L19k45r4J12M1
5024H4K49m84J55J7R7o3P6l55L68j66j04K10j87K81j58rr9k1k8K73l5o8J60k59
5048f6K32n5k43K76l68P6K36J66p5j21m1J84J24l65J35j32M8R3Lj02L2k37J30
$$ plain form
5071 -70 -96 -88 257 -176 -11 86 -25 73 120 -199 -6 -58 289 -29 -84 -11 226 218 16 329 -80 85 -99 33
5095 33 175 -58 -121 116 -124 -118 -154 -195 31 2 122 -133 -241 81 -209 -260 105 -22 -4 308 171 104 201 184
5119 184 40 -154 -118 -62 -61 33 162 -1 82 -67 79 113 114 287 -96 -143 153 -33 -16 6 -188 -58 102 -166
5143 -166 149 96 82 60 -8 103 167 -78 109 238 -89 -125 168 532 89 -58 -92 -88 12 16 53 -56 167 -117
5167 -117 252 138 -184 105 -84 -92 -74 -152 192 313 -128 204 -102 -93 -3 -146 -58 124 -339 -166 150 -76 205
5190 205 -102 -205 53 -102 70 206 -9 78 111 81 -45 -168 -200 19 88 61 96 152 -232 -44 195 -64 -61
5213 -61 155 195 -84 257 126 85 -130 -212 -70 -138 99 -12 -58 5 83 -7 136 -84 -32 149 -60 -36 128 -156
5237 -156 53 25 35 -52 15 105 38 -47 -167 356 -254 23 -44 -100 175 -129 203 80 -148 -44 -151 41 197
$$ packed form
5071g0k6QL45m33J65R7j11R8M7l19J93n2L47l18n5P3K37qk02L13m09J65j84J32
5095C3J42k33o3K37k40Ol6m1K26k9J20k55j08L22k90n1L65j27J8L12j37o7R7j7
5119A84j44j94L6N6JR4J29j63Q3j49J46L4JJ73l83m7K96j86J7K2j94J30J60k68
5143a66L15n3j4k2o8J11O4k45J87J29l27l6K93L64m43j47l4MJ00ML7j09K23k84
5167a17L69j14l22K89j89qJ8p8L44J21m41L32l06RR0j43Q8J82m63J73L16k26K81
5190B05l07j03K58j55J72J36k15Q7L3l0j26j23l2K19O9k7L5N6l84J88K39k59L
5213f1K16M0k79L41j31m1k15q2J42o8K37j11m6O3P8r0J43k20N2J81k09K4J64k84
5237a56K09k8J0q7O7R0o7q5j20N23o10K77o7n6K75l04L32j23k28J04j07J92J56
$$ plain form
5260 197 26 69 152 -315 101 -165 -195 300 -124 -73 3 -27 5 198 -137 -50 401 150 226 -114 -39 -41 -79 -180
5284 -180 -9 -293 93 88 -18 -207 29 276 -36 -34 16 95 45 -169 -130 -113 5 -39 167 60 -8 200 98 77
5308 77 111 188 314 -66 -73 178 -12 -106 -3 -177 13 64 -130 222 12 -82 7 -86 285 -38 -108 175 2 -84
5332 -84 -110 -177 96 138 -37 104 12 33 -7 -331 -80 62 -218 75 -12 118 -66 95 -82 104 -454 -28 -137
5355 -137 -314 135 -154 -116 229 -109 -167 119 90 184 -131 95 79 -22 147 165 -263 43 3 2 226 -85 -70
5378 -70 67 -222 29 12 -86 157 -73 105 186 -229 265 -29 -17 282 92 76 18 -101 -286 57 -115 92
5400 92 181 113 -112 208 -28 138 38 -103 209 -268 -240 -123 -235 -234 -222 6 -33 -259 95 -297 -42 215 -135
5423 -135 -100 -96 -119 -208 53 -174 11 -50 66 252 124 129 -23 8 173 85 -58 57 -77 -76 190 -101 198 82
$$ packed form
5260A97j71M3Q3m67M16k66l0M95m24N1P6l0L2J93l35Q7M51k51P6l40P5kl8j01
5284a80J71k84L86nj06j89K36K47l12KN0P9n0k14L9J7J18m4K06j07o8K08j02k1
5308G7L4P7J26l80pK51j90r4J03j74J90N1j94L52k10r4Q9r3L71l23p0K83j73q6
5332h4k6o7K73M2j75J41r2K1m0l24K51J42k80K93q7J30j84J61j77J86n58M26j09
5355a37j77M49k89L8L45l38n8K86k9R4l15K26j6j01J69J8m28L06m0jK24l11J5
5378g0J37k89K51j7r8K43k30J78Q1m15M94k94J2K99j90j6n8j19j85L43j72K07
5400I2Q9o8k25L20k36J66j00j41L12m77K8J17j12JJ2K28l9k26L54l92K55K57l50
5423a35L5Mk3q9K61k27J85o1J16J86j28Nj52L1J65q8j43J15j34JK66k91K99j16
$$ plain form
5447 82 39 16 -226 66 18 -32 -91 -65 -90 134 -116 53 127 -147 -23 133 385 12 87 319 209 -49 3 32
5471 32 114 85 -121 120 117 -22 -43 -8 -185 104 -6 178 67 -70 -205 153 -257 39 -104 -78 65 75 85
5494 85 179 -288 -96 72 -141 163 44 -23 165 78 63 -177 67 69 -75 -102 -13 -235 84 125 -70 148 92 110
5518 110 132 -75 64 103 -156 136 -131 -130 218 186 128 -50 -20 -70 -339 -226 165 115 6 -31 -23 78 155 -166
5542 -166 147 118 -149 -159 -79 42 72 9 188 -152 -195 90 47 -71 -83 -299 330 259 -23 -22 207 125 -35 25
5566 25 -34 -292 -175 76 20 -41 53 -28 -20 218 -157 -15 77 -25 -67 -352 198 323 -186 95 -59 -178 158
5589 158 -51 145 140 -239 100 26 -30 15 -231 -80 -92 -65 158 51 14 66 18 -123 15 48 115 -122 130 46
5613 46 45 9 200 34 38 -78 59 -37 -94 -88 135 72 -44 174 18 92 -16 -114 50 26 -76 179 -216 -224 -132 8
$$ packed form
5447H2m3k3k42K92m8n0n9K6k5K24k50J69P4k74J24J56K52l73P5K32j10k58N2K9
5471C2Q2k9k06K41lj39k1L5j77K89j10J84j11j37j35L58m10K96j43K6J43J0J0
5494H5R4m67J92J68k13L04j19o7J88q7j5k40K44Kj44k7Q9k22L19M1j95K18n6J8
5518A10K2k07J39L9k59K92k67JL48l2n8j78L0n0k69J13L91n0j09l7QJ01P7l21
5542a66L13k9k67j0Q0J21L0o3J79l40m3K85m3j18j2k16O29p1k82JK29q2j60O0
5566B5n9k58J17K51n6o1R4q1QK38l75J42R2j02m2k85N50J25n09K81j54j19L36
5589A58k09J96nl79L39p4n6M5k46J51j2K7K23j07l7N2m8j41J38L3O7k37K52q4
5613D6jl6J91j66Mj16J37r6n7OK23o3j16K18j56P4j08r8J64k4j02K55l95qR2J40
$$ plain form
5639 8 53 -217 -104 260 -101 109 82 -309 79 2 60 135 91 -21 58 23 -96 19 13 216 149 -55 76 -15 63
5664 63 231 -348 92 -227 -125 141 174 5 51 -131 -5 38 -97 85 -133 -171 -5 -19 342 -272 112 -58
5686 -58 85 92 -253 -158 -174 115 -56 16 -100 41 16 -8 51 -73 -103 -98 -45 -12 30 -117 220 494 -144 115 -116
5711 -116 39 160 33 271 35 -151 -25 -92 145 -111 111 51 -125 -184 -81 162 -290 57 5 -21 269 -148
5733 -148 -340 89 -194 13 -256 -120 173 59 75 -80 161 7 84 182 205 -51 42 152 -188 93 -150 256
5755 256 55 -123 -41 142 -57 1 68 -104 104 -29 42 177 -181 -138 113 204 -15 -253 -156 48 -179 -187 -109
5778 -109 -46 156 -150 -212 127 -40 27 -117 112 -111 -28 -150 205 -47 -191 143 187 64 -78 -219 172 18
5800 18 -47 97 -197 39 -23 -35 51 41 -252 -183 -9 -82 60 6 2 -185 -98 15 -82 -105 -17 -102 62 163 -342
$$ packed form
5639HM5k70J13L64l61K10k7l91L88p7N8P5m4j12P9l5j19J15oK03o7k04J31r1P8
5664F3J68n79M40l19J02K66L3j69M6j82J26M3j35J82k18l8J66j4L61o14L84j70
5686e8J43Pl45R5j6K89j71P2j16J41k5k4N9j24l0NN3L3M2j47L37K74o38K59k31
5711a16J55J21j27K38k36j86J26o7K37k56K22o0j76n9J03K43m52L47n2k6K90m17
5733a48j92M29k83K07k69J36K93j14J6j55K41j54P7R8K3k56R3J10l40K81k43M06
5755B56k01j78Q2J83j99N8O7j72K08j33P1J35l58M3K51R1k19k38R7K04k27qP8
5778a09O3K02l06o2L39j67O7j44K29k23Q3j22L55k52j44L34M4j23j42j41L91j54
5800A8o5J44k94K36o2j2Q6j0k93O9J74p3J42n4mj87Q7J13r7k3Q8q5J64J01n05
$$ plain form
5825 -342 -89 62 -153 14 -21 -37 -2 -219 -64 39 50 172 134 101 -100 -79 -10 -61 74 19 224 -32 151
$$ packed form
5825c42K53J51k15J67l5j6L5k17J55J03J1J22l8l3k01K1O9n1J35n5K05k56J83
$$ [...]
8191A76
##END NTUPLES=NMR FID
##END=
