##TITLE=1H_Pr 5022
 CDCl3,8 sc, 
 11.02.2021
##JCAMPDX= 6.0         $$ Bruker NMR JCAMP-DX V2.0
##DATA TYPE= NMR FID
##DATA CLASS= NTUPLES
##ORIGIN= UXNMR, Bruker Analytische Messtechnik GmbH
##OWNER= root
$$ XWIN-NMR		Version 3.5
$$ Thu Feb 11 14:10:24 2021 Russian Standard Time (UT+4h)  she@DPX200
##.OBSERVE FREQUENCY= 200.1315066352
##.OBSERVE NUCLEUS= ^1H
##.DELAY= (6, 6)
##.ACQUISITION MODE= SIMULTANEOUS
##.ACQUISITION SCHEME= undefined
##.AVERAGES= 8
##.DIGITISER RES= 18
##SPECTROMETER/DATA SYSTEM= spect
##.PULSE SEQUENCE= zg30
##.SOLVENT NAME= CDCl3
##.SHIFT REFERENCE= (INTERNAL, CDCl3, 0, 15.7039)
##AUDIT TRAIL= $$ (NUMBER, WHEN, WHO, WHERE, WHAT)
$$ ##TITLE= Audit trail, XWIN-NMR		Version 3.5
$$ ##JCAMPDX= 5.01
$$ ##ORIGIN= Bruker BioSpin GmbH
$$ ##OWNER= she
$$ F:/spectra/data/she/nmr/H-F/1/audita.txt
$$ ##AUDIT TRAIL=  $$ (NUMBER, WHEN, WHO, WHERE, WHAT)
(   1,<2021-02-11 14:09:12.68 +0400>,<she>,<DPX200>,
      <created by zg, POWCHK disabled, PULCHK disabled
       configuration hash MD5:
       00 E9 B6 7A A2 85 ED C7 34 08 36 98 17 FE 4E 26
       data hash MD5: 16K
       4C 9E 2C 4C 1A 00 D6 96 43 DE DF D8 12 5E C8 5E>)
$$ ##END=
$$ 
$$ hash MD5
$$ 03 10 AF 63 B7 F4 78 72 B6 29 70 A6 D7 B7 18 73
##$RELAX= 
##$RELAX= 
##$RELAX= 
##$RELAX= 
##$RELAX= 
##$RELAX= 
$$ Bruker specific parameters
$$ --------------------------
##$DU= <F:/spectra>
##$EXPNO= 1
##$NAME= <H-F>
##$PROCNO= 1
##$TYPE= <nmr>
##$USER= <she>
##$AMP= (0..31)
100 100 100 100 100 100 100 100 100 100 100 100 100 100 100 100 100 100 
100 100 100 100 100 100 100 100 100 100 100 100 100 100 
##$AQSEQ= 0
##$AQ_mod= 1
##$AUNM= <au_zg>
##$AUTOPOS= <>
##$BF1= 200.13
##$BF2= 200.13
##$BF3= 200.13
##$BF4= 200.13
##$BF5= 200.13
##$BF6= 200.13
##$BF7= 200.13
##$BF8= 200.13
##$BYTORDA= 1
##$CFDGTYP= 0
##$CFRGTYP= 5
##$CHEMSTR= <none>
##$CNST= (0..31)
1 1 145 1 1 1 1 1 1 1 1 1 1 1 1 1 1 1 1 1 1 1 1 1 1 1 1 1 1 1 1 1 
##$CPDPRG= <>
##$CPDPRG1= <>
##$CPDPRG2= <>
##$CPDPRG3= <>
##$CPDPRG4= <mlev>
##$CPDPRG5= <mlev>
##$CPDPRG6= <mlev>
##$CPDPRG7= <mlev>
##$CPDPRG8= <mlev>
##$CPDPRGB= <>
##$CPDPRGT= <>
##$D= (0..31)
0 1.2 0 0 0 0 0 0 0 0.06 0 0.03 0 0 0 0 0.0002 0 0 0 0 0 0 0 0 0 0 0 0 
0 0 0 
##$DATE= 1613038152
##$DBL= (0..7)
120 120 120 120 120 120 120 120 
##$DBP= (0..7)
150 150 150 150 150 150 150 150 
##$DBP07= 0
##$DBPNAM0= <>
##$DBPNAM1= <>
##$DBPNAM2= <>
##$DBPNAM3= <>
##$DBPNAM4= <>
##$DBPNAM5= <>
##$DBPNAM6= <>
##$DBPNAM7= <>
##$DBPOAL= (0..7)
0.5 0.5 0.5 0.5 0.5 0.5 0.5 0.5 
##$DBPOFFS= (0..7)
0 0 0 0 0 0 0 0 
##$DE= 6
##$DECBNUC= <off>
##$DECIM= 32
##$DECNUC= <off>
##$DECSTAT= 4
##$DIGMOD= 1
##$DIGTYP= 9
##$DL= (0..7)
0 120 120 120 120 120 120 120 
##$DP= (0..7)
150 150 150 150 150 150 150 150 
##$DP07= 0
##$DPNAME0= <>
##$DPNAME1= <>
##$DPNAME2= <>
##$DPNAME3= <>
##$DPNAME4= <>
##$DPNAME5= <>
##$DPNAME6= <>
##$DPNAME7= <>
##$DPOAL= (0..7)
0.5 0.5 0.5 0.5 0.5 0.5 0.5 0.5 
##$DPOFFS= (0..7)
0 0 0 0 0 0 0 0 
##$DQDMODE= 0
##$DR= 18
##$DS= 0
##$DSLIST= <SSSSSSSSSSSSSSS>
$$ [...]
##$SUBNAM2= <"">
##$SUBNAM3= <"">
##$SUBNAM4= <"">
##$SUBNAM5= <"">
##$SUBNAM6= <"">
##$SUBNAM7= <"">
##$SUBNAM8= <"">
##$SUBNAM9= <"">
##$SW= 16.9725356469052
##$SWIBOX= (0..15)
0 0 2 0 0 0 0 0 0 0 0 0 0 0 0 0 
##$SW_h= 3396.73913043478
##$TD= 16384
##$TD0= 1
##$TE= 0
##$TE2= 300
##$TE3= 300
##$TEG= 300
##$TL= (0..7)
0 120 120 120 120 120 120 120 
##$TP= (0..7)
150 150 150 150 150 150 150 150 
##$TP07= 0
##$TPNAME0= <>
##$TPNAME1= <>
##$TPNAME2= <>
##$TPNAME3= <>
##$TPNAME4= <>
##$TPNAME5= <>
##$TPNAME6= <>
##$TPNAME7= <>
##$TPOAL= (0..7)
0.5 0.5 0.5 0.5 0.5 0.5 0.5 0.5 
##$TPOFFS= (0..7)
0 0 0 0 0 0 0 0 
##$TUNHIN= 0
##$TUNHOUT= 0
##$TUNXOUT= 0
##$USERA1= <user>
##$USERA2= <user>
##$USERA3= <user>
##$USERA4= <user>
##$USERA5= <user>
##$V9= 5
##$VALIST= <valist>
##$VCLIST= <CCCCCCCCCCCCCCC>
##$VD= 0
##$VDLIST= <DDDDDDDDDDDDDDD>
##$VPLIST= <PPPPPPPPPPPPPPP>
##$VTLIST= <TTTTTTTTTTTTTTT>
##$WBST= 1024
##$WBSW= 4
##$XGAIN= (0..3)
0 0 0 0 
##$XL= 0
##$YL= 0
##$YMAX_a= 17098
##$YMIN_a= -31180
##$ZGOPTNS= <>
##$ZL1= 120
##$ZL2= 120
##$ZL3= 120
##$ZL4= 120
##$ABSF1= 10
##$ABSF2= 0
##$ABSG= 5
##$ABSL= 3
##$ALPHA= 0
##$AQORDER= 0
##$ASSFAC= 0
##$ASSFACI= 0
##$ASSFACX= 0
##$ASSWID= 0
##$AUNMP= <proc_1d>
##$AZFE= 0.1
##$AZFW= 0.1
##$BCFW= 1
##$BC_mod= 2
##$BYTORDP= 1
##$COROFFS= 0
##$CY= 11.3945322036743
##$DATMOD= 1
##$DC= 2
##$DFILT= <>
##$DTYPP= 0
##$F1P= 15.9154993809931
##$F2P= -4.1035820241983
##$FCOR= 0.5
##$FTSIZE= 0
##$FT_mod= 4
##$GAMMA= 1
##$GB= 0.15
##$INTBC= 1
##$INTSCL= 1
##$ISEN= 128
##$LB= 0.24
##$LEV0= 0
##$LPBIN= 0
##$MAXI= 10000
##$MC2= 0
##$MEAN= 0
##$ME_mod= 0
##$MI= 1.114404
##$NCOEF= 0
##$NC_proc= 0
##$NLEV= 6
##$NOISF1= 3.799351
##$NOISF2= 2.8
##$NSP= 1
##$NTH_PI= 0
##$NZP= 0
##$OFFSET= 15.70392
##$PC= 1
##$PHC0= -10916.31
##$PHC1= 15.20094
##$PH_mod= 1
##$PKNL= yes
##$PPARMOD= 0
##$PSCAL= 0
##$PSIGN= 0
##$REVERSE= no
##$SF= 200.130013532006
##$SI= 16384
##$SIGF1= 3
##$SIGF2= 2
##$SINO= 400
##$SIOLD= 16384
##$SREGLST= <1H.CDCl3>
##$SSB= 0
##$STSI= 0
##$STSR= 0
##$SW_p= 3612.71676300578
##$SYMM= 0
##$S_DEV= 0
##$TDeff= 0
##$TDoff= 0
##$TI= <>
##$TILT= no
##$TM1= 0
##$TM2= 0
##$TOPLEV= 0
##$USERP1= <user>
##$USERP2= <user>
##$USERP3= <user>
##$USERP4= <user>
##$USERP5= <user>
##$WDW= 1
##$XDIM= 8192
##$YMAX_p= 0
##$YMIN_p= 0
$$ End of Bruker specific parameters
$$ ---------------------------------
##NTUPLES= NMR FID
##VAR_NAME=  TIME,          FID/REAL,        FID/IMAG
##SYMBOL=    X,             R,               I
##VAR_TYPE=  INDEPENDENT,   DEPENDENT,       DEPENDENT
##VAR_FORM=  AFFN,          ASDF,            ASDF
##VAR_DIM=   8192,          8192,            8192
##UNITS=     SECONDS,       ARBITRARY UNITS, ARBITRARY UNITS
##FACTOR=    0.0002944,     1,               1
##FIRST=     0,             0,               0
##LAST=      2.4114304,     0,               0
##MIN=       0,             -31180,          0
##MAX=       2.4114304,     17098,           0
$$ Real data points
##PAGE= N=1
##DATA TABLE= (X++(R..R)), XYDATA
$$ [...]
549h4L1l47P72j234J603j142M24j25L20J05r36J414j063P02n31P66p10J25P01
$$ -84 -53 -400 372 -862 741 -401 23 -102 218 323 -613 801 -262 440 -91 675 -35 90 791
568G91j148J312j164O59n17P14l83m29R25j103R39o79Q00j040O40J88q96J081
$$ 791 -357 955 -209 450 -67 647 264 -165 760 -343 596 -83 717 -323 317 505 -391 690
586F90r72N31m53R87j239L99O39r95Q45o92P96j139R06j80l07M56p52Q58o58N99
$$ 690 -282 249 -204 783 -456 -57 582 -413 432 -260 536 -603 303 123 -184 272 -480 378 -280 319
606C19r88J019k58p18J073q05M60p80J137p59J46J10l29O88j034J047q99P44o38
$$ 319 -669 350 92 -626 447 -358 102 -678 459 -300 -154 -44 -373 315 -719 328 -571 173 -465
625d65K17M85p67P13p26R70r70O69k95M9J81o99J124r20O59o04O06k62k45O13
$$ -465 -248 237 -530 183 -543 427 -543 126 -169 -120 61 -638 486 -434 225 -379 227 -35 -280 333
645C33n73O92j028J119o53J68L1j84O05r01R18p94O38n70L72J04n60P15q11R52
$$ 333 -240 452 -576 543 -110 58 89 -95 510 -391 527 -267 371 -199 173 277 -283 432 -379 573
665E73r31O05k92r4L52m70O70r40R05q06O32k14k64M05n42P47r11Q88o89L53q5
$$ 573 -358 247 -45 -139 213 -257 413 -527 378 -428 204 -10 -274 131 -411 336 -575 313 -376 -23 -108
686a08q0M31p64Q20p61P73o60K69J25l56M89n64P82r49P43l23N2J53m63P29q04
$$ -108 -188 243 -521 299 -462 311 -349 -80 45 -311 178 -386 396 -553 190 -133 -81 72 -391 338 -466
707d66Q31o52M86l20M6L72n42O38p58P77n88L53n2j50L52n70Q33q19N19m07L76
$$ -466 365 -287 199 -121 -75 297 -245 393 -365 412 -176 177 125 -25 327 -243 590 -229 290 -117 259
728B59q7k93N48p55Q67p94N43l27N3R4k57N93q32P33o16M48k04L0J99n69P89q51
$$ 259 172 -121 427 -328 539 -255 288 -39 14 108 -149 444 -388 345 -271 177 -27 3 202 -367 422 -429
750d29P01n34L17j38j6K04n41P51p98O71l91K36j32r1L85o77P78o90N57m17K21
$$ -429 272 -262 55 -83 -99 105 -436 315 -483 188 -203 33 -99 -190 195 -482 296 -394 163 -254 -33
771c3j0k92O00p36Q23o43M22k99J63R0l59O16p13O55n14M56k54j2K50m87O85o37
$$ -33 -43 -335 265 -471 352 -291 131 -168 -5 85 -274 342 -371 284 -230 226 -28 -40 210 -277 408 -229
793b29N55m87L55j20j18L94n53O16n90N40l83J53%k04M73o45O38o01M95l97J95
$$ -229 326 -161 194 74 -44 350 -203 413 -177 363 -20 133 133 -71 402 -243 395 -206 289 -108 87
814H7R2m41N55n75O27n66M24k96J03J88n06O24o07M97l84L44k84o3L58m93N77
$$ 87 179 -262 293 -282 345 -221 203 -93 10 198 -308 316 -291 206 -178 166 -118 -181 177 -316 261
835B61n51N19m57K61l1j76M00o46N67m48M21l32K20Q8m68N37m48N22n65N12k89
$$ 261 -290 229 -228 33 2 -174 226 -420 147 -301 120 -212 8 96 -372 165 -283 239 -326 186 -103
856a03k6K48m37N93n33M47n42N66k56j30M74n01L94m58O08m95K46P0k51L29m41
$$ -103 -129 119 -318 275 -258 189 -353 213 -43 -173 301 -200 194 -264 344 -151 95 165 -86 243 -198
877a98N35n36N73n22J59K59l69L29m12N30n90M81l29Q4J46k65M31n89M81m57L74
$$ -198 337 -199 374 -148 11 270 -99 230 -182 348 -242 239 -90 -6 140 -125 306 -283 198 -259 115
898A15j40j64K09l07N16o26N56m49J94m1p4K90n29M90m10M78l85J54M0j79L74
$$ 115 -25 -189 20 -287 229 -397 159 -290 -96 -137 -211 79 -450 40 -370 108 -277 -123 -83 -262 112
919A12m89N03n42M04j76J98K0l44M87m11M58n48M70k72JL20m16L79l84L99l63
$$ 112 -377 126 -416 -12 -188 10 30 -314 173 -238 220 -328 142 -130 -129 191 -225 154 -230 169 -194
940a94L93k58q5L85l92M04m74N06m41K17J27k73J79k86M70n41N52l94J00J53k72
$$ -194 199 -59 -144 241 -151 253 -221 285 -156 61 188 -85 94 -192 278 -263 289 -105 -5 148 -124
961a24L39l40M34n42M31j93J3Oj11L21n00N87m78J86J6j15J68k37L65n66N66k68
$$ -124 215 -125 309 -233 198 5 18 24 -87 234 -266 321 -157 29 45 -70 98 -139 226 -340 226 -42
983d2N6q3LJ32l59N94n74L06j77J19m4J3J58m23N64n44L72j58lM1j37L99n44M46
$$ -42 14 -69 -66 66 -293 301 -273 33 -144 -25 -69 -56 102 -321 243 -301 71 -87 -90 -49 -186 213 -331 115
1007A15l28L18j54j5J08k73M75m55M37l79J71lM2J28l62L66l60M06l10J68L3j65
$$ 115 -213 105 -49 -64 44 -229 246 -209 228 -151 20 17 59 187 -175 191 -169 237 -73 95 128 -37
1029c7K90l10L95m81L36k15J85o7j84L22m08M96m53L02k10N6J17j79J69l65M92
$$ -37 253 -57 338 -143 193 -22 163 96 -88 234 -174 322 -131 171 -39 17 134 -45 124 -241 251
1050B51l89K19j38K6J01k74L70k84K31k21J40m0n0J58l60M22m03L96k25L5Nj46
$$ 251 -138 81 -57 -31 70 -204 166 -118 113 -108 32 -8 -58 100 -260 162 -241 155 -70 -35 -30 -176
1072a76L54l15K47k83K53j60J27k2k11L19l36L64k48J74k42J80K3k01L08l87L53
$$ -176 178 -137 110 -173 80 -80 47 25 -186 133 -203 161 -87 87 -155 25 48 -153 155 -232 121
1093A21k28K58j42q2J72k98L73k78K24k35J66L2j09K07m10M37k59K60k38K8N7
$$ 121 -107 151 9 -73 99 -199 174 -104 120 -115 51 83 -26 181 -229 208 -51 209 -29 -1 56
1114E6j59L05l37K81l44L21j67M6J03k85L17k02K38k78J62j39L5J99k96J75k60
$$ 56 -103 202 -135 146 -198 123 -44 2 105 -180 137 -65 173 -105 57 -82 -47 152 -144 31 -229
1135b29L10j89J56j13p6K52k67K79l09K78k21J24L7j70J89k47L24k86K61k14L3
$$ -229 81 -108 48 -65 -141 111 -156 123 -186 92 -129 -5 32 -138 51 -196 128 -158 103 -111 -78
1156g8J57j63J60k17K98l07K57j09p3J34j36K70l03K98l43J96J1q3J86k78K85
$$ -78 79 -84 76 -141 157 -150 107 -2 -75 59 -77 193 -110 188 -155 41 52 -31 155 -123 162
1177A62l03K90j82J23p9r3K42j92K40l59K29j33J03Qj69K25k10L10k86J38j17
$$ 162 -141 149 -33 90 11 -82 160 -32 208 -151 78 -55 48 56 -113 112 -98 212 -74 64 -53
1198e3K0Q5r3J90l31L17k18J69o5m8M7j40K57k82K60k71J15L2j5O3j79J87k04
$$ -53 -33 52 -41 149 -182 135 -83 86 21 -27 20 -120 137 -145 115 -156 -41 -9 -24 39 -140 47 -157
1221a57K06j08O0r6K5J34j95K39k95K21m2J0J4j36K13k04K80k37J86j75L1J82
$$ -157 49 -59 1 -95 -70 64 -131 108 -187 34 -8 2 16 -120 93 -111 169 -68 118 -57 -26 156
1243A56k06J97k83K89k28J39n5k0J19j90K49l01K10j68J20N1j3%j55K16k44K61
$$ 156 -50 147 -136 153 -75 64 9 -11 108 -82 167 -134 76 -92 28 79 66 66 -89 127 -117 144
1265A44j51k5L8k8J75k71K08j98J61l7J8M8j88K34k45K22j69J00p9J2J15k39K38
$$ 144 -7 -32 6 -22 153 -118 90 -108 53 16 34 82 -106 128 -117 105 -64 36 -43 -31 84 -155 83
1288H3k70K40j04R4n4q1J41j77K01k21J79p6Q4m2j30J93k33K07j37J14o6J3P0
$$ 83 -187 53 -51 43 -11 -92 49 -128 73 -148 31 -45 39 -3 -133 60 -173 34 -103 11 -55 -42 28
1311B8p4J56k05J85j94J81q5l2P8j42K45k49J98j22P6j3k3R7k05K46j97J22p2
$$ 28 -46 110 -95 90 -104 77 -8 -40 38 -104 141 -108 90 -32 44 31 8 105 -100 146 -51 71 -1
1334aM6k9l2J42j33J01j97J47o7R3l8j55K38k27K05j63J36p2j9P0p8J49k01J32
$$ -1 45 16 -16 126 -7 94 -103 44 -23 70 32 -123 115 -112 93 -70 66 -6 -25 45 -33 116 -85 47
1358D7j23J78j22m2J42j78J77j54J20j42Q6kn9J47k25J24k1J50j69P4j6q4J09
$$ 47 -76 102 -20 -62 80 -98 79 -75 45 -97 -11 -13 -72 75 -150 -26 -47 103 -66 8 -8 -92 17
1381A7r9J29j64J52q8Q2L9j63K11k04J59j32J23o9j6P6n3R3j65J69j38J24o9o5
$$ 17 -82 47 -117 35 -53 29 68 -95 116 -88 71 -61 62 -7 -23 53 0 93 -72 97 -41 83 14 -51
1405e1J05j10J65j88J72j21O0mn6O5r9J42j65J40p7%N3o8J63j35J05k66K39r9
$$ -51 54 -56 109 -79 93 -28 32 28 -28 37 -62 80 -85 55 -22 -22 31 -37 126 -9 96 -170 69 -30
1429c0J9L9j09J41j51R6l9M8l0J4M5j22J22j61J58r6R5m2n5O1q9J07j26J14p9
$$ -30 -11 28 -81 60 -91 5 -34 14 -16 -2 43 -79 43 -118 40 -56 39 -3 -58 3 -86 21 -105 9 -70
1454g0L4Q8j63J79j48J02j13O0mj7J20p1Q9j52J69j72J50j8q4O6q6J02j06J47
$$ -70 -36 52 -111 68 -80 22 -91 -31 -35 -52 68 -3 86 -66 103 -69 81 63 -21 45 -41 61 -45 102
1478A02j26M6j1QO2j60J33j00J72q9l1J6k1M3j28J70j57J55j10J9M4l6P2j28R4
$$ 102 -24 22 11 19 81 -79 54 -46 126 37 6 22 1 44 -84 86 -71 84 -26 -7 37 1 73 -55 39
1503C9j02J32j09KL4m7J01j07R6q7M1K5oQr3J38j00Q2j35O5Qk7O2j01J21j46R9
$$ 39 -63 69 -40 -38 -4 -51 50 -57 39 -48 -7 18 12 20 -73 65 -35 47 -88 -23 -15 -42 20 -81 40 -106 -7
1530gk0L6o5Q3Qr9J02j48J48j6oK5p6L2p1J40p3O5m1j4N4r1R6n5K2l0J6K6j02
$$ -7 -27 9 -56 27 35 -64 38 -110 38 22 16 41 -35 -3 -74 66 -7 58 17 3 57 -34 62 7 29 -1 15 41 -61
1559f1J01r3J32j34J10r2Q8n6n7J09r8J73j04j6j8L4j22l2K25j74Mm2J53k44K55
$$ -61 40 -53 79 -55 55 -37 51 -5 -62 47 -51 122 18 2 -16 18 -104 -136 89 -85 -81 -123 30 -214 41
1584D1P6m3Nk81M21n40M80j85l70K02J14M00k66j98L49n8j3k21P3p8Q2r1J07o3
$$ 41 117 74 79 -202 219 -321 159 -26 -396 -194 -80 320 54 -144 205 147 134 -87 -14 -92 -10 -101 6 -57
1608e7N6j1k9P0p5L2k1N3o6L8pl1Q3p6J10r2Q7l1qN6j14J12j32R1l4K7L1p3J2
$$ -57 -1 -12 -41 29 -46 -14 -35 18 -48 -10 -17 -48 35 -41 69 -23 64 33 25 81 -33 79 -53 38 4 31 62 -11 1
1637Ak3P8j28J05m3R2n6k1Nj8O0n6L8m6%N2o1P2p8M6j01J06o7N5l5p3J17q2J02
$$ 1 -22 56 -72 33 -10 82 26 5 10 -8 52 -4 34 -12 -12 40 -21 51 -27 19 -82 24 -43 12 -23 -96 21 -61 41
1666D1p7N2k8k1J6nJ05j54R8q5P6nm5P7j36J54j18Q9j28Q2J3m7O4o3J25j10O0
$$ 41 -36 16 -12 -33 -17 -22 83 -71 27 -58 18 13 -32 45 -91 63 -55 34 -94 -12 1 -46 18 -45 80 -30 30
1693C0l9Qnp9J01m6Q5j40J24n9P7k5q8J51r7M9q2P9n8J3J6J0M4j17J08n0J7kk2
$$ 30 -9 -1 -6 -85 16 -30 55 -85 39 -20 57 32 -56 95 -2 47 -35 44 -14 -1 15 25 69 -48 60 10 27 25 3
1722CK9m5M1j33J41r1M9M7m4om3M8mJl5L6pk8M8o1K8n0N1M2J3np2P8q3O8n7L6
$$ 3 32 -13 28 -105 36 -55 -6 41 -3 -9 -52 -4 -8 -7 -42 -6 -13 -41 7 -54 -26 -76 -25 17 30 25 -47 31 -52 16 -41 -5
1754eJ4j1N3j11J06r3O0r4J04m9j2M5m4J17p4L5o6J0M4n8N8j10J64j36L8RP0m9
$$ -5 9 -2 51 -60 46 -47 13 -81 23 -26 -38 7 -37 80 6 41 -25 -15 29 -29 29 -81 83 -53 -15 -6 64 15
1782A5p9J45j33J02p9O4Lo3N8n4O6l4J1l3Q7m5p2L5l1Q2m2K5l7j1K1m2K5k4L6
$$ 15 -64 81 -52 50 -29 35 38 -25 33 -21 45 11 22 -11 76 31 -41 -6 -37 45 3 28 -9 -20 1 -41 -16 -40 -4
1811dj7M6k2K4l3J3oj1K3l2l6L0M6j2m6N4lJm5N3Oo6P9k4K1o7M5j9Mm9lO8j20
$$ -4 -21 25 3 27 -6 7 1 -10 13 -19 -55 -25 21 9 -37 17 14 15 -30 23 29 -37 42 18 39 -28 17 -2 2 -47 -50 18 -102
1844a02J24p3M1qK6Kl6O6j12Q7n6O1p3J05k5o5J24q8k9K1N5m9j1O9p8M1mPl1L1
$$ -102 22 -51 -10 -18 8 10 -26 40 -72 15 -41 20 -53 52 27 -38 86 -2 -31 -10 45 -4 -15 54 -24 17 13 20 -11 20
1874B0roK2p8R6o2N6n0RM8p9K4o1J09q8P8k3l3J3k7N2q7P3r3O3K0J0L5p1J8l9
$$ 20 11 5 27 -51 45 -17 39 -11 -2 46 -33 -9 -70 39 -49 29 6 -27 -14 -41 11 -76 -3 -96 -33 -13 -3 32 -39 -21 -60
1905f0P9Rj8j4jJ6m5O2m1Q6o7m9O4pom0N5n8OJ0M9k6n9N8m2MJ4N2k4K4m3k8N0
$$ -60 19 28 10 -4 -5 11 -34 28 -13 73 6 -43 21 14 8 -32 23 -35 -29 -19 30 4 -55 3 -39 -35 -21 31 7 31 -12 -40 10
1938A0l3N9l6mj1K3N8k6J0n0Qk7P7m1Kj1k3N2j9ll0O0q0J1K1OM5m3k2J6OJ7n9
$$ 10 -23 36 0 -4 -15 8 66 40 50 0 8 -19 58 17 19 8 -15 37 18 15 -15 45 -35 -24 -3 3 48 5 -17 -1 5 22 -37
1971c7O5o0M6q9Q6l3j8J4pM9j03J27q9M0N6o5M4J6j2l9N1m8Onl0Oj1J0J8J20o2
$$ -37 28 -32 14 -75 11 -22 -40 -26 -33 16 -87 40 -49 -9 47 -18 26 42 30 -9 42 -6 0 -5 -35 -29 -40 -30 -12 108 46
2002D6n3N7m3P1j06M7l9K5m3M6Rk9Q0j08K2j5M0k9N2j7j7O2q1M7k5Nk1L8J5l3
$$ 46 -7 50 7 78 -28 19 -20 5 -38 8 17 -12 68 -40 -18 -33 7 -22 30 13 -4 58 -23 24 -1 4 -17 21 36 3
2032CN0j23J17m8l2ql4Q8l9L0j8O2o5lMlK0m7Q4q6O0m1K3l0k6P2n6P0o9N1l0N6
$$ 3 53 -70 47 -1 -33 -41 -75 13 -26 4 -14 48 -17 -20 -16 -19 1 -46 38 -48 12 -29 -6 -36 -62 10 -46 24 -45 6 -24 32
2064C2m3k0O3m2L8krl0K9j2k7J9%KK1j7J2k0j7J7M5j0n9K4j3J1m3O2j04J43n4
$$ 32 -11 -31 32 -10 28 26 17 -13 16 4 -23 -4 -4 -2 19 2 14 -6 -23 -6 39 29 -30 -6 -19 -8 -51 11 -93 50 -4
2095dJ4n4N2Jm2L6n3O8l4K4n4L9K2l5L0m6L4Pj8O0o3%JMJ1P3j34P7j7kP4r5L7
$$ -4 10 -44 8 9 -33 3 -50 18 -16 8 -46 -7 15 -20 10 -36 -2 5 -13 47 -16 -16 -15 -11 0 73 -61 16 -1 -3 71 -24 13
2128A3k0k8J8Jj9N3J5n6Nj4M6qnK8m4J2rQ0q3N4k7mP3j01OL9M6j14P4Mlm3J1O
$$ 13 -7 -35 -17 -16 -35 18 33 -23 -18 -32 14 6 1 29 -15 -3 -12 68 -15 39 12 8 81 -20 -14 25 71 -43 31 35 32 -11 0 6
2162Fj5L1Qn1nM7O7j21M9no0N0j2J0j0Lm8J00j16O5J4o9Q4K1j7o0N5j5rJ9m6P2
$$ 6 -9 22 30 -21 -26 21 88 -33 16 11 -49 1 -11 -1 -11 -8 -56 44 -72 -7 7 -62 22 43 26 -34 21 6 -3 16 -30 42
2194D2o3J08j29N6n6O6l4m5M6J1k8J5O1j11K8L1L0l7l1L3pK7l1oM7p1O2l7M3K
$$ 42 -21 87 -42 14 -42 24 -10 -55 -9 2 -26 -11 50 -61 -33 -2 28 -9 -40 -7 -14 13 -18 -24 23 -48 14 -23 20 22
2224B2o3M5pk6j3N9m0J36j47L2L4n8P8l3j3k1nJ9%j2J0l3j5N9mJ7n6M6No8k0J5
$$ 22 -41 4 -3 -29 -42 17 -23 113 -34 -2 32 -26 52 19 6 -15 -20 -1 -1 -13 -3 -36 -51 8 4 21 -35 11 16 -52 -72 -57
2256e7J06q5J14p9J3J8p4O4j2J7m0K3Jm9M6MN7p6K7J3l3J0k3M7o8j0%Q1l3l2n
$$ -57 49 -36 78 -1 12 30 -44 20 8 25 -15 8 9 -40 6 10 67 -9 18 31 -2 8 -15 32 -36 -46 -46 35 2 -30 -35
2287c5K1M8j12Q3kk9O2rm5kM8k7J4j6l1M0n9Q7m3M7l4J6oj0j2l8L5oLRJ2j15J26
$$ -35 -14 34 -78 5 3 -26 36 27 -18 -20 28 1 15 -1 -32 8 -51 36 -7 40 6 22 16 6 -6 -44 -9 -15 -12 -3 9 -106 20
2320B0l9KJ9l1M5kk9K5Pj2k3rR9l4m4M0m2m9M1J3jJ2Mj3RJ4PJ4p3O3m8K0M5p7
$$ 20 -19 -17 2 -29 16 14 -15 10 17 5 -18 -27 72 38 -6 34 -8 -57 -16 -3 -4 8 12 -1 8 22 29 43 -30 33 -15 5 50 -27
2354b7L5J2k0l9O6j09O7j9M3l0j4M2j5K6l3N9rJm8k1K2mJ6k1K7M6m4n9M3K1l8
$$ -27 8 20 0 -39 27 -82 -15 -34 9 -21 -35 7 -8 18 -15 44 35 36 -12 -33 -11 -15 1 -20 7 53 9 -50 -7 14 -24
2385b4K9lj4N2p9L2K5Jp1R7p3L0J0j9jr4J11l3M3p2lO8l2onJ9K3j3L1l7K8k0L6
$$ -24 5 2 -12 40 -39 -7 18 19 -52 45 -28 2 12 -7 -8 -102 9 -24 19 -53 -56 12 -20 -26 -31 -12 11 -2 29 -8 20 0 36
2418C6o1K1qM6m3m0J9l5J13p0P6m4m2M1l2J7n3L9M8j6pj4mj7lRJ2MopJ2njK5n1
$$ 36 -25 -4 -12 34 -9 -49 -30 -65 48 -22 54 10 -32 9 -23 -6 -59 -20 28 12 5 -9 -13 -30 -33 -24 -12 -8 -14 -21 -9 -14 -15 10 -41
2453d1J07p0o0K3O0m5J7L1l4M2p3O2K7j00O9m4K7L4j0l1L0m9JL4m6K2J6J8OJ9
$$ -41 66 -4 -64 -41 19 -26 -9 22 -12 30 -43 19 46 -54 15 -29 -2 32 22 -9 21 -28 -27 7 -39 -17 -1 17 23 42
2483D2l9L7n7j49J28j15J03Q2k21K73j0j25R6k24J4K05k55J85j67J07J71j05P7
$$ 42 3 40 -17 -166 -38 -153 -50 32 -189 84 74 -51 45 -179 -165 40 -215 -30 -197 -90 81 -24 53
2506E3j97K13q5N6m8JJ0J2Mj7J4p7J19o1j08J46o5J0l9P4o1L7K9q2M6LL2j9j3
$$ 53 -144 69 -16 40 -8 -7 3 15 19 2 16 -61 58 -3 -111 35 -30 -20 -59 15 -46 -9 20 -62 -16 -13 19 0 -13
2535a3%l4P4n8J4m0P6m8lQ7k6K5n5qN4qj1pl2l7J4L6k1L1k8l1K1N4p0R7o7J1j8
$$ -13 -13 -47 27 -31 -17 -57 19 -29 -32 55 29 54 -1 -9 45 37 26 19 -13 -50 -36 0 -21 10 -18 -49 -28 26 -44 53 -14 -3 -21
2568b1K3n4M2j2L0J1n4L7n4P0K4l3k1K6J5l5m0R7q9L6l4J9RPl8K1%o0Q9l6K8q
$$ -21 2 -52 -10 -22 8 19 -35 2 -52 18 42 9 -12 14 29 -6 -46 51 -38 -2 -36 -17 -8 -1 -39 -18 -18 -78 11 -25 3 -5
2600eMj0J7K8o2J4j3j7k8Q3Qm%n1K0lQ4m8l0J9j0K3k7M0j3k1J05j40L9J3l7L4
$$ -5 -1 -11 6 34 -28 -14 -27 -44 -72 11 19 15 15 -36 -16 -19 65 17 -13 6 -4 19 -8 32 19 -2 103 -37 2 15 -22 12
2632A2K6l5k3nnKJ4K9l0O7q9RK2PLm1QJ5M7l5ML5q7P4o4J4J7RnJ9K0j1K4l8K1
$$ 12 38 3 -20 -25 -30 -28 -14 15 -15 52 -37 -28 -6 1 4 -37 -29 -14 33 -2 2 37 -50 24 -40 -26 -9 0 -5 14 34 23 47 9 30
2667C0k4j9K5n5L7JPl3K6J8N2j26M0j2pR3j19L6N3o0koN4j6J1M3j8L2p3k5N7K8
$$ 30 6 -13 12 -43 -6 -5 2 -31 -5 13 65 -61 -21 -33 -40 53 -66 -30 23 -37 -39 -45 9 -7 4 47 29 61 -12 -37 20 48
2699D8k2m9M7j1nK1m8L4k8Kp7N3M2N6o6m9N8l8K5M7o3J0k2J3L2q0M7JML5l7M5
$$ 48 26 -23 24 13 8 29 -19 15 -13 -11 -88 -35 7 63 -3 -52 6 -32 -7 40 -23 -13 -35 -22 10 -70 -23 -22 -18 17 -20 25
2731B5k5k2J9kk1L1J8k4L2k8n7L8N5n5QOK8k5m2O0l8K2k8M0l4J8j3K1k9j5L2r
$$ 25 0 -22 -3 -5 -26 5 23 -1 31 3 -54 -16 39 -16 -8 -2 26 1 -41 19 -19 3 -25 15 -19 -1 -14 7 -22 -37 -5 -14
2763a4K0m4K7K6l5qPj6P7l9K2rJj4K5k8L2qn4O2k8oJ0jK3nm0J5J6rl3L6l5J2N8
$$ -14 6 -38 -11 15 -20 -28 -21 -37 40 1 23 14 15 1 26 -2 30 22 -32 30 2 -4 6 5 28 23 -17 -2 14 5 -28 8 -27 -15 43
2798D3k8m0L7l1O5p5L3j0Kj2J1k4L4m9O4n9o3M8J7R7j48J04oJ0L3j33j1J7J49
$$ 43 15 -25 12 -19 46 -29 4 -6 -4 -16 -5 -29 5 -44 20 -39 -102 -54 -37 60 -88 16 10 20 53 -80 -91 -74 75
2827G5nr8J94j21J48j51q7K11q6P3l91Q2O1J21k25J15L03k34N7r1m3N6J4J19K4
$$ 75 70 -28 166 45 193 42 -45 166 80 153 -238 -156 -95 26 -199 -84 219 -15 42 -49 -92 -36 -22 97 121
2852A21j04j16Q0R8j67o7N6L8o7J86m4j68K35j3n6J59k58J16o6J81j77N3O9l05
$$ 121 17 -99 -19 79 -88 -155 -99 -61 -128 58 14 -154 81 68 12 171 -87 29 -37 144 -33 20 89 -216
2876b16J51J54o7J9o1k4j11L99j78k24J30J0R9k2j84oJ68o1o9K00k01J13o6j1
$$ -216 -65 89 22 41 -20 -44 -155 244 66 -158 -28 -18 81 59 -125 -131 37 -24 -93 107 -94 19 -47 -58
2900e8O8M5j03K6O1j02J84q1m0k3j10J18J13j09n7R3J2K5r3pk7J62n1j49J77j23
$$ -58 10 55 -48 -22 39 -63 121 40 0 -23 -133 -15 98 -11 -68 25 37 62 -31 -38 -65 97 46 -103 74 -49
2926d9l1J18oo2j9pK3M7j6n3J09q6R9r5J01n3m2M8PK2j26N9%k0P5n2Nr5J01n6
$$ -49 -80 38 32 -30 -49 -56 -33 14 -2 -55 54 -32 67 -28 73 20 -22 26 33 55 -71 -12 -12 -32 43 -9 -4 -99 2 -54
2956e4J3M0k3qO8k5k2n8J01J4m4Pj8Kj7J3N0r7N5K5Nj0p1O8j4kk3ROj7K9mL5n
$$ -54 -41 -1 -24 -32 36 11 -11 -69 32 46 2 9 -9 -7 -24 -11 39 -58 -3 22 27 17 -54 14 0 -2 -25 -16 -10 -27 2 -2 33 28
2990B8l5mlk5KrK6N9n3NLQN7r4J5J8l6RM1J9Kl6JOK0r5J08j2p5K4L7jk3M0m8J5
$$ 28 -7 -11 -14 -39 -37 -46 -20 39 -14 -9 -6 2 59 -35 -20 -2 -38 -29 12 31 33 -3 -2 4 24 -71 37 25 -50 -26 11 10 -13 27 -21 -6
3026fLk6PL6m8O0o1K4Mj2Kj4M3l7rK9J2k6JL4m3l4K3N7n0K5k0K2K0rn5L4k5K6
$$ -6 -3 -29 -22 14 -34 26 -35 -11 -7 -19 -17 -31 12 -25 -34 -5 7 -19 -18 16 -27 -61 -38 19 -31 -6 -26 -4 16 7 -48 -14 -39 -13
3060a3L9J7k3j9oPl5O5n6K8L9q4R0n1l6L9j2j4kL1nM5j44Q0k3M9p9P8j0k0N1j3
$$ -13 26 43 20 1 -5 2 -33 32 -24 4 43 -41 49 -2 -38 1 -11 -25 -27 4 -1 44 -100 -20 -43 6 -73 5 -5 -25 26 13
3092A3Kjk3k3K7JM8m1J6jj9qKL0l5n6K9K0K0n0O6jm6M6o6N6m1K9m9M1K4m9L3k7
$$ 13 15 14 -9 -32 -5 -4 44 3 19 18 -1 -9 -7 23 -12 -68 -39 -19 1 -49 17 16 -30 16 -50 6 -35 -6 -55 -14 10 -39 -6 -33
3126c3N9%mj5k9P9o8J4j7P2r4P3Om7Q4k2l7m2Jk2J1J4M5J3On4pJj3MJ0K1j2k2
$$ -33 26 26 22 7 -22 57 -11 3 -14 58 -36 37 43 -4 80 58 21 -21 -20 -42 -31 -17 28 41 47 -7 -14 -13 -26 -22 -12 9 -3 -25
3160b5M3l8J6j2J4lrkJ6pOK0J5n0MLk1M4k4OK2J7k6l7L9K9j1J8m6oPm8L0L0J9
$$ -25 18 -20 -4 -16 -2 -5 -14 -16 0 -7 -1 19 34 -16 -12 -9 -30 14 -10 -4 18 35 9 -28 11 40 29 47 1 -5 2 -46 -16 14 33
3195C3o6K1j5j2L1Jm0M8L2o4O1p6N6Nj8pqK3rj0J3J9j8j1M8o4KK4k7M2jo4K2K5
$$ 33 -33 -12 -27 -39 -8 -7 -47 1 33 -31 30 -46 10 15 -3 -10 -18 5 -4 -14 -1 18 0 -11 37 -27 -25 -1 -28 14 13 -51 -29 -4
3229dK6j9N2o5J1K3k6j3K3rl2k3K0N6j8J3l7L9%n6P8j05K4J2K9NK5k8kN4p1j0
$$ -4 22 3 55 -10 1 24 -2 -15 8 -1 -33 -56 -36 20 2 15 -22 17 17 -39 39 -66 -42 -30 -1 4 29 1 -1 53 -18 -28
3261b8O1k8j3J3l2N5l3K5pK1l4k9j3N3l3J0N0l9k0K1j9J9Oj9j1J5J9k6L2J2Pl5
$$ -28 33 5 -8 5 -27 28 -5 20 13 34 0 -29 -42 11 -22 -12 38 -1 -21 0 -19 0 6 -13 -24 -9 10 -16 16 28 35 0
3293@NN4l3k0PJ8l7L0n7K3M7ljM5j26P9n0L5j01M1M8m9K0K5j8NO1n2k9J9MM4j
$$ 0 5 59 26 6 13 31 -6 24 -33 -10 37 34 33 78 -48 31 -19 16 -85 -44 4 -45 -25 0 -18 -13 48 -4 -33 -14 -10 34 33
3326C3n2M2l8N2k5o2K6K9k2%n1R1J6J7j02J7k2M3Lm8J53p8j22j8J84J58j52n4
$$ 33 -19 23 -15 37 12 -50 -24 5 -17 -17 -68 23 39 56 -46 -29 -51 -8 -5 -53 100 22 -100 -118 66 224 72 18
3354A8r4K33j66P5q5p3J45n8q0j07O1J29L79l69j36J2Q2L2M41l47M93o49p0J95
$$ 18 -76 157 -9 66 -19 -92 53 -5 -85 -192 -131 -2 377 8 -128 -116 -34 -2 439 92 585 -64 -134 61
3378F1l70L03j51P6r5M2J90%k95J23KP7N8m4j02J18q3p3J80j29P1RN7Rj4m6J04
$$ 61 -309 -6 -157 -81 -176 -134 56 56 -239 -116 -114 -37 21 -23 -125 -7 -90 -163 17 -112 -41 -32 25 34 20 -26 78
3405G8p3m5M0Jj6rK9J1l2M7n9RL6l0j8RK5N3l8o1P0m5j3j2RO1n7J2Jk9R4o6M8
$$ 78 5 -40 0 1 -15 -24 5 16 -16 31 -28 -19 17 -13 -31 -22 3 56 18 -43 27 -18 -31 -43 -34 27 -30 -18 -17 -46 48 -18 30
3438C0Nj4m9K8m0O3j9PL5n3M0k7ql0M8k5N2l5n0L5J9n7N4k0N6l7K6k7L3l4j5j2
$$ 30 35 21 -28 0 -40 23 4 11 46 -7 33 6 -2 -32 16 -9 43 8 -42 -7 12 -45 9 -11 45 8 34 7 40 6 -9 -21
3470b1J5k5m4O1j1J1M3q6L2qL4qqk9Q7l8Npmj3JJ4N3l0l4L9q4K2O0JL1q4L9M4
$$ -21 -6 -31 -75 -14 -25 -14 29 -57 -25 -33 1 -7 -15 -44 43 5 10 3 -1 -14 -13 1 54 24 -10 29 -55 -33 27 28 59 -25 14 58
3504E8o7pl3M7nM4o0j0N7j6K0l8J3qK7m3M1NJl2nK7l5K4k0M9m6K4Pj3L3n3L3M2
$$ 58 -9 -16 -49 -2 -7 37 -23 -33 24 8 28 -10 3 -5 22 -21 20 25 26 -6 -11 16 -19 5 -15 34 -12 12 19 6 39 -14 19 61
3538F1m5m9J6K2JL0k6M5m0m1M5l3j1M9l0l6JRJ2j6J5K7Oj9mn8O0qL9J3l1j3KP
$$ 61 16 -33 -17 5 6 36 10 55 15 -26 19 -14 -25 24 -6 -42 -41 -32 -20 -36 -21 6 12 -7 -11 -69 -9 -17 22 35 4 -9 -7 0
3572@Mm7M3OK9k8J1jo8jR1rm9L9n5M1j8k7j6O3Qpm3Pj7N1l0K0j1k1M1k6P5p5O9
$$ 0 4 -43 0 6 35 7 18 17 -51 -52 39 30 -19 20 -35 6 -12 -39 -55 8 16 9 -34 -27 -44 7 -23 -3 -14 -35 6 -20 55 -20 49
3607D9l9k0j0jK8l2J6L4o3P1j6ql6O7m8L8o3O9p3M9n5M0K7o6O6l5JJ0l4PRM2m8
$$ 49 10 -10 -20 -21 7 -25 -9 25 -38 33 17 9 -27 40 -8 30 -33 36 -37 12 -43 -3 24 -42 24 -11 -10 0 -34 -27 -18 24 -24
3640b4RjPj3L3q5J19j17Q7qk0K7l0J3J3rl4M2l6L4L3n5l1K7j4qM4jqL6p3L5L2
$$ -24 -15 -16 -9 -22 11 -74 45 -72 15 7 -13 14 -16 -3 10 1 -33 9 -27 7 40 -15 -46 -19 -33 -41 3 2 -6 30 -43 -8 24
3673B4nq7J6L7M2n5RNJ1OmJ6j8j3j6M0j2K7m2O3mM5j18L7l5M1Pj6K2k8J9K8o4
$$ 24 19 -68 -52 -15 27 -28 -19 -14 -3 3 -1 15 -3 -16 -32 8 -4 23 -19 44 40 85 -33 4 -31 10 17 1 23 -5 14 42 -22
3706b2K1L7Lon1j4k1M5J3jn0J4M2j1J8j6J6j9j6K5l7N2n6K6k0J7M8m7J4QRj7L0
$$ -22 -1 36 39 33 -18 -32 -53 -8 5 4 -46 -32 10 -1 17 1 17 -2 -18 7 -30 22 -34 -8 -28 -11 37 -10 4 12 21 4 34
3739C4n5j2LN1l2oO1l1J1l0J1m8K6J5j8j5K8Rj0N4k5J3p4L0L0Pl9QK6j6L1Oj7
$$ 34 -21 -33 -30 21 -11 -17 44 13 24 -6 5 -43 -17 -2 -20 -35 -7 2 -8 46 21 34 -40 -10 20 27 -12 -4 22 6 37 43 26
3772B6Nl2k1%R6ro8K7qMj2Rk5LQj1L1l5L4k0j3Nk1Q1n4j9JK3K5l3L1m3J5j1J7
$$ 26 31 -1 -22 -22 74 65 -3 24 16 20 8 17 -8 -5 3 -8 23 -12 22 2 -11 -6 -27 54 0 -19 -18 5 30 -3 28 -15 0 -11 6
3807F%l5K9olPj3N5j2j5J7k6L6nm3kjK8m9L4j9l2O0l0L3J4j6j7j0K2m7J1N3j6
$$ 6 6 -29 0 -6 -9 -2 -15 40 28 13 30 4 40 35 -8 -10 -11 17 -32 2 -17 -49 11 -19 14 28 12 -5 -15 7 -40 -29 24 8
3841Hj9oJ0KJ6Lk4k4K0LL7j7j9Q3q5J4j8J7K1Ol3m0L4J7j3lM1K0j01N7L8o1kL0
$$ 8 -11 -17 -7 -5 11 14 -10 -34 -14 -11 26 9 -10 73 -12 2 -16 1 22 28 -5 -45 -11 6 -7 -10 31 51 -50 7 45 -16 -18 12
3875A2J9m8J0N1l4l9L0j8L1m3M4rL7jrn0M3k4l0M9k6Rm8K4M1Mj3j7J1l5Q3l7l
$$ 12 31 -17 -7 44 10 -29 1 -17 14 -29 15 6 43 42 33 -17 26 2 -28 21 -5 4 -44 -20 21 25 12 -5 6 -29 54 17 14
3908A4o9O4j3k8j3nQ4j3nl1j5j0M8l1J4J4j6J2J9m4J9Nk7RPo3L6M5L8l0J2qK1
$$ 14 -55 9 -4 -32 -45 -50 34 21 16 -15 -30 -40 8 -23 -9 5 -11 1 20 -24 -5 0 -27 -18 -11 -74 -38 7 45 15 27 19 40
3941D0j2Kn0L2Rl3J7qJr2O3J6Jk3Rk3OO5j00P5Ok1K5k9K4M2n1M2l4PK6l1J3j2
$$ 40 28 30 -20 12 21 -12 5 -3 -2 -94 -31 -15 -14 -37 -28 -51 -45 20 -80 -5 1 -20 5 -24 0 42 -9 33 -1 6 32 1 14 2
3975Bk2%N1m6j4N9m2L8oj0JJ6o6P3m3qJK3q3P1l4K3L9m7L7k0PKj4J5o3J10j8n8
$$ 2 -20 -20 31 -15 -29 30 -12 26 20 10 11 27 -39 34 -9 -17 -16 7 -76 -5 -39 -16 23 -24 13 -7 0 2 -12 3 -60 50 32 -26
4009b6P0m9l7L5K5m3k1M1k4L1MJ2j9%J1%k3pJ5J0Lj8rN4k4l0rj9J13o8J6k2n6
$$ -26 44 -5 -42 -7 18 -25 -46 -5 -29 2 6 18 -1 -1 10 10 -13 -20 -5 5 8 -10 -19 35 11 -19 -28 -47 66 -2 14 -8 -64
4042f4J06m7olN8n3M9m5M4k7k2J6J5m6J2n3J06l5Rk9L5o0K9N2q3O5l9LNpL2kj7
$$ -64 42 -5 -11 -14 44 -9 40 -5 39 12 -10 6 21 -25 -13 -66 40 5 14 -15 20 -40 -11 41 -42 23 -16 -13 -8 -15 17 15 -2
4075bJPm1L4l5L1m8O7k7l2J26q0k5rJ0PK0pM1l1l5N8o0m3J23j22J00O5oj23M1
$$ -2 -1 6 -35 -1 -36 -5 -53 14 -13 -45 81 1 -24 -33 -23 -16 4 -3 38 7 -28 30 -30 -73 50 -72 28 93 87 -36 5
4106Em6N0M0m8K05k94P4j8o4p1K80K2j96m2Q2mN1o0j7P1L32m04J85l40J52N9j12
$$ 5 -41 9 49 1 206 -88 -14 -32 -96 -167 113 135 -61 -103 -21 -25 26 -34 -51 20 352 -52 133 -207 -55 4 -108
4133a08J28J25o4n6M52k53k72N24m71L12l06R0l42j35N26m2L4l8k5l77K47j66
$$ -108 20 145 81 25 477 224 -48 476 5 317 11 101 -241 -376 150 108 142 104 79 -298 -51 -217
4155b17L31j00J45k81J10J87p3j29l6J9j0J6o8J31k1j54J99k97O8p0M02j38J88
$$ -217 114 14 159 -122 -12 175 102 -27 -63 -44 -54 -38 -106 25 4 -150 49 -248 -180 -250 152 14 202
4178B02k10n1K23l19r7J26K51j60K66k73Q8j76J25n6pR9j7m6j7N4l4L8N1r6P6
$$ 202 -8 -59 164 -155 -252 -126 125 -35 231 -42 46 -130 -5 -61 -68 31 14 -32 -49 5 -29 9 60 -36 40
4203D0k3k4J7m1L8k0L8k8J4ML6mj14P4KMJ3j0n5KOL6j6L1j5l1N1k5J7J9k6m5K0
$$ 40 17 -7 10 -31 7 -13 25 -3 11 15 51 47 -67 7 9 13 26 16 -39 -37 -31 5 -11 20 5 -26 25 0 17 36 10 -35 -15
4236a5j0K7j0M3mRL6o2j5L9l9J0J9o4P2l8J9k5K7L0n0P5n7nk3MJ0m7k3N8K1m0
$$ -15 -25 2 -8 35 31 40 76 14 -1 38 -1 9 28 -36 36 -2 17 -8 19 49 -1 74 17 12 -11 -7 3 -44 -67 -9 12 -28
4268b8MK6J8kj5Nl2JJ6PLk3L3j6J6j6k4J6N7ll0jMJ8k9nOj8rN1OJ8o3K3nm0P2
$$ -28 -24 2 20 18 3 8 -24 -23 -7 0 3 -20 13 -3 13 -3 -27 -11 46 43 13 12 16 34 5 0 6 -12 -21 30 36 54 -9 14 9 -31 41
4305D1o4kqKJ5j5P2l9j0j6oM4K5mn8M4J3J8j7l9j2lK6J7N5p2m1O9m8L9l1J7Jl5
$$ 41 -23 -25 -33 -31 -16 -31 41 2 -8 -24 -30 14 39 35 -23 21 34 52 35 -4 -16 -19 7 24 79 7 -34 35 -13 26 -5 12 13 -22
4339b2j1M1l4NQLJ3l0L5J6J1j8l1Kk0nL0Ok7Q3n6j2M1n5K0J6N4l0o3N7k3l1JM4
$$ -22 -33 8 -26 -21 -13 -10 3 -27 8 24 35 17 -14 -12 -32 -37 -7 -1 -28 55 -1 -13 28 -27 -7 9 63 33 -30 27 4 -27 -26 18
4373A8o9L0j1L7K2Om7K7n9N3%m0K5l1L9Rk8L7l2j6K5k1jM6j5J3n2J2M7k9mL0n3
$$ 18 -51 -21 -32 5 27 33 -14 13 -46 7 7 -33 -8 -39 0 9 -19 18 -14 -30 -5 -26 -27 19 4 17 -35 -23 24 -5 -9 21 -32
4406c2L4L0l5JK1Mo2N6o7P9k7k9j6Q3q9O8j5o2Q4Rr7L0M3q1R5Ql2K0l7K3K0j5
$$ -32 2 32 -3 -2 19 23 -39 17 -50 29 2 -27 -43 40 -49 19 4 -58 26 35 -62 -32 11 -70 25 33 1 21 -16 7 27 12
4438A2k8L3l8J4J3k9N7k7L1m7OrL1J4p5Q2o0J1k2P3l3j8RK2k2Ll2N2J1qk1l4L3
$$ 12 -16 17 -21 -7 6 -23 34 7 38 -9 -3 -12 19 33 -42 40 -20 -9 -31 42 9 -9 0 22 0 3 -29 23 34 26 5 -29 4
4471DJ0J3j4m2L0p4K0L2NkN4qLm1J2m4J2K0l1J1R9p4m4P1l9L9k1L7o7J7K1J8k1
$$ 4 14 27 13 -29 1 -73 -53 -21 -16 -18 36 28 31 -10 2 -42 -30 -10 -41 -30 69 -5 -49 22 -17 22 1 38 -29 -12 9 27 6
4504FL3m1j5koM1m6M5K6n4j2L6%Opj6J4Lk5K2kN2o5N1m4mK9k0K3j6mRll3J4L7
$$ 6 39 -2 -17 -19 -25 16 -30 15 41 -13 -25 11 11 17 10 -6 8 11 -14 8 6 58 -7 44 0 -4 25 5 28 12 8 17 14 -19 -5 32
4540C2j6j6qj8j6N7q1N7J0k3m4M7L7r2O8J6j8j0M0Ml0K2kj1J5k0k8L4n5J22l6
$$ 32 16 0 -8 -26 -42 15 -66 -9 1 -22 -66 -19 18 -74 -6 10 -8 -18 22 26 -4 18 16 5 20 0 -28 6 -49 73 37
4571C7j11P3j0K2NK3r7J3RM5J2l3O3q4L0L1l6q%M2l5J6l0N1l4NqKJK8On0K2K8
$$ 37 -74 -1 -11 11 16 39 -58 -45 -36 9 21 -12 51 -33 -3 28 -8 -16 -16 26 -9 7 -23 28 -6 -1 -9 -7 -6 22 28 -22 0 28
4605B8l1m4L0k4N1Rjm2N6J3q6O2m3J8rL1m6K3j1J6L7k9k5j0K7l1PL1kj4J3Km5
$$ 28 -3 -47 -17 -41 10 19 18 -24 32 45 -41 21 -22 -4 -13 18 -28 -5 -16 0 37 8 -17 -27 0 -31 -24 7 5 -9 4 6 -39
4638c9L9k0K2K4J3%qm5j3M8j2l0K4K8l7L6L4q7oM7K2j0j1J3o5J9J2K5m0K6l3j4
$$ -39 0 -20 2 26 39 39 31 -14 -27 21 9 -21 3 31 -6 30 64 -23 -29 18 40 30 19 32 -33 -14 -2 23 -17 9 -24 -38
4670c8J2J5J2pQj5roM7l3K6J2k2l1L9PpL3l9K1j7j0l9O2j2M5l5m4L3j7K4l2N6
$$ -38 -26 -11 1 -6 2 -13 -22 -28 19 -14 12 24 2 -29 10 17 10 43 4 25 8 -2 -41 21 9 54 19 -25 8 -9 15 -17 39
4703C9l5j5j3K7k9N1m9K1j4m8N1k7K7mJ5Rm9MJ4L6RJ4m7jJ2oJ8k6L0jj6JK4j2
$$ 39 4 -11 -24 3 -26 25 -24 -3 -17 -65 -14 -41 -14 -18 -3 6 -43 -39 -25 11 20 34 -13 -14 -2 -8 10 -16 14 13 -3 -2 22 10
4737A0j2j5KJk5L4NRl1k8M5J5k1l5l2Q9m3ON7j3Lk4m5Q5m2J5r9N9N4n5N7lj1J7
$$ 10 -2 -17 -15 -14 -39 -5 0 9 -22 -50 -5 10 -11 -46 -78 11 -32 -26 31 18 21 -3 -48 37 -5 10 -89 -30 24 -31 26 23 12 29
4771B9NjK5n2k0M8m1K9k7J3p4O4J0MK7l8Jj8N3r8P2Pp5O5m7PN0j9QK9m8K0k6L1
$$ 29 34 33 58 6 -14 34 -7 22 -5 8 -66 -2 8 12 39 1 2 -16 37 -61 11 18 -57 8 -39 -32 18 -1 7 36 -12 8 -18 13
4805A3K2l1K4m2N1j5J4o3O2l8n5M4jPj0L3q3N2N2j9m0L1k3k6j6R1K5r5M5k4pL6
$$ 13 35 4 28 -14 37 22 36 -27 35 -3 -58 -14 -15 -8 -18 15 -68 -16 36 17 -23 8 -15 -41 -57 34 59 -36 9 -15 -22 14
4837A4j4j2k2L5K1k0k9K6Qm1L1m0L7l1M4n9N9rOJ83r3j69R7K19m14O1K1J28o9
$$ 14 0 -12 -34 1 22 2 -27 -1 7 -34 -3 -43 -6 -37 7 -52 7 -2 4 187 94 -75 22 241 -173 -112 -91 37 -32
4866c2M0k5QQk3L2k8qL5ql6L7k2K8M5o2K4j0Kj5J4L0mJ1Qk1n5J2K83k13j76J60
$$ -32 8 -17 -9 -1 -24 8 -20 -28 7 -1 -37 0 -22 6 51 -11 13 3 5 -10 4 34 30 41 49 28 -27 -15 268 55 -121 39
4898C9q5P4k5l7O6m3K4l4J8k6j0OL1qj0mK3L0k0J2K6l1j5k5M4n1M5j4j6M7oJ3
$$ 39 -46 28 3 -34 32 -11 13 -21 -3 -29 -39 -33 -2 -10 -20 -24 -1 29 9 21 47 16 1 -24 20 -31 14 0 -16 31 25 38
4930C8Pn3L6k3N2o7J4lk3P9p1j2j4N1j6L4l3j8nJ3N2l6j9J1j0L1J1l5M0j3L5n6
$$ 38 45 -8 28 5 57 -10 4 1 -22 57 -14 -26 -40 11 -5 29 -4 -22 -27 -14 38 2 -17 -6 -16 15 26 -9 31 18 53 -3
4962cKJ1j0K3k7j8L1lk6%j8K9Lk0N5o6J6j8M7lk8PL9k6L4k5J1k6LjQj5n1O4N6
$$ -3 -1 10 0 23 -4 -22 9 6 -20 -20 -38 -9 -6 -26 29 -37 -21 -39 8 5 -23 -16 23 -3 31 6 17 -9 -6 -7 1 -14 -65 -1 55
4997E5n3K6q3QM5K7qJ4o1O5n6lPM7p3M6N2m1m2LN9m9k8J4L6kk1M4k4Lk9PK1J1
$$ 55 2 28 -55 -47 -2 25 17 31 -30 35 -21 -24 -17 30 -43 3 55 14 -28 -25 34 -15 -43 -29 7 5 -16 28 4 7 -22 -15 6 17
5031A7Kmj7l2PN5n8M7qJ6L6l6M4m9%%ONp8O9m1M7Rn6J0k3J6K9K3jp7N4k9ML0K0
$$ 17 19 15 -2 -34 -27 28 -30 17 9 25 61 25 69 20 20 20 26 31 -47 22 -19 28 37 -19 -9 -32 -16 13 36 35 -42 12 -17 -13 17 37
5067C7r2M6qP8Ko9K5R0j38Q3J41K96m96MJ02j62J10p2P0k8j08J22n1%K9J5m0J0
$$ 37 -55 -9 -17 61 63 -6 19 109 -29 54 195 491 -5 -1 101 -61 49 -23 47 19 -89 33 -18 -18 11 26 -14 -4
5095dk4M0J1n3k0K6O7r1N1k1N2j9LJjk5j3K2m9P3p1R9q0j2L3L4j3jNl9J1JN8o6
$$ -4 -28 12 23 -30 -50 -24 43 -48 3 -18 34 15 18 19 18 -7 -20 2 -47 26 -45 54 -26 -38 -5 29 16 15 20 -19 -8 -7 51 -15
5129a5K6j9j1M4m7L4k7L6j9lJ8m9M2m9K4o1L5L6L1l0M5o2L4Ol2O5q1N8J8m5LR
$$ -15 11 -8 -19 25 -22 12 -15 21 2 -1 17 -32 10 -39 -15 -76 -41 -5 26 -4 41 -21 13 19 -13 52 -29 29 47 2 5 14
5161A4n8O5K0j0J3j7jj3k7J4k9N1j1oL7k7k2K7m8Rl8M2JJ6r5K04k14l2J23j60
$$ 14 -44 21 41 31 44 27 26 13 -14 0 -29 22 11 5 42 15 -7 20 -28 -19 -57 -15 -14 2 -93 111 -103 -135 -12 -172
5191a72J73m6N7n2O5o6K8kJ7k8K0k3J5J5qJ2K5k1k2J9j4o3Q2j8L3n1k5M2R1p3
$$ -172 1 -45 12 -40 25 -41 -13 -15 2 -26 -6 -29 -14 1 -7 5 30 9 -13 6 -8 -71 11 -7 26 -25 -50 -8 83 10
5221A0n6N1oJ0JRl3m9P1pm9QL6O5l6l8lM6n5K6J5mk7jJ0Pj0M7j5j8J7n1J4j0K6
$$ 10 -46 5 -1 9 10 19 -14 -63 8 1 -48 -40 -4 61 25 -13 -16 30 -25 1 16 12 -15 -16 -6 1 -9 38 23 5 22 -29 -15 -25 1
5256Am2L8j2Rm1Q0n4Pk0O6o4M6J0j9N3l5Qj1J8l3J8pJ4j1J1n4J0m1J8M8Jq1P7
$$ 1 -41 -3 -15 -6 -47 33 -21 -14 -34 32 -32 14 24 5 58 23 31 20 38 5 23 16 30 19 30 -24 -14 -55 -37 11 12 -69 8
5289HK1l2J8pk0j3L1%J3j6m2N9k8j4lM3m4P1q9O4p5J16j83K06k25l4J06J9J08
$$ 8 29 -3 15 8 -12 -25 6 6 19 3 -39 20 -8 -22 -25 18 -26 45 -44 20 -55 61 -122 84 -141 -175 -69 -50 58
5318E8o5LLm1K4O7p4L5qK8k9j4l5M1j4J8J8Pl4N1l1m7Qk8L9kMK8l1P7j15O0ll4
$$ 58 -7 -4 -1 -42 -18 49 -25 10 2 30 1 -13 -48 -7 -21 -3 15 22 -12 39 8 -39 -31 -59 -20 -22 -18 10 -21 56 -59 1 -2 -36
5352c6j5K2L0k3O5m6l4N9k2jK7k2N1m1K5kK2j10N9%k5k5K5MJ8oK8pk6ql5L3K4
$$ -36 -51 -29 1 -22 43 -3 -37 22 0 -1 26 4 55 14 39 37 59 -51 8 8 -17 -42 -17 -13 5 -1 27 20 -6 -14 -49 -16 8
5385Hj0J6Kn1P1l6m4K6N9o2M7J5n4j3K1lM9o9OM8k7J9k4M1o7K2N1Mn0j5Q1j12
$$ 8 -2 14 16 -35 36 0 -44 -18 41 -21 26 41 -13 -26 -5 -8 41 -28 -22 26 -1 18 -6 35 -32 -10 41 45 -5 -20 61 -51
5417e1N3k9PK8jjm9K7J1j2J1k5k6Q4Rl6PN4p2lK7l2J1K1rRm2M4mK8l7J4om1L9
$$ -51 2 -27 -20 8 7 6 -43 -16 -5 -17 -6 -31 -57 27 36 0 7 61 -11 -14 13 -19 -8 13 4 13 -29 15 11 39 2 16 10 -31 8
5452Hj6l7M3K2l1kpK0m2K1K3k1Q6o1k5k1R8q9L9k3Kk5jJ4Q4j4m8qp6J22J8j5O0
$$ 8 -8 -45 -2 20 -11 -13 -20 0 -42 -21 2 -19 67 6 -19 -40 58 -31 8 -15 -13 -38 -39 -25 59 45 -3 -11 -87 35 53 38 98
5485I8n0k0j43l9K35j2k15J39O1j5j13P5K50k53P3k16K45j88q4L13J49j58l62
$$ 98 48 28 -115 -154 81 69 -146 -7 54 39 -74 1 251 -2 71 -145 100 -88 -172 141 290 132 -230
5508b30N62k12K42m39K23m19K29J4l87Q40k46pl50N9P0J16N9j14n7Q0R4k65K46
$$ -230 332 120 362 -77 146 -273 -44 -30 -417 423 177 170 -180 -121 -51 65 124 10 -47 33 127 -138 108
5531A08j98J65mq2j6L0n2J3K3r0J5J44j83J18M2K5p6N3K4q6J45k8k39J84n5J34
$$ 108 -90 75 71 -11 -27 3 -49 -36 -13 -103 -88 56 -127 -9 33 58 -18 35 59 -27 118 90 -149 35 -20 114
5557A14j14L73l56l4O2L0kj55N12n81K21q1j84K73j36Q3j87L10k86K99m08K36
$$ 114 0 373 17 -17 45 75 73 -82 430 -151 70 -11 -195 78 -58 25 -162 148 -138 161 -247 -11
5579a1L61l59N9r5JL26j46jk78L09j43L9k40J25K41n4j11q4m4J62j50J87j04k75
$$ -11 350 -9 50 -45 -44 282 136 135 -143 166 23 62 -178 -53 188 134 23 -61 -105 57 -93 94 -10 -285
5603b85L92j28p7k2K91k68R4P0J67k16j2Q7k29K81k37J5K24j52j72L45k40P0q4
$$ -285 107 -21 -98 -120 171 -97 -3 67 234 18 6 93 -136 145 -92 -77 147 -5 -177 168 -72 -2 -86
5626h6R8O7j78J14j53J23j20J90J20m23K61j00L0j46J51K50k20n8K54k6j25K88
$$ -86 12 79 -99 15 -138 -15 -135 55 175 -248 13 -87 -57 -203 -52 198 -22 -80 174 148 23 311
5648C11m48L47j01m37J43M27k75K90n26J57R3j65J31j07K43L8r0j72J5R0K11n20
$$ 311 -137 210 109 -328 -185 242 -33 257 -269 -112 -19 -184 -53 -160 83 121 31 -141 -126 -36 175 -345
5670c45M91L53o76K85pl75M38K46j77k99J29R9J68j54j32Q0k75J93J09l06K60
$$ -345 146 499 -177 108 101 -274 164 410 233 -66 63 162 330 176 44 124 -151 42 151 -155 105
5691A05j72K01l02O3MQ4k07l4J89J9J35J17k58q9L22j68j48j85L64k14J39j6K55
$$ 105 -67 134 -168 -105 -101 -17 -224 -258 -69 -50 85 202 -56 -145 177 9 -139 -324 40 -174 -35 -51 204
5714B04j41m8L4L2j99K21l24M22k13j26J54%p9o9Q9J32j09M3l7J0k1M3m0j3K6
$$ 204 63 15 49 81 -118 103 -221 201 -12 -138 16 16 -63 -132 -43 89 -20 23 -14 -4 -25 18 -22 -35 -9
5739iK5k8j9O0k7K6p6N1J3k4j4N1l0j4L1QM1m0l7J7L5m8L1m4J1M2kn3O9m3NK5
$$ -9 16 -12 -31 29 2 28 -48 3 16 -8 -22 29 -1 -15 16 24 65 25 -12 5 40 -8 23 -21 -10 32 30 -23 46 3 8 33
5771C3m9K1M5j28R3k6M5q1Q3j3k8RLjj7K3ql0nQ0o3mK2J0POJ9j4j7mp6M6N6mm0
$$ 33 -16 5 50 -78 15 -11 34 -47 36 23 -5 4 7 6 -11 12 4 -26 -31 49 -14 -18 4 14 21 27 46 32 15 11 -65 -19 37 33 -7
5806gj7L3j6k4M2n5J4J03r4J7OoJ2K3n4j3K4J1l0L3L4m3K2j3L3O5q5J2l8O1q0
$$ -7 -24 9 -7 -31 11 -44 -30 73 -21 -4 2 -4 8 31 -23 -36 -12 -1 -31 2 36 -7 15 2 35 100 15 27 -11 50 -30
5837c0J01p4L3K4r7N8K4m4N0k9K4j1j5K0n4K4MJ5Qm5J8m8Q2l1Q2l1j72P7n4N8
$$ -30 71 -3 30 54 -43 15 39 -5 45 16 40 29 14 34 -20 4 8 23 31 -14 4 -44 38 7 89 58 -114 -37 -91 -33
5867c3N0Jj73M9J29N3l1n6j38K15M7j08k91L74O6m47j07J06J57L14j99P0J82j39
$$ -33 17 18 -155 -106 23 76 45 -11 -149 66 113 5 -286 88 154 -293 -400 -294 -137 177 -22 48 230 91
5891I1k68M33q7k49L9n0j20J2J72m96N64K45j55k64J57K39l21J53j92J99j39n0
$$ 91 -177 256 169 -80 -41 -91 -211 -199 -27 -523 41 286 131 -133 24 263 -58 95 -97 102 -37 -87
5913h7L01j92l6l5Q9l2j9j71M27k42N1m47M60n01M58K28J3o16K72n4L31n38J60
$$ -87 214 22 -14 -49 40 8 -11 -182 245 3 54 -393 67 -434 24 252 265 -351 -79 -133 198 -340 -180
5936a80J6o3j66J13O66q7p71N29m81K73J79n8n62N52Q2K23j86m67Q24m44q7N8
$$ -180 -164 -227 -393 -280 386 299 -472 57 -424 -151 28 -30 -592 -40 42 265 79 -388 436 -8 -95 -37
5958c7J47l63M86l84K08q0k44M16j74j9Q7j69K89k03L00k62K65j15P9l82K13m2
$$ -37 110 -253 233 -151 57 -23 -267 149 -25 -44 43 -126 163 -40 260 -2 263 148 227 -155 58 16
5980A6j1j17N1j93M4K29j55K63m06N4L70k6k70m1m8r3L52j03l10K67M6Q2J27j88
$$ 16 5 -112 -61 -254 -210 19 -136 127 -279 -225 145 119 -151 -192 -240 -333 19 -84 -394 -127 -81 1 128 -60
6004f0k70M7N07k26q8K74j87k6J29r3mp8J00j22K20o7m17J44O96j53l53j03K9
$$ -60 -330 -283 224 -2 -90 184 -3 -29 100 7 3 -75 25 -97 123 56 -361 -217 479 326 -27 -130 -101
6027a01J60n1K86l35l6O1j08l5R2Q5K51l17J09n2j23J48n0k1R4o1p6J73j03Q0
$$ -101 59 8 294 -41 -77 -16 -124 -159 -67 18 269 -48 61 9 -114 34 -16 -37 57 -4 -80 93 -10 70
6051G0o8m5P4o9L6m0J5RJK5l9J8jNQj1O6k1n1O6k0k2J5KlK3p0K0N1l2k2m1J73
$$ 70 2 -43 31 -38 -2 -42 -27 -18 -17 8 -31 -13 -14 -9 -1 -12 54 33 -18 48 28 6 21 23 20 43 -27 -7 44 12 -10 -51 122
6084A22k5r3nJ0NJJ6n9L5l0O3o8J0K4J0k6l3L0nJ2K7Jk9OJj6M8j7n8pL7%O0j9
$$ 122 97 4 -1 9 14 15 31 -28 7 -23 40 -28 -18 6 16 -10 -43 -13 -18 -6 21 22 -7 -1 0 -16 32 15 -43 -50 -13 -13 47 28
6118B8m8M0l7L5j5N0o3k0N2o5P4o7J5n7J6N1k4j4L6N7m7LPlJ2OJ4j5J3n0K8Nm2
$$ 28 -20 20 -17 18 3 53 -10 -30 22 -43 31 -36 -21 -78 -62 -11 -35 -49 -13 44 -3 0 7 4 16 22 36 21 34 -16 12 17 -25
6151b5O8k0kK9o4JL6nl5K1k1M7J8l2j1J5N0l6jlk5Op6j1P7m9RJ9N9pnJ0q4%PJ96
$$ -25 43 23 21 50 -14 -13 23 18 -17 4 -17 30 48 16 5 20 70 34 33 30 5 11 -65 -76 1 -48 -39 -20 39 32 27 37 -47 -47 -40 156
6187A56r9nJ4q9J5L4m1n0R2p4M0Kk3O2j8OM5n1qK5k9l4k7K4K8j0k5O1Mk5j7J3
$$ 156 57 52 66 -23 -8 26 -15 -65 27 -47 -7 -5 -28 34 16 22 67 16 8 33 4 -30 -57 -33 -5 -15 -40 21 25 0 -17 -4
6219dk5K7j8N1m9L2j6J6l1R0m9J1p3O5K6k4p1J31M6j48Q6L4l51M22J59k72J06
$$ -4 -29 -2 -20 31 -18 14 -2 14 -17 73 24 35 -38 27 53 29 -42 89 135 -13 73 107 -244 178 337 65 171
6246A71j34P1K96l43J32O5l06j1o7K85j6j90j12OO5J01k7M2k5k5N0l1l4O8lj9
$$ 171 37 108 404 61 193 258 -48 -59 -126 159 143 -47 -159 -153 -88 13 -14 28 3 -22 28 -3 -37 31 28 9
6272IK0j3k3J8K6l0j1Jq4O2M8j43J36J16k71P0K45m3k94Q5N5k17L23m36L03J12
$$ 9 29 16 -7 11 37 7 -4 -3 -87 -25 23 -120 16 132 -139 -69 176 133 -161 -76 -21 -238 85 -351 -48 64
6298F4m5l2K10l62J72o8M2n0R8k8j7J36j12M2m9J2K2k8j4N2l4Rn9L6J7l8J7Jn
$$ 64 19 -13 197 -165 7 -61 -19 -69 29 1 -16 120 8 50 1 13 35 7 -7 45 11 20 -39 -3 14 -24 -7 -6 -11
6327a1qL1l5k1k6Q9j4k5JP4l4J8o7l9L5L5Nk7J5Nk9L8l4J8L3qk2J7RJ9n4k8L8
$$ -11 -19 12 -23 -44 -70 19 5 -20 -19 55 21 39 -28 -67 -32 3 8 -19 -4 1 -28 10 -24 -6 27 19 -3 14 23 42 -12 -40 -2
6360bJ3j3J4NJ3m4K7ok2OKk4N7m9Nll1QL7N5k5j8KQl8P5o0k2L0JK9k8kK9n0J3
$$ -2 11 -2 12 17 30 -14 13 7 -15 -9 -7 -31 26 -23 -18 -21 -52 -44 -7 48 23 5 7 15 -23 52 -8 -30 0 1 30 2 0 29 -21 -8
6396hOo1N1L2n8nM5n3LM3pK3kk8J0L2o4K7K9k4J2km1N7j7l9PR7m8m1M3M8n3j7
$$ -8 -2 -63 -12 20 -38 -43 2 -51 -48 -5 -12 11 9 -19 -9 23 -41 -14 15 -9 3 1 -40 17 0 -39 -32 65 17 -24 19 67 14 -3
6430cj5kmj9M5j8J5nn0J08o3J8Nk1J5L6j12P5N2r3K7%nOJ8Mj0l1J4kLm7N1K8j7
$$ -3 -18 -20 -24 -43 2 -16 -1 -6 -56 52 -11 7 12 -9 6 42 -70 5 57 -36 -9 -9 -14 -8 10 14 4 -27 -13 -15 -12 -59 -8 20 3
6465CM4l3J7j8mN9j31O2J4j6J3N2l8j0kL7n7j5J2q%Q6o5M0k8lmJ5l6j3J5j5K2
$$ 3 47 14 31 13 9 68 -63 -1 13 -3 10 62 24 14 12 49 -8 -23 -11 -19 -19 67 2 42 14 11 7 22 -14 -27 -12 -27 -5
6498eLK0j6l5P5j9Lpj4K2o6L6K8rrL9m2pRj9K4J3o0L3l8O8jKr0P6n7J8M8l9pk5
$$ -5 -2 18 2 -33 42 23 26 19 5 27 -39 -3 25 16 7 46 4 -3 6 -13 11 24 -36 -3 -41 27 26 28 -62 14 -43 -25 23 -16 -23 -48
6534d8L3OJ0p3O6l1M9L1p4K0K2j8K1M1p7PN1l7OPj6J1K0p1J2j2RL0pj3JJ9k5M6
$$ -48 -15 -9 1 -72 -6 -37 12 43 -31 -11 11 -7 14 55 -22 -15 36 -1 5 12 -4 7 27 -44 -32 -44 -35 -5 -12 -25 -24 -5 -30 16
6568A6J4l1nL6p8Q6n3Qj4l1O7k5j5M4J0mk1NJ3j2J8o4N9p7P0k7K4k1m1nO9k8K3
$$ 16 30 -1 -6 30 -48 38 -15 -7 -21 -52 15 -10 -25 19 29 25 4 9 22 10 28 -36 23 -54 16 -11 13 -8 -49 -54 15 -13 10
6601A0J2m1jj6K4K2ml1k1J8K5n1K0M9om3L8J6m8O3p8Q8m8L4J4k4l0L5lN2p7J13
$$ 10 22 -19 -20 -36 -12 10 6 -25 -46 -28 -3 -54 -34 15 9 -34 4 20 -28 35 -43 45 -3 31 45 21 -9 26 23 75 -2 111
6633A11l9r3Oj1L8L1m3jpJ7k1Lk4j3J3N6K3p7P6p6J9O2o2K0K1J2r9M6L9Qk3l0
$$ 111 72 -21 -15 -26 12 43 0 -1 -8 9 -12 -9 -33 -46 -33 23 46 -31 45 -31 -12 50 -12 8 29 41 -58 -12 27 35 12 -18
6665a8M5l2%J01k9p7K1mk2L4m6P5o1ol9RK1n7M6N9j01k35L82j42L37k64O1r0o9
$$ -18 27 -5 -5 96 67 -10 11 7 -15 19 -27 48 -13 -19 -58 -49 -28 -85 -39 20 -81 -316 66 -76 261 -3 58 -32 -101
6694a01J08R5j41J22j17J49j06j04J46l3K1n7N0q0Q3n2Ll2Q2j5l6lj7M1M3o1M1
$$ -101 7 102 -39 83 -34 115 9 -95 51 18 39 -18 32 -48 35 -17 -14 -46 36 21 -15 -18 -35 6 49 -12 29
6721B9r4M5m0P8pk9J4j0J2l1M9m6M7k0k9J8j1O3j8k9K6p0P0k7K3m0P0n6L0L6n9
$$ 29 -65 -20 -60 18 11 -18 -4 -14 -2 -33 16 -30 17 -3 -32 -14 -25 38 20 -9 17 -53 17 -10 13 -27 43 -13 17 53 -6
6752fj5L2j1M3l7Nj4n3L2l7J16q2M9j3nk9jL3M2n8QJ6j8n3O6p2N1J9J2j9j2J9
$$ -6 -21 11 0 43 6 11 -3 -56 -24 -61 55 -27 22 9 4 -25 -26 7 49 -9 -1 15 -3 -56 10 -62 -11 8 20 1 -11 8
6784HK6lJ0L0p2J4K7n2J9rJ8l7M5l8K3j4ONMjj2J0j6j0JO6m5k8J0J6J2J5j0j9
$$ 8 34 31 41 71 -1 13 40 -12 7 -2 16 -21 24 -14 9 -5 1 6 10 9 -3 7 -9 -19 -18 48 3 -25 -15 1 13 28 18 -1
6818aNN4o2J8J3K3qk1ml3K4k6J2Jj6M5M5n1l2MJ1J0k9MqK0j2lj1K5k9J7l6J0L9
$$ -1 4 58 -4 14 27 50 42 21 17 -16 8 -18 -6 -5 -21 24 69 18 -14 -10 1 11 -18 -14 -22 -2 -14 -17 -28 -3 -32 -15 -51 -41 -2
6853bJ5Oj9OL4k8J8j0n4M8l3L7j0JJ6k1L5Ql5J8j1OOl8L5l0m0L6J4k6j2QL3L6
$$ -2 13 19 0 6 40 12 30 20 -34 14 -19 18 8 9 25 4 39 47 12 30 19 25 31 -7 28 -2 -42 -6 8 -18 -30 -22 11 47
6887D7m1on2L2N1l2k0J3O5o7kM3j1j8L2l2J2k9K2pK2J9o2LK2n0O9Mk0J5J1k4L3
$$ 47 6 0 -52 -20 31 -1 -21 -8 57 -10 -12 31 20 2 34 2 14 -15 7 0 22 41 -21 -18 4 -46 23 27 7 22 33 9 42
6920D2o2Q1k1k1K1o1M1L1l9k2K5kJ9n3j0K7j4Rl1P4Rjqj2K0l9OL0k5K5jp3j4O2
$$ 42 -20 61 40 19 40 -21 20 51 12 -10 15 13 32 -21 -31 -4 -18 -9 -40 34 43 42 34 22 42 3 9 39 14 39 38 -35 -49 13
6954A3j2o8L0M1m1M6p4NJ03j44J65M7r8l6N4%q1R5O9K1n0j10k26K54j05J37j83
$$ 13 1 -67 -37 4 -37 9 -65 -60 43 -101 64 111 13 -23 31 31 -50 45 114 135 85 -25 -251 3 -102 35 -148
6981a48J39J03j90nJ40N1k27k2K21o7R1l56K84k06K01K18k96R1lK66l3k43j93
$$ -148 -9 94 -96 -101 39 90 -137 -159 62 -5 86 -270 14 -192 9 227 -69 22 19 285 252 9 -184
7004a84J90Q8k6j73l8J32j29K07j21k09J46M9J65k0o7J2j9J99j32n3k3o7Q2J9
$$ -184 6 94 68 -105 -143 -11 -140 67 -54 -263 -117 -68 97 77 10 22 3 202 70 17 -6 -73 9 28
7028B8k7M6l2m7M6Nkp1L9POpk8M1J0l6L0Ql5k6K1l2P5k8J5k9N4j0m0j8rML8L6
$$ 28 1 47 15 -32 14 19 17 -54 -15 -8 -2 -9 -37 4 14 -22 8 16 -19 -45 -24 -56 19 -9 6 -23 31 21 -19 -37 -46 -42 -4 32
7062C2l9K7k7KL4J4l7m2L5MM7n3N0m9J1N1n5J0m5J9N8k2j3L0o7M1k1QMl1L1k9
$$ 32 -7 20 -7 -5 29 43 6 -36 -1 3 50 -3 47 -2 9 60 5 15 -30 -11 47 25 12 42 -25 16 -5 3 7 -24 7 -22
7094b2K2n6N5K8Ll8L6Mp4Q0mj9pj3M3lm0K0k2K4j3rok2jJ4J7K7nm5MR2Rl3j6l2
$$ -22 0 -56 -1 27 30 -8 28 32 -42 38 34 15 8 -5 38 35 -5 15 -7 17 4 -5 -11 -33 -34 -20 -3 24 19 -26 -22 70 79 46 30 -2
7130bl3O7j3oj1j4J9j4qK2L0l3kK4m4L2l6mP5n5j0N4j4Rm5O2k7l0k1qN2n9P0m4
$$ -2 -35 32 19 13 2 -12 7 -7 -15 7 37 4 2 26 -18 14 -22 -26 49 -6 -16 38 24 33 -12 50 23 -7 -28 -36 16 -43 27 -17
7164a7J8J0l4J7j8M5l1pN9Jp9M8Qok4MP0l2j2M9m0j2J7p0O1l7K6j5J1k5L5m4J5
$$ -17 1 11 -23 -6 -24 21 -10 -17 42 43 -36 12 20 14 -10 -6 64 32 20 69 29 17 34 -36 25 -12 14 -1 10 -15 20 -24 -9
7197iL8p2N6m3M2k3rJ8J5j9L8Ql1n0QnO7o2M9M5l3j0j2o3R6k3Qj4j4j4L7M4po8
$$ -9 29 -43 13 -30 12 -11 -20 -2 13 -6 32 40 9 -41 -33 -38 29 -33 16 61 28 18 6 -57 39 16 24 10 -4 -18 19 63 56 -12
7231a2k9J7O2o1J1%rLJ2j0k1L3jqj6N1J3n1K1n8O2k4P8m0qk2%j2M0qJ4rk1j2J6
$$ -12 -41 -24 38 -23 -12 -12 -21 -18 -6 -16 -37 -4 -5 -13 -29 22 35 -16 5 -53 9 -15 63 23 15 -7 -7 -19 21 13 27 18 -3 -15 1
7266Al2K6K5Rl7M0k4K0l2J9Rj7j4lm1P2No1rR0k3m8L3m0O8k0JO7p4m5L2J6k4N
$$ 1 -31 -5 20 29 -8 32 8 28 -4 15 24 7 -7 -10 -51 21 26 -35 -44 46 23 -25 8 -32 36 16 17 84 10 -35 -3 13 -11 -6
7300fJ8j5Q1k4r7N6l9M4J0k6RrJ8k0qj7M5p0K1M7k1k0N9p8N1K6l3nRK2j2K7l3
$$ -6 12 -3 78 54 -43 13 -26 18 28 2 11 2 20 0 -8 -25 20 -50 -29 18 -3 -23 36 -42 9 35 2 -3 6 28 16 43 10
7333A0L4j0j0m8M3K4j6J0%n6N2O0j06K23j23K1k88J70R1Njp5ln2o0P8L8j06Q7
$$ 10 44 34 24 -24 19 43 27 37 37 -19 33 93 -13 210 87 108 -180 -10 81 86 85 10 7 -45 -105 -27 11 -95 -8
7362hL2k9K0k8l3O3l3M6k3MK4m7K2k5R2o9j7M8k9J9kpk2M4j9K9n5k6M5j4QoLj3
$$ -8 24 -5 15 -13 -46 17 -16 30 7 11 35 -12 10 -15 77 8 -9 39 10 29 27 20 -2 42 23 52 -3 -29 16 2 10 4 7 -6
7396fJ1k6J8K0j8k6K7j7k2N5M0o8K5L8o4M5j4jj5J2KM0rm7OPooO0j02M6n3N6j1
$$ -6 5 -21 -3 17 -1 -27 0 -17 -39 16 56 -12 13 51 -13 32 18 17 2 14 16 56 47 0 6 13 7 1 61 -41 5 -48 8 -3
7430cj8K2L4k8l0K1N9n3LJL2k1K9l9l3j9Q7m1k1Q1m9j1j3L8m7M1L1n4K1j9kM0
$$ -3 -21 1 35 7 -23 -2 57 4 7 8 40 19 48 9 -24 -43 44 3 -18 63 14 3 -10 28 -19 22 53 -1 20 1 -1 39
7462C9m1L8j0KM0m7pk4K0Lml8J0l3l1Q6l9PL2m9L5N1n5KPM0k6m5N5M2q9L9j0J8
$$ 39 -2 36 26 28 68 21 14 -10 10 13 9 -29 -19 -52 -83 3 -36 -29 3 -46 -11 40 -15 -13 -6 34 8 -37 18 60 -29 10 0 18
7496A8K9l7j4ok2J7L9k5nL1l0m1M3M8o2O6o7O8q0N5mo4KL9RlM7q5N9j8Om1M6j2
$$ 18 47 10 -4 -10 -32 -15 24 -1 -6 25 -5 -46 -3 45 -17 49 -18 50 -30 25 21 -43 -41 -2 7 4 51 -34 25 7 13 -28 18 6
7530FLoJ0o3O0K0L7m0m9P0kn5k5P4m7N5o2J9o%J4k2m7L6k9O7k3j4L3ql3M9o9O1
$$ 6 9 3 13 -50 10 30 67 27 -22 48 46 -9 -34 40 -7 48 -14 5 -1 -1 13 -9 -56 -20 -49 18 -5 -19 14 6 -27 22 -47 14
7564A4Rk7J5J1K1p9J5J3PlJL8m2J4k1N1p0L5M6m4L9k9KOj3L2p4K3k6K2RK3l1R
$$ 14 23 -4 11 22 43 -36 -21 -8 -1 -4 -3 35 -7 7 -14 37 -33 2 48 4 43 14 16 22 9 41 -33 -10 -36 -14 -5 18 -13 -4
7598dn6M0M3l6RJ6j9j6L5LJ7j4l6M2l3K2L6o5K3rj7P3k4Nn2L0l3P1on0j1LL7l1
$$ -4 -60 -20 23 -13 -4 12 -7 -23 12 15 32 18 -18 24 -9 13 49 -16 7 -2 -19 54 30 35 -17 13 -20 51 45 -5 -16 -13 24 -7
7632gk4K7J4j4J8qk8L4k1nOj2K9j0k1P5jm8J6K5J4l8j3M5r1j9P2l9O7m9J0P0o2
$$ -7 -31 -4 10 -4 14 6 -22 12 -9 -14 -8 -20 9 -1 -22 53 52 4 20 45 59 21 8 53 -38 -57 15 -24 43 -6 4 74 12
7665A2n5Q5k4Jj1K3l5L9m9M9nOo2L8j2pK9Oj7J8l0kl0L3%L0n5L7oJ9%QK1k9m1
$$ 12 -43 42 18 19 8 31 -4 35 -14 35 30 36 -26 12 0 -7 22 28 11 29 -1 -3 -33 0 0 30 -25 12 6 25 25 33 54 25 -16
7700a6P8m4PN6j14M1Kk3M0l8j2RL0k1j1K9Mok2n1N5J4pjM6r4O5l0PK5Lkj2Rm0
$$ -16 62 18 25 81 -33 8 10 -13 27 -11 -23 -14 16 -5 -16 13 17 11 -11 -62 -7 7 0 -1 45 -49 16 -14 -7 18 21 19 7 16 -24
7735b4L9QK6no2M3J3j2Jk6K0lj7%mK6k1Ml6J9J5Ql8K8Oj1j6M5M0j32M8J3m5L8
$$ -24 15 23 49 44 -18 25 38 26 27 1 21 18 1 1 -3 23 2 6 -30 -11 4 12 -26 2 8 -3 -19 26 66 -66 -18 -5 -50 -12
7769a2M2l5j9O9o1J9K2J9j5m7L4K0K1j7o7M6n4L0O2n9m4kP5Mn9RQK1k1k4PJ7R
$$ -12 30 -5 -24 45 -16 3 25 44 29 -18 16 36 57 40 -27 19 -35 -5 57 -2 -46 -48 27 31 -28 -19 -11 10 -11 -35 -28 -11 -2
7802blj5k1O0m7M3K1n0N3k4qRJ7J4ml9J9o7O2k5J5l0P6p5mN8l1J9o0N3m1mK5L9
$$ -2 -5 -20 -41 19 -28 15 36 -14 39 15 7 16 33 47 43 4 23 -44 18 -7 8 -22 54 -21 -25 33 2 21 -39 14 -27 -31 -6 33
7836C3m9J6o2P7pl6k6R2o7P1l6j1M4o7O3j7L0k8n4l5R5o2R6j58J58j08J02j86
$$ 33 -16 0 -62 15 8 -28 -54 38 -29 42 6 -5 39 -28 35 18 48 20 -34 -69 26 -36 60 -98 60 -48 54 -132
7864a32O3K6R5o8J6J2o4r8L25j91j35K56J6r3m28K83K95O2n77J0N66k80Pp0l7
$$ -132 -69 -43 52 -16 0 12 -52 -150 175 -16 -151 105 121 28 -400 -117 178 240 -337 -327 239 -41 -34 -104 -141
7889a41L57o4j88j92J86N9L2K03J83n23J26J8j57J41J94P2j18j10j39J43J94k17
$$ -141 216 152 -36 -228 -42 17 49 252 435 -88 38 56 -101 40 234 306 188 78 -61 82 276 59
7911E9j70K35j46M7l4p2J86k69K0J04Q2J85n71M29k74N41l23j50L00m30J53J00
$$ 59 -111 124 -22 25 -9 -81 105 -164 -144 -40 42 227 -344 85 -189 352 29 -121 179 -251 -98 2
7933BM6r0j78j5L17j17J64j30O7j76P8J94k24q9M2M06k47l0M4k50K37n9J15p3
$$ 2 48 -42 -220 -235 82 -35 129 -1 66 -110 -32 162 -62 -151 -109 297 50 20 64 -186 51 -8 107 34
7957C4P7k22J82k77K97j05n5mN8J25p9J44j39j13K59k06O8Q4k60M8P6J38j10J46
$$ 34 111 -111 71 -206 91 -14 -69 -73 -15 110 31 175 36 -77 182 -24 44 128 -132 -84 -8 130 20 166
7981A66j79J55l5m7n7N2J56j89K6N6j04J16j96J42n5j19J96k26J09m4j0K2K0J26
$$ 166 -13 142 107 60 3 55 211 22 48 104 0 116 -80 62 7 -112 84 -142 -33 -77 -87 -65 -45 81
8005H1k38QR9Q4J1r3M1r0K8J1l7P9J18n6l8M3j60J27M3k03O3J49J8k68J32K14
$$ 81 -157 -149 -50 34 45 -48 -7 -97 -69 -58 -95 -16 102 46 8 51 -109 18 61 -142 -79 70 88 -180 -48 166
8031A66j07r2J41r3j00K01j04L1Q5k12K26p5o1mN5j5K2l0j34J12Nl7K4L8j9Ll6
$$ 166 59 -33 108 15 -85 116 12 43 128 -84 142 67 6 2 57 42 64 34 -100 12 17 -20 4 42 23 26 -10
8058a0k8O2m7L7lKon8Q1k1l0K6JOk3J7m5O9n7M2J3m4qK8L7m1ML1k4L2j0J8k2l3
$$ -10 -38 24 -23 14 11 13 7 -51 30 9 -21 5 6 12 -11 6 -39 30 -27 15 28 -16 -24 4 41 0 4 35 11 43 33 51 29 -4
8092dQ9r2lM3j0K2q1O1p3O3J9n8J6J9Jj2L0l2qJ0l2K0K8J6m8m5J25r0kJ1J2L0
$$ -4 85 -7 -10 33 23 45 -36 25 -48 15 34 -24 -8 11 12 0 30 -2 -10 0 -32 -12 16 32 -16 -61 64 -26 -28 -17 -5 25
8124B5n6O7Jk5m2k3N6K6Roo0L9OMl8O1n2kLj9K9j5Oj5k4N3l0M3m3pK6j1NL1Oo3
$$ 25 -31 36 37 12 -30 -53 3 29 38 32 -28 11 17 21 -17 44 -8 -10 -7 -26 3 -12 -6 -21 -45 8 -22 21 -22 -29 -3 -14 -9 22 28 -35
8160c5MJ9M5pj1nL8k6pK7k1J2J3l9klm2O6J6m8O6p9L0J4l4N8m6KK4L1m3
$$ -35 -31 -12 33 26 15 10 48 22 15 42 21 33 46 7 5 2 -40 26 42 -6 60 -19 11 25 -9 49 3 5 29 60 17
8191A7
$$ Imaginary data points
##PAGE= N=2
##DATA TABLE= (X++(I..I)), XYDATA
0@%%%%%%%%%%%%%%%%%%Lj1J6j6J6j6J6k4L2l2M0m8N2o0P0p8Q8j02J12j22J37j55
$$ 0 0 0 0 0 0 0 0 0 0 0 0 0 0 0 0 0 0 0 3 -8 8 -8 8 -8 8 -16 16 -16 24 -24 28 -32 38 -40 48 -54 58 -64 73 -82
40h2J75j97K17k39K65k93L24l58L94m34M79n27N80o40P05p78Q64r60J069j196
$$ -82 93 -104 113 -126 139 -154 170 -188 206 -228 251 -276 304 -336 369 -409 455 -505 564 -632
60f32J345j525J747k027K395k904L656m908P527k3047K3814J1657l7663J5184
$$ -632 713 -812 935 -1092 1303 -1601 2055 -2853 4674 -18373 5441 17098 -20565 -5381
74e381J3146j4780n379J8239j1343P209j2529Q235J3646j0188j5607J2012J3945
$$ -5381 7765 -7015 -12394 5845 -5498 1711 -10818 -2583 11063 875 -14732 -2720 11225
87A1225k2462J2056P164j1003k803P743K959q406L554o789J5367n004p895N231
$$ 11225 -11237 819 7983 -3020 -5823 1920 4879 -3527 27 -6762 8605 3601 -4294 937
101I37j219j353o41Q898q545L228m982L765O834j2239J100N363M731j2545J0666
$$ 937 -282 -1635 -2276 6622 -1923 1305 -3677 88 6922 -5317 -4217 1146 5877 -6668 3998
116C998n44j1461P041M144j249o148P756p264N828K57p199O118k745J423J72N523
$$ 3998 3454 -8007 -966 3178 1929 -4219 3537 -3727 2101 2358 -4841 1277 -1468 -45 127 5650
132E650j0818L154M100m620M935l266R90l779P705m484j964K092k478M519k751
$$ 5650 -5168 -2014 2086 -2534 2401 -865 125 -3654 4051 -433 -2397 -305 -2783 1736 -1015
147a015L877n701J478j464L994J131p696O774k449J423j466K575m774P63N009
$$ -1015 2862 -2839 -1361 -2825 1169 2300 -5396 1378 -1071 352 -1114 1461 -3313 -2550 2459
162B459l757M537o235K047L08K737k531r03L703n260N966k001k38l625L769P13
$$ 2459 -1298 3239 -2996 -949 -641 2096 -435 -1338 2365 -2895 3071 1070 832 -2793 976 1689
178A689j832M332o587L332p87K410k481M40L25j908N116m464K285l852K522L64
$$ 1689 -143 4189 -2398 934 147 2557 76 516 841 -1067 4049 -415 1870 -1982 540 904
194I04K21J087m415L291k260L747l598R38l15m58K962k967K548n131L409n1J070
$$ 904 1125 2212 -2203 1088 -1172 2575 -1023 -85 -400 -858 2104 -863 1685 -3446 -37 -88 982
211I82q61k399K876k163L183l665K746k582L64L420j976J53l631M846k249J771
$$ 982 121 -2278 598 -1565 1618 -2047 699 -1883 -1519 1901 -75 78 -3553 1293 -956 815
227H15j123o14J012j926M125l324J569l278L303J213k288Q15k095K983k785L862
$$ 815 -308 -922 90 -1836 2289 -1035 534 -2744 559 1772 -516 299 -1796 1187 -1598 2264
243B264k513k27K13j96L080l666J521k352L714j540J40N99k512K042j230L498
$$ 2264 -249 -476 -263 -459 2621 -1045 476 -1876 1838 298 438 1037 -1475 567 -663 2835
259B835l983J206k50M69J308k465J742k654L158j606J674j538j350K198j392K450
$$ 2835 -1148 58 -192 277 1585 -880 862 -1792 1366 -240 1434 -104 -1454 744 -648 1802
275A802l229J951j671J587L43j651J087k178L114k051K207k324j13J192o63J710
$$ 1802 -1427 524 -1147 440 783 -868 219 -1959 1155 -896 1311 -1013 -1126 66 -597 1113
291A113k872K306k166K218p28j59L6j786L080j959K048k625J325k42j0J313k126
$$ 1113 -1759 547 -1619 599 -129 -288 -252 -2038 1042 -917 1131 -1494 -169 -411 -421 892 -1234
308a234J763k245L002j611M32n36m84J805j616K227k722J611q45R67mj100J296
$$ -1234 529 -1716 1286 -325 107 -429 -913 892 -724 1503 -1219 392 -453 514 510 -590 706
325G06k053K935j942J093j283K80Q24q49J607k576K132j626J459n65m01L86j173
$$ 706 -1347 1588 -354 739 -544 -264 560 -289 1318 -1258 874 -752 707 142 -259 127 -1046
342a046K553k385J635j694R49j02m3Q66k101K032j958K131j237J32k88j35J622
$$ -1046 1507 -878 757 -937 12 -90 -133 733 -1368 664 -1294 837 -400 -268 -556 -691 931
359I31k040J820j970J322q02Q61J38j423J451j613K340j873P70n85L74N93j095
$$ 931 -1109 711 -1259 63 -739 122 260 -1163 288 -1325 1015 -858 -88 -673 -299 294 -801
376h01J661k275J693r67J358q97n56J122j157J806j733J263j291R26J13k95Q75
$$ -801 860 -1415 278 -689 669 -228 -784 338 -819 987 -746 517 -774 152 265 -30 845
393H45j942J883j270J573j201J59K23l60J406j766J535j703J537o60L42K39j509
$$ 845 -1097 786 -484 1089 -112 47 270 -90 1316 -450 1085 -618 919 259 601 840 -669
410f69J608j187J762j866P05j66J40M11j110J625k267J558m80P10r46n27J400
$$ -669 939 -248 1514 -352 353 187 327 738 -372 1253 -1014 544 64 774 -172 -699 701
427G01j125J127j633J480j164N68pk09Q62k241K161o35L19j307J219J48j260J466
$$ 701 -424 703 -930 550 -614 -46 -53 -262 600 -1641 520 -115 204 -1103 116 264 -996 470
445D70j010J057j652J472j72j71P3r63J975j400N32o02J520j639j4J990j717M30
$$ 470 -540 517 -1135 337 165 -6 67 -896 1079 -321 211 -391 1129 -510 -524 1466 -251 179
463A79o42J830j706N97K46n89P69j030J324j187J108j564J139O69j772R84k78
$$ 179 -463 1367 -339 258 504 -85 684 -346 978 -209 899 -665 474 1143 -629 355 77
480G7P92j648J785q63l12N96n60R64j314J249j349J218k29p36O71l97O29j311
$$ 77 869 -779 1006 143 -169 427 -133 831 -483 766 -583 635 406 -330 341 -56 573 -738
498g38J789j444L98R3j55N94j208J195j103J122q55J97j1lM73j413J854j488M62
$$ -738 1051 -393 5 98 -57 537 -671 524 -579 543 -312 -115 -126 -129 344 -1069 785 -703 -241
517b41k35O17l55q05J441j094P67j083J241p65M7M14p19J299j553J057l20N11
$$ -241 -476 141 -214 -1019 422 -672 95 -988 253 -512 -465 -51 -770 529 -1024 33 -287 224
535B24q86M42R10j477J062o52J088j416Q96K78p26Q14p36Q76r61J051r11O58Q4
$$ 224 -662 -220 690 -787 275 -377 711 -705 191 469 -257 557 -179 697 -264 787 -124 534 618
554F18q63J052p33Q81j284J097l90k40L87l14L86j119J593j323O69j95l36N60
$$ 618 -245 807 74 955 -329 768 378 138 525 211 597 -522 1071 -252 417 222 -114 446
572D46m32N87j257J355q79K60Q7j54J05n66J292j519J070m07j59L51j2k5q95J653
$$ 446 14 601 -656 699 -180 80 167 13 118 -448 844 -675 395 -12 -171 180 168 143 -752 901
592I01j383O87k07J10j28k80J002j240R74r07P00j24j28lj55Q06j435J322o14
$$ 901 -482 205 -2 108 -20 -300 702 -538 436 -471 229 105 -23 -26 -181 625 -810 512 -102
611a02P1j54K69L29q78R33q26Q73q54M97L0l37N36q03J111j054O95l93K69K1l80
$$ -102 -31 -185 84 413 -465 468 -358 515 -339 158 188 -149 387 -416 695 -359 336 -57 212 233 -147
632a47P10q20Q74j009R46l65j87L41m24O24q94R33o95M19l85J61M49r05Q07p73
$$ -147 563 -257 617 -392 554 189 2 343 -81 543 -351 582 -113 306 -79 82 531 -374 433 -340
652c40Q13p50M10rl15M08n81R30j161P84m44L31j52l59P27q56Q43p25O04m83K45
$$ -340 473 -277 133 124 -191 217 -364 566 -595 189 -255 76 -76 -435 292 -564 279 -446 158 -325 -80
673h0N1l19P05r73Q67o18N54m47J51K88n96P55p58P77o98M26j02j07M10p04Q61
$$ -80 -29 -348 357 -616 251 -367 187 -260 -109 179 -417 338 -420 357 -341 85 -17 -124 286 -418 443
694D43p10N49m14L42k31j54O75q23P63p72P70n34J41K43m25N63p36Q35p42N65
$$ 443 -267 282 -132 210 -21 -175 500 -323 440 -332 438 -96 45 288 -137 426 -310 525 -217 348
714C48l76J14J87n44P45p91P12o83N40k35j36L75n18O37p61P36n85L48l3l50N09
$$ 348 -28 86 273 -271 474 -317 395 -288 252 17 -119 256 -262 375 -386 350 -235 113 80 -270 239
735B39o51P03o68O40n51J93J98m68N50o15P02p50O70l89M2K88m89N89n46N89o92
$$ 239 -412 291 -377 263 -288 -95 103 -365 185 -430 272 -478 192 -197 -155 133 -356 233 -313 276 -416
756d16O08k62p0L74n50N47o02P71o81L66p6j72M30m98N76o93P07n08L30J0l62
$$ -416 192 -70 -140 234 -316 231 -371 400 -281 85 9 -163 267 -231 345 -348 359 -149 181 191 -171
777a71M61n20O93p38N93l93Q6K13l78M70n60O58o23N27k60p6K82m16N23o60O18
$$ -171 290 -230 463 -275 318 -75 11 224 -154 316 -244 414 -209 318 58 -18 264 -152 371 -289 329
798C29m83L14j41o3K61m75O00o68N92m60K59j9k25L44n05O53p58O15l44J63L6
$$ 329 -154 160 19 -44 217 -258 342 -326 266 -194 65 46 -179 165 -340 313 -445 170 -174 -11 25
819B5k65M47n91O64o11N03k72PK07l19M55o98P10n07L89j60r1K51m01O35o85N85
$$ 25 -240 207 -384 280 -331 172 -100 -93 114 -205 250 -448 262 -245 144 -16 -107 144 -257 378 -307 278
841B78m48L13k4j45J85l64O39o80N26l23J64m3j32M52o21N95n26M12k00J2J21
$$ 278 -170 143 119 -26 159 -205 434 -246 280 -43 121 78 -54 398 -223 372 -154 258 58 70 191
862A91k22M03o26P06n09K29p1J1J34l77N18o28O20m78K75j46o8K86n07O48o53
$$ 191 -31 372 -254 452 -57 172 101 112 246 -131 387 -241 379 -99 176 30 -38 248 -259 389 -264
883b64M33k63K64j87j47L77n63N63n21M24l46J55O8k56L96n78N35l71L60k92R1
$$ -264 169 -94 170 -17 -164 213 -350 213 -308 116 -230 -75 -7 -263 133 -445 90 -281 79 -213 -122
904a22K51m57N01m23M00m07L06q4J5J46l89N21n46N60l57K09r0j63M03m04M48
$$ -122 129 -328 173 -250 150 -257 49 -35 -20 126 -263 258 -288 272 -85 124 34 -129 274 -130 318
925C18n31M22j53O8k2j60L55n61O25n26L12k45J25J12k35L47m99N03l71J91j01
$$ 318 -213 209 56 124 102 -58 297 -264 361 -165 147 -98 27 139 -96 251 -248 255 -116 75 -26
946b6P5N7l47N78n45L11k48K83j89k0J89m26N92n24L60k98J70n3j11M25n34L41
$$ -26 49 106 -241 337 -208 103 -145 138 -51 -71 118 -308 284 -240 120 -178 -8 -61 -172 253 -281 60
968F0l11L62l41J82M9l53M86l65L21l21K76k72J21K57m80L86l64L88l44L44j99
$$ 60 -251 111 -230 -48 1 -352 134 -231 90 -231 45 -227 -106 151 -329 57 -307 81 -263 81 -118
989a18r7L19l46L38l12L98m49L49lj90K81m18M57l49M10l31N1J11j88L25m19L92
$$ -118 -215 104 -242 96 -216 182 -267 82 79 -111 170 -248 209 -140 270 -61 -10 101 -87 238 -181 211
1011B11m29M51k25LJ98l43K64k04L31m31L16j79J05O4k99L70l70M15l16J29q5
$$ 211 -218 233 8 11 209 -134 130 -74 257 -174 142 -37 68 132 -167 203 -167 248 -68 61 -24
1032b4r3K53k60L19m80M55l21J26Qj77L18l56L53l14L02k76J63Q2k61K85l91M38
$$ -24 -117 136 -124 195 -285 170 -151 -25 -17 -194 124 -232 121 -193 109 -167 -4 78 -183 102 -289 149
1054A49l90K94o9q7J23j61K59k86L51m19K93j05k3K37l06L09k78K78k74J07N6
$$ 149 -241 53 -16 -103 20 -141 118 -168 183 -236 57 -48 -71 166 -140 169 -109 169 -105 2 58
1075E8j48K13k11K84l93L82j99J20j7j83J60k02L86m02K81j92P6J12j68K00l67
$$ 58 -90 123 -88 196 -197 185 -14 106 89 -94 66 -136 250 -152 129 -63 13 125 -43 157 -210
1096b10L91k55J56k3j40J38j54K96l98L50k98J45J08j21J32l16L15k40K78k85
$$ -210 181 -74 82 59 -81 57 -97 199 -199 151 -147 -2 106 -15 117 -199 116 -124 154 -131
1116a31Q5L1p1K22l19L06l97L49j26M0l3o8J87k31K97l27K08j18P0R1k62K58k05
$$ -131 -46 -15 -86 136 -183 123 -274 75 -51 -11 -44 -112 75 -156 141 -186 22 -96 -26 65 -197 61 -144
1139a44K61j99J50j17j6J79k43L64l76K65j67J29oj14K01k67L07l00K43k03J14
$$ -144 117 -82 68 -49 -65 114 -129 235 -141 124 -43 86 80 -34 167 -100 207 -93 150 -53 61
1160F1J0r8J88l18L19k61K29j19K7K5j72K60k41K32k70J57o1OJ35k63L06k81K77
$$ 61 71 -27 161 -157 162 -99 130 11 38 63 -109 151 -90 142 -128 29 -32 -26 109 -154 152 -129 148
1183A48k41N6l3j2K41l00K59k94K32j12O3nj87K93l13L15k04J22j51Q2O5j37J92
$$ 148 -93 -37 -70 -82 159 -141 118 -176 56 -56 7 2 -185 108 -205 110 -94 28 -123 -41 24 -113 79
1206G9k88K68k34K78j63K6P6j53K05k17K30l11K23k0k6P2j48K03j96K48k00R9
$$ 79 -209 59 -175 103 -60 -34 42 -111 94 -123 107 -204 19 -1 -27 45 -103 100 -96 152 -48 51
1228E1o0o4K42k84K95k86K42j67J13J6j70J95j84K07j93J86j62M3Q6j52J69k35
$$ 51 -9 -73 169 -115 180 -106 136 -31 82 98 -72 123 -61 146 -47 139 -23 20 106 -46 123 -112
1250a12K03j75J73j84L9J02j37K70k70J94k74K00j2q7J34k34K67k50K45k05N6
$$ -112 91 -84 89 -95 -56 46 -91 179 -91 103 -171 29 17 -70 64 -170 97 -153 92 -113 -57
1271e7Q4j14J36j84J94k09K39j48M4L7j59K09j49K20k22J72j09K0N4j42J73k35
$$ -57 27 -87 49 -135 59 -150 89 -59 -15 22 -137 72 -77 143 -79 93 -16 4 58 -84 89 -146
1293a46K13r6Q2l6q6J37q1J71k56K30k19Q5L8r8J57j70K16k10J68j11M0L4j38
$$ -146 67 -29 53 17 -69 68 -13 158 -98 132 -87 -2 36 -62 95 -75 141 -69 99 -12 28 62 -76
1316g6J63j53J70j97J94q4m3J3q3K00k16K37j96J16l3l2Q3j38J16j45K11j41Q8
$$ -76 87 -66 104 -93 101 17 -26 -13 -96 104 -112 125 -71 45 12 -20 63 -75 41 -104 107 -34 54
1339E4l6j07J49j29J14k03K13j36K2J15j39J12j65K24k52K26p2l2M6o6Q5j54K29
$$ 54 18 -89 60 -69 45 -158 55 -81 -59 56 -83 29 -136 88 -164 62 -10 -42 4 -62 23 -131 98
1362I8k03J40n0k6M6q6J55j79J55j27N4J7m1O8j18K27j99J82r8J2Qj8O4j46K18
$$ 98 -105 35 -15 -41 5 -81 74 -105 50 -77 -23 -6 -47 21 -97 130 -69 113 15 27 35 17 81 -65 153
1387A53j92J48j32P3mp5J26j54J77j57J08p6M9J1r9J38j86J58j25J25q3M0K5j63
$$ 153 -39 109 -23 50 46 -29 97 -57 120 -37 71 -5 44 55 -44 94 -92 66 -59 66 -17 23 48 -115
1411a15J64r4R9j42P7qj1N2r9J09j28J43j07P2k9n8J78j78J31j62J26m8J2mp8
$$ -115 49 -45 54 -88 -11 -19 -30 22 -77 32 -96 47 -60 12 -17 -75 103 -75 56 -106 20 -28 -16 -20 -98
1436i8J68j64J41j06J11o7J1O0p5P9j76J56o3O3q5J0P3j19K00j80R8o1P3Qn6J09
$$ -98 70 -94 47 -59 52 -15 -4 56 -19 60 -116 40 -23 40 -45 -35 38 -81 119 -61 37 -24 49 57 1 110
1462A10j90J64j07P3q6Q7J2r6J72j87J52j29O6p3O0l5o5J35j75J61p8J01r0NO3
$$ 110 -80 84 -23 50 -36 51 63 -33 139 -48 104 -25 41 -32 28 -7 -72 63 -112 49 -29 72 -18 -13 50
1487E0j19J05j06O7l2P1r6K3Lo0J12r9J37q0L1l6K4L8j31J66j30M2oK2j5j5J9
$$ 50 -69 36 -70 -3 -35 36 -60 -37 -34 -94 18 -81 56 -24 7 -29 -5 33 -98 68 -62 -20 -26 -4 -19 -34 -15
1514a5o6J33p9L5qj8K9n8J25r7O8j10N0N6j08J42j05Q8j05Q4o3M5Pm3R9j33J63
$$ -15 -81 52 -27 8 0 -18 11 -47 78 -19 49 -61 -11 45 -63 79 -26 62 -43 41 -22 23 30 -13 86 -47 116
1541A16j69P0m0N5l5j0K7n1J43j06L5qk4L9o6O3j10J57j04L0K1o9M0p3J63j69
$$ 116 -53 17 -23 32 -3 -13 14 -37 106 0 35 27 3 42 -24 39 -71 86 -18 12 33 -36 4 -69 94 -75
1567g5Q5j08J01Oj07L5l3J15q4N2J69j59n7oJ23M9l4j71K30k78R1L6R7k33J00
$$ -75 10 -98 3 9 -98 -63 -96 19 -65 -13 156 -3 -60 -66 57 106 72 -99 131 -147 -56 -20 77 -156 -56
1592e6J21k75M89j29m07K55p0K18j63K96l25J24j33O3j0j37K69j35J23j12L1q3
$$ -56 65 -210 279 150 -257 -2 -72 146 -17 279 -46 78 -55 8 -2 -139 130 -5 118 6 37 -46
1614d6O6M2q4M2p9J11l6%O1r2Q6j04J28j51R5l2j6N0o0O9j18J21j48J67q7J9L8
$$ -46 20 62 -22 20 -59 52 16 16 77 -15 71 -33 95 -56 39 7 -9 41 -19 50 -68 53 -95 72 -15 4 42
1641D2q5J34j60J56j63J10m5lK5r3R6k9N4m0L4j16J8Q4o6J25j10P7k1m8l1KR0
$$ 42 -43 91 -69 87 -76 34 -11 -14 11 -82 14 -15 39 -1 33 -83 -65 19 -47 78 -32 45 24 -24 -55 -53 37
1668C7n0M9j23J49j17N1M5o8P1j07J14n9M8k3jj5l6R3j11Q5p8N9J3k6L9o2M8o8
$$ 37 -13 36 -87 62 -55 -4 41 -27 44 -63 51 -8 40 17 16 1 -35 58 -53 32 -46 13 26 0 39 -23 25 -43
1696d3M9j4n6R4lM6q0O5r7J07j30M4N5l0L9j50J80j03N8r7P0K8l9K9j00P7j5j0
$$ -43 6 -8 -64 30 27 73 -7 58 -39 68 -62 -18 37 7 46 -104 76 -27 31 -66 4 32 -7 22 -78 -1 -16 -26
1724b6J1KL1o9Q6j09R4p7RM9p2O3o8R9p8P0n8OL2j7M5m5%kL5K0k2L4j3j5k1J9
$$ -26 -15 -13 18 -51 35 -74 20 -57 -48 1 -71 -8 -76 23 -55 15 -43 -37 -5 -22 23 -22 -22 -24 11 31 9 43 30 15 -6 13
1756A3o3O3j7O1o4J1K9q3P5k7J1L2l4M2n9O0r9O9l7J8pp2J02o2M2o7J01l1N3p
$$ 13 -50 13 -4 57 -7 4 33 -50 25 -2 9 41 7 49 -10 50 -49 20 -17 1 -6 -78 24 -38 4 -63 38 7 60 53
1786E3q8J9K9L9j03O0M0p7J9q7J25q1O0j03R3Oj0R5j19N2j17J20j01M6M6m9N0
$$ 53 -35 -16 13 52 -51 9 49 -28 -9 -96 29 -52 8 -95 -2 4 -6 89 -30 22 -95 25 -76 -30 16 -33 17
1813A7o1O7p5P2m0K8K7n0Q2j08Q3n0N0p1K1PL9m5k7R2p0k4N9m1N4JJ7p9L5n7L3
$$ 17 -44 23 -52 20 -20 8 35 -15 67 -41 42 -8 42 -29 -8 -1 38 -7 -34 58 -12 -36 23 -18 36 37 54 -25 10 -47 -14
1844a4L5j2m1j5P3j06P4NmK1m8J0K6N7q7Q8m5M3m6m7M7K5K7r4M9m7N3on1P5j11
$$ -14 21 9 -32 -47 26 -80 -6 -1 -5 16 -32 -22 4 61 -26 62 17 60 14 -33 14 39 66 -28 21 -26 27 21 -30 45 -66
1875f6Q1n6N1m6L1N4j05P2m4N7o4J5q5J07J6n5P9l1L7o1k3L3k8Q1j05J41q1K4
$$ -66 15 -41 10 -36 -5 49 -56 16 -28 29 -35 -20 -105 2 18 -37 42 11 48 -13 -36 -3 -31 50 -55 86 5 29
1903B9m6J8P3p0K2p0R6n3K3k9L5j6q5J44q4K7k8l4RR1K1q4L0p9J09m6nNQL2o7
$$ 29 -17 1 74 4 26 -44 52 -1 22 -7 28 12 -73 71 -13 14 -14 -48 -39 52 73 -11 19 -60 49 3 -2 3 11 43 -24
1934b4L9p7J16o9j1L3l6M3j4O8q7L0MJ9j4k6L1p7J36r9JL3Ll2k7OOP0p1k9L5K8
$$ -24 15 -62 54 -15 -26 7 -29 14 0 68 -19 11 15 34 20 -6 25 -52 84 -15 -14 19 22 -10 -37 -31 -25 45 -26 -55 -20 8
1966H%m0K5J9J4m7NJKJ0J6J3k7J2k2QJ2j4R4p1R1o1Po1rJ4KN1o8PK4Rp9Q7k7q
$$ 8 8 -32 -7 12 26 -21 -16 -15 -13 -3 13 26 -1 11 -11 -3 9 -5 89 18 109 48 55 -6 -15 -1 1 52 -16 -9 15 24 -55 32 5 -3
2002cJ2qK0J5KM2r9J2ol2M3lqnO2ln2QM9l6mK6l0J5rk2J1J6k0L2J6L0j2r2Q2q1
$$ -3 9 1 21 36 38 80 -19 -7 -13 -45 -2 -5 -13 -18 44 41 -11 -3 46 10 6 32 2 17 8 -14 -3 13 -7 25 41 71 59 -33 49 -32
2038c2L0l4L8L0l2o3KP9r9N1l3j3O8j8K6n5Q1k8J20j45qO1M8J1j26J04m3J4j8
$$ -32 -2 -36 2 32 0 -63 -61 18 -81 -30 -63 -76 -8 -26 0 -55 26 -2 118 -27 -35 26 74 85 -41 63 20 34 16
2067A6j7M3n0M4m9N5k8ORj5J7k6Q7j64R0l8J0J5n3L8j5J29j61J03o6Rk1k0Q0k2
$$ 16 -1 42 -8 36 -13 42 14 20 29 14 31 5 92 -72 18 -20 -10 5 -48 -10 -25 104 -57 46 -20 -11 -32 -52 28 6
2097Fk2O3Mj00L1rN7km2M5m5Q1j05K5N5o4N9o5O2p8P4k9Ok1J7K9m3K4rJ6l3J4
$$ 6 -16 47 51 -49 -18 -27 30 28 -14 31 -14 67 -38 -13 42 -22 37 -28 34 -44 30 1 7 -14 3 32 -11 13 4 20 -13 1
2129AJ8k8Q3o8nrJ0L0n2O0k5K9j09R6Nm8L3m9QK4M7l9k9N1o0M8k9M2k5j1m2K8
$$ 1 19 -9 74 6 1 -8 2 32 -20 40 15 44 -65 31 36 -12 21 -28 -20 4 51 12 -17 34 -26 22 -7 35 10 -1 -43 -15
2161a5J9n7M1l3J02o2J9k8O4m6k9N0j7J3m1N0l6k3K3KL7j08R6k2J9m4MN3p8P9
$$ -15 4 -53 -12 -45 57 -5 14 -14 50 4 -25 25 8 21 -20 30 -6 -29 -6 -4 33 -75 21 -1 18 -26 -22 31 -47 32
2191C2n7P5k0j1j9l8J5pM4qrm5j6P6K0Lm8J1lK3k7J7j3L7L4n9L3l0J3j0J1j3N
$$ 32 -25 50 30 19 0 -38 -23 -30 14 6 -3 -48 -64 12 32 35 -13 -2 -5 18 -9 8 -5 32 66 7 40 10 23 13 24 11 16
2224A6J2rJ00j14pN1ok5krj0N1l0j1j2Rrk5M4k8ll1P2k9rPoJ8Rnj5lM2m9N4qm0
$$ 16 28 19 119 5 -2 49 43 18 16 7 -3 48 18 7 -5 4 -5 -30 14 -14 -17 -48 24 -5 -14 -7 -13 5 14 9 -6 -9 33 -16 38 30 -10
2261a0M1km5K5K4m2N3q2N0j4K6k2J2K1o8R1o2j2oL8k9n4N7j3L7n1J6K3j9Rl0N1
$$ -10 31 29 -16 9 33 -9 44 -38 12 -2 24 2 14 35 -33 58 -4 -16 -22 16 -13 -67 -10 -23 14 -37 -21 2 -17 -8 -38 13
2293A3K5m9N3l6J8q0N3L5J4m4K2Kj3j4K6m7lQ1n4MqL1k5k1j3J3J2J9kj3m0O5o3
$$ 13 38 -11 42 6 24 -56 -3 32 46 2 24 26 13 -1 25 -22 -25 56 2 6 -2 29 4 -17 -30 -17 -5 14 12 -1 -41 24 -39
2326c9%KQ3q4P6n8J47p5m7j8j1j8J7K4l2K7M3n0N7m2j4J7K0m4m7O6JL4o0L0l5
$$ -39 -39 -37 46 -38 38 -20 127 52 5 -13 -24 -42 -25 -1 -33 -6 37 -13 44 2 -12 5 25 -19 -66 0 1 35 -25 5 -30
2357c0P1k4p1O3pN3j32R2J3lo3L8L3p2O7l3J3nk5Q2j56J07OM8q3oK3j1L1J6n9
$$ -30 41 17 -54 9 2 55 -77 15 28 25 -38 0 33 -39 28 -5 8 3 -22 60 -96 11 17 65 -18 -24 -1 -12 19 35 -24
2388b4N4n6j0k5N9K0m3J9M0l4J6Ql6j9K4N0o6N9p4%K7MjK1Ro3M5j5k3P6lk9J8
$$ -24 30 -26 -36 -61 -2 18 -25 -6 34 0 16 24 -12 -31 -7 43 -23 36 -38 -38 -11 -7 -8 13 22 -41 4 -11 -34 42 39 10 28
2421B8l4KRj4NnJ7k7kL5rM6n6k3N4n8LK4K2k4%J6k1Jk5L2pJ7l6P3k7j2m1J9J5
$$ 28 -6 -4 5 -9 -4 -9 8 -19 -21 14 5 51 -5 -28 26 -32 -29 -5 17 -7 -7 9 -12 -11 -36 -4 -11 6 -30 43 16 4 -37 -18 -3
2456cM8rp5N4l7JM4l9M5k5rMmk0K5j0m1N2n0M9l2K0j6j5qR8M5j11NJ33j43N4r5
$$ -3 45 36 -39 15 -22 -21 23 -16 29 4 -5 -1 -5 -25 0 -10 -51 1 -49 0 -32 -12 -28 -43 -51 47 92 -19 -14 119 -24 30 -65
2489f5J59j84O1J76O7J24m80K42qj65K68N1l55K47j20K0j22K14o4j10R5l3J1p4
$$ -65 94 -90 -29 147 214 338 -142 100 92 -73 195 246 -109 138 18 38 -84 130 66 -44 51 18 29 -45
2513d5K6lK6J1l9L7lJj2k9M2k5K5l5J8k3mK5o4J17p8Q3j3nl1L6l0N3n2j6J4j0
$$ -45 -19 -22 4 15 -24 13 10 11 -1 -30 12 -13 12 -23 -5 -28 -32 -7 -71 46 -32 51 38 33 2 38 8 61 9 -7 7 -3
2545cM4jj7j8j8J2K0m9J2P7n7rJ4J8l3m0P8m9K1l0K9j0m8R0r8L3KM0K4k3J9k1
$$ -3 41 40 23 5 -13 -1 19 -30 -18 59 2 -7 7 25 -8 -48 30 -19 2 -28 1 -9 -57 33 -65 -32 -30 10 34 11 30 9
2577Ij8Q7n8K7n9JK0J6m2oMK0J6n3L0k0O3p4L7K6k9j3L5L2p4N7m8QK8p4L2l6N3
$$ 9 -9 78 20 47 -12 -11 9 25 -17 -23 -19 1 17 -36 -6 -26 37 -37 0 26 -3 -16 19 51 -23 34 -14 -6 22 -52 -20 -56 -3
2610cL6o6k7N5k4oqk9M8QO0p7k3O5l6J5J1L8n5O7p6L0K0j7j3k1k5K0J9K4n6K4
$$ -3 33 -33 -60 -5 -29 -35 -43 -72 -24 -16 44 -33 -56 9 -27 -12 -1 37 -18 49 -27 3 23 6 -7 -28 -53 -33 -14 10 -46 -22
2642b2j0L1j1N8m4K7m6l4O9j0k9NR7q7M3m8J9q1N5K4L0o9J4N9l8pJ0J8n7jqK1
$$ -22 -32 -1 -12 46 2 29 -17 -51 18 8 -21 -16 81 -6 37 -11 8 -73 -18 6 36 -33 -19 40 2 -5 5 23 -34 -35 -43 -22
2674b2K2j2j5jJ1L0j2k7L3m3P1p9K2K8J2n0K3K8j4rl6P0m5N0n4J8Nm2kL2l1M4
$$ -22 0 -12 -27 -28 -17 13 1 -26 7 -36 35 -44 -22 6 18 -32 -9 19 5 -4 -40 30 -15 35 -19 -1 4 -38 -40 -8 -39 5
2706EL1r4O5k0L5l4K5on1O4r2L8K0rJ8o6Q5lrl1L7K0p3R7m8L3n9k6N4PJ7l1Rn4
$$ 5 36 -58 7 -13 22 -12 13 7 -44 20 -72 -34 -14 -23 -5 -71 14 11 2 -29 8 28 -45 52 4 37 -22 -48 6 13 30 -1 8 -46
2740d6MJ4L2M1m9M6j08rN8K3j2K2l2J3k1J4M3n7N4k7j5K5l0O0k9No3J05k5k8%
$$ -46 -42 -28 4 45 -4 42 -66 -75 -17 6 -6 16 -16 -3 -24 -10 33 -24 30 3 -12 13 -17 43 14 19 -44 61 36 8 8
2771Hpk8L8K2j3j6OK3l1j1L0m8N0qkk4j2N6l3J7m6N6j6j9k6k4J8L1M4n7NLP2q1
$$ 8 1 -27 11 33 20 4 10 33 2 -9 21 -27 23 15 13 -11 -23 33 0 17 -29 27 11 -8 -34 -58 -40 -9 35 -22 -17 -14 58 -23
2805b3P9r6L9M6r4L1J6r1J32r3N4m7O2j04R9k5J9M3m6Ln6p1j2Q6J05j29j09J1
$$ -23 56 -40 -1 45 -49 -18 -2 -93 39 -54 0 -47 15 -89 10 -15 4 47 1 4 -52 -123 -135 -49 56 -73 -182 -171
2833a71K03l0K40l43l9M08k01j68K77J30l93J03l0j40J06P8l4j9J28Kj85J21l9
$$ -171 32 2 242 -101 -140 268 67 -101 176 306 -87 16 -14 -154 -48 30 -4 -23 105 107 -78 43 4
2856Dj9O6M3j5j57J46j97J04J50k27O0r4J22J40l37K28k7j6p6Q5PM2J18j93j7
$$ 4 -15 51 94 79 -78 68 -129 -25 125 -102 -42 -136 -14 126 -211 17 -10 -26 -102 -17 -10 32 150 -43 -60
2881f0O4J14j04M5q1K5j03R3l7J77j32M4r6P2n5J88j52P0m9J7QK2l3k4J22l42
$$ -60 4 118 14 59 -22 3 -100 -7 -44 133 1 45 -51 21 -34 154 2 72 23 40 48 70 37 13 135 -207
2907b07L11k9j27l5L9L1R5j57J12j5k8q3K06j7j44J1O9J0Qn1o6J19J2j53J15K3
$$ -207 104 75 -52 -87 -48 -17 78 -79 33 18 -10 -93 113 96 -48 -37 32 42 50 -1 -67 52 64 -89 26 49
2933D9j13M0k8K4JL5L7m3K8M4l9k4PJ3n0K8m7j4J22q3j7oK2mk4M3k7L1l3Q0j26
$$ 49 -64 -24 -52 -28 -27 8 45 2 30 74 35 11 18 31 -19 9 -38 -52 70 -13 -30 -36 -14 -18 -42 1 -26 5 -28 52 -74
2964g4O7J0J4J7l8M0k8J5K0j1k9KJ4K0k5m1J0L8j5Jj4K4M1J5o5M9r5J3j6NL2m
$$ -74 -7 3 17 34 -4 36 8 23 43 32 3 5 19 39 14 -27 -17 21 6 7 -7 17 58 73 8 57 -38 -25 -41 -36 -4 -8
2996hn7O2M1p2M6j00J16L8j18M7k3OL8l0N4j0o4N2nK1n6M2nPmj1Nk0K2kk6J1J5
$$ -8 -65 -3 38 -34 12 -88 28 66 -52 -5 -28 -22 16 -14 40 30 -34 18 13 34 -22 20 15 22 18 7 12 -8 14 12 -14 -3 12
3029A2L7j1m3m7K4O7k2m6jl3M2n5Q2k9J7K1Kl1K7oj5K1km8M8Kmm8O7o7N0oqJ2
$$ 12 49 38 -5 -52 -28 39 17 -29 -30 -63 -21 -76 6 -23 -6 15 17 -14 13 7 -8 13 11 -37 11 13 9 -39 28 -39 11 5 -3 9
3063Iq0J07l1j0k9j5M0qK3k4N9n6knJ4J5k9Jj9L9l1J7kmj6N8r2K9K9L5o5P6l6
$$ 9 -71 36 5 -5 -34 -49 -9 -17 6 -18 41 -15 -17 -22 -8 7 -22 -21 -40 -1 -32 -15 -17 -21 -37 21 -71 -42 -13 22 -43 33 -3
3096cK7j1l5K5QKj3k0O8l2j7j5j6K6K2l3K9o3k7M5L7j5J8K9j1nm4N7l0rJl7M2
$$ -3 24 13 -22 3 11 13 0 -20 48 16 -1 -16 -32 -6 16 -17 12 -51 -78 -33 4 -11 7 36 25 20 -24 33 3 -6 -5 -42 0
3129@j6N2k5jl5RN4nj7k0J0k7N4l7kl6M6J5j3L5l3ll2N0l7J6Po2M9m4L2l2O9l8
$$ 0 -16 36 11 10 -25 -16 38 33 16 -4 6 -21 33 -4 -6 -42 4 19 6 41 8 5 -27 23 -14 2 9 -53 -4 -48 -16 -48 21 -17
3163a7M8j6k0okjN6l7L3m2KK7k3K3M7n5PJ0m7K6j1Oj9J1K3n7NO1j06L8N3m3k4
$$ -17 31 15 -5 -11 -13 -14 42 5 38 -4 -2 25 2 25 72 17 24 34 -13 13 2 8 -11 0 23 -34 -29 32 -74 -36 17 -26 -50
3196e0L3j5k0NM5qN8l8n0J5j0Rj2J06p1j0K7j6L5j9J0mL0o2K5k5l2Q0p1J0j4M1
$$ -50 -17 -32 -52 -47 -2 -10 48 10 -40 -25 -35 -26 -38 68 -3 -13 14 -2 33 14 24 20 50 -12 13 -12 -44 36 -35 -25 -39 2
3228Bm1K6J5J2J9m6J5r4M6N5%m3K8M0o9L8n1nQ3K2m3L0n6N5k3JN6n0Mk7N8k5l1
$$ 2 -39 -13 2 14 33 -13 2 -92 -46 9 9 -34 -6 34 -35 3 -48 -53 30 52 9 39 -17 38 15 16 72 22 26 -1 57 32 1
3261AOJJ2J1KOk6n7N9l7Pm4LN9l9L7Nj8nN3j2m3j1NJ9L5k6L5m6m8J16p9m3R2L1
$$ 1 7 8 20 31 33 39 13 -44 15 -22 -15 -59 -56 3 -36 1 6 -12 -17 36 24 -19 -30 -25 -6 29 3 38 -8 -56 60 -19 -62 30 61
3296F1o8KQK2nl3m5N5PL5m6k8L5J1k2Nnj8MM6k7K3Kj4J1j5qJ7pK8k2K1l4O8j05
$$ 61 -7 -5 3 25 20 -13 -58 -3 4 39 -7 -35 0 11 -11 -6 -11 -29 -25 21 -6 17 19 5 16 1 -7 10 3 31 9 30 -4 64 -41
3331d1M7K7m8O0L3j37Q1QNm9J87k09K4n8J69j38k3rJ71j48L0L56l71j2m1L7n0
$$ -41 6 33 -15 45 78 -59 22 30 35 -14 173 -36 -12 -70 99 -39 -62 -71 100 -48 -18 338 -33 -45 -86 -49 -99
3358i9N9N9J19k02O0J28ml11j45K20K54J30l08L03l65KJ5J48J19J04j41k81L9
$$ -99 -40 19 138 -64 -4 124 120 -191 -336 -116 138 268 -40 263 -102 -100 -85 63 182 286 145 -136 -97
3381i7L23m29q8L06J36k52jJ99j41M6n2J25n3N8kr1j2P7o1k7O7k3k0M4m1M7K4
$$ -97 226 -203 -291 15 151 -101 -102 97 -44 2 -50 75 22 80 78 -13 -25 52 -9 -36 31 8 -12 32 -9 38 62
3408F2p2P0k3l6l7K7l6R6m5oN6q7oL1j7lJ2J0ML1n6PK3k8j0j7J9K0k3K8j4NL6
$$ 62 -10 60 37 1 -36 -9 -45 51 6 0 56 -31 -37 -6 -23 -26 -14 -4 0 31 -25 -18 5 -23 -33 -50 -31 -11 -34 -6 -20 -15 21
3441B1ok0L4k2J%j5M7k2l6j0K3O0m0jM4q2L7Jn3Q2n2K7rj6ll4L9K9l5j6J5k1L7
$$ 21 15 -5 29 7 8 8 -7 40 18 -18 -28 -5 55 15 14 58 -24 13 14 -39 43 -9 18 9 -7 -10 -44 -5 24 -11 -27 -12 -33 4
3475Dm1L4K3m8K7k2L3%l4L9K5l7pk4K9Ol2O6k6j5K0k7l3L6m0Q7m9k4L5m1M7m2
$$ 4 -37 -3 20 -28 -1 -23 10 10 -24 15 40 3 -4 -28 1 7 -25 41 15 0 20 -7 -40 -4 -44 43 -6 -30 5 -36 11 -31
3507c1%K2nL0Nn8O6q5J2J9M1m6QllJ9K9k1K4k2L5l9K1j6K3J1Nk1rp1P6K8k6Po8
$$ -31 -31 -9 -14 16 21 -37 29 -56 -44 -25 16 -30 -22 -25 -28 -9 20 -1 23 1 36 -3 18 2 25 36 41 20 11 -60 16 44 18 25 -43
3542d3N1rNrk1N7r0N1k3N0Kk1K7l0j3O5n7J6J9q0L4J7j2pM4p1O4o0N9KK9m7K1
$$ -43 8 -1 4 -5 -26 31 -59 -8 -31 19 21 0 27 -3 -16 49 -8 8 27 -53 -19 -2 -14 -21 23 -48 16 -44 15 17 46 -1 20
3575B0k8L5j6l7k0J6J9k4l2M9J3K8m4J4j6rJ3oLj5J4MM4p8O3mM9m4j5J6QK4m2
$$ 20 -8 27 11 -26 -46 -30 -11 -35 -67 -18 -5 23 -21 -7 -23 -32 -19 -25 -22 -37 -23 -19 25 -53 10 6 55 11 -4 12 20 44 2
3608BRJ9m8P4n4o0O2M1o9J7j9J6J8j2J5Ll1O6nn7O7o0l8K7J1m9R2n6J0k0K1J1
$$ 2 11 30 -18 56 2 -58 4 45 -24 -7 -26 -10 8 -4 11 14 -17 49 44 -13 54 -6 -44 -17 -6 -55 37 -19 -9 -29 -8 3
3640Cl1J7j6O2l5N6l7l0L8Nk9OoJ8k5J7m2rO8o0L1j7j9KOJ8l0O7n4K9n5N1L1K
$$ 3 -28 -11 -27 35 0 56 19 -11 27 32 3 9 3 21 -4 13 -29 -38 30 -30 1 -16 -35 -33 -27 -9 -39 28 -26 3 -52 -1 30 32
3674C2Lk0k3k2PK4JrLN5r8O5Mk3L7m6K3J6j2J7o2P1j1L2q3K4O8o0M4n5l6K3K0
$$ 32 35 15 -8 -30 -23 1 2 -7 -4 51 -47 18 22 -1 36 -10 13 29 17 34 -28 43 32 64 -19 5 73 13 57 2 -34 -11 9
3707Ip3N0L8m5pL0L1Rk6%pqO0q4J8N3l4k4m4P5m8K8Mkk8L9J8lnl5K2k8O0r3N3
$$ 9 -64 -14 24 -21 -28 2 33 42 16 16 9 1 61 -23 -5 48 14 -10 -54 21 -27 1 5 3 -25 14 32 29 24 -11 11 -17 43 -50 3
3742Ck5J6kJ3NJ2l1l0N9n1K8%L6o7J8qK0jj9RJ7Ljj3k7N6k4KQrop5J08rl7K5O2
$$ 3 -22 -6 -8 5 10 22 -9 -39 20 -31 -3 -3 33 -34 -16 -24 -4 -5 -24 -15 2 5 4 -9 -36 20 -4 -2 6 -3 -9 -84 24 15 -22 3 65
3779F5n3k4N2m8j%l6N2K3n1jK4K4p7M0K4k6pK9k2%J4pL2p1J5M0J3mj1L7q1M2K1
$$ 65 12 -12 40 -8 -9 -9 -45 7 30 -21 -22 2 26 -51 -11 13 -13 -20 9 -13 -13 1 -6 26 -45 -30 10 23 19 8 45 -36 6 27
3813B7o3P8m3o0R6Km6k0L2L0rk1qo1M6j3K6j4qJ9J3l4M6q0O9NMO5p8Oj9POK0p2
$$ 27 -36 42 -1 -61 35 37 -9 -29 3 33 24 3 -5 -66 -20 -33 -7 -21 -29 -10 3 -31 15 -65 4 9 13 78 0 6 -13 -6 0 20 -52
3848e2O0k7nQ8k5m7lJ5k0k9P8n7J9poO8r8R9q2J0J2K5J8p7L8L4m8j2J9L8k0j6
$$ -52 8 -19 -24 64 39 -8 -11 4 -16 -45 33 -24 -5 -12 -18 50 -48 51 -31 -21 -9 16 34 -43 -5 29 -19 -31 -12 26 6 -10
3880a0L8rk4k7J18o5k3K8q7N0J6J1j8K9J5m3L2p8L1j3J7J9Jj9l8J4l3Q8l1M2n1
$$ -10 28 19 -5 -32 86 21 -2 26 -61 -11 5 16 -2 27 42 -1 31 -47 -16 -29 -12 7 8 -11 -49 -35 -68 20 -11 31 -20
3911b0Pk5O6mJ1o7M2j9K6j5o%j3K7J9k0jjJ0n6L0j3M4n5M8J2m5NklM7o8L1Q9q1
$$ -20 -13 -38 28 24 35 -32 10 -9 17 2 -4 -4 -17 10 29 9 8 7 17 -39 -9 -22 22 -33 15 27 -18 -13 -15 -18 29 -39 -8 81 0
3946@o0Q2k3j9M3m3J7L5om1K7J2o4J6KM7mj0L4j9j0rPok4L6l2qK0JjL6o0k2RN4
$$ 0 -60 22 -1 -20 23 -20 -3 32 26 -15 12 24 -40 -24 -22 25 21 11 45 26 16 7 14 8 -16 20 -12 -20 0 1 0 36 -24 -46 -37 17
3982A7j2o6M3jJN8q8O5l4nK1L1k8o4P8n1L3l8P7Nk2mm7j7J2KM7J9k5Jm4L3j4L1
$$ 17 5 -61 -18 -19 -18 40 -48 17 -17 -22 -1 30 2 -62 16 -35 -2 -40 37 42 20 16 -31 -48 -36 -34 13 32 7 8 -36 -3 -17 14
4016A4o4L3L7n5M3J3q3P5J5k3m5N2n6MK6l6Q6ol1jk6kO1l3Rm4J0N6n4J3j3oP6
$$ 14 -50 -17 20 -35 8 21 -62 13 28 5 -40 12 -44 -40 -14 -50 36 30 -1 -2 -28 -30 31 -2 7 -37 -27 29 -25 -12 -25 -31 45
4049D5o0kL1l8M2kM0j38J05p0K0OM0j1k1j1P5n1j3qL7m9M2j1m8L0NM3m8K9j0N8
$$ 45 -15 -17 14 -24 18 16 56 -82 23 -47 -27 -21 19 8 -13 -24 51 0 -13 -21 16 -33 9 -2 -50 -20 -15 28 -20 9 -1 57
4081E7n9l0L9j2L2m1%lK7l1J3m2O7Lj0pl9K4K8q6K31j58P2j00k7j7J9J03l65L54
$$ 57 -2 -32 7 -5 27 -14 -14 -17 10 -21 -8 -50 17 20 10 3 -36 -12 16 -70 161 3 75 -25 -52 -69 -50 53 -312 42
4111D2k2P6r6j20M6j17J33L18j86M16l73j78q4J12M22m27n9M98m01J6Q2j01J90
$$ 42 20 96 0 -120 -74 -191 -58 260 74 490 117 -61 -145 -33 389 -38 -97 401 0 16 98 -3 187
4134A87K3l52l6K11j03j93K08J76l76R30n20m71L88J49k30J94L8j59k8j40J80
$$ 187 210 -142 -178 33 -70 -263 -55 121 -255 675 155 -316 72 221 -9 185 223 64 36 -104 76
4155G6k76J67N3k5j13oK03M3o0JJ97m53J85R2j29J57j89J91k04N4n4K37l70K81
$$ 76 -200 -33 20 -5 -118 -124 79 122 62 63 260 -193 -8 84 -45 112 -77 114 -90 -36 -90 147 -223 58
4179E8j02J48j21j38J64L8j21Q3J53r0n2J7m8j5oQ1m6Kl7L5k2P0k7p2J04q6J0
$$ 58 -44 104 -17 -155 9 47 -74 9 162 72 20 37 -11 -26 -32 49 3 5 -32 3 -19 51 24 -48 56 -30 -20
4206b0N6j2l3o2Q2m3K2L3l3JpK8m4J8lj1LK5n8Q6o7NN8m3mK7J2j3M1l8Qj7J4J
$$ -20 36 24 -9 -71 11 -32 -10 23 -10 -9 -16 12 -32 -14 -17 -28 -25 0 -58 28 -39 -34 24 -19 -23 4 16 3 44 6 14 -3 11 12
4240A2pJ1n3P7k7l8K7L7l7j1k3LmJ5O5p1RM1m9K2KK6j4Jjk4kl0J7M9nK0n4PlJ1
$$ 12 5 16 -37 40 13 -25 2 39 2 -9 -32 -29 -33 -18 47 -24 -15 26 -23 -1 1 27 13 14 13 -11 -13 -43 -26 23 18 38 -16 -9 -12 -1
4276aJ0j6O5n0jj3l3M4Jl1K6K7l1j8jJ3qN3o3k7L0J4k5RL5p7M7n5P4l2KM4Rn0
$$ -1 9 -7 58 8 7 -6 -39 5 6 -25 1 28 -3 -21 -22 -9 -17 36 -27 -54 -24 -10 -35 -26 9 -68 -21 -76 -2 -34 -32 12 21 -29
4310b9m6J20p7M1N1q1mK0LK1m4O6j6%K4j5l2L0j7J3l3RnKol5K8mk0N0J4m7LJ7
$$ -29 -75 45 -32 9 60 -21 -25 -5 -2 19 -25 41 25 25 49 34 2 32 15 28 -5 4 -1 1 -5 -40 -12 -16 -36 14 28 -19 -16 1
4344Ak9J0pP0n3k1M1pJ3l8k0J9L8l0K9j9M4J9j6j09J4O6J2l5j8M6Qj9Ol9K4jo2
$$ 1 -28 -18 -25 45 -8 -29 12 5 18 -20 -40 -21 17 -13 16 -3 41 60 44 -65 -51 15 27 -8 -26 20 28 9 15 -24 0 -1 -63
4377f3N9K4l2k0L6n5L6K1K7m4k5Q3j2k3K7k2N2p0L8pk9jON6q1M4j4o1N9j7KN2
$$ -63 -4 20 -12 -32 4 -51 -15 6 33 -11 -36 47 35 12 39 17 69 -1 37 30 1 0 6 62 -19 25 11 -50 9 -8 -6 46
4409D6o2K1L8m3K8k1kl9qM9j5j4J7L7m7J8k8J0j2j4J2L3llM1p5M8om9K3J2k5J6
$$ 46 -16 5 43 0 28 7 5 -34 -42 7 -8 -22 -5 32 -15 3 -25 -15 -27 -41 -29 4 1 -2 39 -36 12 6 -43 -20 -8 -33 -17
4442a7j5O3j8kk0J1J5k0m7L6OK8Km2j4J7k7M4J2k9K5j8L8l6L8n2K2J3qk3J3M1
$$ -17 -32 31 13 11 -9 2 17 -3 -50 -14 -8 20 22 -20 -34 -17 -44 0 12 -17 8 -10 28 -8 30 -22 0 13 5 -18 -5 36
4474C6jrl5K4M2p8J8JM1j4N1q7K6Rj9K0J2J3m8n1N0j2n7M9k1J7L6M3m9k8j2K3
$$ 36 35 26 -9 15 57 -21 -3 -2 39 25 76 -11 15 24 5 25 37 50 2 -49 1 -11 -68 -19 -40 -23 13 56 7 -21 -33 -10
4506a0L3p8N7Ml7J3L3rJ1l6mJ7K5L0l8k0J7Rk8N6k3L7k6l6j6O5pn1m9QK1Oj8M1
$$ -10 23 -55 2 6 -31 -18 15 6 17 -19 -23 -6 19 49 11 -9 8 17 -11 45 22 59 33 -3 -19 46 39 -12 -61 -53 -32 -26 -44 -3
4540cj0j6qn0P5M6j2L2l4n3OL1j5K6K0Kj3k8PjK8k0K6r0L8L7J4k1Ql1J0K8p7L3
$$ -3 -13 -29 -37 -87 -12 34 22 54 20 -33 -27 4 -11 15 35 37 24 -4 3 2 30 10 36 -54 -16 21 35 14 22 -9 1 29 -48 -15
4574a5oO8o2J1n7L6k1qJ2kM4l9J0K3n3P7qK5Ko3%OM9j9l5M4qN%l6L0J6l9PL5K0
$$ -15 -21 47 -15 -4 -61 -25 -46 -54 -42 -44 0 -39 -29 -6 -59 18 10 35 37 -26 -26 -20 29 10 -25 19 11 16 16 -20 10 26 -13 -6 29 49
4610D9r5R8m9j9M9p5N4J5j3n0rJ4L9k5M2k2Mk7Lk8QN9l6j3RM2n8P2o4M7LQj8j1
$$ 49 -46 52 3 -16 33 -42 12 27 14 -36 -45 -31 8 -17 25 3 7 -20 -17 -45 -37 22 -14 -27 -18 24 -34 38 -26 21 24 32 14 3
4644Cj9K0pPl6K4M5k3m5J7Lk8N6K0j02N5j4k8J3J6J5Jk4jQ4n3K1k5oO3po0J6j6
$$ 3 -16 4 -3 4 -32 -8 37 14 -31 -14 -11 -39 17 37 -65 -10 -24 -52 -39 -23 -8 -7 -31 -32 52 -1 20 -5 -11 52 45 -15 1 -15
4678a5L4Klk1J6pk3O7m2L8m3l1M1m5K1m1L6j4%J8KO7j9p9K7ln0J01k2OJ8n2L7
$$ -15 19 21 18 -3 13 6 -17 50 8 46 3 -28 13 -32 -11 -52 -16 -30 -30 -12 -10 57 38 -41 -14 -17 -67 34 12 18 36 -16 21
4711B1l0J2J2K7n5K5MK7n1J8j5o7P8K8Pn5M3m7K5OJ5k0j9LJ0k8j2N8o0O1j8j4
$$ 21 -9 3 15 42 -13 12 16 43 -8 10 -5 -72 6 34 41 -14 29 -18 7 13 28 8 -11 -8 2 -26 -38 20 -40 21 3 -11
4743a1n5O6RM2k2m4O3m4J1j6J8N3m4j8J7nk1n1P9m2J8Nk3l4L6m6J09n9K6n0J7
$$ -11 -66 0 9 51 29 -15 48 4 15 -1 17 70 26 8 25 20 -1 -52 27 -15 3 8 -15 -49 -13 -59 50 -9 17 -33 -16
4774a6K6pj09J51o4M7l9J0j0k3L3l6M5jqk5k8P0m5j0K6K5k1K3J3%n0L6k3M5l7
$$ -16 10 3 -106 45 -19 28 -11 -1 -11 -34 -1 -37 8 7 -1 -26 -54 16 -29 -39 -13 12 -9 14 27 27 -23 13 -10 35 -2
4805bl1J6L3j2n1J7K6qk1L4j5J9j3qj2L1QOm8o8Q7nJ9llk5M7k3M1n2MJ8l3M3o
$$ -2 -33 -17 16 4 -47 -30 -4 -12 -33 1 -14 5 -8 -16 -28 3 11 17 -31 -99 -12 -17 2 -1 -4 -29 18 -5 36 -16 -12 6 -27 16 10
4840A0l0rO2Qj0K9k5lj3p7Q7j0j6%n1J33j00O1J21j52p8J78j6K9k00J23m8l8K3
$$ 10 -20 -29 33 41 31 60 35 32 19 -58 29 19 3 3 -48 85 -15 46 167 15 -63 115 99 128 -72 51 3 -35 -12
4869a2KL9qk4O8m2L0o0M3l1j9j2MJ9OPm9j1K4rN0L4r6R8N8m7k34J98m3j2K1Pm8
$$ -12 -10 29 21 -3 65 23 53 -7 36 5 -14 -26 -22 -3 3 10 -39 -50 -26 -35 15 49 -47 51 109 62 -172 26 -17 -29 -8 -1 -49
4902d9K9M5l9n3J6M2J2J6m9M8k8j2J0J0qK5m8M2M0m7J2Nm0l7J05k1m4LN9p2j6
$$ -49 -20 25 -14 -67 -51 -9 3 19 -30 18 -10 -22 -12 -2 -10 15 -33 9 49 2 14 19 -21 -58 47 26 -18 -15 44 -28 -44
4933d4K7KK7m1K7K5J1kop7J9L3J0J8k4q1Q0k9N4J4o8nM5rL2kk6j8N5l3Oj5n8K3
$$ -44 -17 -15 12 -29 -2 23 34 32 26 -51 -32 1 11 29 5 -76 4 -25 29 43 -25 -30 15 6 38 36 10 -8 47 14 20 5 -53 -30
4967c0J6rjK2j6l2R0r2J1J2k3N6l5jL5k0nL2J8q3L5jK0lk6K1O0qjk0l8RM1j0l0
$$ -30 -14 -23 -24 -2 -18 -50 40 -52 -41 -29 -52 4 -31 -32 3 -17 -22 10 28 -55 -20 -21 -1 -4 -30 -9 51 43 42 22 -16 -7 34 24 -6
5002fM3j4o4O8j0pkm1N2l2k0NM9ro5Q6Or4O5k1l1N1LJ8J1m4j3PL4o6k0N8QJ8j5
$$ -6 37 23 -41 27 17 10 8 -33 19 -13 -33 -28 21 12 -53 33 39 -55 10 -11 -42 9 12 30 41 -3 -16 -9 25 -41 -61 -3 5 23 8
5037HJ5Nn5O6nl4lK0j7j3J3m6pQ9p0K6%l3M1%l0K5qj4lL2m4O7j5qPM1k3J2Or1
$$ 8 23 28 -27 39 34 0 -3 17 0 -13 0 -46 -53 36 -34 -8 -8 -41 0 0 -30 -5 -13 -27 -30 2 -42 25 10 2 9 50 27 39 45 -46
5073d6K01j31J26l53Q2K09N2k76N2J21pj9l3L7k6M5j6m1k1K6jl6M4M2n3M9o6l0
$$ -46 155 24 150 -203 -121 88 140 -136 -84 37 30 11 -22 15 -11 34 18 -23 -44 -18 -19 -55 -11 31 -22 27 -39 -69
5101f9K6O1p6J7K3l5O9J1l5M9o0P2j8p6N5lp2P6j4Rl8O0k9l2N8m2O2pp2N2K1l3
$$ -69 -43 18 -58 -41 -18 -53 16 27 -8 41 -19 53 35 -41 14 11 -61 15 1 10 -28 32 3 -29 29 -13 49 42 -30 22 43 10
5133A0m1M9J9Jjn6K3K3m1%kM2l1M4m9K6p2K0J5L7j2K8j3j7K6l6Ok6P0q8L7M7q8
$$ 10 -31 18 37 38 37 -19 4 27 -14 -14 -16 26 -5 39 -10 16 -56 -36 -21 16 4 32 19 2 28 -8 -2 -28 42 -46 -9 38 -50
5166e0K4M4nkk1J8l3L3n9O8m3K0K6j9l0KKM3J5n4Nj79pJ68k4O6K5m3O1p0%nM5
$$ -50 -26 18 13 11 -10 8 -25 8 -51 17 -26 -6 20 1 -29 -27 -25 18 33 -21 -16 -195 -202 -34 -58 8 33 -10 51 -19 -19 -24 21
5199B1ko0PM5j3J6l2M8j05L3O5k0j0Rkj0m6N6lpj7J8J9n7N4l7M0o7N8n0P8nK1
$$ 21 19 -41 -34 11 -2 14 -18 30 -75 -42 23 3 -7 2 0 -10 -56 0 -3 -10 -27 -9 10 -47 7 -30 10 -57 1 -49 29 24 45
5232D5k7J6n6L5J8r6Q0m3R8m8Mjl7L5j7l6LJqO5j1k0l8N9m6rK0J4j4K3l7L0M3
$$ 45 18 34 -22 13 31 -65 15 -28 70 22 26 25 -12 23 6 -30 -27 -26 -34 31 20 0 -38 21 -25 -34 -14 0 -14 9 -28 2 45
5265D5m1M7j0j6J6k2%K7o9M2Rk7M1kJ5k5k6Jj2J9k8J5L6o3J0j5%J6J8J0kj9o0
$$ 45 4 51 41 25 41 19 19 46 -23 19 28 1 42 40 55 30 4 5 -7 12 -16 -1 35 -28 -18 -33 -33 -17 1 11 9 -10 -70
5298g0L3K8oM9r7J06m7L7k6J2kk8l5R8J53j35k20J11J03j28Q5K1j8K3m3qKk4L2
$$ -70 -37 -9 -15 34 -63 43 -4 33 7 19 17 -11 -46 52 205 70 -150 -39 64 -64 21 42 24 47 4 -4 -2 -26 6
5327Fk7K8l7L7j6L0m0j4K4k5M5o9N7J6oo8L4KN9k3mj1l5K1L8j1k4J6J0M6m9K7
$$ 6 -21 7 -30 7 -9 21 -19 -33 -9 -34 11 -58 -1 15 9 -59 -25 -23 36 13 9 -2 -37 -16 22 11 -13 3 13 59 10 37
5359C7l3m1M6J0j00P6m4M2L2l7J2K4k0rk0K5k6L2Qk2K2J0l1l5J10ql8k6Pn5KQ4
$$ 37 4 -37 9 19 -81 -5 -49 -7 25 -12 0 24 4 -5 -25 0 -26 6 14 -8 14 24 -7 -42 68 60 22 -4 3 -52 -50 34
5391C4m5O2j5o7L9J5%lj3J7J4m5k1L1nj7ROl0M6J8K3q4J6k9O0j6o1M4KN1q7O4
$$ 34 -11 51 36 -31 8 23 23 20 7 24 38 -7 -28 3 -2 -19 -10 -4 -34 12 30 53 -31 -15 -44 16 0 -61 -17 -15 36 -51 13
5424A3j7J7m4O5J3p5M9j2j2Q2q5m3L9RqJ6L1Mp5k4M6k6JL2k6L9j6k4pL4l2N5K2
$$ 13 -4 13 -31 34 47 -28 21 9 -3 79 -6 -49 -10 -1 -9 7 38 42 -33 -57 -11 -37 -36 -4 -30 9 -7 -31 -38 -4 -36 19 41
5457D1l8P5j23Q5p9O0Nmk4N0m6noO5j17O7k2P7p9P0l7L8%j23J3j1R1m7NK25n4
$$ 41 3 78 -45 40 -39 21 26 22 -2 48 2 -3 -9 56 -61 6 -16 61 -18 52 15 53 53 -70 -57 -68 23 -24 -19 206 152
5488A52k99J49J02j82l0M7J65k79J96J16j3j83M2J67k01n3k82K91J47m58M16M5
$$ 152 -147 2 104 -78 -108 -61 104 -175 21 137 124 -59 -17 150 -51 -104 -386 -95 52 -406 10 55
5510E5J18l03m8M20j06j40j81K92o2K09k01k8k6o6J1l9L9p5J20J30j47o5O7J26
$$ 55 173 -130 -178 242 136 -4 -185 107 45 254 53 25 -1 -67 -56 -95 -56 -131 -11 119 -28 -93 -26 100
5534A00q3m1O0n1P8L8k74K84k21j15J26J90j31J90l4K2j79q3J02M6Q6J32j62j37
$$ 100 17 -24 36 -15 63 101 -173 111 -110 -225 -99 91 -40 150 116 138 -41 -124 -22 24 110 242 80 -57
5558e7l9j23L91l30L29l8j16J58l28K06r0P9rj77J16j23j27L49j54K8N2R4j88
$$ -57 -96 -219 172 -158 171 133 17 175 -153 53 -37 42 33 -144 -28 -151 -278 71 -83 -55 -3 91 -97
5581i7L6K30k43j60M07m63K79J49l9m8M1J63j41q1k85J88K93j31j10J8K20n5l67
$$ -97 -61 169 -74 -234 173 -290 -11 138 99 51 92 255 114 33 -252 -64 229 98 -12 6 226 171 -196
5604a96m9J25J48j92RL11j95k02N26j17j0j97L7J6O5rj23J29m4J36p1l26K76m
$$ -196 -245 -120 28 -164 -155 156 -39 -241 285 168 158 -39 -2 14 79 70 -53 76 32 168 97 -229 47 43
5628D3k54J82J86j12J12K04Ml95m7l4K78o1m5j15R7o8j61K29j03p2J94L2k50J00
$$ 43 -211 -29 157 45 157 361 365 -30 -77 -111 167 106 61 -54 43 -25 -186 43 -60 -132 62 94 -156 -56
5652e6j75k43M54L7j96J65J37o0j4o9j90K28oj48K47J75l31k34M51l80k69L81
$$ -56 -231 -474 -20 17 -179 -14 123 63 49 -20 -210 18 12 -136 111 286 -45 -279 172 -208 -477 -96
5674i6K98m15J32j10L65j00m36J33M47j40N9l82M71m78O0kL65k28Q5j07O5q3j2
$$ -96 202 -213 -81 -191 174 74 -362 -229 218 78 137 -245 226 -252 -192 -194 171 -57 28 -79 -14 -97 -109
5697a09J3O7P4r2j05L29l83P4J45r4m8O9N3m2n3P3J29j31P6n3L0Nj03k65L24K5
$$ -109 -96 -29 45 -47 -152 177 -206 -132 13 -81 -129 -60 -7 -49 -102 -29 100 -31 45 -8 22 27 -76 -341 -17 8
5723HN0L6j38O0j40m1J36O2J9q6J5l1J0KM1Jk3J5j8K4K7n5N1J3m5J1K2l1rQ4q8
$$ 8 58 94 -44 16 -124 -165 -29 33 52 -34 -19 -50 -40 -38 3 4 -19 -4 -22 2 29 -26 25 38 -7 4 26 -5 -14 70 -18
5754a8k8P2l6j8K6l8jJ1l3O1JPml2J0k3nJ2jJ8K9Qr3J4N1llP4o3k9k5M8L8m5m
$$ -18 -46 26 -10 -28 -2 -40 -41 -30 -63 -2 -1 6 2 -30 -20 -43 -48 -36 -37 -19 10 18 -75 -61 -10 -13 -16 58 -5 -34 -59 -11 27 -18 -22
5789b2M8K8l1j2J6j5m7M9Ll6P0p9O0n2m6Q2jj5Pk1L3k3qK1o0L9L4Ok0j0j5OkK8
$$ -22 26 54 23 11 27 12 -35 14 17 -19 51 -28 32 -20 -66 16 15 0 7 -14 19 -4 -12 9 -51 -12 22 28 8 -2 -17 -11 -13 15
5823A5j1o0M4j3mN0p1P0pm9L3OK7pm3K1K0%jqJ3n9rNO8j2l1J0rq2J31o3P3k6j6
$$ 15 4 -56 -12 -25 -29 21 -50 20 13 -36 -3 3 30 23 -20 1 21 21 20 12 25 -34 -43 -38 30 18 -13 -3 -12 -94 37 -26 47 21 5
5858EK6m3J28j00q6J21o3J20j15K8j1o9j0K60j55n7M2n3j8N4l9j34J46N1J13j31
$$ 5 31 -12 116 16 -70 51 -12 108 -7 21 10 -59 -69 191 36 -21 21 -32 -50 4 -35 -169 -23 28 141 10
5884A0j4p3L17l06q2K80j10M9j80R8o0RJ38Mm5j03q2RK19o5j52Q9l2J00r9R1P6
$$ 10 -4 -77 240 -66 -148 132 22 71 -109 -11 -71 -62 76 80 35 -68 -150 -141 78 13 -139 -50 -82 18 -81 10 86
5911H6n9J73m36J13O6J65j62J26j61J71l53M48K71o05J4L27Q0j22j03j59p3J78
$$ 86 27 200 -236 -123 -57 108 -54 72 -89 82 -271 177 448 -157 -143 184 264 142 39 -120 -193 -15
5933a5L46l60KL57o04k16N35j12l36O33k98K4K81k40k0K47m20m4k91N76L2l17
$$ -15 331 -29 -27 330 -274 -490 45 -67 -403 230 -68 -44 237 -3 -23 224 -196 -240 -531 45 77 -240
5955b40K35K88l26j31j27Q5J4M56k73J57m47L13J77j71j34j55K67J5j28K14l03
$$ -240 -5 283 -43 -174 -301 -216 -202 254 -19 138 -309 4 181 10 -124 -279 -12 3 -125 89 -214
5976b14J24L93o02L11j2J73j32L56l92J24R9l04R0pN1K62j99nk98K22j45l16L67
$$ -214 -90 303 -299 12 0 173 41 397 5 129 228 -76 14 7 58 320 121 116 -182 40 -105 -421 -54
5999e4m88L74jK57j94j17L3J03J94p6j46K07n7j3M8k90R3R5k71K36J20m43J50
$$ -54 -542 -168 -169 88 -106 -223 -190 -87 107 31 -115 92 35 22 70 -220 -127 -32 -303 -67 53 -390 -240
6022b40J89j16K00Oj91J48n4r0l8K02K38r9j91N0p3J39j5p4n9m5O5L6pL9p7M6
$$ -240 -51 -167 33 39 -152 -4 -58 -148 -186 16 254 155 -36 14 -59 80 65 -9 -68 -113 -48 -12 -19 20 -57 -11
6048a1M2p4M1l1O6n8%L0m8L5j1K0N7m9mK0m5O3Nl9M8o0N3o5L1J0l3Jl2J9j8K6
$$ -11 31 -43 -2 -33 33 -25 -25 5 -43 -8 -19 1 58 9 5 25 -20 43 48 9 57 -3 50 -15 16 26 -7 -6 -38 -19 -37 -11
6080a1J4m0K2J2kn3L5K7o2O0J9kj1k3N2j3K3rm5j2L4M0p0J5kj4M3k2K6J4pMj09
$$ -11 3 -37 -15 -3 -5 -58 -23 4 -58 2 21 19 8 -15 37 24 47 38 -7 -19 15 55 -15 0 -2 -16 27 5 31 45 38 42 -67
6113f7M0M9m5J5rj7RqQj9L1O5n9J8l2L3j3J6m3J0J7l9L7Qj8l6Q8o8M8m9K2L6k9
$$ -67 -27 22 -23 -8 -17 -34 -25 -33 -25 -44 -13 52 -7 11 -21 12 -1 15 -28 -18 -1 -40 -3 5 -13 -49 39 -29 19 -30 -8 28 -1
6146aL6ol8K2n1mK3K9j6J1k3K8p1R2n5kOJ0K5l8j7jK9l3L7M2K3Po3j9l6j6J38
$$ -1 35 29 -9 13 -38 -42 -19 10 -6 5 -18 10 -61 31 -24 -26 -20 -10 15 -23 -40 -41 -12 -45 -8 34 57 64 1 -18 -54 -70 68
6179F8j13R9l4K2k0J43o3o4m0jJq4M8Q7mm0RMj5j5oKJ9Rj8n2O3n7O1m7pN7J1l2
$$ 68 -45 54 20 42 22 165 102 38 -2 -3 -2 -86 -38 49 45 5 14 18 3 -12 -18 -16 3 12 -6 -58 5 -52 9 -38 -45 12 23 -9
6213iKRk6N7oj3L1n2J1QL0oK6l4L3p2J0o4M7rr5J71qj46L5P6j67J21K7K28k9n50
$$ -9 -7 2 -24 33 27 14 45 -7 4 12 42 36 62 28 61 -11 -1 -65 -18 -27 -122 49 41 -105 -70 6 -161 -40 -13 215 186 -364
6245c64J87J94K34k85L0j2O8K0l06M69m81O93p20M1K01L9K9r1N2jJ00o9pK0L8
$$ -364 -177 17 251 -34 -4 -16 52 72 -234 235 -246 447 -273 -232 -31 8 37 -54 -2 -3 97 28 21 41 79
6270G9n0j5j1J2q6N5M4kQn8N4J21j12Q1j26j47K88k3l44L61j08r2j18L20j68J28
$$ 79 29 14 3 15 -71 -16 28 26 34 -24 30 151 39 120 -6 -153 135 112 -232 129 21 -71 -189 131 -37 91
6296I1j33k28J95nJ92j61J11L9l5j12n4J01KM2q2M1k5O8j2k7k8J2KL9m2OL5M2
$$ 91 -42 -270 -75 -80 112 -49 62 101 66 -46 -100 1 3 45 -37 4 -21 47 35 8 -20 -8 -6 33 -9 -3 32 74
6324G4l9n4j2L0Jk1N7n9K0J8m9K4oN4k8NL0K3r0K5K3pl2j0L8K6n4J0kkk0J5nq
$$ 74 35 -19 -31 -1 0 -21 36 -23 -3 15 -34 -10 -16 38 10 15 45 68 -22 3 26 19 -13 -23 15 41 -13 -3 -5 -7 -27 -12 -17 -25
6358b5Rl0J4j2O3l0L7l3j9k1O5j4k1K6l1K0k5L9l9M7Lk2oJ6k5M4n6P7o0NL2l6
$$ -25 -16 -46 -32 -44 19 -11 26 -7 -26 -47 18 4 -17 9 -22 -2 -27 12 -27 20 23 1 -5 11 -14 30 -26 51 -9 -4 28 -8
6390hOPJ0j8L4j0m0K0j7l9M3J2k4L5k2J5K1Pk8kk7K8k4J6pmJ4K2l5M7%m1K5m3
$$ -8 -2 5 15 -3 31 21 -19 1 -16 -55 -12 0 -24 11 -11 4 25 32 4 2 -25 3 -21 -5 -12 -16 -2 20 -15 32 32 -9 16 -27
6424b7J2l0R0%n2O5q0l7M8K1J6n7rK4L1j5j4K4j8j5K5j0k4J9pl0R8q8N1k5PoJ2
$$ -27 -15 -45 45 45 -7 58 -22 -59 -11 10 26 -31 -40 -16 15 0 -14 10 -8 -23 2 -8 -32 -13 -20 -50 48 -40 11 -14 -7 -13 -1
6457aK6l2M5k3K1j1J6k9n4M2J0J4m3K5j5K7p4N3K9j1j6m3Q5l4j2j1Oj0J6J8qJ1
$$ -1 25 -7 38 15 36 25 41 12 -42 0 10 24 -19 6 -9 18 -56 -3 26 15 -1 -44 41 7 -5 -16 -10 -20 -4 14 6 17
6489A7k2jm9QN1ok5M8j8J2J5j7J3K4k8Pk1l9M0Jk4l8L2L6N1p8L9k5m4L5lk4J2
$$ 17 -5 -6 -55 -47 4 -2 -27 21 3 15 30 13 26 50 22 29 8 -31 9 10 -14 -52 -20 16 67 -11 28 3 -41 -6 -9 -33 -21
6522b1MM0J4p4l3Q8m5PM4%j4k3K9N8p1OK1nk9kJ5l7N7k1O2r4P4q1M1Jn5P1n2Q
$$ -21 -17 23 37 -37 -70 18 -27 -20 24 24 10 -13 16 74 3 9 30 25 -4 -6 9 -28 29 8 70 -24 50 -31 10 11 -44 27 -25 -17
6556a7l3L6nO3o8K4L9p5RL4n8N3k0J6j4M0j2j7J4K7l2L0l3l5N2q3J12Jm6MK9n0
$$ -17 -50 -14 -19 44 -24 0 39 -36 -27 7 -51 2 -18 -2 -16 24 12 -5 9 36 4 34 1 -34 18 -65 47 48 2 6 35 -15
6588a5ML8j0o0O4n0L6k4L3Pl5k6LM8k0k8JL4m3O6l8K0k0l1J1oO2n6L3K8m2k7M3
$$ -15 -11 27 17 -43 21 -29 7 -17 16 23 -12 -38 -35 13 -7 -35 -34 0 -43 23 -15 5 -15 -46 -35 -41 21 -35 -2 26 -16 -43 0
6621@JNj5M3j8qj4MQk9j2R8n9Nl3MK0pj0J9n8O4m9M0Oj1o6M4J2m3N2pjl1L0N5
$$ 0 1 6 -9 34 16 8 -6 -2 6 -23 -35 63 4 9 -24 -20 0 -7 -17 2 -56 8 -41 -1 5 -6 -72 -28 -16 -59 -7 -14 -15 -46 -16 39
6657C9n4K1L5lm3J4m4K7qj3K5L1J8m8O0k9j9k0ON5n9Rjk7k2l0m7J80j63R7K06
$$ 39 -15 6 41 38 -5 9 -35 -8 -16 -29 -4 27 45 -3 57 28 9 -11 -5 50 -9 0 -1 -28 -50 -80 -127 53 -110 -13 193
6688A93k08q3R9K47k17m4K25j41l46M51j82J78k53J87r0jm7l0Q1j1K1k8J7m7L8
$$ 193 -15 -98 1 248 31 -13 212 71 -275 176 -6 172 -81 106 16 15 -32 -62 19 8 29 1 18 -29 9
6713Il5K0k4K6j2J5k5J4m6Q9n5L7mMj9J4m6M8rn3N5J4j9JL8k3mm4K6L3k6J5K3
$$ 9 -26 -6 -30 -4 -16 -1 -26 -12 -58 31 -24 13 9 13 -6 8 -38 10 1 -52 3 17 -2 -1 37 14 10 -34 -8 25 -1 14 37
6746C7pj3Jl3JK9J9l5l9L8ln4J4O0r6M0O1q7j6Q5j6JK1J8m3L2j7K7lj4j4L5l4
$$ 37 30 17 18 -15 -14 15 34 -1 -40 -2 -5 -59 -45 15 -81 -41 20 -67 -83 2 -14 -13 8 26 -17 15 -2 25 22 8 -6 29 -5
6779eJ2k8M7l8M2K8j4m6L1k1PJ3rPJ2m4l2O5k7o7Q6n0k2J3jL7j2Rk1L1%j1J0M4
$$ -5 7 -21 26 -12 30 58 44 -2 29 8 15 28 19 26 38 -6 -38 27 0 -67 19 -31 -53 -40 -41 -4 -16 -7 -28 3 3 -8 2 46
6813D6l7m6N4j7M7r6L3N4k9L3oj2l8J4l8L5mm8N7J7m2J5K0l4P0k9jl9NLj4O8k4
$$ 46 9 -37 17 0 47 -49 -16 38 9 42 36 24 -14 0 -38 -3 -7 -55 2 19 -23 -8 12 -22 48 19 18 -21 -16 -13 -27 41 17
6846A7j0oK9j1l0L1n0KL5n9J15n2n6O7j2k3MK7m3K8j5J1J5m2j4K0P5n5L6j9j7
$$ 17 7 1 30 19 -11 20 -30 -28 7 -52 63 11 -45 22 10 -13 -9 18 -25 3 -12 -1 14 -28 -42 -22 53 -2 34 15 -2
6877bJoJ1j7J7m8N1J2j1mK5J5p6K3nOj8KK4K9j0l3O7r1K6K3%n7M2qJ6k3J1KK3
$$ -2 -1 -7 4 -13 4 -44 7 19 8 4 29 44 -32 -9 -14 -8 -26 -24 0 29 19 -14 53 -38 -12 11 11 -46 -4 -12 4 -19 -8 -6 17
6912A7o5O9k7l7J6Qjj6L6mm1K3L7k0k4KN8k6k4K0pJ9J6m6M2o7Q2j4k0j8J6j3m0
$$ 17 -48 21 -6 -43 -27 -19 -20 -36 0 -4 -45 -22 15 -5 -29 -27 31 5 -19 1 -6 13 29 -17 25 -42 40 26 6 -12 4 -9 -49
6945d9J4O0l4k9M9j8k9K9P0r1M6k9K1L3r2M9pm6J19kp5l1N2j29J93j5r2N6R4J8
$$ -49 -35 25 -9 -38 11 -7 -36 -7 63 -28 18 -11 10 43 -49 0 -7 -53 66 64 -11 -42 10 -119 74 59 -33 23 117 135
6975A35O5j92N6k58J42o6J74m1j8k5Nj49L81j21k12J26J74m83L75k65J75R3k71
$$ 135 200 8 64 -194 -52 -118 56 15 -3 -28 -23 -172 209 88 -124 2 176 -307 68 -197 -22 71 -200
6998b00J66p2J88j40L39j69j44O3K06o51M21K4O9L6k4J1j39l8J47j52N2n8J08
$$ -200 -34 -106 82 -58 281 112 -32 31 237 -414 7 31 100 136 112 123 -16 -54 93 -59 -7 -65 43
7021D3j43J3K28j38%mpl1R2n0N4p3l9K4K4o6P2k3nM2j7j3J3PJ1j9Rnk8O0j2m7
$$ 43 -100 -87 141 3 3 -1 -8 -39 53 3 57 -16 -55 -31 -7 -73 -1 -24 -29 13 -4 -17 -4 3 14 -5 4 -1 -29 31 19 -28
7053b8L6o0R4Rl8l7N8j9j3k5rRM1m4lM5Mk6n5j8Q2l3J9j3L7n3L2L0j0J3k3k6J7
$$ -28 8 -52 42 51 13 -24 34 15 2 -23 -32 -23 18 -26 -29 16 20 -6 -61 -79 3 -30 -11 -24 13 -40 -8 22 12 25 2 -24 -7
7086gk7N4m0nL9n8P1J7rJ1l2nK4n6j4J6pk1O9LJ2o3Om2P4j1l7J2K7j6j1N4j2n3
$$ -7 -34 20 -20 -25 14 -44 27 44 35 46 14 9 33 -23 -37 -21 -28 -49 20 23 35 -28 -22 -64 10 -1 -38 -26 1 -15 -26 28 16 -37
7120c7J6k4P1m3q0Q9J0k7J2MM9o3Pk5PK6K8mOmJ8m4L7k6qj9L3L8o0%K3k6K5k8
$$ -37 -21 -45 26 -17 -97 -8 2 -25 -13 -9 40 -23 -16 -41 -34 -8 20 16 22 18 36 -8 29 3 -5 -24 9 47 -13 -13 10 -16 9 -19
7154a9J7n4K2N1l1m3R3j6q0L1P0q5JL0k4L6L6m9L3oo5jQ3k9j1j8oQ0p2M7k1J0
$$ -19 -2 -56 -34 17 -14 -57 36 20 -60 -29 41 -44 -43 -13 -37 -1 35 -14 19 13 -52 -53 30 1 -10 -28 -34 46 -26 21 0 10
7186A0J8j2r5P3Rk7KknL3k1k3L4%J7j6J5j1nPk4KM0k7O9q6J1O2p0k3M1J1Nm9P9
$$ 10 28 16 -79 -6 3 -24 -22 -24 -29 4 -17 -40 -6 -6 11 -5 10 -1 -6 1 -23 -21 19 -8 61 -25 -14 48 -22 -45 -4 7 12 -37 42
7221D2n7K2Lm3M1p5M3M9j7n2O8j9NJ3Lo0L7j9P1j6p7M7mJ2j1Oj5J9m1L4nn0J5
$$ 42 -15 7 10 -33 8 -67 -24 25 8 -44 24 5 10 23 26 -34 3 -16 55 39 -38 9 5 17 6 12 -3 16 -25 9 4 -46 -31
7254c1O8m7l1M2k3J8J5k0k6K1L0Jn5K2J6J1k8J2K0m1L4n2M8k4k2O9p0M3k3k2P8
$$ -31 37 -10 -41 1 -22 -4 11 -9 -35 -14 16 17 -38 -16 0 11 -17 -5 15 -26 8 -44 4 -20 -42 27 -43 0 -23 -45 33
7285C3l3M2k5KL9o4K6mK7k2m6L7l4J6M4N0p4J8n1K7J1L4j5p1pN5j4K2n7K4M7r9
$$ 33 0 42 17 19 58 -6 20 16 43 21 -25 12 -22 -6 38 88 14 32 -19 8 19 53 38 -33 -40 15 1 23 -34 -10 37 -62
7317f2O9M5q0J6J7J3n0M7rl1K2l6J6M2k3OKK0knK2mk0K2j7M1l6l5k4m4r5R2m3
$$ -62 7 52 -28 -12 5 18 -32 15 6 -25 -3 -39 -23 19 -4 2 4 24 22 17 39 35 15 37 20 61 25 -10 -34 -78 -173 -81 -124
7350a24J7J02j7K04k0m29K07l6O1O1l5K2Jk8o0Q1j1N3J1Rr4J8l4Q2o0OmM0J7m
$$ -124 -107 -5 -22 182 162 -267 -60 -96 -35 26 -9 13 14 -14 -74 7 -4 49 60 69 -25 -7 -41 41 -19 -13 -17 23 40 36
7380C6r0P2L9n1n2N6jj0PPl4J6Rk6K7j1L7ol1K0j8M3n2k6R5rp3J0j0L5lK7qp5
$$ 36 -54 18 57 6 -46 10 9 -1 6 13 -21 -5 4 -22 5 -6 31 25 -6 14 -4 39 -13 -39 56 47 -26 -16 -26 9 6 33 25 -50
7414e0M4J7jJ0N1p4KJPq1J16p8JL1L2j3k2l1J0QK4j9k0jL6n2Q4k2n6L3K6lk2M2
$$ -50 -6 11 10 20 71 -3 -1 0 7 -74 42 -36 -35 -4 28 15 -7 -38 -28 -20 4 -15 -35 -36 0 -52 32 10 -46 -13 13 10 -12 30
7448C0o2P9j2j3l7%k3Q2m9k2L0q2O1J8j0j9K3K5j8Qn4M4o0Q2o2L9Pj0N7k9l5J8
$$ 30 -32 47 35 22 -15 -15 -38 44 -5 -27 3 -79 -18 0 -10 -29 -6 19 1 9 -45 -1 -61 21 -41 -2 5 -5 52 23 -12 6
7480Fn1PnK9k2L6K3%k0M3o0J8J1pK0j8Jj3Qk2PoM8J5p2M9m6J4K1j8kJ7l8Q7p4
$$ 6 -45 -38 -43 -14 -36 0 23 23 3 46 -14 4 15 8 28 10 11 -2 6 -16 -9 -15 33 48 -24 25 -21 -7 14 -4 -6 11 -27 60 -14
7515a4J6k0Pj6J4m6Q8m6J9L6k9o6M3K4l8RJN0k0rk2K9l1N3j4n5j3K4M0J3o0J7
$$ -14 2 -18 -11 -27 -13 -59 29 -17 2 38 9 -57 -14 10 -28 -19 -18 32 12 3 -19 10 -21 32 18 -37 -50 -26 14 27 -33 -16
7547a6L3L4p5mk7J4K0K1K0m7J4k3L8oL8Pok4p5Q9k0j1K4L9k9l0MqL1o2Q2o1M0
$$ -16 17 51 -24 -28 -55 -41 -21 0 20 -27 -13 -36 2 -4 34 41 35 11 -64 25 5 -6 18 57 28 -2 2 -6 25 -37 45 -16 24
7580B4j2n2%P3j2p2K5J4kL1nn6L4j4j3J9l7P9m8l3P0K3mj6pn0k4N4J1l2L9L5K9
$$ 24 12 -40 -40 33 21 -51 -26 -12 -14 17 12 -44 -10 -24 -37 -18 -55 24 -24 -57 13 36 32 16 9 -41 -65 -11 0 -32 7 42 71
7613G1q5K9Qr4Q8k5J8n7O1Lp3J7J6Jn3L7JL7J1n7ML0mJ3l8O6%M1o9j6rM8k2k2
$$ 71 -14 15 23 -71 17 -8 10 -47 14 17 -56 -39 -23 -22 -75 -38 -37 0 11 -46 -42 -12 -16 -3 -41 25 25 66 -3 -19 -28 20 -2 -24
$$ [...]
8191b6
##END NTUPLES=NMR FID
##END=
