##TITLE=1H_Pr 5021-mat
 CDCl3,8 sc, 
 12.03.2021
##JCAMPDX= 6.0         $$ Bruker NMR JCAMP-DX V2.0
##DATA TYPE= NMR FID
##DATA CLASS= NTUPLES
##ORIGIN= UXNMR, Bruker Analytische Messtechnik GmbH
##OWNER= root
$$ XWIN-NMR		Version 3.5
$$ Fri Mar 12 13:23:22 2021 Russian Standard Time (UT+4h)  she@DPX200
##.OBSERVE FREQUENCY= 200.131506
##.OBSERVE NUCLEUS= ^1H
##.DELAY= (6, 6)
##.ACQUISITION MODE= SIMULTANEOUS
##.ACQUISITION SCHEME= undefined
##.AVERAGES= 8
##.DIGITISER RES= 18
##SPECTROMETER/DATA SYSTEM= spect
##.PULSE SEQUENCE= zg30
##.SOLVENT NAME= CDCl3
##.SHIFT REFERENCE= (INTERNAL, CDCl3, 0, 15.7039)
##AUDIT TRAIL= $$ (NUMBER, WHEN, WHO, WHERE, WHAT)
$$ ##TITLE= Audit trail, XWIN-NMR		Version 3.5
$$ ##JCAMPDX= 5.01
$$ ##ORIGIN= Bruker BioSpin GmbH
$$ ##OWNER= she
$$ F:/spectra/data/she/nmr/H-F/1/audita.txt
$$ ##AUDIT TRAIL=  $$ (NUMBER, WHEN, WHO, WHERE, WHAT)
(   1,<2021-03-12 13:22:18.31 +0400>,<she>,<DPX200>,
      <created by zg, POWCHK disabled, PULCHK disabled
       configuration hash MD5:
       00 E9 B6 7A A2 85 ED C7 34 08 36 98 17 FE 4E 26
       data hash MD5: 16K
       9A EB 75 30 58 93 8A 45 F7 83 76 C2 2F 9F EC 0D>)
$$ ##END=
$$ 
$$ hash MD5
$$ 6F 6B 80 5F 43 D9 05 46 E7 4F 10 8A F2 2B 33 3C
##$RELAX= 
##$RELAX= 
##$RELAX= 
##$RELAX= 
##$RELAX= 
##$RELAX= 
$$ Bruker specific parameters
$$ --------------------------
##$DU= <F:/spectra>
##$EXPNO= 1
##$NAME= <H-F>
##$PROCNO= 1
##$TYPE= <nmr>
##$USER= <she>
##$AMP= (0..31)
100 100 100 100 100 100 100 100 100 100 100 100 100 100 100 100 100 100 
100 100 100 100 100 100 100 100 100 100 100 100 100 100 
##$AQSEQ= 0
##$AQ_mod= 1
##$AUNM= <au_zg>
##$AUTOPOS= <>
##$BF1= 200.13
##$BF2= 200.13
##$BF3= 200.13
##$BF4= 200.13
##$BF5= 200.13
##$BF6= 200.13
##$BF7= 200.13
##$BF8= 200.13
##$BYTORDA= 1
##$CFDGTYP= 0
##$CFRGTYP= 5
##$CHEMSTR= <none>
##$CNST= (0..31)
1 1 145 1 1 1 1 1 1 1 1 1 1 1 1 1 1 1 1 1 1 1 1 1 1 1 1 1 1 1 1 1 
##$CPDPRG= <>
##$CPDPRG1= <>
##$CPDPRG2= <>
##$CPDPRG3= <>
##$CPDPRG4= <mlev>
##$CPDPRG5= <mlev>
##$CPDPRG6= <mlev>
##$CPDPRG7= <mlev>
##$CPDPRG8= <mlev>
##$CPDPRGB= <>
##$CPDPRGT= <>
##$D= (0..31)
0 1.2 0 0 0 0 0 0 0 0.06 0 0.03 0 0 0 0 0.0002 0 0 0 0 0 0 0 0 0 0 0 0 
0 0 0 
##$DATE= 1615540937
##$DBL= (0..7)
120 120 120 120 120 120 120 120 
##$DBP= (0..7)
150 150 150 150 150 150 150 150 
##$DBP07= 0
##$DBPNAM0= <>
##$DBPNAM1= <>
##$DBPNAM2= <>
##$DBPNAM3= <>
##$DBPNAM4= <>
##$DBPNAM5= <>
##$DBPNAM6= <>
##$DBPNAM7= <>
##$DBPOAL= (0..7)
0.5 0.5 0.5 0.5 0.5 0.5 0.5 0.5 
##$DBPOFFS= (0..7)
0 0 0 0 0 0 0 0 
##$DE= 6
##$DECBNUC= <off>
##$DECIM= 32
##$DECNUC= <off>
##$DECSTAT= 4
##$DIGMOD= 1
##$DIGTYP= 9
##$DL= (0..7)
0 120 120 120 120 120 120 120 
##$DP= (0..7)
150 150 150 150 150 150 150 150 
##$DP07= 0
##$DPNAME0= <>
##$DPNAME1= <>
##$DPNAME2= <>
##$DPNAME3= <>
##$DPNAME4= <>
##$DPNAME5= <>
##$DPNAME6= <>
##$DPNAME7= <>
##$DPOAL= (0..7)
0.5 0.5 0.5 0.5 0.5 0.5 0.5 0.5 
##$DPOFFS= (0..7)
0 0 0 0 0 0 0 0 
##$DQDMODE= 0
##$DR= 18
##$DS= 0
##$DSLIST= <SSSSSSSSSSSSSSS>
$$ [...]
##$SUBNAM2= <"">
##$SUBNAM3= <"">
##$SUBNAM4= <"">
##$SUBNAM5= <"">
##$SUBNAM6= <"">
##$SUBNAM7= <"">
##$SUBNAM8= <"">
##$SUBNAM9= <"">
##$SW= 16.9725357007746
##$SWIBOX= (0..15)
0 0 2 0 0 0 0 0 0 0 0 0 0 0 0 0 
##$SW_h= 3396.73913043478
##$TD= 16384
##$TD0= 1
##$TE= 0
##$TE2= 300
##$TE3= 300
##$TEG= 300
##$TL= (0..7)
0 120 120 120 120 120 120 120 
##$TP= (0..7)
150 150 150 150 150 150 150 150 
##$TP07= 0
##$TPNAME0= <>
##$TPNAME1= <>
##$TPNAME2= <>
##$TPNAME3= <>
##$TPNAME4= <>
##$TPNAME5= <>
##$TPNAME6= <>
##$TPNAME7= <>
##$TPOAL= (0..7)
0.5 0.5 0.5 0.5 0.5 0.5 0.5 0.5 
##$TPOFFS= (0..7)
0 0 0 0 0 0 0 0 
##$TUNHIN= 0
##$TUNHOUT= 0
##$TUNXOUT= 0
##$USERA1= <user>
##$USERA2= <user>
##$USERA3= <user>
##$USERA4= <user>
##$USERA5= <user>
##$V9= 5
##$VALIST= <valist>
##$VCLIST= <CCCCCCCCCCCCCCC>
##$VD= 0
##$VDLIST= <DDDDDDDDDDDDDDD>
##$VPLIST= <PPPPPPPPPPPPPPP>
##$VTLIST= <TTTTTTTTTTTTTTT>
##$WBST= 1024
##$WBSW= 4
##$XGAIN= (0..3)
0 0 0 0 
##$XL= 0
##$YL= 0
##$YMAX_a= 437592
##$YMIN_a= -545931
##$ZGOPTNS= <>
##$ZL1= 120
##$ZL2= 120
##$ZL3= 120
##$ZL4= 120
##$ABSF1= 10
##$ABSF2= 0
##$ABSG= 5
##$ABSL= 3
##$ALPHA= 0
##$AQORDER= 0
##$ASSFAC= 0
##$ASSFACI= 0
##$ASSFACX= 0
##$ASSWID= 0
##$AUNMP= <proc_1d>
##$AZFE= 0.1
##$AZFW= 0.1
##$BCFW= 1
##$BC_mod= 2
##$BYTORDP= 1
##$COROFFS= 0
##$CY= 11.3945322036743
##$DATMOD= 1
##$DC= 2
##$DFILT= <>
##$DTYPP= 0
##$F1P= 15.9154993809931
##$F2P= -4.1035820241983
##$FCOR= 0.5
##$FTSIZE= 0
##$FT_mod= 4
##$GAMMA= 1
##$GB= 0.15
##$INTBC= 1
##$INTSCL= 1
##$ISEN= 128
##$LB= 0.24
##$LEV0= 0
##$LPBIN= 0
##$MAXI= 10000
##$MC2= 0
##$MEAN= 0
##$ME_mod= 0
##$MI= 1.114404
##$NCOEF= 0
##$NC_proc= 0
##$NLEV= 6
##$NOISF1= 3.799351
##$NOISF2= 2.8
##$NSP= 1
##$NTH_PI= 0
##$NZP= 0
##$OFFSET= 15.70392
##$PC= 1
##$PHC0= -11276.19
##$PHC1= 10.20094
##$PH_mod= 1
##$PKNL= yes
##$PPARMOD= 0
##$PSCAL= 0
##$PSIGN= 0
##$REVERSE= no
##$SF= 200.130013532006
##$SI= 16384
##$SIGF1= 3
##$SIGF2= 2
##$SINO= 400
##$SIOLD= 16384
##$SREGLST= <1H.CDCl3>
##$SSB= 0
##$STSI= 0
##$STSR= 0
##$SW_p= 3612.71676300578
##$SYMM= 0
##$S_DEV= 0
##$TDeff= 0
##$TDoff= 0
##$TI= <>
##$TILT= no
##$TM1= 0
##$TM2= 0
##$TOPLEV= 0
##$USERP1= <user>
##$USERP2= <user>
##$USERP3= <user>
##$USERP4= <user>
##$USERP5= <user>
##$WDW= 1
##$XDIM= 8192
##$YMAX_p= 0
##$YMIN_p= 0
$$ End of Bruker specific parameters
$$ ---------------------------------
##NTUPLES= NMR FID
##VAR_NAME=  TIME,          FID/REAL,        FID/IMAG
##SYMBOL=    X,             R,               I
##VAR_TYPE=  INDEPENDENT,   DEPENDENT,       DEPENDENT
##VAR_FORM=  AFFN,          ASDF,            ASDF
##VAR_DIM=   8192,          8192,            8192
##UNITS=     SECONDS,       ARBITRARY UNITS, ARBITRARY UNITS
##FACTOR=    0.0002944,     1,               1
##FIRST=     0,             0,               0
##LAST=      2.4114304,     0,               0
##MIN=       0,             -545931,         0
##MAX=       2.4114304,     437592,          0
$$ Real data points
##PAGE= N=1
##DATA TABLE= (X++(R..R)), XYDATA
$$ [...]
1316b771J281L813k385l097L620K011m043o40M302o25l984K050L358k849k270
1331b229L477J302l529n03L882n52l720J732L342k728k483L489J467m136j9M042
1347B834j266l685K427K797l225j644L285P78l655K00L353j032l320J921K742
1362B510k927k095L755Q84m424O90L877k026l050K883J772l227p41K954J03l079
1378b141N10L113j465k797K356K361l390j261L957l12l682J628K981k373j926
1393b441K796J114k748m53K955o6k919R46K932j831k260K602J761l360l18L561
1409B271q84l171J858K510k588j350K736O58k734m5K747n12k635J067K682k241
1425C69k095L123J007l694K36L526j717k775K491J557k627r05K430M04k673J70
$$ plain form
1316 -2771 -1490 2323 -62 -3159 461 2472 -1571 -2211 2091 1466 -2518 -468 2890 41 -2229
1331 -2229 1248 2550 -979 -1482 2400 1848 -1872 -140 3202 474 -2009 1480 2947 -1189 -1208 2834
1347 2834 1568 -2117 310 3107 -118 -1762 1523 2301 -1354 -1154 2199 1167 -2153 -232 2510
1362 2510 -417 -2512 1243 2127 -2297 -1607 2270 244 -2806 77 1849 -1378 -2119 835 938 -2141
1378 -2141 -1631 1482 17 -2780 -424 1937 -1453 -2714 1243 931 -2751 -1123 1858 -515 -2441
1393 -2441 355 1469 -1279 -1732 1223 1157 -1762 -816 2116 285 -1975 627 2388 -972 -1290 2271
1409 2271 1387 -1784 74 2584 -4 -1354 1382 2040 -694 -739 2008 1496 -1139 -72 2610 369
1425 369 -1726 1397 2404 -1290 -1054 2472 755 -2020 471 2028 -599 -1504 926 1330 -1343 -1173
1441a173K777r64k805J831K225k839j321L299J40l441J070K884k068j986K408
1456C7J168k612n07K696k15k438N83K617j417k317K290J774k934o84L311m37l026
1473b111J576K387k053j493K359Q60k352k00K413j49k648J070K465j656j939K428
1489I57J204k949K7K924j087k486J726J846j920j381K238P44k528j43K564o19
1505A117k562J566J977k262j470K598N19k942N92K452j205k165J689J527k128
1520f97r57K289K39k457M63K456j238k097J630J707k283j068K694N2k625R95K069
1537A172j461j650J866J205k198n63K388o4k289P90K177j375j772K060J259k414
1553h69l56K487m18k150J163J830j500j435J970R12k218j93K336m85k180J182
$$ plain form
1441 -1173 1604 640 -2165 -334 1891 -948 -2269 1030 1170 -2271 -1201 1683 -385 -2371 37
1456 37 1205 -1407 -1914 782 567 -1871 -1288 1329 -88 -2405 -115 1659 -1275 -1959 1352 915 -2111
1473 -2111 -535 1852 -201 -1694 665 1525 -827 -1027 1386 1237 -1411 -341 2124 468 -1471 957
1489 957 2161 -788 -761 2163 1076 -1410 316 2162 242 -1139 1099 1843 -685 -828 1736 1117
1505 1117 -1445 121 2098 -164 -1634 964 1483 -1459 -867 1585 380 -1785 -96 1431 -697
1520 -697 -1654 635 874 -1583 -1120 1336 98 -1999 -369 1338 -945 -2013 681 733 -1892 -897 1172
1537 1172 -289 -1939 -73 1132 -1066 -1629 759 695 -1594 -804 1373 -2 -1774 286 1545 -869
1553 -869 -1225 1262 844 -1306 -143 1687 187 -1248 722 1634 -584 -777 1559 1074 -1106 76
1569G6J939j831j222K185M55k264Q6K255q50j959J131J688j738j220K152M52k187
1586h52J21K097q59j945J311J544j877j001K123K23k169K86K106j047j700J477
1602a62J164j730o63J837J08j964L93K027j097j744J729J127j995m83K214k39
1618E22j842N83J804j183j353J610J073j929n47K255j40k016R44J589j319j102
1634a051J597Q17j843r9J798k83j832R03J539j320j180J871M75j939O2J731l99
1651H47j618Q28J430j354j176J796N06j895N9J867q02j583J119J145j453q41J670
1668E45M42k032J87J830p45j667J376R22j523o63J708K01j788L77J602q68j389
1685a485J280J011j621m75J861j43j772O75J538j035j027J298P36j503m20J878
$$ plain form
1569 76 2015 184 -1038 1147 1602 -662 -576 1679 829 -1130 1 1689 -49 -1269 883 1335 -852
1586 -852 -731 1366 507 -1438 -127 1417 -460 -1461 662 885 -1284 -998 1108 61 -1639 -162
1602 -162 1002 -728 -1391 446 554 -1410 -1017 1010 -87 -1831 -102 1025 -970 -1453 761 522
1618 522 -1320 -737 1067 -116 -1469 141 1214 -715 -1262 993 853 -1163 -219 1370 51 -1051
1634 -1051 546 1363 -480 -579 1219 936 -896 7 1546 226 -954 917 1392 -547 -485 1246 847
1651 847 -771 57 1487 133 -1043 753 1259 -636 -577 1290 488 -1095 24 1169 -284 -1125 545
1668 545 987 -1045 -858 972 227 -1440 -64 858 -665 -1328 380 581 -1207 -830 772 -96 -1485
1685 -1485 -205 806 -815 -1290 571 428 -1344 -669 869 -166 -1193 105 841 -662 -1082 796
1701G96l00j570P08J595j151j153J485P84j607j42J661l59j533P97J314j142q85
1718g02J265N94j510%J528k83j606P69J460j402r01J525L37j588N7J557n99j356
1736h55R82J066j335q70J466L61j669J69J569p56j232J030Q85j368n88J527K53
1753F35j818L97J598j039j126J322P22j508k13J389j62j172K82J250n98j243J244
1770d0Q69j534l00J709k55j366O92J130r12q38J061O44j158l68J544m4j577O12
1788a31J307j059q14J256M24j331NJ375l67j352P89J178j211q16J453L22j477
1805d49J94J139m68j213P94R58j009p31J207N05j633J43J465q32j148J047P62
1822G31j258m49J358l6j185K80J072n63j031Q72Q22j235n33J528n7j328L45J301
$$ plain form
1701 796 496 -1074 -366 1229 78 -1075 410 1194 -413 -555 1106 747 -786 11 1325 183 -702
1718 -702 563 1157 -353 -353 1175 892 -714 55 1515 113 -788 737 1074 -514 -457 1100 501 -855
1736 -855 127 1193 -142 -1012 454 815 -854 -685 884 128 -1104 -74 811 -557 -1145 382 635
1753 635 -1183 -786 812 -227 -1353 -31 691 -817 -1030 359 197 -975 -693 557 -41 -1284 -40
1770 -40 829 -705 -1005 704 449 -917 -225 905 -7 -845 216 860 -298 -666 878 834 -743 -131
1788 -131 1176 117 -697 559 983 -348 -343 1032 665 -687 102 1280 69 -747 706 1028 -449
1805 -449 -255 884 416 -797 -3 955 -54 -785 422 927 -706 -563 902 70 -1078 -31 731
1822 731 -527 -976 382 346 -839 -559 513 -50 -1081 -209 613 -622 -1155 373 316 -1012 -667 634
1840F34r46q18J148M91j168r3J281k07j085M29J062o98q48R64P00j212k10J401
1858H25l80j268Q32R69r55o86J173K62r60o6J043j37j052N78Q36q59p57J138M61
1877I97j287l5J359n01j153P74Q32j167l97J158Q8j134R3J012l86j032P71P32
1895G24j069n52J247J16j334L59J066o28r36R92N93j253j44J045kj057L27R54
1913D48o24q09R07P62j285k51J291n8j163M93Q43o80p25J144K24q57r5J003j15
1932D53r76M16R33o69q22J050M84j177r9J251l22j069O86R10j064n00J078J54
1950G17r90L2J065l59r68O31P71r28o16J168J97j218K25J067o49q76R15M33r26
1969c09l08J038rr90J56R60n73q38P38O13j018n21J229J20j074K09R41o50o40
$$ plain form
1840 634 -312 -1130 18 509 -659 -752 529 322 -763 -334 728 30 -818 146 846 -366 -576 825
1858 825 445 -823 9 978 23 -663 510 772 -188 -254 789 652 -400 178 1014 155 -602 536 997
1877 997 -290 -325 1034 533 -620 154 986 -181 -578 580 668 -466 -373 639 253 -779 -8 724
1895 724 -345 -897 350 466 -868 -509 557 -71 -1007 -15 578 -675 -819 226 224 -833 -506 448
1913 448 -176 -985 -78 684 -601 -852 439 381 -782 -289 554 -126 -851 293 517 -340 -435 568 453
1932 453 -523 -107 826 157 -665 385 869 -308 -407 844 522 -547 139 1049 -15 -515 563 717
1950 717 -273 -241 824 465 -503 128 899 -29 -645 523 720 -498 -273 794 145 -731 184 617 -309
1969 -309 -617 421 412 -578 -422 538 -35 -873 -135 478 -540 -1061 168 288 -786 -577 364 -286 -926
1988i26Q42N10r26j85R87j84q25L60Q74m40q39Q39N35r37k83J132q6j108N54R01
2008G95q13n17J003J84j030Q6R78k88p97M22R27p67o27R69K35j055J35R85l65
2027D60r25P21N11o91m83R22J20r58J30Q59m73p84N56O95q12m40R38J95j107K78
2047b88P66m08q89Q38N11j011j40Q25r0q32L06P07m55p13Q07M84q77k51J005j37
2067A58r44M19R46o88o85Q21N48j014n2Q79j00r05M56Q54p10o08Q16M82q80j96
2087d03R95r6r03N38O17p26l57Q97O4q68O5Q99l18p86N02O52p57m44Q77J69r62
2108c45K27Q17l99p62N81N07p34l98R49r0q22J67Q06l92p91O00N98q27l36R84
2128C40m4q91K40P11m07p39O97N38r41k14R07j31p66K91Q85n89n89O50L75o90
$$ plain form
1988 -926 -84 426 -500 -685 302 118 -707 -347 527 87 -752 87 622 -315 -598 534 448 -660 -106 795
2008 795 -18 -535 468 652 -378 -292 686 398 -399 23 950 183 -444 525 760 -295 -160 825 460
2027 460 -465 256 767 76 -407 515 635 -323 -193 666 193 -591 -35 660 -152 -592 346 541 -566 -288
2047 -288 478 70 -819 19 530 -481 -621 204 114 -718 -412 295 -160 -873 -66 418 -459 -710 295 158
2067 158 -786 -367 579 -109 -794 27 575 -439 -491 388 288 -617 -161 693 -17 -625 191 673 -207 -403
2087 -403 592 496 -407 131 748 22 -335 562 626 -242 -177 722 404 -382 120 772 15 -429 448 617 -345
2108 -345 -118 699 300 -462 119 626 -108 -506 443 353 -469 -302 504 112 -679 -79 519 -308 -644 340
2128 340 296 -595 -355 356 -51 -790 -93 445 -496 -710 197 66 -700 -409 476 -113 -702 -52 323 -367
2148c67k55R54j37r27N54P92p39m44R13K56q39j41J013k61p99N13O33o26m74P92
2168D11J85p82J23P60l49o49M50N15n87m24P18K08p76n9R79m94o96O58M56q11
2188a64j61O46O8q17J62P75l78o44M41M38p31j99Q70N8j022K23P67m51o38O72
2208h5M74q95j25Q66p8q45L66P09n58m86N25M22o34k46Q83r1q65M60P31o86l80
2229e38P11K33p55Q2P70l19o28M72N15l35n30O83K30p22m7Q16k48o77M75N26o21
2250I3l47P61Mp10J02P24k97p13M78M68o16k99O69Q2q18J54Q36l63p10N39M44
2271D81o96k87Q26j38p11L01N97m70n10M13N37o52l56Q53k7q49K87P55o05m25
2291f76O45K46o30k02Q36k37n10K76N35l89m76O47L44p36Q0O86j88p11M45M98
$$ plain form
2148 -367 -622 332 195 -732 -178 614 -125 -569 344 600 -239 -380 633 372 -427 86 719 93 -381 411
2168 411 596 -186 -63 697 348 -301 149 664 77 -347 371 579 -197 -256 723 229 -467 191 647 -164
2188 -164 -325 321 389 -428 -266 509 131 -513 -72 366 -365 -564 306 364 -658 -435 332 -119 -757 -85
2208 -85 389 -506 -631 235 157 -688 -322 387 -171 -657 -132 290 -344 -590 293 202 -663 -203 528 -158 -538
2229 -538 173 406 -349 -267 503 184 -444 28 543 208 -322 361 591 -131 -178 638 390 -287 188 714 93
2250 93 -254 507 511 -199 -97 627 330 -383 95 563 -53 -352 317 399 -419 -265 571 208 -502 37 481
2271 481 -215 -502 324 186 -525 -224 373 -97 -607 -194 343 -309 -665 188 161 -688 -401 354 -251 -676
2291 -676 -31 215 -415 -617 219 -18 -528 -252 283 -106 -582 65 409 -327 -247 439 251 -460 -15 483
2311D83m88l96P00K60p16M7O45k47m73L51M95o45k78N98J94o92l5Q75k99p24M43
2332I8N45o52k43O64N5p27P0Q04n11n18M56L04n34k73O76k5o58K52N45m03n12
2353e87N07L92o79l01Q07l3o16K54N79m52m93N80K54m14k82N38M1o25K94O14m30
2374e2m69N37L18n85j28O63j21m53J34N25m15k40O25J90o96m9O64j71o12L52N17
2395E34n05m03Q08R7p41L6P40k48n60L74L66m01l46N85J30o13m1O72k60n75L61
2416A0N19o00k37O57j5q46L04M99k98n40M71L70n26l01O02R4n89Q7O47m20n36
2437f48N40M60p70j18P57j42o91L38N53l96m17N23K89o12k1N81Mn23J14N78l51
2458D8l80O04J67o01j48P47j82m76K60M43m88k32N68J19n30LN79j97m91K59O54
$$ plain form
2311 483 -5 -401 299 559 -157 -110 535 288 -185 166 661 16 -262 336 530 -162 -197 678 379 -345 98
2332 98 643 -9 -252 412 467 -260 -190 614 103 -415 41 345 -189 -462 214 189 -469 -217 328 -75 -587
2353 -587 -80 312 -367 -668 139 106 -510 -256 323 -129 -622 -42 212 -202 -484 54 95 -530 -236 378 -52
2374 -52 -521 16 334 -251 -379 284 163 -290 -156 369 -46 -286 339 529 -167 -216 448 277 -335 17 534
2395 534 29 -374 434 531 -210 -174 566 318 -242 132 498 97 -249 336 466 -147 -188 484 224 -351 10
2416 10 529 -71 -308 349 334 -512 -208 291 -7 -547 -76 294 -232 -533 69 163 -426 -339 308 -112 -648
2437 -648 -108 352 -418 -536 221 79 -612 -274 279 -117 -534 -11 278 -334 -355 226 230 -293 -179 399 48
2458 48 -332 272 439 -162 -310 437 255 -221 39 482 -6 -238 330 449 -81 -78 501 304 -187 72 726
2479G26o01l01N08J48o28J09O24l65m83M12L00n10l12O41M1n93K2N93k95m12L14
2500f2L63n12k71P97j14p40K44N00l78m38M78L00m11k62O04o7m16P8M90k34n15
2521e66M36L52n22j88P45l7o19K37N11l94l10M43K66m80n0N16j39m93K82M78m85
2542a7k55N01K89o48Q7N30j55o58M37L56l66k59M65J57m63k8M72j67n20K84M46
2563D88m58k98M79J44n32RN67l73m04M15K42m67j98N05J1n81K30L96k39m60M08
2584a16K60m65r9N46rn73L4N07j69l85L80J97m55p7N07J23n85K60L93k60m34M50
2606C0K54m40q8N22r0m92K90L74k39m33N75J44n09p5N18j15m01J97M63l35k53
2627a03M34K10o08L5N41k05n14L59K84l59k21L91J50n55Q8M42k77l88K67L75l83
$$ plain form
2479 726 125 -176 332 480 -148 -39 585 220 -263 149 449 -61 -373 268 309 -284 -262 331 36 -376 -62
2500 -62 301 -211 -482 315 201 -539 -295 205 -173 -611 -133 167 -244 -506 98 31 -385 -307 183 -51 -566
2521 -566 -130 222 -300 -488 257 220 -399 -162 349 -45 -355 88 354 -126 -176 340 201 -292 -10 468 -17
2542 -17 -272 229 518 -130 -43 487 332 -326 111 467 101 -158 307 464 1 -27 445 278 -242 42 488
2563 488 30 -268 211 355 -177 -168 399 26 -378 37 279 -188 -386 119 130 -451 -221 175 -64 -524 -116
2584 -116 144 -321 -420 126 117 -456 -422 85 -84 -469 -89 108 -347 -424 83 206 -379 -119 274 14 -420 30
2606 30 284 -156 -244 278 188 -304 -14 360 121 -312 263 407 -102 -177 341 226 -175 22 485 150 -103
2627 -103 331 541 -67 -32 509 304 -210 149 433 74 -147 244 394 -161 -73 369 92 -296 -29 346 -37
2648c7k28M43L1m62l6M70j9n52L29K20m35q9M31P0o32K49M58k28m10K76K94l12
2670a69l31O10n3m20J34M43l16k81M52J40l48j86M62L3m24K05M14k95l29M89J03
2691C33m80l4M96j15l66J66M51l71k93M77K43o28M4N01j37m51J92L66l37j62K58
2712A53M1k14q0L71o5m03K59K68m68q5K99J05l43O1L56j67m15K57K48l12j96L43
2734A3R0l53r0M11o4m08L07J04k93p9M38p6l79M8N07l10k35L33J90l04j68M34
2756A16M7l85J78M01k72l44L62J54l35r7M67q9l88K01K81k08k88L38J29l30l1
2777i3N04j24m33K33L75l44l05L50J52l53K4K91j75l11K09K41k72j26K24J39k26
2798b0p1M12k39l63L21K69m19j38K99L9l76J19K86j83k50J36K74l55k6K26N7k65
$$ plain form
2648 -37 -265 178 209 -253 -289 181 162 -390 -61 159 -276 -365 66 136 -496 -247 211 -17 -427 -151 143 -169
2670 -169 -500 110 57 -363 -229 214 -102 -383 69 209 -139 -325 137 170 -254 -49 365 70 -259 230 333
2691 333 -147 -181 315 200 -166 0 451 80 -213 264 507 -121 -77 424 287 -164 28 394 57 -105 153
2712 153 194 -20 -100 271 206 -197 62 330 -138 -223 76 181 -162 -101 255 88 -327 -70 178 -134 -330 13
2734 13 103 -250 -340 71 7 -401 -94 10 -283 -362 76 0 -379 -331 176 -134 -369 -36 154 -150 -318 116
2756 116 163 -222 -44 357 85 -259 103 257 -78 -175 292 203 -185 16 297 89 -199 139 268 -62 -93
2777 -93 411 287 -146 87 462 118 -187 163 315 -38 -14 277 102 -209 0 241 -31 -157 67 206 -20
2798 -20 -91 321 82 -281 40 309 -110 -248 51 90 -286 -167 119 -64 -314 -178 96 -259 -285 -59 -2 -267
2820b67J39K08j60k45K13K62l23j48M44q4k66P1K73k18k35L67K03l61J6L37m6
2841A80l38J77K20k22j11K10K26l71l7L12n3k95K62J95l40j65K74J97l93R1K09
2862B28m9k78J74J94k70r5K71N5l74p2M58r5m32K61K46k99q8K47Pk98J14J65n2
2885A8l46K22L14l37j65K74L3l16J78K46j77l63L27J06j67PJ72Q5m40K11K23k07
2907a02j20J90K20j90j65K97J04l19P7K66k41j70K03J18j77l0K62j8l00K54J12
2928B71k59j22K80J14k88p9M03k07j27J91R9j70j96K22L6k17o0L00j78j97K04
2949B0K01k32k10K45J27l90O2L93k00k59J96K37k84j81L90q0k70Q3L10k55k40
2970c37L10J53l06j10M10j6l59R1K71j47k06K50J19k53j08L98j14j91J06K64j52
$$ plain form
2820 -267 -128 80 -80 -325 -112 150 -173 -321 123 39 -227 -156 117 -101 -336 31 234 -127 -111 226 180
2841 180 -158 19 239 17 -94 116 342 -29 -66 246 193 -102 160 355 15 -150 124 321 -72 19 228
2862 228 179 -99 75 269 -1 -96 175 230 -144 -216 242 147 -285 -24 222 -77 -165 82 89 -209 -95 70 18
2885 18 -328 -106 208 -129 -294 -20 13 -303 -125 121 -56 -419 -92 14 -153 -146 26 111 -329 -118 105 -102
2907 -102 -222 -32 188 -2 -167 130 234 -85 -8 258 17 -153 50 168 -9 -39 223 205 -95 159 271
2928 271 12 -110 170 284 -4 -83 320 113 -14 177 276 106 -90 132 168 -49 -109 191 13 -184 20
2949 20 221 -11 -221 24 151 -239 -177 216 16 -243 -47 190 -94 -275 115 35 -235 -152 158 -97 -337
2970 -337 -27 126 -180 -290 120 104 -255 -164 107 -40 -246 4 123 -130 -238 160 46 -145 -39 225 73
2991G3k76K97J31j86j87M25r2k37J04K35j86k53L49N1k68M4K15ql26K02J00j34
3013G3j67K80Mj63r6L30k08k39J88J85j52l85M60o5j25r6L72k14j54J03J56j92
3035a05k40M44o7k92J12K88k10j93J59K16l45j8L52n2j64j22K67p6j55J50K25
3056A74k41j94L85M4k95K0L23j53k22K06Q6k16nJ99J14l40Q7K39j27j11J96J8
3078A87j55j27K71m4j94J61J36j55j27K48K1k82Q3K11k41j94K28J79j70j35J46
3099D7M7j64q3K30pk99K62J78l03j90L18Kk03O8J56j09k05K03Q9k86L7K37L7l32
3123b70J53K34j97j09J90rp8j21K66M5k24j0K50r5k20J95J86l38K0K47Qk26J05
3146BK31k23r0K02N3j20J4J46n2l19J80K64k07j91K41O5k02m8K04P3l06P3J01
$$ plain form
2991 73 -203 94 225 39 -148 277 185 -52 52 287 101 -152 197 248 -20 24 239 231 -95 107 207 73
3013 73 -94 186 190 27 -69 261 53 -186 2 187 35 -350 110 45 -80 -176 196 -18 -172 -69 87 -105
3035 -105 -345 99 32 -260 -148 140 -70 -263 -104 112 -233 -251 101 49 -115 -237 30 -46 -201 -51 174
3056 174 -67 -261 124 168 -127 -107 216 63 -159 47 133 -83 -88 111 225 -115 -28 211 84 -27 169 187
3078 187 32 -95 176 132 -62 99 235 80 -47 201 222 -60 23 234 -7 -201 27 206 36 -99 47
3099 47 94 -70 -153 77 70 -229 33 211 -92 -282 36 38 -165 -97 59 -50 -255 -52 37 -249 -212 25 62 -270
3123 -270 -117 117 -80 -189 1 -8 -86 -207 59 104 -120 -130 120 25 -195 0 186 -152 -132 115 123 -103 2
3146 2 233 10 -80 122 175 55 69 215 163 -156 24 288 81 -110 131 196 -6 -54 150 223 -83 -10 91
3169I1j53j17L17m7k97J78J92p2l00J49Q7o7j72J92J08l39L7K31k6j42J06J0j09
3192a43n5K49o6j58L6K12j55k21L97Rk27QJ46l8j23M7J56j34q2J95L7j87K0K70
3216A93j12j92M9K17j46j64K84R7j69m1J48K3j47lJ05j06l0K44Mk31QJ09J5k73
3240a18K79L3j24r9J41M9k05n0J98k2k90J06L05k30j54K13K2j54k2K12j67j14
3262a91Q0K35k74q6K48N2l37J15J77n8r5P9K6j09l9J42J00j76N7J54j90m5J50
3285A5Q4j35j84L60p4k09J73K28j26k23J93j2j51M9J85m3j58JK39j69j63K88r
3308A59j04r7K34q1j61O5J92j03m3J05J7k12N6J25j07j74J07J75j27j72K39n0
3330D3k51J30J49j62r8K34K1j92o6K90r2k25O1J28l6j44J02K23l11q2K91q0j30
$$ plain form
3169 91 -62 -179 138 91 -206 -28 164 92 -208 -59 28 -39 -211 -19 89 -250 -213 18 -8 -150 -44 -34 -143
3192 -143 -198 51 -15 -173 -137 75 -80 -301 96 105 -122 -114 32 -6 -129 -82 74 -60 -142 53 90 -97 -77 193
3216 193 81 -111 -62 155 9 -155 129 226 57 16 164 187 40 37 142 36 6 250 254 23 31 140 155 -118
3240 -118 161 194 70 -29 112 161 -44 -94 104 82 -208 -102 203 -27 -181 32 54 -100 -122 90 -77 -191
3262 -191 -111 124 -150 -236 12 64 -273 -158 19 -39 -134 -55 -29 -138 -177 -35 65 -111 -54 100 -90 -135 15
3285 15 99 -36 -220 140 66 -143 30 258 132 -91 102 90 -61 -12 173 130 -28 -27 212 43 -120 168 159
3308 159 55 -42 192 111 -50 15 207 104 61 166 183 -29 27 152 45 -129 -22 153 26 -146 93 43
3330 43 -208 -78 71 -91 -189 45 66 -126 -192 98 6 -219 -158 -30 -66 -210 -108 115 -196 -278 13 -67 -197
3353a97Q6K68j94j28J70P7j35r9K95r1j99R0J20j44MJ31J67l23O5K31j59j07J48
3376G6J45k43j56L79k5p5q7K15l9k51J03J88j26j63K42O7k45KK44m2k85Q8J67
3399A79j59o8O8J09k75M0J31O9k47J14J48j53r4J68M3j91r6K33jk91J88O3j02
3422a24m6K49q4j81J5K07N2k90K10J3j81P6J49j4p0%J30o0j41J19O6J3r7O7O3
3447A41k08Q8J69j32k9QJ68j57L3J13q9j69O6K79l52M4J86o9q8L2P5j1k03J60
3471E5N5j16n8J58J11l19L9J62r9j28J64J06j60j51K41qk90J31R8p1n8N5J10j71
3495a44o0J75n0k8J22K9j38j27K39J09k21k3K35%k95J56L9M1j08J25oj63j6J73
3519F4Kr6Q0R3j25J33j20K7J7j72L66k22r5J45M3M5k46J51j2p8n8J73L8k36J47
$$ plain form
3353 -197 -111 157 -37 -165 5 82 -53 -152 143 52 -147 -57 63 -81 -77 54 221 -102 -37 194 35 -72 76
3376 76 221 -22 -178 201 176 101 14 229 190 -61 42 230 104 -59 183 250 5 7 251 209 -76 12 179
3399 179 20 -48 20 129 -146 -106 25 94 -153 -39 109 -44 -138 30 73 -118 -214 19 18 -273 -85 -22 -124
3422 -124 -170 79 -5 -186 -171 36 88 -202 8 21 -160 -84 65 51 -19 -19 111 51 -90 29 95 108 11 78 141
3447 141 -67 21 190 58 29 37 205 48 81 194 105 -64 2 281 -71 -27 159 90 2 34 109 98 -105 55
3471 55 110 -6 -64 94 205 -114 -75 87 -12 -140 24 130 -30 -181 60 52 -238 -107 -9 -80 -138 -83 27 -144
3495 -144 -204 -29 -79 -107 15 44 -94 -221 18 127 -94 -117 118 118 -177 -21 18 59 -49 76 70 -93 -109 64
3519 64 66 -30 50 143 18 151 31 58 75 -97 269 47 -48 97 140 185 -61 90 78 0 -58 115 153 -83 64
3544F4J55j99j44J81J22k84J08O8k4p9L1R0j47k8J0J43j98o8L53j70j44J29M0
3567Ij10r1K38J0k49l4K93j28k27K16K10l30pK18M3j20l7J93j07j24J23R7j10
3590b4m6J36L4j24NR1L2k37K96mj61r0J99Lq7P5J28j52j01K52o0p7m1J53p5j54
3616b9O5J10n5j41J10J79l18L7J30O4j17K5R0j23j13Q8R7j75j6J95q6j96Q9J20
3640C0j58p2J60Oj04O5P1p9o7L2J66j14l5J28p7q3M1J10j05j57J97J44j05k33
3664b39K65k1j21K02j4q5j45K77N2j45n3J85q8k6m7J36k1j75K36P4j52j20J83
3687A58o7q2L8O0q8j18K22k0j54j3K01pj80k7J50j37k9J31k6j28J09Q1j06j68
3711b00J62J7J14j67J28N0j94J2Q9Pr6p8J28k2j99K72l5n7j1J52j11j61K94l9
$$ plain form
3544 64 219 20 -124 57 179 -105 3 71 47 -32 -1 89 -58 -86 -76 67 -131 -199 154 -16 -160 -31 9
3567 9 -101 -192 46 56 -193 -227 66 -62 -289 -73 137 -193 -200 18 61 -59 -96 97 -10 -134 -11 86 -24
3590 -24 -70 66 100 -24 -19 72 104 -133 163 159 -2 -92 107 110 23 98 226 74 -27 225 165 88 47 200 125 -29
3616 -29 36 146 91 -50 60 239 -79 -42 88 152 35 60 150 27 -86 2 99 -76 -92 103 17 -179 -90 30
3640 30 -128 -200 -40 -34 -138 -73 -2 -81 -148 -116 50 -64 -99 29 -48 -131 -90 20 -85 -242 -45 99 -6 -239
3664 -239 26 5 -116 86 72 -13 -158 119 171 26 -27 158 70 44 -3 133 112 -63 173 247 95 -25 158
3687 158 91 9 47 107 19 -99 123 103 -51 -64 137 130 -50 -77 73 -64 -93 38 12 -116 -7 74 -32 -200
3711 -200 -38 -21 93 -74 54 104 -90 -78 11 18 -78 -156 -28 -50 -249 23 -12 -69 -80 72 -39 -200 94 55
3735E5r7k12L18L5j04n7J62j26j37J44J34j31l7J53o4j62J13K27j37j68J32J42
3757A83q3j17K37q7j24Q0L6m7m0J29o1j24J7J89Nk61K8J96q0k26J28J50m9j29
3781e0J94j49j12J24O0j25o2J43kr5nR5j7k63K64Rp8p9J28Lp7p4K03j30n8Q9J70
3808A06k09MJ22j3q1L6N7r1j1O0J22j77N9L2N1r9K0J62j75r5K55j5o0o5J79J2
3834A86j66LM8m4L4n9J76r5r1J96p4q1O9N4k32l9L23j32p7q6J68J7j76K16j26
3859A2j23M3N9O4m8n8N6N1j11l4J22r1q6Q7J51l40J48P9Pl8l4L8j0r5K41j03r8
3886a11K2J66j79M3j6K05j87j8J40Q5j93r7K15k0m6J9M6j21J6R2P4j65L0J46j60
3911a4lJ21J17j13j05L4J67k21O0J40q5r3k1K30j86n2J63pj85K9J08q7%K0J11
$$ plain form
3735 55 -42 -254 64 99 -5 -62 100 -26 -163 -19 115 -16 -53 100 36 -126 -13 214 77 -91 41 183
3757 183 100 -17 220 133 9 89 125 78 38 167 106 -18 -1 188 193 -68 -40 156 76 -150 -22 128 79 -50
3781 -50 144 -5 -117 7 67 -58 -120 23 21 -74 -79 16 -1 -264 0 9 -69 -148 -20 -17 -94 -168 35 -95 -153 -64 106
3808 106 -103 -99 23 10 -71 -35 22 -69 -80 -20 102 -75 -16 16 67 -32 -12 150 -25 -120 135 120 60 -5 174 186
3834 186 20 23 71 27 61 2 178 83 -8 188 114 33 102 156 -76 -115 208 76 -1 -87 81 98 -78 138 12
3859 12 -111 -68 -9 55 7 -51 5 56 -55 -89 33 -58 -144 -57 94 -246 -98 -19 -12 -50 -84 -46 -56 -151 90 -13 -111
3886 -111 -89 77 -102 -59 -75 130 -57 -75 65 150 -43 -140 75 55 9 28 74 -47 -31 61 135 -30 0 146 -14
3911 -14 -17 104 221 108 3 37 204 -17 43 183 98 5 -16 214 28 -24 139 132 -53 -24 84 -3 -3 17 128
3936A28j86l5J13M9r2m1J41j61k6Q6J17r2j37J09j3j10J39l2p5q2K00n6l7O9O2
3961C8Qk36J29M3J8r3J45j1j78J03L7N0o8LJ26r4j19K16Kj32j2L9N6n2J13J6k15
3988f8J12JJ27j12N1J9L4j69Q1O1j08N1pN7k59K12j3m5j0K0L4p8q9J89Ko9M3j24
4016e7nj2J12r4m9L1N4P2j16n0P7o1p0J68N1j51j1J76n5j36J07O4j22k3N4N6k6
4043a6L6Okj06N7O5k0j25J46L3j87J77K1o4j56K52L2j94J59%o9J3m7J27j9k25
4069a06P2J70j15NQ6p6L9o9J12k2m1K8J3j07j09J52M9l8k8kl3j16J18k8j3m4J42
4096C9J2j06q4K15q5p2Q6J1j41r4J93l3rJ0L9j03n6J31J17k42O5J89o5j30L0J24
4122D1n2M3m3R9j54L9J34p1N1n6J36j01j11N4O0Mr0P9K6m7o7J01R2m4J8n7p4L
$$ plain form
3936 128 -58 -93 20 69 -23 -64 77 -84 -110 -24 93 1 -136 -27 -40 -150 -11 -43 -118 -200 0 -56 -93 -24 38
3961 38 46 -190 -61 -18 0 -93 52 41 -137 -34 3 53 -15 -12 114 20 -99 117 119 -13 -25 14 70 18 131 147 -68
3988 -68 44 45 172 60 111 130 164 -5 76 137 29 80 73 130 -129 83 70 25 15 35 69 -9 -98 91 93 24 67 -57
4016 -57 -62 -74 38 -56 -105 -74 -20 52 -64 -114 -37 -98 -168 0 51 -100 -111 65 10 -126 -19 45 -77 -100 -46 10 -16
4043 -16 20 26 24 -82 -25 40 20 -105 41 74 -113 64 85 21 -135 117 149 -45 114 114 45 58 11 138 119 -106
4069 -106 -34 136 21 26 112 36 75 6 118 96 55 83 96 -11 -120 32 81 43 15 13 -20 -136 -18 -46 -59 -103 39
4096 39 51 -55 -139 76 -9 -81 5 16 -125 -219 -26 -59 -68 -58 -19 -122 -178 -47 70 -172 -107 82 17 -113 -83 41
4122 41 -11 32 -11 88 -66 -27 107 36 87 31 167 66 -45 9 69 73 -17 62 88 41 -26 75 167 123 141 84 10 13
4150A3J18j19K5J5M9j42O5J13n4j63M0J91j05j08l5J02j77K14l2r7qj1J09j8j00
4175a15N5L2k8J0j0J3j17J13Qpm6Q6l0r1M1N4o6m7N5J17j40P4R7L7j53k8J36l5
4203A5P4L7j60J06l8oQ0q2p3J74j19o3M3J47j43j1M8O6k3l4P7Mj30n2K02j01m0
4230bQ3Mp4J13Oj52n8J28N2j16q3J72n3L5n5L5j48K2r0J68j77J21J68j88kj0J29
4257B8j68j0J56o6n0N9M5p0M2Q8k0j12N2R0pp1rO5k6k0Npn4K4PP9k9q8J31P9j94
4288e1N5R5p2o7R0j61J06q5J24K1L2j02J02K6j49L8J3l4n0K52j38p0M9J13o7j68
4314i8J21l7l6l5J33q6l9L0k2J08r5PQ2j20J5M1l4n4J02q8J29m4O4p6j25J37M2
4341B2l5o2O8l5K5j26K09Ko0o1J38j04K5M2j9pk2PN9k2n5J18p3JJ29j51ql5J61
$$ plain form
4150 13 131 12 37 52 101 -41 24 137 83 -80 -40 151 46 -62 -97 5 -172 42 10 -87 -95 -106 3 -15 -115
4175 -115 -60 -28 -56 -46 -56 -43 -160 -47 -39 -46 -92 -6 -36 -127 -86 -32 -98 -145 -90 27 -113 -39 58 95 -58 -86 50 15
4203 15 89 126 -34 72 34 28 108 26 -47 127 8 -55 -12 135 -8 -19 29 95 72 38 115 119 -11 -63 139 38 -2
4230 -2 81 85 11 124 130 -22 -80 48 100 -16 -99 73 20 55 0 35 -113 -91 -181 -13 -190 -69 99 -89 -91 -101 28
4257 28 -140 -150 6 -60 -110 -51 -6 -76 -34 54 34 -78 -26 64 57 -14 -23 42 16 -4 1 -6 -60 -36 -29 50 21 -67 64 143 -51
4288 -51 4 99 27 -40 50 -111 -5 -90 34 55 87 -15 87 113 -36 2 15 -19 -69 183 45 -25 24 137 70 -98
4314 -98 23 -14 -50 -85 48 -38 -77 -47 -69 39 -56 -49 33 -87 -72 -31 -65 -119 -17 -105 24 -20 44 -32 -157 -20 22
4341 22 -13 -75 -7 -42 -17 -143 66 68 8 -53 85 -19 6 48 29 22 0 7 66 44 -11 107 34 35 164 13 5 -30 131
4370A31j43m0J11L7j15LR1n7o3j4J17j07j6J11J3m7j6N0j28K3n7J69k1k6m2J83
4396A47j59JP6m8j01j04K69j65N8J0Ko1rP4jrl6j0q4L5R0n7m4N3J78j65R6j33
4424i7P5m2l8J44K9j13oJ21l5j61J97n9n8L4M2Q6j7j06J46q1l3l7knj0Q9k8p9
4452d4L8P0n9OK2N2l2m7o0R5n6j8N2Pp2M9k9j4N2j2p6q1J58kJ1j12P1K8q5NL5
4483d8L5p9O1L5qj45Q9O4j29R3K5N6q7n7O2p1L1Q7M4m3m9L4k0rO4N3km0k4J17
4513A39n8n1Q0k7j60R4O2r3J8j4M0nP9nN3j55k3O3m3J9J48k1j89O4j0r5PkJ29
4542D4j27Q7L9j0q9M4k7N0m5L8q9J14j03O5l8j43K34j44jL9m1N8k2J3Q1K8r2J1
4570b6k8J9N0p1K6M7k9k2J25o9j9O4o7k9O0r7J32m5O8o9J4o2J14J5j65J19K2k3
$$ plain form
4370 131 -12 -52 59 96 -19 -16 75 18 -45 -59 58 -49 -65 46 59 12 -4 46 -82 -59 -116 53 32 6 -36 147
4396 147 -12 -11 65 17 -84 -188 81 -84 -26 -16 -14 -75 -84 -10 -11 -20 -56 -66 -150 -115 -25 -82 -126 -73 105 -60 36 -97
4424 -97 -22 -64 -102 42 71 -42 -48 73 38 -123 74 15 -43 -9 33 119 102 -4 142 61 28 -9 -11 -16 -26 63 35 -44
4452 -44 -6 64 5 11 33 85 53 6 -54 41 -15 -33 19 26 -46 3 -26 -40 12 0 -76 -157 1 -1 10 -102 -31 -3 -88 -83 -48
4483 -48 -13 -92 -31 4 -4 -149 -60 4 -125 -32 -7 49 -38 -95 -33 -104 -73 14 58 15 -34 0 -20 -29 35 88 86 46 22 139
4513 139 81 30 110 83 -77 17 79 -14 4 -10 30 25 104 99 152 -3 -26 37 -6 13 161 140 -49 15 5 -90 -83 -85 44
4542 44 -83 4 43 33 -56 -12 -39 11 -34 4 -85 29 -74 -9 -47 -190 44 -100 -101 -62 -103 -45 -67 -54 27 55 -37 -26
4570 -26 -54 -35 15 -56 -30 17 -12 -34 91 22 3 67 0 -29 31 -66 66 21 89 20 34 -28 86 101 -64 55 77 54
4598E4m7J39j59j5JK7L6j67K15q2L6j20M0P8rn6Q6j7o0P5r0lj4R5k0j22J05n2
4626d6JJ6OL5p9k7J06j13k2Q0j3MJ0J05j55P1L8N6p4j53J95j8j7K8j30J23r6j0
4654g9J62j87O2J29n9j7j03Q8J9OK1J12k20P4J18k1j36L9%N2m8m9J58j17L0kK8
4681F0m6m1K7O7p4Mn9J34l7Kj5r4Q6J8L9j16R9p4o4QoL2j5Q3M0r7M0L5K4o1p4
4712g5J1J5k6jL8L0M8o5P5j00j8P5Q6k54J90Km0r4O0K6J14o5k3q0N9K6J5k8L0
4741C1J3J1j57J04J19o0L9k4K1p0j3Q6M9o9p4M6lj98J80N9n7rk9j8R2o6j4M1j0
4770B0l3M9m0o7L2N3m0l8J31j10O2J0k9k9qr2J21J2J7j9Nm3K7Rl2no3O4k3J47
4800H8l8q2K8N4r3J35l0K3j55J9L1N8jj00J43m2Kk2J9J8j01O3P2n1Oo3R2k1rr3
$$ plain form
4598 54 7 146 -13 -28 -27 0 36 -131 84 2 38 -82 -42 36 27 -29 57 40 -20 55 -35 -38 -52 43 23 -99 6 -46
4626 -46 -45 -29 -23 12 -67 -94 12 -101 -123 -43 -56 -52 -42 63 -92 -21 17 73 -1 -154 41 23 6 34 -96 27 -69 -79
4654 -79 83 -104 -42 87 28 11 -92 -4 15 21 42 154 -66 8 126 105 -31 8 8 60 12 -37 121 4 34 32 60
4681 60 14 -27 0 67 -7 -3 -62 72 35 37 22 -72 14 32 71 -45 54 -20 -84 -76 -82 -50 -65 18 58 -39 1 36 60 -1 -75
4712 -75 -64 -49 -75 -76 -38 -8 40 -25 50 -50 -68 7 93 -161 29 31 -9 -103 -43 -17 97 32 9 -71 -12 14 29 1 31
4741 31 44 55 -102 2 121 61 100 76 97 27 14 100 149 80 6 52 49 -149 31 90 33 24 -5 -23 69 3 -11 30 20
4770 20 -13 36 -4 -71 -39 14 -26 -64 67 -43 19 29 0 -29 -37 -129 -8 4 21 2 7 -36 -9 0 -32 -37 -100 -36 -59 88
4800 88 50 -32 -4 50 -43 92 62 85 -70 -51 -20 38 37 -63 80 38 40 18 37 55 -46 17 89 38 44 -19 73 52 43 -50
4830e0J34n6M9j7q7O2p7J42j28J06n6Km3l5J00nJ3K8q3pn6l2Q0k2N2j1j17M6L9
4859b9m4m6J37OJ6j52R8J05n2q0L1K5p1N2P1on3p5N6J5lQ1p4k0L2k8J40j23O3
4888G2j63K10j37MlM8L0r1O3r6J38q2O8q5O4KMj34J67nj41J00Q4j25nN2K9p5L5
4917B8K3j55J53m2J3q9K5N7K5p1N8m2J8j30J5P0k9M2K2J8r5P6O7j57Q6ROq6P4
4946a1lq9P9k1O5J32j97P5l6j10J42Rrl4m7R4Ko6Q8r1M9m7M6kNQ0k9n9oR7k1p3
4978A2q1J66l2j24pP4O7j18kJ14o3K1L0p8KM6KJ0J5m7k6j7N8j4m3j17J65K7j31
5007i1P9M5r6J9O4k32J12%Q3j24O7Q9K0m5J1Qo0Q0j10LN9JKK7L0l2O8n0q2L5N
5038a5O6mP6Lj09pm4R3L0r9R1N4j43O2J0L1j64P8P9j67L1J35P4k03j3J63r7Qk2
$$ plain form
4830 -50 84 28 77 60 -27 35 -42 100 -28 78 22 24 -19 -54 46 41 54 82 -1 -8 -64 -96 -16 -38 14 3 -114 -68 -29
4859 -29 -73 -119 18 24 40 -112 -14 91 39 -41 -10 15 -56 -4 67 61 8 -67 -11 4 1 82 8 -12 20 -8 132 9 72
4888 72 -91 119 -18 -14 -17 31 61 -30 33 -63 75 -7 61 -24 40 42 46 -88 79 74 -67 33 117 -8 -13 39 68 -7 28
4917 28 51 -104 49 7 20 -69 -44 13 38 -33 25 -17 1 -129 -114 -44 -73 -31 -9 9 -86 -10 57 -100 -14 -5 1 -85 -11
4946 -11 -14 -103 -24 -45 20 152 -45 30 -6 -116 26 35 26 -8 -55 39 41 -25 63 -28 21 -26 20 18 23 103 74 15 9 106 85 12
4978 12 -69 97 65 -59 -66 8 75 -43 -45 69 6 27 57 -21 -19 27 29 39 54 7 -19 -36 22 8 -35 -152 13 40 -91
5007 -91 -12 33 -63 -44 20 -212 -100 -100 -17 -141 -74 15 35 -10 1 9 -51 29 -81 -78 -19 -18 -16 11 41 9 77 27 -55 -20 -15
5038 -15 51 47 123 126 17 10 -34 59 89 -10 81 135 -8 54 64 95 -69 9 88 -79 -48 87 161 -42 -55 108 11 19 -3
5067cJ9nk1L5k9J9m4M8k4K3m0%m4O2L8j11J6J6P6j28qQ2j5k1j0J00q6J2L8M5o0
5098b0o6M9J10j08M6M6m9r8J03r6O2Nm3NKL0M6l6P2k2r2O7PP4j06J27m8l1n6L9
5128A9l2J34j55J08m5o2R1n1L3L8r7m4J24j5j25O6N3o0K8k9om7O7Kl8Ok1Q8p2
5157d2N9N1r8k9KJ6r1J74j69J20l1l5J28j25K3J7J27j31o1O5j09L7J25m3L1o7
5183e6PN3L3P8n0j03k0L5M3L5o6K4J0o3P3k0n3Q4j0K7k1L2J28j11l1%q1Q3j58
5212i8M6N4J3K2l6o6nJ43j68J0nR8QN4q1nj7rP1m9J3o6m2J56r1J7J46q2j05L5
5242c9j1J5m5K1P6j21M1J0j2J9LN7r3kJ23n3Q2j05M1J2L9r5O2q7N0j3pJ57q8P1
5272A08j21J3P8K2j17nN2j6K2M8j39J61j00MJ3j00J42N3j50l4K7J15l1l6nJ3m4
$$ plain form
5067 -3 16 11 -10 25 -4 15 -29 19 -5 18 -22 -22 -66 -4 34 -77 -61 -45 31 -97 -105 -23 -38 -59 -69 31 -55 -43 -5 40 -20
5098 -20 -86 -37 73 -35 11 57 8 -90 13 -83 -21 -16 -59 -54 -52 -22 24 -12 60 38 -54 13 20 94 -12 115 67 36 -20 19
5128 19 -13 121 -34 74 29 -33 58 7 40 78 -19 -63 61 46 -79 -13 40 -20 8 -21 -27 -74 -7 -5 -43 -37 -58 30 -42
5157 -42 17 68 -30 -59 -57 -41 -132 42 -127 -7 -38 -73 55 -70 -47 -30 97 -34 -95 -30 -139 -102 23 -20 11 -56
5183 -56 -49 4 37 115 65 -38 -58 -23 20 55 -11 13 23 -40 33 13 -40 44 34 61 40 72 200 89 58 58 -23 60 -98
5212 -98 -52 2 15 37 1 -65 -70 73 -95 -85 -90 8 16 70 -11 -16 -33 -42 29 -20 -7 -73 -115 41 -50 -33 113 31 -74 -39
5242 -39 -50 -35 -80 -59 17 -104 -63 -53 -65 -46 -43 14 -79 -81 42 -11 71 -34 7 19 58 -37 25 -62 -12 -25 -32 125 37 108
5272 108 -13 0 78 100 -17 -22 30 14 36 84 -55 106 6 10 23 -77 65 118 -32 -66 -39 76 45 9 4 17 -27
5299b7mL5m3m7n6Q8J5Pj04Q1q8J55q0L7jj9Q3j09J4J29q5k1O5kL6k22J04L9Jm2
5329f1N2k5J02j50M9J1n3qJ92j65m1J08J2l2L1M3L8j06pP4p7k1O0j8J9k5Q2j4
5357G0m2o8M7K4j2%L9l5n5O0q6P8J3n2r2O0K7J04j22J2O4p3n2KM6j2j6R6k7pr3
5388a02n0J12mN3o8n1J4O4R0r5LnrJ8Q1q4jpjO1M3j15J0R7K5k5Ml8r8J14K9k6
5420C9K6m4j0l7J55m8n2l1M0L6J6J7k3k3Oj7J7o4J07l1r3lL2N0j45J33n5M0p5
5449c7L7m0M6l2L7k4j3q2K4N0j11R1J25q6j09J13M8r9jQn5P6j1L0j3M5p1M6j01
5478a09O4K4o3K0J18k6Ln6N8o3L7K4J1n5m1J03p5L5R7rr9l4L3R0j0O3m2o8M9j5
5508F4k0K1K4o6Q8p3o0O3R6m1j16J05l8j05M7K1j0J7n6qQ9q4N4on0j02K11j02
$$ plain form
5299 -27 -31 4 -39 -86 -142 -54 -39 -32 -136 -55 -143 12 -68 -31 -32 -51 32 -77 -63 66 -19 -40 25 23 59 -163 -59 -20 -19 -61
5329 -61 -9 -34 68 -82 -33 -22 -75 -83 109 -56 -97 11 23 -9 22 65 103 -3 -10 64 -13 -34 26 8 27 2 84 70
5357 70 28 -40 7 31 19 19 58 23 -32 28 -58 20 33 -19 -111 -51 -24 80 -42 -30 34 -39 -91 -89 -43 -55 -71 25 -2 -9 -102
5388 -102 -152 -40 -44 9 -59 -110 -96 -32 58 -37 -34 -39 -48 -30 51 -33 -34 -41 -42 19 62 -53 -43 54 79 54 58 20 -78 36 65 39
5420 39 65 21 11 -26 129 81 29 -2 38 74 90 107 84 61 67 50 67 3 110 79 -14 -17 15 65 -80 53 -2 38 -37
5449 -37 0 -40 6 -26 11 -13 -26 -108 -84 -34 -145 -54 71 -15 -124 -11 37 -62 -63 -55 -110 -34 -45 -15 -28 17 -54 -8 -109
5478 -109 -45 -21 -84 -64 54 28 31 -25 33 -30 7 31 42 -13 -54 49 -26 9 106 97 -2 -36 -3 87 77 140 98 30 79 64
5508 64 44 65 89 23 111 38 -22 41 137 96 -20 85 47 -58 -11 10 0 17 -39 -47 42 -42 12 6 -44 -146 65 -37
5536c7M0k0j6n9kL6j3Q3o1K9P6m7J2J1r1N8nl4j38J95q4P8m4n2O0p4J15Nn6L7
5566BRm4Q0J8j2K1r5J0k1L2k6O6l9j1N5L9j5j6J7J03j62k8P9j12M0J03k6m7L7
5595E7o9R0p9O0n0l2J08n1l9n2J8M3J4q6k0N6Q8p6m6K3n5Q1k4M2Q2k02K01q0j23
5624a21J10o4J24q9j9J27j26O0m8J2J07j33J93j80m4J28m9J2l4J11j26nJ13L1
5648I0j23K0lK3k4K6L1l6m1J06ko0M6p9O6q4J04L3r0Q0N1j14k1mn0O3JM8k6k5
5678Fk7L1j2j9O1n8K8j3k3j2J20j28M3M6j28L8o2J27p8R3K2o9l2L9j5M9o9l0J18
5707D6k0Q7n5Qp6R3j22L7M3p8J0J7lKR6o5rl1J27j04RL2k9j7M5nj00O8rj4O3n
5739D1o2J20l5K0j60Q2k3pM2o0m1J3J18m1K9j01P3l8L9n4P1j8j4lL1q9J10j64
$$ plain form
5536 -37 3 -17 -33 -92 -94 -58 -71 12 -49 -20 56 9 21 32 -59 -1 -6 -40 -178 17 -67 11 -33 -85 -25 -99 16 21 -35 2
5566 2 11 -33 47 65 53 74 -21 -11 -32 0 -26 40 1 -10 45 84 69 53 70 173 11 -17 62 -50 -10 93 67 20 57
5595 57 -12 78 -1 59 9 -23 85 34 -5 -57 -39 4 18 -68 -88 -32 56 -20 -66 -43 -98 -17 -41 1 83 -119 82 2 -121
5624 -121 -11 -75 49 -40 -59 68 -58 2 -46 -34 73 -60 133 -47 -91 37 -12 0 -34 77 -49 -54 59 90
5648 90 -33 -13 -16 7 -17 9 40 4 -37 69 67 7 53 -26 40 -44 60 93 3 83 134 20 -1 -5 -55 8 9 57 31 6
5678 6 -21 10 -2 -21 40 -18 10 -3 -26 -38 82 -46 -3 43 -85 -47 -109 18 -60 33 55 -14 -46 -7 -22 27 -42 -72 46
5707 46 26 113 58 66 -10 83 -39 -2 41 -37 -27 -10 -13 -11 85 20 11 -20 107 3 12 44 15 -2 43 38 -62 6 -3 -17 46 41
5739 41 -21 99 64 84 -76 6 -17 -24 18 -42 -83 -70 48 7 36 -65 8 -30 9 -45 26 8 -6 -9 22 -67 43 -121
5767a21R5Mn7O3p9J68j58R3N6j00k3R0j13R7j12O1L7K3M9j58O3n5J57J1j0j25
5793d4Q4K4m9j4Q1l7m1R0j12K3J13j25P7o1oM1JL4Nn2l2K1J11r3N1q1J37j97O7
5822A6J18q0k9o%j0m6J1K8k4%J43j1r7q1J70j14k5Q8o3M7o1J7n7kP7n3P0n1k6
5852e1k3N1j1P7o2K7M6r6j2O2o1J51p3o5pJ02r0J37J0l8l6k0M8l5kJ2p2J9K7K5
5882D0O2l3p3R3j07j8Q0n5N8k5l9K2K9n7L9K7k2r0R1K7r4N3Q0q4Q%l4j2M7o4M8
5913cj10K1L1N2k7p9J02p6J07j02K5m5L8K0O8p6l3J07k0K6l1o8J4N3l5ol5P4N1
5942D3k6l0J0M6j6o6J3P5%k9O3j4o4O9o9L9l4K9O7r9P8j4j38J25k6L2K0l8q2N8
5972B2J17j06O3n8p4K3M0k7Nj15J06L1k2M5oN1j18M3M6j43j0P7O0q2R8l7j10N9
$$ plain form
5767 -121 -26 -22 -79 -16 -95 73 -85 8 64 -36 -59 31 -82 15 -97 -36 1 24 73 -85 -22 -77 80 91 81 -44
5793 -44 40 64 15 1 82 45 4 94 -18 5 118 -7 70 9 3 44 45 79 84 32 0 21 132 39 90 9 146 -51 16
5822 16 134 54 25 19 19 9 -37 -26 2 -22 -22 121 110 13 -68 102 -12 -37 51 -12 35 -26 -9 -66 -68 9 -44 26 -25 -51
5852 -51 -74 -23 -34 43 -19 8 54 -42 -54 8 -53 98 25 -40 -47 55 -35 102 112 74 38 18 66 31 29 41 -31 -12 15 40
5882 40 102 69 -4 89 -18 -36 44 -11 47 22 -17 5 34 -23 16 43 21 -69 22 49 -45 8 88 4 12 12 -22 -34 13 -51 -3
5913 -3 -113 -92 -61 -9 -36 -115 -13 -89 18 -84 -59 -104 -66 -46 22 -54 -87 20 0 26 -5 -73 -59 -6 -41 -47 -82 -8 43
5942 43 17 -13 -3 43 27 -39 -26 49 49 20 83 69 5 74 5 44 10 39 106 7 85 71 -67 58 32 64 84 46 -36 22
5972 22 139 33 96 38 -36 -13 27 0 5 -110 -4 27 5 50 44 95 -23 20 66 -77 -87 -10 50 -32 66 29 -81 -22
6000b2K7lj80J76m5L6k9n3N4J3j5P6j40L9j3L7O4o2oK1mL5Nm3O0N2o3N0L4p8m
6031A9J02J4l9o7j8N0M2q8mo9P9k3m2k7Q3l6O8M6p9j03L5P5Mo7M7n2k9N0P7N2
6061A00j04o6P7L1q3M7n4O6L4r3L5l4l4J00m5j1R6j24Q7l4j13M8L3k4K4NOM9j16
6090i7Q8nq5Q3L5l6mLj3L5PK1N2p6J07j1l5r4L1L7l9P5m1j3L4rJ1m6J04j1j28
6121b0k9N5l7O1K9m9j3k9K8j5K8k7M9o4j2P8m0ON5o3M6r8J6P2o1r9J69l2k2R9
6151H1j15J07j12N0J5j1n4M1m5L2m0O9j6pj27J75J6j09J48p5n0L0lO5l7L6n9j0
6179ek9J07n5n1J14n6l0j5Q4L0n%m2N1q0O6j23J01K9n4N9r5O3j8Lj8m5j2R8j30
6209e8R4J2r1L6n8N3j4k1JJ4L3P6o1q3J18n2K6k2oJ07j06r6O8l%O4m8K1Mm5L7
$$ plain form
6000 -22 5 2 -178 -2 -47 -11 -40 -93 -39 -26 -41 35 -105 -66 -79 -42 22 -40 -46 -25 -29 6 11 -32 28 80 17 67 101 23 19
6031 19 121 135 96 29 11 61 103 15 11 -58 21 -2 -44 -71 12 -24 44 90 11 -92 -57 18 22 -45 2 -50 -79 -29 48 100
6061 100 -4 -70 7 38 -45 2 -52 14 48 -45 -10 -44 -78 22 -23 -34 62 -62 25 -9 -122 -74 -41 -65 -41 -36 -30 19 -97
6090 -97 -9 -14 -99 -16 19 -17 -21 -18 -31 4 11 32 84 8 115 104 69 -25 6 43 4 79 38 25 59 50 61 15 119 108 -20
6121 -20 -49 6 -31 30 59 10 -3 -32 -4 -19 9 -18 31 -33 -45 33 -7 -1 54 -9 37 -61 -45 27 -34 -133 36 4 -18 81
6151 81 -34 73 -39 11 26 15 -39 2 -43 -11 -51 18 2 -5 -132 43 59 -50 98 23 -27 3 0 65 28 64 5 -5
6179 -5 -34 73 18 -33 81 25 -5 -20 64 94 89 89 47 98 18 84 -39 62 91 37 96 1 64 46 49 31 -14 -26 72 -58
6209 -58 36 48 -43 -7 -65 -12 -26 -47 -46 -32 1 77 16 -67 51 -1 25 3 -3 104 -2 -98 -30 -33 -33 31 -17 4 8 -37 0
6240@L3j22J05Kp9J11j37P3q2K7NJ63j35J18Kj18OL7N5r5P5n1Q1m7j5jK7jK4O0
6270A21K4j08J8m3q8Q8k4Q4m0K3m5J4j23J10km1R1m7r4m7K07j29N9J1j03K13j97
6297f8Q6j36M8Q3j42J51n3K5o8J36j23mJ72j99M0m0J33j8J8p8n9l7J07p0J23l7
6323a0K9j1K6m4K9q6M6L7R5j93O3j4J03p1P7j8k5k1J46j57rK7l2qL3l6K2k3Q1
6352E6k6j20Q6P5o5mj4j8J20r3l5J16r4n6lQNO9j6n4J9l9l0J51p3P3p4j0K7Qm
6383a5l1L7j3P9r8j4J18j29L3N9qM9r7J4jK4q0J05l1J6m8n0J14k1Q8k7j01L1O1
6412F4p7M8L1L3k4n6k1M6l4J4L9N0j2q7L9Q8k5q5M4n5n6Q5P4j18n9Q8o8L5O3r8
6442c4M5l2Nk9k0Rl4O6k7P2j35k9J75p1L6K2k0o2J08q1L2q1KJ02O2j50N7Ok9L3
$$ plain form
6240 0 33 -89 16 18 -61 50 -87 -14 -96 -69 -64 99 -36 82 84 -34 -28 9 64 -31 44 -7 74 27 12 11 38 37 61 121
6270 121 145 37 55 12 -76 12 -12 72 32 55 10 24 -99 11 9 -32 59 12 -82 -129 78 -51 8 19 -84 129 -68
6297 -68 18 -118 -70 13 -129 22 -31 -6 -74 62 -61 -65 107 -92 -52 -92 41 23 41 -37 -96 -133 -26 -96 27 -10
6323 -10 19 8 34 -10 19 -67 -21 16 111 -82 -19 -33 70 -1 76 58 33 12 158 1 -8 19 -13 -21 12 -24 -2 -25 56
6352 56 30 -90 -4 71 6 2 -12 -30 90 -3 -38 78 -16 -72 -75 -67 -62 7 -9 -63 -44 -83 -113 38 -35 38 -36 -46 -19 -11 -15
6383 -15 -46 -9 -22 57 -41 -55 63 -66 -33 26 18 67 -30 -16 -17 7 -73 32 1 17 -31 -81 33 12 100 73 -28 3 64
6412 64 -13 35 66 99 75 19 -2 44 10 24 63 113 101 14 53 141 116 31 75 20 -36 49 123 5 -54 34 -34 1 64 -34
6442 -34 11 -21 -16 -45 -65 -56 -90 -24 -51 21 -114 -143 32 -39 -3 19 -1 -63 45 -36 -4 -85 -83 19 81 -69 -12 -6 -35 -2
6472bJ64j18l5K2k0m0QJ04j46J16l3M4j41M7J02pj29J06p3k2Q1k7m7N8LK2k6O1
6500G2Kl7j6m9j2K1J09q5p9J16k9j9K8QK8j45N7L4O5j8j27P5r9Q1N1p7m5m9J72
6529C3j8J9n6k2J66j17l4J1M7m6N3L0o4%n4Q5j00loJ51j49O2k6N4L7o7m4J03L8
6558H3j01J0qL1p5J39q6K3m2J35l7r3R7L0m9j31J35K0L2n5m4N4kj1j01M1P3M8
6586A16j23l2J21j8j11P1k2m1L3m9Q8q1PJ5n5n0O1P2Kn2rk0O5j4p3M0M7k6P1n7
6616b4M0n1O2M4j76J77j27J23Lj9n0N7P6j79N5JN0Jj26J02r6O0K3k8L0p6OJ3M9
6645B0%q0J10j2k4pr7M5M5J6j9J6K0O7m9J0k3j3N9r5K9n7R6No2r3J26n1K9K8j71
6676a32Q1K7N0L9J2j30o0J20n5oM2K7l1o7K2NR0j14j2P7n6M8k9M8l6j2M5m3N7
$$ plain form
6472 -2 162 44 9 31 11 -29 -21 83 -63 53 20 64 -77 -30 72 65 -64 42 -31 -53 28 1 -46 12 15 37 11 72
6500 72 74 37 21 -28 -40 -19 90 5 -74 42 13 -6 22 30 58 -87 -30 4 69 51 -76 -1 -100 -19 32 -45 -90 -139 33
6529 33 15 34 -22 -44 122 5 -29 -18 29 -17 36 66 2 2 -52 33 -67 -70 -76 75 -74 -12 -38 16 53 -14 -58 45 83
6558 83 -18 -8 -16 15 -60 79 -7 16 -26 109 72 -21 76 106 57 -74 61 81 113 58 14 68 66 55 -46 -5 68 116
6586 116 -7 -39 82 64 -47 24 2 -39 -6 -55 33 -48 -41 -26 -81 -131 -70 2 4 -48 -57 -77 -12 -26 -99 -59 -12 -38 33 -24
6616 -24 16 -35 27 71 -105 72 -55 68 71 52 2 59 135 -44 11 12 62 63 -63 39 -57 3 26 -2 28 -48 -42 -29 20
6645 20 20 -60 50 38 14 7 -90 -45 0 16 -3 13 33 100 51 61 38 25 84 -11 18 -39 57 62 0 -93 33 -18 11 39 -132
6676 -132 -51 -24 26 65 77 -53 -113 7 -48 -54 -12 15 -16 -83 -61 -56 34 -80 -92 -15 -71 -23 -52 -4 -40 -52 -7 -50 7
6705GK8qk9l6R5k4r4K7k8J52r2O0k6Rj8J0Pp2J12M1r4rl4o1J63q0Q0n8M2p8L2
6736B4j02P9ok2J04p4J6lO6j00L9K1k3p9Q0j9K1J5p8J1k2k5N7o5M4K8k8J4l8J3
6766e2J6l2l9O4%n7P4P5j01L4p7J29o0O6J1o0l1N6P3m2O8j23l0J20j00N1mO8j1
6795H6k7K7r8j5K5L9J3l5m7R2p2Jn6P8M0QJr0J2o7J33K0j39J0RN4Q6l9j18O2L1
6826B4p5jM0L6p6j43P7J7O3j20J98o5j42J39K7jm5J1J6o7P8K9N6l7qr1J56j55
6854e9K08j44o9Q9K3j8L2Kk8jqL1o9R6m2K1o9j2o6J49o0O0r3J18n2j01J8p8Q2
6883d0O8J0j02L6P4l6k0l1KK2o7m7Q2P2k9k8K4pl1PO0k7N6r9K0l2k6Q3n0P2J5
6914C1o8J0M6r1J31p9j17rN0J32r5R6l1o7O2Ol7LN3Kq7N3O8j33J20K9j49R7qm3
$$ plain form
6705 7 35 27 -2 -38 57 33 -61 -34 -62 90 -2 58 32 41 23 33 40 -32 80 121 27 18 -16 -77 86 6 86 28 70 -8 24
6736 24 -78 1 -5 -27 77 3 19 16 82 -18 21 42 19 -60 20 1 22 37 -41 -30 -52 -77 -20 -85 -41 -13 -41 -27 -65 -52
6766 -52 -36 -68 -107 -43 -43 -100 -26 49 -52 -18 -95 34 -26 40 51 -9 -40 16 89 47 115 -8 -38 82 -18 33 29 97 86
6795 86 59 86 -12 -27 -2 37 50 15 -32 60 -12 -11 -67 11 51 59 60 -30 -18 -85 48 68 -71 -61 -52 2 88 49 -69 -7 24
6826 24 -51 -52 -12 24 -52 -195 -118 -101 -38 -158 40 -25 -167 -28 -1 -2 -47 -36 -20 -87 -9 20 76 39 31 -60 96 -59
6854 -59 149 5 -64 25 48 30 62 64 36 35 27 58 -11 85 43 64 -5 -17 -83 66 6 66 -27 91 39 -62 -44 -122 -40
6883 -40 28 38 -64 -28 46 10 -10 -41 -39 -17 -84 -131 -49 23 -6 -34 -10 -17 -48 -41 19 -8 48 -51 -31 -63 -89 -6 -56 16 31
6914 31 -37 -27 19 -72 59 -20 -137 -146 -96 36 -59 37 6 -61 1 7 -30 -27 26 28 -59 -6 62 -71 49 78 -71 26 18 -25
6944b5Q1m4Q2l3k9m1J10n7j7jk8n3R3p3L4p1J70o5J3o0L0l0k6N9j00J30l5O3j90
6973a13Q0J8J0p1M2J00m7j7j5q8J19q5o7J86o7P2j6q7P6m7J4j24O9J04j33N1P5
7000C9Km8or9nO5n1P5l1N5l1MlO5j5q4R1k7J9N9n7j1M3j20J26n5O0ro3l3R3k5
7032B3n0P8j26J30J2q8Q1K6j46J23j03K8j2p9O2Pk3L5o1M9O1k8l2J9j07J2J41
7059C2p0Q7j57J79j39Q3J6J4q7N7o0k7R4M4q0o4K9L4Q9j01m0k6J08j39Q2Q8m3
7086CN3n9qro2J51r2Q6J3rm5m1M1mJ2JK1%rm6O4Nj70J01Q4l4Q9j98J13o2Q1K6
7118I6q4L5o3j7P7m9j0J22j73Q6j57J34J3J4j52J08J02r3l8KNQ%n6M5M1m1P9j6
7147A8o0lQ8r9J03m6nO3l8l9nl2kl2J57r5k9Q4l9jKN3K3j06K7J1KN4n2m3J19k8
$$ plain form
6944 -25 56 12 94 61 32 -9 101 44 27 26 -2 -55 38 -35 -1 -72 98 33 46 -14 16 -14 -40 19 -81 49 14 77 -113
6973 -113 -33 -15 -5 -76 -34 66 19 2 -13 -101 18 -67 -134 52 -15 57 41 -46 30 -17 -3 -127 -58 46 -87 -36 39
7000 39 41 -7 -13 -112 -117 -52 -103 -28 -59 -4 -35 -31 -34 31 16 -68 23 -4 15 74 17 6 49 -71 55 0 60 51 -12 -45 48 23
7032 23 -27 51 -75 55 67 -21 60 86 -60 63 -40 -12 -24 -103 -41 -34 -57 -22 -83 -34 27 -1 -33 -14 -121 -109 32
7059 32 -38 49 -108 71 -68 15 31 45 -42 15 -45 -72 22 66 -14 -78 -49 -15 74 -27 -67 -93 15 -124 -42 46 3
7086 3 56 -3 -11 -20 -82 69 -23 63 76 67 22 -19 22 18 30 31 52 52 43 -3 61 66 -104 -3 81 47 136 -62 51 -11 70 96
7118 96 12 47 -16 -33 44 -5 -15 107 -66 20 -137 -3 10 24 -128 -20 82 -11 -49 -47 -42 -34 -34 -90 -45 -4 -45 34 18
7147 18 -42 -45 43 -56 47 1 -4 59 21 -18 -23 -55 -57 -89 68 -27 -56 28 -11 -12 -10 43 66 -40 -13 -2 0 54 2 -41 78 50
7179E0j03kJ41p6lL7n1J35j95P6J7kJO6j89M9M4j4J2r6N1J6N0n4j5n1M2M5q0M9
7209e0Q6N6j44%M3r6J32q0J1l2P1p7N9JNL2J4K4r5J33p8o6R0l9j7K5L4J1l3%l2
7240a2J8mJ09j32J34J4j12m9R9Jm6k2l0Q8n4oj1m5K7R7o9JRM1pq4K4k6O4j5LJ
7272Fk9R4l8o4JJ44j72R7l3n4N3J0p3J11J4j25m9J70k8r2J3mJK9j5j9oN4o%O3
7303E3o5J2NK6qj2o9J17n9N4j35l2J98o7K7k8j22J01nLj4J0R7p9L4j4l1o3J16
7332E0p2J13q5K5J9n5J11j35NO7K8ml6M3p9N2j2J9j3Kn0n0M0J8m2N1j52P6L9P8
7362E1o6l2O3m3N3j31M8MQ0n8m5R0r0m7P6J08ko4RLpR8j14Q8q6L2j5K6k9O4Om4
7394B6k0k5J4N5p2L3mjo7O6J2n2M3j9M5n3NJ7L1m0m6N3Ql9j2J11p2K4L2j0p1K9
$$ plain form
7179 50 -53 -55 86 10 7 44 -7 128 -67 9 26 24 25 91 -98 -49 -5 -19 -7 -103 -52 -36 14 -40 -55 -106 -64 -19 -99 -50
7209 -50 36 92 -52 -52 -9 -105 27 -53 -42 -74 -3 -80 -21 -20 -15 17 31 55 -40 93 15 -51 39 0 -17 8 42 53 20 20 -12
7240 -12 6 2 111 -21 113 127 15 -34 65 66 20 -2 -32 56 2 -4 -15 -60 -33 64 -5 -4 5 46 39 -45 -21 -47 17 2 5 6
7272 6 -23 71 33 -31 -30 114 -58 39 6 -48 5 15 -58 53 67 -58 -107 63 35 -57 -44 -48 -47 -18 -33 -52 -58 -4 -10 -10 53
7303 53 -12 0 5 31 23 11 -58 59 0 54 -81 -113 85 18 45 17 -105 -4 -9 -6 -20 -10 87 8 42 28 -3 -66 50
7332 50 -22 91 6 31 50 -5 106 -29 -24 43 71 67 31 74 -5 47 35 54 41 43 -7 -57 -17 1 -41 10 -142 -66 -27 51
7362 51 -15 -47 16 -27 26 -105 -57 -53 27 -31 -76 14 -76 -123 -47 61 59 -5 4 7 0 98 -16 72 -14 18 3 29 0 64 70 26
7394 26 6 -19 -5 50 -22 11 7 6 -61 5 17 -35 8 -11 34 -19 -14 3 34 -6 -52 1 9 -30 -42 69 -3 21 53 43 -28 1
7426ANk8OP5p1J4K4j24J02K7o8N4o0Q7J9l7o1PQ0p6j7n9J44j39l2O6P6j3j5O7
7456E4Qpp4m7oM9Q3o1N8j47oJ10NN5j41J22p6M0l2L6o8ON1r0J03Qk3L4l6o8OP7
7488B3Oo3J05L3j56L1J9jL0p5J03kMn3J7j0n4JqP0qk9M4K1j09P4Mq7N4J55k10
7519g1j6O8L3j28J48q8oP8k3M7n9M7kq2j9P7l3P1q0P3r4J30r7L5m2M1J06j89K6
7548d9%J9O2m5m5R8Mq7Q5Kq0K7N2N8j08j6l2O3j6oO5o3n3N3M9j4O1m9m4lJ5p5
7580g2M1P6n1NJJ7M7l2K3lk6Ko2J02o7J4p4k9M1j7Nj7P9k9L1lqQ1j70J25k4K5
7612C1m3j8L9J08j54rJ4PL6j1o6R3kOl5j1%R3m5m5J8P4o2q5K5L9M1m0N1L5k8J5
7644G1mq7L5qj4j8K9K3j13J15lp6R3p7L5p7N9p3J48j69M0J19q1j2J55q1o3O5r5
$$ plain form
7426 1 6 -22 -16 59 -12 2 26 -98 4 31 -37 17 -43 44 63 26 -35 -28 52 -24 -41 -100 44 -95 -127 -61 15 2 -13 54
7456 54 62 55 -19 -66 -72 -23 60 -1 57 -90 -96 14 19 74 -67 55 -21 19 -13 23 -45 -39 12 -78 25 33 10 44 8 -60 -54 23
7488 23 29 -34 71 104 -52 -21 -2 -3 27 -48 55 53 57 4 21 11 -43 -42 -50 20 12 -17 27 48 -61 13 17 -70 -16 139 -71
7519 -71 -87 -19 14 -114 34 -54 -60 18 -5 42 -17 30 28 -54 -73 4 -29 42 -38 35 -59 71 -26 9 -33 8 114 -75 -49
7548 -49 -49 -30 32 -13 -58 40 44 -43 42 44 -36 -9 43 101 -7 -23 -55 8 -8 -14 51 -12 -65 -12 37 23 84 35 -9 -12 3 -72
7580 -72 -31 45 -6 -1 0 17 64 32 55 52 26 28 -34 68 1 15 -59 -88 -47 -64 -59 -76 3 -26 5 2 -6 75 -95 30 6 31
7612 31 -12 -30 9 117 -37 -46 -32 -25 11 0 -66 27 25 31 -4 -15 -15 78 33 -12 6 80 18 -67 -42 -3 38 -2 49 84 56 71
7644 71 67 -20 15 7 -7 -25 4 27 -86 29 26 -50 43 -34 1 -76 -17 -90 58 -111 -71 48 -33 -45 110 29 -34 31 -64
7673f4P0j3L5n8p8L4N5J2L1m1l0J6%l2Q0j40J96j7n1q7J19m9jO9j54O7P0r7mK1
7703d1mRJ17j46J58Pm5m8n5M7R4j86O9j21J23M1m2O7j31O9K9k4J15p6k2m9R6m9
7731Bl8L8l8K4K4L5J9n0O2p2rK4j6mQ5m1j9o9J12j18l5J16j07J2K8rP2n1N1K2
7761E0o8JJ2lM6o1M5q3M5n6N8j1J3m3L7L7n6L6l5Q2M7J1r1QK8o1J7k4N2o2m8R9
7793B2K8l6N8p6l7M5k1K2QQ2j62R4m3Llo0N9J5N9j24J09j10O0l2l2N9n6M6p2N7
7823c8k7N4k7J4OR6qj12pJ6pj0p9J21o1J3R5o2j9N7j3P6p9l4K1K4p4J21k3j5K
7854B1j6j14J60q4M7L2K1k7lj2K8o4L5L3M5m0q4K6J9p5M0l7P4l6O4j28M3L0rL1
7884B0m7K0Ol3R5m3k2j8M8pj01L1n3J05k4K9mLk4N5J14j68O9J7j5P2j93Q1k3l5
$$ plain form
7673 -64 6 -7 28 -30 -108 -74 -19 -7 24 -17 -47 -31 -31 -63 17 -123 73 56 5 -82 37 -12 -13 56 -98 -31 39 -58 -62 -41
7703 -41 -45 -36 81 -65 93 100 55 7 -48 -1 93 -93 -24 -145 -22 19 -23 44 -87 -18 11 -13 102 26 4 -45 51 2
7731 2 -36 2 -36 -12 12 47 66 16 78 6 -3 21 5 1 86 45 26 -43 69 -49 -84 32 -75 -63 -35 -44 28 -23 28 50
7761 50 -18 -17 -5 -8 38 -23 22 -61 -16 -72 -14 -25 -12 -55 -18 19 -37 -1 -36 46 93 104 13 21 49 -12 5 -19 33 -29 -77 22
7793 22 50 14 72 -4 -41 4 -17 5 13 95 -67 27 -16 -13 -16 -76 -17 -2 57 -67 42 -68 -8 -40 -72 -13 -69 -23 -95 -38
7823 -38 -65 -11 -38 -24 -18 78 70 -42 -49 -33 -40 -50 -129 -8 -69 -56 39 -23 -42 15 2 78 -1 -35 -14 10 -64 57 34 19 21
7854 21 5 -109 51 -33 14 46 67 40 37 25 53 -11 24 57 102 62 -22 4 23 -52 -12 -49 25 -11 53 -75 -32 -2 -11 20
7884 20 -27 -7 -1 -34 61 18 -4 -22 26 19 -82 -51 -104 1 -23 6 2 5 -19 36 150 -18 51 68 53 125 -68 13 -10 -45
7914d5K4L0p4K2O6M4q8p7M6J7O7p1qO2j07O3P2j3N6j08N1K3l0r2J25j8o7J14p8
7943FJ7j7P0q2N7j37R3K4L6p1QK3L3j25N4J03o8n5mK0n3P8m6l3j1L7oj3P9m3K1
7974ej4Q2n9j7R1o8p5P7pK3p4J35q8J9j10L9OL0lNK9L4q1L6k3M3kl6j02P0J12
8005F7r6Q5n9oK9p9J59q1M5q0mP8k0n6Q2o5q8R7L1J9j57O3N1m1J26j40J2P4k0
8034B6k5r2K6L9l2nqoL6L5L4L4j28O3k3J3m8m9J59Rj13L2M3l4MJ6j1Q2j94J78
8064F1p1L0M7j5k9K9j15N2P0p5lQ2j19M4k0oJ3R2j52J31j08J29j26J2M8N1K2r8
8092b4m6J08k9N1Jn4J8Lm3Ql5M7O3j10M1j0K5j8j2M4o2qj3J06k5K0j92J66j43
8121a23J16N8r4l5K3mQ1m7L2q8Q8%j6om6J17j0j4l7K4k6m5J05o2k9P4l6R6j08
$$ plain form
7914 -45 -21 9 -65 -43 23 67 -21 -98 -52 -35 32 -39 -47 15 -92 -29 43 30 86 -22 29 52 22 -70 55 37 -30 84 6
7943 6 23 6 76 -6 51 -86 7 31 67 -4 4 27 60 -65 -11 92 24 -31 -35 -15 -68 10 -36 -69 -80 -43 -49 -62 17 -26 -5
7974 -5 -19 63 4 -13 78 10 -65 12 5 28 -46 89 1 20 -90 -51 -45 -15 -18 -13 16 50 -31 5 -18 25 23 -13 -115 -45 67
8005 67 -29 56 -3 -9 20 -59 100 19 64 -16 -20 58 38 -18 64 -1 -89 8 39 58 -99 -36 15 -26 100 -40 -28 46 26
8034 26 1 -91 -65 -26 -58 -63 -71 -77 -41 -6 28 62 -66 -3 -26 -13 -61 -110 49 58 -55 -23 20 -14 -10 6 -5 77 -117 61
8064 61 -10 20 67 52 23 52 -63 -11 59 -16 -19 63 -56 -12 -32 -38 -25 67 -85 46 -62 67 -59 -47 1 52 74 -24
8092 -24 -70 38 9 60 61 7 25 28 -15 -7 -42 5 68 -42 -1 -11 14 -4 -16 28 -34 -42 -55 51 26 46 -146 20 -123
8121 -123 -7 51 -43 -78 -55 -59 22 -25 7 -81 7 7 -9 -15 -61 56 46 32 -5 19 -7 -52 53 -9 -38 36 0 96 -12
8150a2O2j02P8P6r8J1l4lJ3J1m1J26r5N1M7j09M4L3k3j14J3J51J5p2j0l6L2L2
8178D6n4K6o8J40q2M2K8kj51J59l2n2l
$$ plain form
8150 -12 50 -52 26 102 4 15 -19 -22 -9 2 -39 87 -8 43 90 -19 25 58 35 -79 -66 85 100 28 18 -18 14 46
8178 46 -8 18 -50 90 8 50 78 76 -75 84 52 0 -3
8191c
$$ Imaginary data points
##PAGE= N=2
##DATA TABLE= (X++(I..I)), XYDATA
0@%%%%%%%qJ6j6J6j6K4l2M0n6P2q8J04j28J58j90K24k61L07l58M16m85N62o46
30c45P40q46R62j091J235j394J569j759J970k202K452k726L029l360L717m108
46b157M537n007N520o079O698p381Q132q964R894j0939J2119j3466J5020j6833
60h906J8983k1578K4784k8865L4259m1760N2971p1731J10701l23402M86870K04701
72D37027r59076M98863L69559n00903m8532L48295n1438j26463j54543K26684
82C9473J88852l75250k5270M40531k78296k35930L83699J1744k78208P7325R6597
93D5267L3928q4471j05670K03316K1758k96128J86346K09742k92879m0591K27873
104A08491n3907r3964J0374P4302L3906j72137M0707K33773j97470j40555K65929
$$ plain form
0 0 0 0 0 0 0 0 0 -8 8 -8 8 -8 16 -16 24 -32 40 -48 56 -72 86 -104 120 -141 166 -192 224 -261 301 -345
30 -345 395 -451 511 -580 655 -739 830 -929 1041 -1161 1291 -1435 1594 -1766 1951 -2157
46 -2157 2380 -2627 2893 -3186 3512 -3869 4263 -4701 5193 -5746 6373 -7093 7927 -8906
60 -8906 10077 -11501 13283 -15582 18677 -23083 29888 -41843 68858 -254544 232326 437027
72 437027 -522049 -23186 346373 -154530 -203062 145233 93795 -32668 -187211 39473
82 39473 228325 -146925 -172195 268336 -9960 -245890 137809 149553 -128655 -51330 45267
93 45267 79195 -5276 -110946 92370 114128 -182000 4346 214088 -78791 -119382 108491
104 108491 54584 -39380 -29006 45296 79202 -92935 -52228 181545 -15925 -156480 109449
115A09449m1997j70233J41280j943o8543O1253q5033O2009J29898k57227J4247
126a06840L17128k43898j64740L60715q5108k91161K42397J23010k39547k172
136i0216J53623k4352j06692J9883J24163n9588j42530J37342R9923j87653n070
147h1167J67121p8867r7219J12318L4113r9615n975P8246O347o9573K254O9660
159C7643k7715n4746N3663L1898n3921j9913M3414L1902m8036l6138P6027Q628
171D2706r6203M7664Q4233r4703l8824J03078p810p5095L0796M2280k8691l1333
183b1902K1249M4379l0346o0085N6046N3606q4566k1334R5189k3514q5236N4276
195b238O5954p0279n3167P9592L8154r4327j2728J05051k9833j02750P1617Q1072
$$ plain form
115 109449 67452 -102781 38499 36556 -31987 29266 -55767 6242 136140 -121087 -106840
126 -106840 210288 -33610 -198350 162365 77257 -213904 28493 151503 -88044 -90216
136 -90216 63407 39055 -67637 -47754 76409 16821 -125709 11633 111556 -76097 -81167
147 -81167 85954 7087 -90132 22186 56299 -43316 -49291 28955 35302 -34271 -32017 37643
159 37643 9928 -44818 8845 40743 -13178 -33091 10323 42225 -5811 -41949 34078 42706
171 42706 -53497 -5833 78400 -16303 -55127 47951 40141 -34954 -4158 38122 9431 -21902
183 -21902 -653 43726 13380 -46705 9341 62947 -21619 -42953 52236 28722 -56514 -2238
195 -2238 63716 -6563 -59730 19862 58016 -36311 -49039 56012 26179 -76571 -4954 76118
207G6118j02826m8307J14604Q953j11420K6893R8920o0027q2081Q7856N7487j08292
219d2122k2401J13531j9921r7106N4229O8749o9823m2491P2164K8386p2346j7361
231d6512Q0094k154q2983L3603P4378o1346n1218P7206K5868p5986m116P0649
243C7483j0746o6146K8480O4756n0331n5247P5368L0439q6603N604P7673l5088
255A5642n4323M7895L4381m8834k5830N1557J9122n9521l814O2806k0343n5768
267c7030M1177L7866n1276k1906N0739J0179n0242k770N1772j0592n6241L1446
279f878M9985n5380l1276O7351L048o4002J9494M8679l1310l6951L6619K9695
291B9074m5004k1065N3742M647n6727J6737M8541l3113l4213M0797K1614m1959
$$ plain form
207 76118 -26708 -75015 39589 48542 -62878 -35985 62935 2908 -79173 8683 66170 -42122
219 -42122 -64523 49008 29087 -68019 -13790 54959 -14864 -57355 14809 43195 -29151 -46512
231 -46512 33582 31428 -51555 -17952 56426 -4920 -56138 21068 46936 -29050 -33166 37483
243 37483 26737 -39409 -10929 53827 3496 -51751 23617 54056 -32547 -26943 50730 15642
255 15642 -38681 9214 43595 -5239 -31069 20488 39610 -19911 -23725 39081 18738 -37030
267 -37030 4147 42013 -9263 -31169 19570 29749 -20493 -23263 28509 17917 -38324 -6878
279 -6878 43107 -12273 -43549 23802 26850 -37152 -17658 31021 -289 -37240 -621 29074
291 29074 -15930 -36995 16747 21394 -35333 -18596 29945 -3168 -37381 3416 25030 -16929
303a6929j2097M3212M921m5784P495M8646k4537m3037M3123K8976n2698q047N1789
316B5033p705m3550J8836L7942k7057l2248L8228K3960m6968q139M9805r055m3215
329b4133K2898L3492l0774k3846L5141J6111l8828p733M2030m054m2848J8033
341d511L8048l2924k6965M0908J2153m2871k90M0241j0521l8072K0165L3495l2813
354c957k5040M1502J0333m5070M106M1296j7203l5310K6023K7546l4157j9150
366b9081L9547Q321m3082L772M3465j8146l9519L2472K9981m3179j5967M8709
378A7293O41m8076J4454M4552k8766l5316M1609K2418m8411o102N0122q426m5861
391b9869K2288M0002l4244k9019M4917J5089m8762J066M7777j5196m0618K6951
$$ plain form
303 -16929 -29026 14186 19107 -26677 -19182 29464 4927 -38110 5013 33989 -18709 -26756 25033
316 25033 17328 -26222 -7386 30556 3499 -28749 9479 33439 -13529 -21668 28137 19082 -24133
329 -24133 -1235 32257 1483 -22363 12778 28889 -9939 -17672 24358 20304 -22544 -4511
341 -4511 33537 613 -26352 14556 26709 -16162 -16452 23789 13268 -24804 -4639 28856 -3957
354 -3957 -28997 12505 22838 -22232 -18126 23170 5967 -29343 -3320 24226 -9931 -29081
366 -29081 10466 18787 -24295 -20523 22942 4796 -34723 -2251 27730 -15449 -31416 17293
378 17293 17934 -30142 -15688 28864 98 -35218 6391 28809 -19602 -25704 24418 15992 -29869
391 -29869 -7581 32421 -1823 -30842 14075 29164 -19598 -18532 29245 14049 -26569 382
403C82L1142l4030j9950L7703R783l7461k090L7772n621l8169J5211L6284k6826
416D130l0277L7163J8801m3463o217M4232p184m1477J7865L4871k6462k8539L1566
429E009K1807l7771j5417M3703M266m9248J0530M8002k7281m1277M0632K8831
441C1786n0684j3208N4476m339n2619K0354M5020l2910l5085M1808K4675m9431
453b0157j1358N5188n423n5724K6076M8347m5063l0146N6883O649n5428J6854
465a3302M2262k9044k3751K9922J1537k3558p574K1254Q571k4881l483K9536o420
478A1069k7535J7343J9801k2312r338K0813L023j6617j478J5037K012j7564P2
491e674K1241p165k1876J5232J7525k2241j1176K6678J919k9056P898K7199j9920
$$ plain form
403 382 31524 -2506 -22456 15247 25030 -12431 -14521 23251 17630 -20539 -5328 30956 4130
416 4130 -26147 11016 29817 -13646 -19863 24369 17185 -24292 -6427 28444 1982 -26557 5009
429 5009 26816 -10955 -26372 17331 21597 -27651 -17121 30881 3600 -37677 2955 31786
441 31786 -18898 -32106 22370 18031 -34588 -14234 30786 -2124 -37209 4599 29274 -20157
453 -20157 -31515 23673 18250 -37474 -11398 36949 -8114 -38260 18623 25272 -30156 -13302
465 -13302 28960 -84 -23835 6087 17624 -5934 -13508 7746 16317 -8564 -12047 17489 11069
478 11069 -16466 877 20678 -1634 -10972 9841 12864 -3753 -5231 9806 11818 -5746 -5674
491 -5674 15567 8402 -13474 1758 19283 -2958 -14134 12544 14463 -14593 -6695 20504 584
504E84j9898K7449O770k8045L752K1832r018j6825Q274J7298j1294k1216K1286
517I49J8562l6123m371M4213j9294l7711M0294J6838m7858P457M0032k3506k5110
530b5628K8351J3755k7980p065L0115J12l2473J1934L1013k5623j9799L4486M517
543A5715l3224R643K5845j6541j6020J8293R912j7199n456J7157K218j5731Q43
556d545J4292j749j3177J333J6304l448k1456J2502K2101k5662j3027L4437l819
569A4086l1731J7749J9435k1513q594J6507N265j2765r385J6170J0739k6430l712
582a4179L3114j1556l0853K4851J9287l0845p917K9724K67k9177M655L0444j3344
595D471l1052K6342K3619l8343q239M1833r234l6117K2242K5039k8036j4300L0061
$$ plain form
504 584 -19314 8135 14905 -13140 -9388 12444 3426 -13399 -5125 12173 879 -20337 949
517 949 19511 -16612 -20983 23230 3936 -33775 6519 23357 -24501 -17044 22988 -518 -25628
530 -25628 2723 16478 -11502 -18567 11548 11660 -20813 -8879 22134 -3489 -23288 11198 15715
543 15715 -17509 -7866 17979 1438 -14582 3711 13623 -3576 -9032 8125 10343 -5388 -4545
556 -4545 9747 7998 -5179 -3846 12458 9010 -12446 56 22157 -3505 -16532 17905 14086
569 14086 -17645 104 19539 -1974 -10568 5939 11204 -1561 -10946 5224 15963 -10467 -14179
582 -14179 18935 7379 -23474 1377 20664 -10181 -18098 11626 11893 -17284 -12629 17815 4471
595 4471 -26581 -239 23380 -14963 -23202 18631 9397 -26720 -4478 20561 -7475 -21775 8286
608H286N220l0075M435K7767j3357k1053K0204J1596k0011l008J5538J379j1838
621d917l085J4253L679j9714K951K3170j3418j8314K2195Q639k3899J380K0430
634A3350o393j6171Q508J4872j1728j3309J7049Q495k1127m40K0685p393j6407
647a0009J1451J0843j2599p572J2485N729j4459m010J7197j189j9035P728J6580
660A3140j4304j2317J8289O019k0859r5K1356p662j9637J4863J4046k0490o162
673a3813K1733k169j9605Q286J5491j2406j0964J4846O562j5818k088J6131k295
686C891j4812O405J3121r500j0167J2123P706j3757m459J6365L44j7365N741J6852
700A2488j1798j2253J6284O979j7854r99J8112m059j6742R605J3866j3948q973
$$ plain form
608 8286 13506 -16569 -12134 15633 2276 -18777 1427 13023 -6988 -9996 5542 6921 -4917
621 -4917 -8002 6251 9930 -9784 -6833 16337 2919 -15395 6800 15439 -8460 -7080 13350
634 13350 6957 -9214 -706 14166 2438 -10871 6178 14673 -6454 -6894 13791 6398 -10009
647 -10009 1442 12285 -314 -7886 4599 10328 -4131 -8141 9056 7867 -11168 -3440 13140
660 13140 -1164 -13481 4808 10827 -10032 -10127 11229 3567 -16070 -1207 12839 -7651 -13813
673 -13813 7920 5751 -13854 -5568 9923 -2483 -13447 1399 7961 -7857 -9945 6186 3891
686 3891 -10921 -4516 8605 -895 -11062 1061 8767 -4990 -9449 6916 7260 -10105 -4364 12488
700 12488 690 -11563 4721 11700 -6154 -7153 10959 6900 -9842 -237 13629 -319 -9292
713i292J6920L133j7126K389J5567o799j2696R518R733j1750o974J3268L634j4841
727e316m0J5401n207j4361R511J1050j3252p503J5225K547j6234J716J5781p079
741B239j4042J1365J0253j4933n953J6635K85j6704N014J4497r518j1050J2261
754C49P049j3618l457J4396j21j4637M582J3761q590j1374J2746P402j4736k609
768h857J5813k030j4553O423J2951r840r881J3253O560j5445j417J6579m061j4593
782i098R164J1189j1799o975J3214L182j3309J84J3364l527j2826P378J0839j0680
796C00p746J2946L702j4050K42J3517m053j2497P053J0803j0609q267J3229M087
810H657j5407Q27J4675o062j2371R006R214j1619o107J2951K430j4129J422J3699
$$ plain form
713 -9292 7628 10761 -6365 -3976 11591 4792 -7904 1614 11347 -403 -7377 5891 9525 -5316
727 -5316 -5356 10045 4838 -9523 -12 11038 -2214 -9717 5508 8055 -8179 -6463 9318 2239
741 2239 -11803 -438 9815 -5118 -11071 5564 5849 -10855 -5841 8656 -862 -11912 349
754 349 7398 -6220 -9677 4719 4598 -10039 -5457 8304 -286 -11660 1086 8488 -6248 -8857
768 -8857 6956 4926 -9627 -3204 9747 -93 -9974 3279 9839 -5606 -7023 9556 5495 -9098
782 -9098 66 11255 -544 -7519 5695 8877 -4432 -4248 9116 5589 -7237 141 10980 300
796 300 -7446 5500 9202 -4848 -4606 8911 4858 -7639 -586 10217 -392 -8659 4570 8657
810 8657 -6750 -5923 8752 2690 -9681 -675 8539 -3080 -9187 3764 6194 -7935 -6513 7186
824G186n848j2053R455R155j2607m949J3799N78j3588L431J2317o854j0058R741
838b95P451j1946l509J3222n72j2474M437J1094p294q530R918O003j1698j936
852f129J2744k194j1455O290R154q823n412R744K494r135m41R119j129r248L573
867h48R190o619p839J0241M049j2163P56J1518n110r008P261N763q109l736Q405
882C751J663q910k24R429k534r786N456Q684r165o269J1947J501j3005L240J1480
897G258p627q539J0003M403j0434j349R614o38r211J780J0045m472j0575R039
911g03Q691j3622l347J5975l617j3973R500R218j1780l655J1169L31r005R34Q437
926D553j167r163L396J0232p092q778J1807M618j3937J324J3112o126r525Q983
$$ plain form
824 7186 1338 -10715 -1260 7895 -4712 -9661 4138 4716 -8872 -5441 6876 22 -10036 -295
838 -295 7156 -4790 -8299 4923 4351 -8123 -3686 7408 114 -8416 1502 7505 -4193 -6129
852 -6129 6615 4421 -7034 -744 8410 -413 -5825 3919 6413 -2722 -3163 5956 4827 -4421 -848
867 -848 8342 1723 -6116 4125 8174 -3989 -3233 8285 3175 -5833 1428 7191 -918 -4654 3751
882 3751 5414 -3496 -3720 5709 3175 -6611 -1155 7529 -1636 -7905 4042 5543 -7462 -4222 7258
897 7258 -369 -8908 1095 5498 -4936 -6285 3329 2691 -6520 -4740 5305 833 -9742 -703
911 -703 7988 -5634 -8981 6994 3377 -10596 -1096 8122 -3658 -7313 3856 4187 -4818 -3884 4553
926 4553 3386 -5777 -2381 7851 759 -8019 3788 8406 -5531 -4207 8905 2779 -6746 2237
940B237N238q746k268P693J092p082r23P863J13r666K606J0399p151q860J1224
955C769M567j3634J103J2303n915q864P561N071p339l452O302L396p466l581J0215
970D036Q27j2989M346J2660j0906q153J4385J245j4014M480J0355p173o378P112
984a67M314o760l807P769L073r849j52J1438m270j0373R045O545j1227j455J1002
999E126k507q501M818O278n623m105O088K904o022j584O352P52o957J019P820
1014E858l641p114O770M939q932j228R086k516o953M319M620m545l163L953L050
1029D503m770l232O918J464r112K320Q747o816n792Q791J465q460J228O657k692
1044A219n656L311N137m653m812O552K763q127j70Q507l115p479N734N095p103
$$ plain form
940 2237 7475 -1271 -3539 4154 5246 -1836 -2759 5104 5217 -4449 -1843 8556 1405 -7455 3769
955 3769 8336 -5298 -4195 8108 2193 -6671 890 5961 -1378 -4830 1472 4868 -2598 -6179 4036
970 4036 4863 -8126 -3780 8880 -2026 -10179 4206 5451 -8563 -4083 6272 -901 -7279 -167
984 -167 4147 -2613 -6420 1349 4422 -5427 -5579 5859 1589 -8784 261 6806 -4421 -5876 5126
999 5126 2619 -5882 -1064 5214 -409 -4514 1574 4478 -1544 -3128 3224 3976 -2981 -1962 5858
1014 5858 2217 -4897 1873 6812 -2120 -3348 5738 3222 -3731 588 5208 663 -2500 1453 4503
1029 4503 -267 -3499 3419 4883 -4229 -1909 6838 22 -5770 3021 4486 -3974 -2746 3911 1219
1044 1219 -4437 -1126 4011 -642 -5454 1098 3861 -4266 -4436 4071 956 -6523 -789 4306 -2797
1059b797k950Q075K95p866K058P165m297n417N920L491o350j702O885J00o853
1074d243J766O904l877n719O305L578p132q73O998j000n996K405N348l211m787
1089c534M803L897o249k052P378m66p232L237N780m913m091N825K356o105j079
1104b445O467p69o811K957N699m869m240O002K115o587k32O125j410n977K985
1119i90M990m596l934N689K264o665k99O532k133n740L630M585m934l217N936
1134A118J551o566M68O459k516n522M366L940n407k106N898N59n830J203N332
1149B947k300m614L601M030m909k578O320N59o379J928N666l537m112M642K717
1164C981m928j305N184L23n559J255N823l428m805N402K675o174m01N713j454
$$ plain form
1059 -2797 -5747 2328 2623 -5243 -3185 3980 -317 -5734 186 3677 -2673 -4375 2510 2610 -4243
1074 -4243 -2477 4427 550 -5169 1136 4714 -2418 -3291 3707 2707 -3289 -884 4464 1253 -3534
1089 -3534 1269 5166 -1083 -3135 4243 3777 -3455 -218 5562 649 -3442 2383 4739 -1366 -2445
1104 -2445 4022 3253 -3558 -601 5098 229 -4011 1991 4106 -2481 -2713 3412 2002 -3975 -990
1119 -990 4000 -596 -4530 1159 3423 -3242 -3541 2991 858 -4882 -1252 3333 -1601 -4818 1118
1134 1118 2669 -3897 -3429 3030 514 -5008 -642 3298 -2109 -4215 1683 2242 -3588 -2385 2947
1149 2947 647 -3967 -366 3664 -1245 -3823 2497 3056 -3323 -1395 4271 734 -3378 1264 3981
1164 3981 -947 -2252 2932 3255 -2304 -1049 4774 1346 -3459 1943 4618 -1556 -1957 3756 2302
1179B302m705K162M087k975l741L962L092n677j264O154j292n610L032M087m228
1194f14k701M308J696m812r72N314o43n715K733M843m892k749N492N79n135P18
1210b550M512j549m251K475M126l945l178N524J269o023J334N185k771l711L376
1225a77K837l630k124M354J476n254L45N784k527m696M392K860m911q71M701j82
1241B377m262J058M222j976m036L668K985m929j226N301o35m765J925L972k944
1256G35l286L795K053m350j112M905n87m870K201L802l467k777L892J602m328
1271a792p28M623o68m716K109L971l584k742M418J023m542K44M219j216m096K369
1287a108L396l348k490M282J222m687M16M305j569l682K598L185l601j930M185
$$ plain form
1179 2302 -2403 -241 3846 871 -2870 1092 4184 -1493 -2757 3397 2105 -3505 -473 3614 -614
1194 -614 -3315 993 2689 -2123 -3095 2219 1576 -4139 -1406 3437 -1455 -4204 1288 1867 -3268 -2550
1210 -2550 1962 413 -3838 -1363 2763 -1182 -4360 1164 2433 -3590 -2256 2929 158 -3553 -177
1225 -177 2660 -970 -3094 1260 2736 -2518 -2173 3611 1084 -3612 780 3640 -1271 -2142 2559 2377
1241 2377 -1885 -827 3395 1419 -2617 1051 4036 -893 -2119 3182 2547 -2218 -293 3679 735
1256 735 -2551 1244 3297 -1053 -2165 2740 2153 -2717 -516 3286 -181 -2958 934 2536 -1792
1271 -1792 -2520 2103 1435 -3281 -1172 2799 -785 -3527 891 1914 -2628 -2384 1835 619 -3477 -1108
1287 -1108 2288 -1060 -3550 732 1954 -2733 -2317 1988 419 -3263 -665 2520 -1081 -3011 1174
1302A174R44m560O95M575k063l806L383K554l782j250M047K99l994Q39L995j883
1318A167l463K963K822l997j338M383k05m131J452L614k464k795K973J822l488
1333f85r25L709j29l771J022L576k298l046L149K113l919r54M157p12l913J742
1349h84L242k811k311L246J219l564j94L365o23l410J497L027k388k495L367J573
1365A856m057j95M175j299l512K663K391l231j235L221M61k950K74L057q42k978
1381b201J741K957k893j894L781N54l882J065L465k227k226K748J410k811o63
1396a076K680K62k822M07K995j362k719K401J976l242r66L616k99l502J305K882
1412B536k364j928K743R42k853l57K659l03k776P29K727j520k778K797J710l612
$$ plain form
1302 1174 2118 -2442 -1747 2828 765 -3041 342 2896 -886 -2136 1911 2210 -1784 -945 3050 1167
1318 1167 -2296 667 3489 -508 -1846 2537 2332 -1799 -347 3267 803 -1992 981 2803 -685
1333 -685 -1610 2099 1970 -1801 -779 2797 499 -2547 602 2715 -1204 -2158 1999 1287 -2626 -884
1349 -884 2358 -453 -2764 482 1701 -1863 -2057 1308 685 -2725 -1228 1799 -589 -3084 283 1856
1365 1856 -2201 -2396 1779 480 -3032 -369 2022 -1209 -2444 777 1238 -1712 -1438 1619 777 -2201
1381 -2201 -460 2497 -396 -2290 1491 2045 -1837 -772 2693 466 -1760 988 2398 -413 -1076
1396 -1076 1604 1866 -956 -549 2446 1084 -1635 766 2742 -500 -1466 2150 1851 -1651 -346 2536
1412 2536 172 -1756 987 1929 -924 -1281 1378 1075 -1701 -972 1755 235 -2543 254 1964 -1648
1428a648n30L769r82l288K124K117k506j288K730M12k500j50K712n09k781J316
1444a002K607k332j763L212P20l431N15L176j571k353K275J654k478p87K666K98
1460A406k637M58K656j185k367J796K170k679j019L084O3l180J126K708j828j998
1476a426K335J195k481m88K363R4k613N70K492j404k160K108J570k829p55L068
1492A639n25k754J235K171j979j460K112R15k504l85K533k19k624J028K282j883
1508d18j810K484R90k890O3K723q94k335J565J806k021j166K206P45k516P9K472
1525A083n81k329J509J973k095j235K531M14k615N20K398j097k050J818J444j994
1541c06p32K164L26k342M48K267j162j953J791J449k258o10K433k07k319P47K139
$$ plain form
1428 -1648 -2178 1591 609 -2679 -555 1562 -944 -2232 498 910 -1590 -1740 972 463 -2318 -1002
1444 -1002 1605 -727 -2490 722 1442 -1989 -1474 1702 131 -2222 53 1707 -771 -1558 1108 1406
1460 1406 -1231 -773 1883 698 -1669 127 2297 -382 -1401 1683 1746 -1434 -308 2400 572 -1426
1476 -1426 909 2104 -377 -865 1498 1592 -1021 -451 2041 637 -1523 585 2155 -674 -1429 1639
1492 1639 1114 -1640 -405 1766 -213 -1673 439 1354 -1150 -1535 998 779 -1845 -817 1465 -418
1508 -418 -2228 256 1246 -1644 -1581 1142 248 -2087 -522 1284 -737 -1903 303 1048 -1468 -1389 1083
1525 1083 502 -1827 -318 1655 -440 -1675 856 1270 -1345 -825 1573 476 -1574 244 1688 -306
1541 -306 -1038 1126 1452 -890 -442 1825 663 -1290 501 1950 -308 -918 1515 1308 -1011 -264 1875
1558A875j398j611J738J070k191n31K299j38k348Q46J981j534j588J994Q67k290
1574i59k18K175m96k007R48J741j443j453J863P29k145j97K201m08k097J115J758
1591A107j716j241K005O83k110J21K056o65j892J369J461j698q43J921M37j975
1607i80P6K210p77j816J356J478j820q53K175J40k002M32J863r79j482J415J204
1624A640j681p64J991J33k086M88J813j051j433J587Q15j752m82J852j66j824
1640i20O78J616j140j355J486Q03j820k91J850l76j722P04J414j063j334J630
1656A60P82j906l61K118n41j700R45J357j317j013J503O64j737j43J836n14j643
1673a510J153J324j409p99J624L34j618J27J731n28j655J128J307j535p31J854
$$ plain form
1558 1875 477 -1134 604 1674 -517 -1048 1251 1113 -1235 -389 1592 58 -1530 464 1331 -959
1574 -959 -1177 998 502 -1505 -557 1184 -259 -1712 151 880 -1265 -1462 739 331 -1766 -651 1107
1591 1107 -609 -1850 155 838 -1272 -1151 905 240 -1652 -283 1178 -520 -1363 558 995 -980
1607 -980 -904 1306 529 -1287 69 1547 -273 -1126 1049 1189 -813 -381 1482 503 -979 436 1640
1624 1640 -41 -805 1186 1319 -767 -279 1534 483 -950 637 1452 -300 -782 1070 904 -920
1640 -920 -242 1374 234 -1121 365 1168 -652 -943 907 531 -1191 -487 927 -136 -1470 160
1656 160 942 -964 -1325 793 252 -1448 -503 854 -463 -1476 27 691 -1046 -1189 647 133 -1510
1673 -1510 -357 967 -442 -1241 383 717 -901 -774 957 429 -1226 -98 1209 -326 -1057 797
1689G97K47j813L96J703q71j380J156J152j551n20J603K62j775L65J512p92j264
1706g73J310R01j563n69J689j06j637N75J471j112j056J223O29j446l51J570j39
1723F16j610M92J496j044j210J473N83j590j85J650m89j333O82J243j044j053
1739a323J474M25j505o8J596n46j334Q78J142j153q23J470M04j541Q9J537n45
1756A77j374J175R24j303m13J410P9j298K74J283n23j181R96J045j407n81J630
1773I13L6j545N71J210q35r48J045O64j233l66J313L7j543N05J322r28r88J238
1791D68M89j231l49J404k20j434N35J256r33j000J297L60j356o8J351l82j180
1808i93N40J007q17q49J099O35j414j26J469m64j342R75R29j227m46J333J09j160
$$ plain form
1689 797 1044 -769 -373 1330 459 -921 235 1387 -164 -684 919 1181 -594 -229 1283 491 -773
1706 -773 537 1438 -125 -694 995 889 -748 -173 1298 186 -870 353 982 -464 -815 755 616
1723 616 -994 -502 994 -50 -1260 213 796 -794 -979 671 182 -1151 -469 774 -270 -1323
1739 -1323 151 576 -929 -997 599 53 -1281 -403 739 -414 -1237 233 637 -904 -815 722 177
1756 177 -1197 -22 902 -401 -814 596 675 -623 -349 934 411 -770 226 1271 -136 -717 913
1773 913 949 -596 -25 1185 350 -598 447 1111 -122 -488 825 862 -681 -176 1146 218 -770 468
1791 468 957 -274 -623 781 561 -873 -338 918 -15 -1015 282 642 -714 -782 569 187 -993
1808 -993 -453 554 -263 -1112 -13 622 -792 -918 551 87 -1255 -280 649 -578 -1024 309 418 -742
1826g42J14J181l57j144P40R78r69o86J419P8j319K80J402p71r88J068P10j188
1844a94k67J131J9j067K38J124n83r28Q15Q55j272l34J282R6j492M80J159q88
1862A74p84J037M83j197p4R67j27j060L01R54o41p80Q67N49j250k33J340k35j275
1881i84N59J129j039n40R59K26j087M9J174l48j004M74R64r04p10J176L00j171
1899g77M7J297m84j116R88O82j088k25J045Q7j014J59J070m70q12Q03O45r33m78
1918e74J147O1j112L63J087p07p60Q28O74j116j70R99Kj059L63R19n54r05Q16
1937C02N77j010l67J175j58j209N17J044q70o98R46M67j294Q4Q98j45r05M02Q84
1956F40q92o88J007M62j203k8J196m23j093P86P49q83m84R48J86r09NR90l37q83
$$ plain form
1826 -742 -628 553 196 -948 -208 770 -199 -885 534 612 -707 -427 975 204 -784 284 994 -194
1844 -194 -461 670 689 -378 -140 984 401 -527 288 1143 -129 -463 819 915 -577 -97 1062 174
1862 174 -610 427 910 -287 -361 606 479 -581 -280 674 33 -747 120 669 -581 -814 526 291 -984
1881 -984 -425 704 -335 -875 84 310 -777 -728 446 98 -906 -432 532 -372 -1082 94 394 -777
1899 -777 -730 567 83 -1033 -45 637 -451 -676 369 456 -558 -399 671 201 -611 192 837 -96 -574
1918 -574 573 634 -478 -115 972 265 -495 333 1007 -109 -279 720 722 -337 26 945 391 -514 302
1937 302 879 -131 -498 677 519 -690 -173 871 1 -697 249 716 -578 -494 404 259 -646 -244 640
1956 640 -252 -940 67 529 -674 -702 494 71 -1022 -236 513 -370 -854 94 280 -629 -624 366 29 -854
1976h54O04Q88r63l97J045J62j104J73J048m24r99Q70O60q42m23J041P8j041L60
1995a18Q04l37q71P27P17j029k61J155j21j161M73R07o80o81Q79L54r84q4Q33
2014E22j00q26K45R15n55p62P72M84j092L9R08j74j039M40P66q03m84P88L37q46
2034d65j54J025l51p90M74O46p04m41Q58K42j188K37R82m26p35O71O49q67m00
2053g37J029Q6r37J24R12l11q38P47O05q72m32J085J00j036K08R76m95n72N87
2072B29N13p67l10J055r5j025L73Q55n80p00Q09L53q20j94Q40o4r15L75P86o58
2092F0n10P77J88q32j14J055l81q54M22O54n71n00O99K87r79J13Q79m07o84L96
2112c02P71p44m45Q64J33q71n9R58k86r24P74N59q60k35Q51R8p34P8P72l18p61
$$ plain form
1976 -854 -250 638 -325 -722 323 485 -619 -446 602 178 -821 49 709 -133 -556 485 563 -478 -118
1995 -118 686 349 -522 205 922 -107 -368 787 666 -495 -22 885 205 -476 403 757 -227 -311 522
2014 522 422 -404 -159 756 201 -561 211 695 -397 -358 550 376 -663 -223 543 -260 -744 44 381 -465
2034 -465 -619 406 55 -735 -261 385 -319 -760 98 340 -848 -611 371 -55 -790 -119 530 -337 -737
2053 -737 292 378 -559 -435 477 166 -672 75 680 -192 -624 461 561 -475 -267 709 214 -358 229
2072 229 742 -25 -335 720 625 -400 -27 828 248 -452 357 710 -110 -304 536 472 -443 -68 718 60
2092 60 -450 327 515 -317 -431 624 243 -611 -189 465 -106 -606 93 380 -599 -486 393 -14 -698 -302
2112 -302 469 -275 -720 144 277 -594 -653 305 19 -905 -131 428 -432 -667 184 282 -452 -374 398 80 -681
2133f81N44O77q49k68R77Q4r18L06Q00n20n94O61N58q49k42Q36K6q97K98P89m50
2154B88o89Q60K10p15j94Q26k2r99M06P80o25n96Q41J76q78K9Q61k25p79L04O23
2175D82m38o56P22L13r23mR14k34r52M95O47o50l00O18J97p67n8Q74k55q05O08
2196a72N62o43m88Q42K25q70J67O90l26o38N96O50q63l27R66J9q63K89P48m81
2216H3n03N60L46n03l14P54Q6q49K67Q75n44o95P88L20p86o4P36j24p85L58O18
2237F24l99o47O59M05q06j25P46j39p96L65P02o80l77N92L64q85q1P41j45p91
2257f73O17M94n73n30P06R7n82k8O53j75o83M65O58p54l78P82K7o57J58O69k61
2278C2o94N83L39m74k71O77J39p56P6Q30m05n96O71L95p11J2P17j82n30p4O91
$$ plain form
2133 -681 -137 540 -309 -577 400 484 -434 -128 672 152 -442 219 777 -72 -314 522 548 -349 -51 738 288
2154 288 -401 459 669 -46 -240 586 564 -435 -29 751 126 -470 371 547 -331 -302 559 334 -445 -141 482
2175 482 44 -612 110 423 -500 -504 410 176 -776 -281 366 -284 -584 34 231 -536 -594 280 25 -780 -172
2196 -172 390 -253 -741 101 326 -544 -377 313 -13 -651 -55 595 -268 -595 371 390 -473 -184 564 83
2216 83 -420 140 486 -17 -331 423 509 -340 -73 802 258 -437 351 671 -115 -179 557 433 -352 6 624
2237 624 225 -422 237 642 -164 -289 457 318 -478 -113 589 -91 -468 124 488 -397 -478 263 118 -673
2257 -673 -56 438 -135 -665 41 138 -444 -472 181 6 -677 -212 446 -308 -686 96 123 -534 -376 293 32
2278 32 -662 -79 260 -214 -485 192 331 -425 -349 481 76 -520 151 546 -165 -153 564 382 -148 -222 469
2299D69k95m81O00L49o64j58O62k8p38K54O64n90k55N24L27r21J01O28k20n82
2319c54K34O93n11n00O14L01q37k9P11r6p06L19N38p10j68O29J30o98K3N87k39
2340f9n54M00M49n19k40N39J81q27K25O27k18n70M50M54n87l05P89Ro68J74O89
2361D29l59l93M08L03m46k59O37J06o55K17N24l16n82O16M04o99j40P16r7o35
2381b21L06M65l19m21M30L64o66j43P07j77n83J75O92m49n38N43K27o49k8O05
2401C20j06p06M21M91n00m11N58K05n79j54O63j68n58K88N76o84l59P21J78o48
2421d52P2O01k45n67M24M88n42k51N42J03n31L1N55j00o09M95L21m12l53P72L2
2442C74p54K05O98m30l88M67K82m68j96N71M7n82O8P41l59n79N04M21o41k42P19
$$ plain form
2299 469 174 -307 293 642 -22 -180 482 454 -284 -30 634 44 -211 313 640 -281 -180 448 228 -354
2319 -354 -120 573 62 -438 176 477 -360 -389 322 226 -480 -161 377 -333 -501 128 258 -440 -417 170 -69
2340 -69 -623 -223 226 -293 -533 6 187 -640 -415 212 -6 -576 -126 328 -259 -564 225 234 -434 -260 429
2361 429 70 -323 85 388 -58 -317 320 426 -229 -12 512 196 -386 230 634 -65 -205 511 414 -221
2381 -221 85 550 231 -190 240 604 -62 -205 502 325 -258 -83 609 160 -378 165 392 -257 -285 320
2401 320 214 -492 -71 420 -80 -491 67 272 -307 -461 202 34 -524 -236 340 -344 -703 18 196 -452
2421 -452 -380 221 -24 -591 -167 321 -221 -472 70 173 -358 -327 228 128 -481 14 335 -77 -430 342 374
2442 374 -380 -175 523 93 -295 172 454 -14 -210 361 408 -174 -106 635 276 -303 201 622 -19 -261 458
2463D58J1p29K29N73m70k71L80J91n61r0O54j02n99K12N09m41m23N62K54q08Q7
2484c74N44k9o56L08M48l89l97N29J65o58M9P02k89l89K25M85m76l49O30J95o72
2505c98NP17k77n26L90M09n03j66M68Q7m12R5M60j98n06M37M07m97k02N20P6n70
2527a84K06L96l02l18M05L15n05j55M06K12o10O0M56k94k66M17J86n02k26O37
2547C34m6m95J90L40k66l58L25K12m19k17N75m1n84L38K97k03m33M46J91n70J6
2568c68N64o7o14K62L96l77k87M27K39n75J75M69k31n57M12L61l49l52O80Lm41
2589b30J56M69l08m28M08L85m31k90N33R1n24J13N27k76l37L24K79n18m4M33O0
2610C92m62J50M21k25m77M30K79n71j76N78o6m54Q7N07k68m28L53K23m78r1N23
$$ plain form
2463 458 469 -260 -31 542 72 -199 181 372 -189 -279 375 273 -326 -114 395 -46 -469 93 347 -461 -374
2484 -374 170 141 -515 -207 241 -148 -545 -16 149 -509 -460 242 -47 -436 -211 274 -202 -551 79 274 -398
2505 -398 -393 324 47 -479 -89 320 -183 -349 119 206 -206 -111 349 151 -355 82 489 -8 -210 310 386 -184
2527 -184 22 418 116 -202 203 518 13 -142 264 476 -134 -74 382 88 -178 239 425 -77 -303 334
2547 334 288 -207 -17 323 57 -301 24 236 -183 -400 175 134 -450 -112 185 -18 -451 -5 186 -384 -368
2568 -368 196 129 -485 -223 173 -204 -491 -64 175 -400 -225 244 13 -544 -132 229 -120 -472 208 211 -230
2589 -230 -74 395 87 -341 67 452 21 -269 264 355 -169 -56 471 195 -142 182 461 -57 -101 332 392
2610 392 -70 80 501 276 -201 229 508 -63 -239 339 273 -181 -94 413 145 -283 70 293 -185 -276 247
2631B47p6m72J31L89k76l46M18J63m93n3N51j82m22K29M38m76k34M28J47l61j16
2652c66N66k19l41J95M67m62k69N40R0m93P4M17j04m30M10J47k99l9L02J49n51
2673b16J93N06l43m06L87K58k48k36M28Rl82O8L13j11l80K55L39l66k07M76J6
2694C53n36J27M08k03n76O87J34n01p0M14j5n46K74L03k60k63L94J24n20qM20
2715A40m4m69J42M41l25k73L41K44n55k0N69k23l83L12K50k44k22K73J97m26n1
2736c26N28j23k94K17K97l66j77L89J08m52J19L39k11k89L64K48l31k53N90m8
2756C29l37m6M90l18k54L27J06k68j64M22k7l81J19L40k38k28K91J70m67q3M51
2777B34j51l04K43L33l77k91L19K31l72j30N11k89k75J62K97j81l72M35K0l43
$$ plain form
2631 247 171 -301 -170 219 -57 -403 15 178 -315 -368 183 1 -421 -192 246 -230 -464 -36 111 -250 -366
2652 -366 200 -19 -360 -165 302 -160 -429 111 201 -292 -218 199 95 -335 75 222 -77 -116 186 335 -216
2673 -216 -23 483 140 -266 121 379 131 -105 323 332 -50 18 331 220 -160 95 434 68 -139 337 353
2694 353 -183 -56 352 149 -427 260 394 -107 -177 237 222 -324 -50 253 -7 -270 124 248 -272 -280 140
2715 140 96 -373 -231 210 -115 -388 -47 197 -358 -378 191 -32 -415 -103 147 -97 -319 -46 151 -275 -326
2736 -326 202 79 -215 2 299 -67 -244 145 253 -199 -80 259 48 -241 123 371 40 -213 377 329
2756 329 -8 -54 436 118 -136 191 297 29 -135 287 260 -121 -2 338 100 -128 163 333 -134 -217 234
2777 234 83 -221 22 355 -22 -313 6 237 -135 -265 246 -43 -318 -156 141 -40 -412 23 43 -300
2797c00P0L12J1m47K76K54k03l29M09R0l46k5L82q0l72K79K02k76j36M36j03k88
2819a84jM21j57k04L3L39l61r2N05k9l71K5M52k83k37K78J71k44m6K32J0l56J07
2842HK64j38k64K13J75k61j40L10j2l86K05K71j72k90J72K27l07j03L63p3k59
2863a97m3M74l88j50L77k8k48j01L15lk83N6L34k25j05K28R2k87K0J56kj95J35
2886f8L13k57l10L95J35l58l1N31k86k60K52K33l05p3K18J12l06P3L97k77k76
2907a48J84L74l72j31L04L2l37P9M18l02l48M10M5j89j13K57L8k95P7K31j97k69
2929b52K61J92k52j87L11Qk80J03J78k25j38K44J48l12n1L07j22j22P6K27k62
2950a48q2J90J49l71P5K30k7m25K27K96k09j01K83j2l84K31K04n4k48K14J65j85
$$ plain form
2797 -300 -230 82 93 -354 -78 176 -27 -356 53 143 -203 -228 154 74 -298 -19 183 -93 -229 207 104 -184
2819 -184 -185 236 79 -125 -92 247 -114 -206 299 270 -101 -76 376 93 -144 134 305 61 15 247 257 -99 8
2842 8 272 134 -130 83 258 -3 -143 167 155 -231 -26 245 73 -217 -45 182 -125 -228 135 62 -197
2863 -197 -240 234 -154 -304 73 45 -203 -304 11 8 -275 -219 115 -110 -215 13 105 -182 -162 -6 -8 -203 -68
2886 -68 245 -12 -322 73 208 -150 -181 350 64 -196 56 289 -16 -89 129 241 -65 8 405 128 -148
2907 -148 36 410 38 -93 211 243 -94 -15 403 101 -247 163 208 19 -94 163 201 -94 -17 214 17 -252
2929 -252 9 201 -51 -238 73 81 -199 -96 82 -143 -281 -37 111 -201 -252 55 -67 -189 -113 114 -148
2950 -148 -230 -40 109 -262 -187 43 16 -409 -182 114 -95 -196 87 75 -309 -78 126 72 -176 38 203 18
2972A8j14K48R3m04OL72K2l97K61K84l39r8J92Q6l32J18K04p8k46J90K70k96p9
2995a9J41J05k83L1K50n9k62J35J94k70l6K39J2m14K40M1q2j93J83J31k68RK51
3018G6o1k35N7J92j50k31L38N0l13N3L55j57l17K48K84l74m7K31J96l57rL01q3
3041D7l83K89J59j23j61K81J92m56Q8J99O9l81K00J91j58j38Q0J78k66J33J80
3062B20o3k47J81J38j61j93L62m2l14J67K22k26r1J12R5j02j54K20l2k64J08K10
3084A46j59j74J57J88l51K0J94P8k59L2K45k58k73L43K11k92q1K09m2j42J19K22
3106A33k88j38L12K3j89K6K45r2k39K04O5o4j82K42J21l58Q5K56J8j86L7J27j79
3129b1p4L57l3l13J09J90p7j49K5K10k16j45K86Q5l04P4L35j87k66J63J87j99
$$ plain form
2972 18 -96 152 245 -159 -153 219 241 -156 105 389 50 -48 144 230 -102 16 220 142 -104 86 356 60 -19
2995 -19 122 227 -56 -25 225 166 -96 39 233 -37 -73 166 178 -236 4 45 -37 -230 -47 84 -184 -175 76
3018 76 15 -220 -163 29 -121 -352 -14 36 -277 -224 131 -26 -343 -95 189 -185 -232 -1 195 -162 -171 130 47
3041 47 -336 -47 112 -11 -172 109 301 -155 -67 132 201 -180 20 211 53 -85 -5 173 -93 40 220
3062 220 157 -90 91 229 68 -125 237 195 -119 48 270 44 -47 65 160 58 -96 124 92 -172 -64 146
3084 146 -13 -187 -30 158 -193 -173 21 99 -160 -128 117 -141 -414 -71 140 -152 -233 -24 -66 -208 -89 133
3106 133 -155 -293 19 42 -147 -121 124 32 -207 -3 62 -2 -184 58 179 -179 -94 162 180 -6 31 158 -21
3129 -21 -95 262 229 -84 25 215 138 -11 14 224 8 -137 149 234 -70 4 339 152 -114 49 236 37
3151C7j63K30k0k20O1K44j07l01K07J82j94j93K76L6l11J25J34n3k01J16J56k36
3173a95O6J18P1k57J40J84k25j47L07o8p7L5Q3J0j79L3J52n8j61K84J8k16L8J22
3197G8l2j83K29K2k7n8K4J11j88nK88j28k07J75P3j64n0K92j2k60J24O5%k12J25
3222H0N6j81m8J59J7k74K54Q9j56j76K73Q2k74j28L33n1k37K6L11k00q4J65N7
3245I3k39mJ52Q2l26J61P4j45l1J31J64l48l8K28kj85J24J82p3j70J65P5j81k4
3269a35J53K7k58K64Q6j54p1K07M0j67N5J52n4j86J70P3k18M1R6P4k45N3J54j63
3293fp1K16n6%p8R8L2k56J36Q9j04l7J30Q6k87L9K19r9j42L4R0l1j67J57n0j20
3319a78L4J57m4j52N4J96j29j50J14J22j61RO0J5j72J02K47k04r1J51O9j52J0
$$ plain form
3151 37 -126 104 84 -136 -75 169 62 -239 -32 150 -44 -237 39 75 -236 -111 23 -30 -231 -115 41 -195
3173 -195 -129 -11 60 -197 -57 127 -98 -245 62 -6 -83 -48 35 45 -134 -101 51 -7 -168 116 134 -82 -44 78
3197 78 46 -137 92 114 87 29 53 164 -24 -29 259 131 -76 99 172 8 -42 250 238 -22 102 167 167 -45 80
3222 80 136 -45 -93 66 83 -191 63 152 -4 -180 93 175 -99 -227 106 55 -182 -156 155 -45 -129 36 93
3245 93 -146 -150 2 84 -242 -81 -7 -152 -183 -52 112 -236 -274 -46 -48 -233 -109 73 0 -170 -5 70 -111 -135
3269 -135 18 45 -213 51 137 -17 -88 119 159 -8 47 199 145 -41 129 202 -16 25 121 195 -50 3 157 -6
3293 -6 -77 139 83 83 5 103 135 -121 15 104 0 -37 93 179 -108 -69 150 51 -91 -57 33 2 -165 -8 -58 -178
3319 -178 -144 13 -31 -183 -129 67 -62 -212 -98 24 -137 -128 -68 -53 -225 -123 124 -80 -171 -20 49 -103 -93
3342i3K18p4j63J25J75r6k06J69K1j38R1J52j53p7P7J07o2p8K07J8k41O2K28r9
3366A70j95J10R6k19M9J74k1k01P3J81k11qJ08j0q0j19K51l7l33K26M3r5j00J82
3390C4M6j74q4J90Mj54K4J63j25j50K25L1j75m0P6J13j43N8Q7r0n0J91n8k09O6
3415a44K58j82p2J30J4j23n0L34n0j86M5J93j19o3N8L0q4j3J97l0j50KJ67j20
3439D2o5J12J13k28M2R2J26k66L7J98r7j36J30k4k1j05J57m1k83J79J67k01r0
3462a62K09l5n3j25J41l7p0M3M3L4k09K21m0k5q5J46j4k31J88J43j22j20K05l8
3486Gj90N1J65j9j49P9P5k6p9J53J7k10P4J41o9j70K11O6j00r5J60lq3m6K38r1
3512A07j45Q4K02j56q0J39M8k12Q7J58q7j62J28J0j45l3K01q5k06J01J03Nj76
$$ plain form
3342 -93 125 51 -112 13 188 92 -114 55 76 -62 29 181 28 -49 28 135 73 -5 202 220 -21 41 269 170
3366 170 -25 85 181 -38 11 185 164 -37 36 217 6 -2 106 96 16 -103 148 111 -222 4 47 -48 -148 34
3390 34 80 -94 -178 12 16 -138 -114 49 -76 -226 -1 30 -145 -185 -109 4 -139 -81 6 -84 -134 57 -1 -210 -144
3415 -144 114 -68 -140 -10 4 -119 -169 165 115 -71 -26 167 48 -15 43 73 -11 -24 173 143 -7 -5 162 42
3439 42 -23 89 202 -26 16 108 234 -32 5 203 106 -30 100 76 55 -50 107 66 -217 -38 129 -72 -162
3462 -162 47 12 -41 -166 -25 -62 -132 -89 -46 -12 -221 0 -40 -65 -150 -4 -18 -249 -61 82 -40 -160 45 7
3486 7 -183 -132 33 14 -135 -56 19 -7 -86 67 84 -126 -52 89 20 -150 61 127 27 -68 92 89 6 -40 198 107
3512 107 -38 46 248 92 12 151 199 -13 74 232 145 -17 111 121 -24 -57 144 59 -147 -46 57 62 -114
3535a14J60k8Lj84K24J6k63J89O2q9l1M3j2j80P9J66L1k76J09J17j47J3Q4J64
3559A36k86P4J53j02j79J93L6r6l5R2L7r9J2J84p0j66J48k2J0j65K55J9j90J41
3583H0L0p6k0J7J54r4r4J66Mj84K2J54q5j55J44J50j51j33J25M0m5j05J61o2j02
3608e9J00Mj45j0R1R9k00Q4R0j36mM6J25k86J1K55m8j73L1J39o9p5J15J1j47K8
3634a23J37p9o1P8J52j30r4J80j82j5M5J32J4k08J31J73j50m1J67j14n6l1J89
3657A14K0k44J60J34j54kQ1O4j47r6K83j71p1J76Q4k25l6J39J1j31J5J90q0j07
3681GM5J00j25q9J77j2j12n7J71k09NK01M9k50k3K8J50l3j23K14j21j81J12J19
3705D3j23n8J52j5j57J55N0j13J1QJ41j46l9J73r3n2k4K34j52j80K72N9k92R6
$$ plain form
3535 -114 46 18 21 -163 61 77 -186 3 65 -24 -55 -12 -24 -204 -125 41 72 -204 -95 22 -125 -112 -28 136
3559 136 -150 -76 77 -25 -204 -11 25 -71 -106 -14 23 -76 -64 120 50 -116 32 10 20 -145 110 129 -61 80
3583 80 110 34 14 31 185 91 -3 163 167 -17 5 159 74 -81 63 213 62 -71 54 94 49 -56 105 43 -59
3608 -59 41 45 -100 -110 -19 80 -120 -36 54 -82 -86 -40 85 -201 -190 65 17 -156 -125 14 -55 -130 -15 -4 -151 -123
3634 -123 14 -65 -126 -48 104 -26 -120 60 -122 -137 -92 40 54 -154 -23 150 0 -41 126 12 -44 -75 114
3657 114 134 -110 50 184 30 28 109 173 26 -70 213 42 -29 147 231 6 -30 109 120 -11 4 194 114 7
3681 7 52 152 27 -62 115 103 -9 -66 105 -104 -99 102 151 -99 -122 -94 56 23 -100 114 -7 -188 -76 43
3705 43 -80 -138 14 -1 -158 -3 47 -66 -55 -47 94 -52 -91 82 -11 -63 -87 147 -5 -185 87 146 -146 -50
3729e0J42M0j63k9J27M8j57J41J34k19K2J78j14j21J26M0o0o1Q1N1k29K03j7L0
3753A43k03L3J40j47P0J6M9k57J49M5L9k53J40Q3l9r9J17k1q3k0Q1J9k45K44k4
3778b3j14J7m1J59j65M8J04j3j87K82q6j8m2P4Nm4L7Pn8nQ7K7j25rQ4R0j47l5
3806i1K44j66O6M8j13k8R0J35j24p7J08m8O3p7R8N8j74l2K47j11j64Q6J59j86
3830A1m1J63lj58%J24M4j82J9J37j44o7J35pj9j7K5N3j68J23k6o8o0LO8jK1JN1
3859A7j37P6Q5j27k5J08K9j85P3L8m0p5J50K9j56P6J36o1m4l7J59l0j82Q3J29
3884H9j08NJ71q7j34J70O2o2j18J92p0q1j3J15k1j03oK42j07k10J33M7j04m9J13
3909F6q2r7R4R8j03l8R2L5j63o4J69j31K2J42j8o0m9Q8n5m9m7Q7k8m6R3N1j78
$$ plain form
3729 -50 92 132 -31 -60 67 115 -42 99 233 14 36 214 100 -21 105 145 85 24 105 156 -73 130 113 143
3753 143 -60 -27 113 -34 36 52 101 -156 -7 38 77 -176 -36 47 8 -91 26 5 -78 -98 -17 2 -243 1 -23
3778 -23 -137 -120 -161 -2 -167 -119 -15 -28 -215 67 -19 -37 -79 -5 0 -44 -7 0 -58 -63 24 51 -74 -83 1 91 -56 -91
3806 -91 153 -13 53 101 -12 -40 50 185 61 -16 92 44 107 30 128 186 12 -20 227 116 -48 38 197 11
3830 11 -30 133 130 -28 -28 96 140 -42 -23 114 -30 -97 38 31 12 -5 20 73 -95 28 2 -66 -126 -123 -55 -56 -35 -34 17
3859 17 -120 -44 41 -86 -111 -3 26 -159 -86 -48 -88 -163 -13 16 -140 -64 72 11 -33 -70 89 59 -123 -40 89
3884 89 -19 -14 157 70 -64 106 168 106 -12 180 110 29 16 131 110 7 1 243 136 -74 59 106 2 -47 66
3909 66 -16 -113 -19 79 -24 -62 30 65 -98 -162 7 -124 -102 40 22 -38 -87 1 -54 -103 -150 -63 -91 -137 -44 7 -171
3936a71Q8K9m1R7p0R7m5q1P9NQL0k7P3j13K9R9p9p9J7K03q0r4J52q1j9q5J97m6
3965I2l5KOM6j24K11n7r3M2J32j58l1O7n2k2o3J14%q9J70q7j25m2J39j0j38M2
3992f3J08j18j23J90M0j32J6P5j1j1k4J37j42l8M7Q7j19n0R5P0j41L4J36j21m9
4017a07k6J20N0q9Q5k3p0KP8r6k5J03Q9j12k3J16p2k3nR3K7j28J1J97j34j6P4
4044I6m9m4l8J74j10j2J37m0j14p2K00ln4k0J38j94j9Q4k4l6r4K40j61oL7O2j33
4071e5%J74j58r4J03J14j18o5N9J06k16J47m3J27j18l1M8q2n5Q0P8r0m8N4N7m8
4097g4k3J45l1j12P4JL4o0R0K4j36J84r4Mj49J52L6k01J07J01n0K7N1J0j14J8
4123A4jM3r9J25R9l5j28j7J00m1j02J47M0k01J43l9P7n9N3l2q3m6nM1j03J1N8
$$ plain form
3936 -171 -83 -54 -95 2 -68 29 -16 -97 -18 -13 -5 25 -2 71 -42 -13 86 7 -72 -55 148 68 -26 126 45 26 -59 138 92
3965 92 57 59 65 111 -13 198 141 48 90 222 64 33 100 48 26 -37 77 77 -12 158 71 -54 -96 43 33 -105 -63
3992 -63 45 -73 -196 -6 34 -98 -82 -7 -18 -29 -53 84 -58 -96 -49 38 -81 -131 -36 34 -107 -73 63 -58 -107
4017 -107 -133 -13 37 -52 33 10 -60 -58 20 -76 -101 2 91 -21 -44 72 0 -23 -28 65 92 -36 -25 172 38 22 96
4044 96 47 3 -35 139 29 17 154 114 0 -72 128 125 71 51 189 -5 -24 60 36 0 -94 146 -15 -21 16 78 -55
4071 -55 -55 119 -39 -133 -30 84 -34 -99 -40 66 -150 -3 -46 81 -37 -68 -20 -102 -157 -77 1 -89 -137 -83 -26 -74
4097 -74 -97 48 17 -95 -21 -20 14 -46 44 68 -68 116 22 26 -123 29 65 -136 -29 72 22 49 100 110 -4 14
4123 14 13 56 -43 82 181 146 18 1 101 60 -42 105 145 -56 87 48 125 66 119 87 4 -42 -47 -6 -109 -98 -40
4150d0M5o2k9J34j20l8J42o4j00P8N1p5j23J39O3j06NM2N1j77N0J17j9m8J01J1
4176B8j32P8j1M9o7J13k0K1o1pj7K9j0J38J6j64N0R5o2l1J4O3j78J34L7m7r4K35
4204A99n5j36l8L3R1l9J7K2j53j5K1Q1j07M2J7K4q0PQ3%L2l7j09K0m2J09Kr9Q7
4233b3K8q3k2L1M2mp3R9m6N3k2l6Q4o1%R0j73kJ78J8j02m7J30j16J1j4J02j30
4261h8O5O2l0j0L6K4m6l7J21m7lJ0L7R5j45L4n0lr4K36p0j72P0Q4J3j02l0L0j9
4290b9k8P0K0kK9l0q5O7K9rp6m4R7J8Rp2K8l9p0Q2%k6J3j7J26p2jP7p6p9P7no8
4323h6K7K8K9m0L9pJ3j66J57pl2L5O6Ok1k6P5k5L6q0Q3j37O4M8Lj8p5O3j01M9
4353@L1J6j4l0O2Q0j58J07k3o8Qn8K08k52L7M3O3j27R8R5j76m8M6K3k8o0J9J27
$$ plain form
4150 -40 5 -57 -86 48 -72 -110 32 -32 -132 -54 -3 -78 -201 -62 1 -105 -100 -58 -7 -184 -134 -17 -36 -84 17 28
4176 28 -104 -26 -37 12 -55 58 38 59 -2 -9 -26 3 -7 131 147 -17 33 128 66 35 49 112 -66 68 105 58 -36 199
4204 199 144 8 -30 3 94 55 72 94 -59 -74 -53 28 -79 -37 -20 4 -76 -69 14 14 46 9 -100 -80 -122 -13 -11 -110 -23
4233 -23 5 -78 -100 -69 -27 -31 -104 -5 -51 2 -20 -56 28 -33 -33 57 -116 -118 60 78 -24 -71 59 -57 -46 -60 42 -88
4261 -88 -23 39 9 -1 35 59 13 -24 97 50 47 57 94 189 44 78 28 25 -69 167 97 -75 -5 79 92 -10 -40 -10 -29
4290 -29 -57 13 33 31 60 30 -55 12 41 32 -44 -88 9 27 36 -36 -8 -47 -117 -35 -35 -61 -48 -65 61 -11 -12 65 -11 -90 -13 -18 -86
4323 -86 -59 -31 -2 -42 -3 -10 3 -163 -6 -13 -45 -10 56 62 41 15 90 65 101 21 104 -33 31 79 82 64 -11 52 -49 0
4353 0 31 47 33 3 65 145 -13 94 71 3 11 -47 161 -91 -54 -11 52 -75 23 118 -58 -106 -60 -37 -65 -125 -106 21
4381B1k7n1j4k5O4K6J10r9j9J8j36J1K6O2J3K5l4K9j1m4j8J26j16J43l5p9n6J11
4409B1pq0R7R1r2q5Q3k8J68k08J88p2n9P3n4nK9L3n7K4r6J73j86%P9J13l4j36
4437b7N8M4j09n1J38m0o9LJ03n0o3N9oM5j07J78j65l7m6J82n2j30J41Q9j43M1
4463a4N7j42n6P3J42r8l3J18r2j34J84K2j10KR8m9J7j18J12pM2j6j3J31p1l6N2
4490F1J4n3LPm5P5Qk4k0O6m3o9M1O1n0k5q0K01r0r9O9J41j37l2K9R8j42M5j8O7
4520E9j05J8Qj1J3r6J08n0J31p6N3j36N1Q9j48KJ41j39J52j28J57j29m8J02l7
4545a9l8RJ03kj95Q0N8o9N6M3Nj37R9P2L9j32P6Oj18O4m7J46r2J0j3M4l8J19p0
4574E9J3k8J7N5j48J5J94k22J05J79j25p1o1L6N7l7n6J88j00JJ6J9j34o3Q1J41
$$ plain form
4381 21 -6 -57 -71 -96 -32 -6 104 5 -14 4 -132 -121 -95 -33 -20 5 -29 0 -11 -55 -73 53 -63 80 45 -34 -90 21
4409 21 14 -66 31 122 30 -55 28 0 168 -40 148 76 17 90 36 31 60 93 36 60 -36 137 -49 -49 30 143 109 -27
4437 -27 31 75 -34 -85 53 13 -56 -53 50 0 -63 -4 -10 35 -72 106 -59 -96 -142 40 -12 -142 -1 88 -55 -14
4463 -14 43 -99 -155 -82 60 -38 -71 47 -45 -179 5 27 -83 -81 17 -32 -15 -133 -21 -28 14 -2 -15 116 45 9 61
4490 61 75 22 25 32 -13 62 70 46 26 92 49 -20 21 82 32 7 -73 128 38 -61 8 149 12 -20 9 107 -35 10 -8 59
4520 59 -46 -28 -20 -31 -18 -114 -6 -56 75 -1 52 -84 -33 56 -92 -90 51 -88 64 -64 93 -36 -84 18 -19
4545 -19 -57 -48 55 53 -142 -62 -4 -73 -17 26 31 -106 -7 65 104 -28 48 54 -64 0 -47 99 7 17 4 48 10 129 59
4574 59 72 44 61 116 -32 -17 177 -45 60 239 114 43 -18 18 75 38 -18 170 70 71 87 106 -28 -91 -10 131
4600A31j60L8K3l7j15J93j43k2lP9mr3J9K7K8lO1J6q0R2Q6k28J7J7K4m8M9J24
4628H8p5j15L4O2P4r1K9J07j21l1M2J7K1M2r7R6j6j2n5J08j31L9J9m2N1M2l7q
4656D0J24q6k9l0J09j16J1L1o3N8k0l0m5l0K2M3j1J7Q0J9r8N9r0j9K8m%Krp7R2
4687b2j08P7P6p1o3k1J16Q1j03k6J45j00l9P2l1q2J63J0n3l7N9l5l4R5p3L8Kq8
4715e2O1j6Q0k7P3l5q9N1J5nm7J27q0q8M6P8m5r6J04n4n5Q1jL6j08%J50j28l3
4744e7R1k0M6n6N4j00P8n0N2Nn1M4n3%PQ0j04p2R8J23n9p8L0J0r2N4qL8q6J09
4774C3k5k5O3p4N0j13k2M0N5RM3n0R1l2n4J3Pj9j4J40j20M3L2n0N9p5L5k6j8L9
4804C5m6JO6R7j57kJ01j35j4J20jq6Q1p2M7q0J58o2K5n0Q1j16j12J12LP9j75J31
$$ plain form
4600 131 -29 9 32 -5 -120 73 -70 -92 -95 -16 -20 -113 -94 -67 -39 -42 19 35 -45 47 133 -95 -78 -61 -37 -85 -36 88
4628 88 13 -102 -68 -6 68 -23 6 113 -8 -39 3 20 41 83 -14 82 66 54 -1 107 -24 15 34 -8 43 85 48 40
4656 40 164 78 49 19 128 12 23 54 -9 49 29 -1 -46 -76 -54 -11 -22 -5 75 94 -4 55 -35 -54 -26 -30 -30 -28 -37 -114 -22
4687 -22 -130 -53 23 -48 -111 -132 -16 65 -38 -64 81 -19 -58 14 -17 -99 64 74 21 -16 43 8 -26 69 -4 34 36 -52
4715 -52 9 -7 73 46 119 84 -5 46 61 56 9 136 56 -32 14 92 47 -49 55 1 -54 27 26 62 -46 -46 104 -24 -57
4744 -57 34 14 60 4 58 -42 36 -14 38 43 -8 36 -17 -17 -10 70 -34 -106 -8 115 56 -22 8 18 -74 -20 -28 10 -76 33
4774 33 8 -17 46 -28 22 -91 -113 -73 -18 -9 34 -16 75 43 -11 2 9 -10 -24 116 -4 39 71 21 80 5 40 14 -4 35
4804 35 -11 -10 56 153 -4 -6 95 -40 -54 66 65 -21 60 -12 35 -45 113 51 76 26 107 -9 -121 -9 -6 73 -102 29
4832B9j04MNJ08k4l3n1p5J86q3J26j60O0Ll5KnPL0l4Q8k8m9N7n9NM0k0P0O3n4
4863F9q8kM1r3O5M3mj53J22M7j9M3kN4r2M4J2n1p3J83n6Lo0Kj9j7K0mk9N2L6k9
4895D5n2J8j1K1o7J9r7J12n7K0J34j05l3J08j35P5j0k8Ok1j0N1p0J7L1l6Jk5J07
4924Hj3j46J72l5L1M6j34K0K8N2j5l3M7m7O5kr6J9L5l1O4l2k0K1K3M9o9p3R9L4
4954F7n1J1Lkr3J46m4j7k2L2n3L8RP7p4r9j5K01j56N6q3j3J60m9L1o3q5P1j03
4983a20P3J5n8J36j05N4%jj00J01N5q0n6jJ01Kj55J97j63J4Nj7L5K2P0j11n8J13
5011c2J34k7j58J05l1qo6J08j26J39JJ1Pj19R7j02K39k9r0j8j4k9M0k4m6P0K9
5038F1j60J28m6K9P4q4Q1k7r5RO0l4m4L0J5o5J03j26J14q1Oj7rJ2l3J3J4R7j25
$$ plain form
4832 29 -75 -71 -66 42 18 -15 -66 -141 45 -38 88 -72 -12 -9 -44 -42 -47 -40 -10 -44 44 16 -33 24 -35 -30 10 -10 60 123 69
4863 69 -19 -21 20 -73 -8 35 31 -122 0 47 28 71 69 123 31 75 87 36 -37 146 90 93 33 35 16 -1 19 15 -14 38 74 45
4895 45 -7 11 0 21 -46 -27 -124 -12 -69 -49 85 -20 -53 55 -80 -5 -15 -43 -37 -58 -68 -17 -87 -70 -39 -75 -74 -99 8
4924 8 -5 -151 21 -14 17 63 -71 -51 -23 29 14 -19 28 -19 46 44 -52 -33 2 -29 35 3 -17 4 27 76 7 -66 33 67
4954 67 16 27 30 28 -65 81 37 20 -2 30 -23 15 24 101 27 -72 -87 114 -42 14 -69 -82 78 29 60 -3 -88 -17 -120
4983 -120 -47 -32 -90 46 -59 -5 -5 -6 -106 -5 50 -30 -86 -87 14 16 -139 58 -105 -91 -86 -103 -68 -46 24 -87 -145 -32
5011 -32 102 75 -83 22 -9 -17 -83 25 -101 38 39 50 57 -62 35 -67 172 143 53 35 21 -8 32 8 -38 32 61
5038 61 -99 29 -17 12 86 2 83 56 -39 -30 30 -4 -48 -18 -3 -68 35 -91 23 -58 -52 -69 -78 -66 -99 -86 -72 25 -100
5067a00O0J7L2Ln0R3o8K8kj49J34j25N3J64j11M6n0N5n3J3njJ8r4N5O9m1L2nM
5097B2J3rN8J2n2N7L1j08l2J82j90J38j23J01q1K3J3k4ro1J77j42LP9P7j48Pl9
5125b5O9j20J71m4n1q1j0P2Jk2P4o1l0R9l3o4j15J62K4K5j06J69n6k9n1J2m1O4
5153CJ5m5j6M8p9M6O5j44Q9L3Oj05P1N0j1MQ9j58O2Jp0J6R0n4j0M3N4n2L5k5R2
5184A43j43P5j02K5j4Q1M7j53J04m6jM2m7L0q3m3J35j05P6p2M0j9r2R3m4n1J42
5211A8j12J1j4R7P7j35j0k3J10pq5R7l0l4q3J43k8p8N9k7P7o3J4p4J02K2o3J7
5239b2P1M0l7n6K0p9O9%J0K1L2q2N3j4J4J6m1R1q3KQ5p1j3n3Q6L2r3J0K9M5j19
5270c7J49j70J24m6j4p3J07j5Jn9%M0K8o7J8J9J3m5rq5N0mqJ38j53N6J39j07l0
$$ plain form
5067 -100 -40 -23 9 12 -38 55 -13 15 13 -136 -2 -127 -74 90 -21 25 -25 30 -23 -10 -15 -16 2 -92 -37 32 -9 23 18 22
5097 22 35 26 84 96 44 101 132 24 -8 174 -16 122 -1 100 19 42 55 31 22 -39 138 -4 -1 78 155 7 14 -25
5125 -25 44 -76 95 51 0 -81 -91 -19 -18 -40 34 -27 -57 42 9 -55 -170 -8 16 41 -65 104 48 19 -32 -20 -61 3
5153 3 18 -27 -43 5 -74 -28 37 -107 -18 15 21 -84 -13 37 26 30 119 -39 23 24 -46 -30 60 6 -4 39 93 41 76 51 143
5184 143 0 75 -27 -2 -16 65 112 -41 63 17 16 58 11 41 -42 -85 50 -55 21 -51 -11 -30 -122 -29 -73 -124 18
5211 18 -94 -83 -97 0 77 -58 -68 -91 19 12 -73 24 -6 -40 -123 20 -8 -86 -27 -54 23 -40 -26 -100 2 24 -39 -22
5239 -22 49 89 52 -4 16 -63 6 6 16 37 69 -13 40 26 40 56 15 106 23 25 110 39 26 -27 59 91 -2 8 37 82 -37
5270 -37 112 -58 66 20 6 -67 40 25 26 -33 -33 7 35 -32 -14 5 18 -27 -36 -121 -71 -75 -83 55 -98 -42 97 -10 -40
5299d0M6m6J8qOl5J43j10n2J19j16N5l0L3pLJ1n8M3R5m2o2Q3K2j22J90j26l6L5
5328A2p1J13j05R0rP1j79O5%J1j7M2J04r4k2J3l5j5R6Pj68Q5L9k3m5P7m7L2l8
5357a1r6J44o8n3P4M5j03K8m8P5k9J5n2QQ6n9On8N8l2P1J6p7o5M9J0rM9k9J05
5387E0j38k1Q9l2N6n2M6l4n2J05M6J6k4j38J18j0nJ36k11J07l1j03J29L9o9j6
5413AN4j3L1m5K6n0R8r4m9N0L2m2L8j4m0J04q4Q2m9q5K0P4o4QpJ6k1m7j3J6P7
5444A0J12j30J7j06K9J1O6j08K5k8J55K0j6p7N4jp0n4R5O7j10L9m7O8J3M9k58
5471a75R4O7L4R2n1J2r3J02l1l1P1o0j2k9J25j1j09P9Ok4l1n7K7j10J30MPO0K8
5500A14n7k0n1O0k7K0L8m0kM1n7P1k01M3R6N3j98N4jM9K1j9k2okJ0M7j0%J5p6
$$ plain form
5299 -40 6 -40 -22 -30 -24 -59 84 -26 -78 41 -75 -20 -50 -17 -24 -21 -10 -68 -25 70 28 -34 49 71 -51 139 13 -23 12
5328 12 -59 54 -51 39 30 101 -78 -13 -13 -2 -19 23 127 33 11 24 -11 -26 70 77 -91 -6 33 10 -35 42 -5 27 -11
5357 -11 -107 37 -31 -84 -10 35 -68 -40 -88 -13 -42 -27 -79 -71 15 -44 -38 -96 -38 -70 1 17 -60 -125 -76 -66 -75 -26 -55 50
5387 50 -88 -109 -20 -52 4 -48 -2 -36 -88 17 63 79 55 -83 35 25 20 156 -55 52 21 -82 47 86 17 1
5413 1 55 42 73 28 54 4 102 8 -41 9 41 -1 37 23 -17 87 3 85 36 -49 -29 45 -19 -11 -18 -2 -23 -70 -83 -67 10
5444 10 122 -8 9 -97 -68 -57 9 -99 -74 -102 53 73 57 -20 34 33 -37 -91 4 71 -39 0 -47 21 34 83 -175
5471 -175 -81 -14 20 112 61 73 -20 82 51 20 91 31 19 -10 115 104 -5 74 80 56 25 -32 -5 -115 15 19 26 86 114
5500 114 57 37 -14 46 19 39 77 37 35 76 19 90 -111 -68 28 81 -117 -63 -64 -15 6 -13 -35 -41 -43 -33 14 4 4 19 -57
5531e7K3oj7O0l3j8J13j74O6J30m0m9l5K3n4N3MJ28j80N8K6P1n7R6j06o2N5KP2
5560I2j46N2K3K2P4j23O3j15J55j13J10k7j2pNqj6P8j74Q7L9k7q7l4R5L7n7j0
5588b4Pm0R3J4j00l9R6j14J15j60O8J32j05k0r3K3J10n9J10j14K5l7J70o2M8J2
5614E6j07J4K6N3l5m8Q9n2Lmk2J1L1j06Q9J19n9k1L9r4J2L3n0M2K9M5J9q7k7M5
5644D3%j46J08K8j20J4J05n4n2P5j6K1m8m1Q2N5q0J2k2K2l1O4np7Q0j02j6R5r3
5673i9M6L1j5J1m0k9oJ09qnj10J4L5N2p6N8kM3m3q7R2joN8L6K5j3m7Lj1m1Q0m
5706E0M3l8L2j13J73k14J53j25Q5J60r0j38Q3k5J39k45J14O3j24L6J6J0rk3j6
$$ plain form
5531 -57 -34 -40 -57 3 -30 -48 65 -109 -43 87 47 -2 -37 -14 -68 -15 -11 117 -63 -5 21 92 35 131 25 -37 18 20 92
5560 92 -54 -2 21 43 117 -6 57 -58 97 -16 94 67 55 48 53 45 29 107 -67 20 59 32 -55 -89 6 43 -14 -24
5588 -24 -17 -57 36 50 -50 -89 7 -107 8 -152 -84 48 -57 -77 -170 -147 -37 -96 14 -100 -75 -112 58 -4 44 56
5614 56 -51 -37 -11 42 7 -41 48 -4 -1 -5 -27 -16 15 -91 -2 117 58 37 76 -18 -6 27 -23 19 48 93 112 25 -2 43
5644 43 43 -103 5 33 -87 -73 32 -22 -74 1 -15 6 -42 -83 -1 54 -26 -14 -36 -14 -45 19 14 -63 17 -85 -101 -6 -99
5673 -99 -53 -22 -37 -26 -66 -95 -101 8 0 -5 -115 -101 -66 -14 -90 -32 -34 9 -34 -121 -29 -30 -36 22 58 83 70 23 26 15 -26 54 50
5706 50 93 55 87 -26 147 -67 86 -39 46 206 116 -22 61 36 175 -70 44 107 -17 19 35 45 36 13 -3
$$ [...]
8191H7
##END NTUPLES=NMR FID
##END=
