##TITLE=1H_Pr 5021-2
 CD3OD,8 sc, 
 11.03.2021
##JCAMPDX= 6.0         $$ Bruker NMR JCAMP-DX V2.0
##DATA TYPE= NMR FID
##DATA CLASS= NTUPLES
##ORIGIN= UXNMR, Bruker Analytische Messtechnik GmbH
##OWNER= root
$$ XWIN-NMR		Version 3.5
$$ Thu Mar 11 11:50:19 2021 Russian Standard Time (UT+4h)  she@DPX200
##.OBSERVE FREQUENCY= 200.131506
##.OBSERVE NUCLEUS= ^1H
##.DELAY= (6, 6)
##.ACQUISITION MODE= SIMULTANEOUS
##.ACQUISITION SCHEME= undefined
##.AVERAGES= 8
##.DIGITISER RES= 18
##SPECTROMETER/DATA SYSTEM= spect
##.PULSE SEQUENCE= zg30
##.SOLVENT NAME= CD3CN
##.SHIFT REFERENCE= (INTERNAL, CD3CN, 0, 15.7039)
##AUDIT TRAIL= $$ (NUMBER, WHEN, WHO, WHERE, WHAT)
$$ ##TITLE= Audit trail, XWIN-NMR		Version 3.5
$$ ##JCAMPDX= 5.01
$$ ##ORIGIN= Bruker BioSpin GmbH
$$ ##OWNER= she
$$ F:/spectra/data/she/nmr/H-F/1/audita.txt
$$ ##AUDIT TRAIL=  $$ (NUMBER, WHEN, WHO, WHERE, WHAT)
(   1,<2021-03-11 11:48:28.87 +0400>,<she>,<DPX200>,
      <created by zg, POWCHK disabled, PULCHK disabled
       configuration hash MD5:
       00 E9 B6 7A A2 85 ED C7 34 08 36 98 17 FE 4E 26
       data hash MD5: 16K
       35 C8 1C 55 9A 81 B8 E7 D4 4F 00 4E 8D DF EE D5>)
$$ ##END=
$$ 
$$ hash MD5
$$ FE 1B 39 76 A6 C7 10 99 E3 08 0F 65 AB F7 25 E1
##$RELAX= 
##$RELAX= 
##$RELAX= 
##$RELAX= 
##$RELAX= 
##$RELAX= 
$$ Bruker specific parameters
$$ --------------------------
##$DU= <F:/spectra>
##$EXPNO= 1
##$NAME= <H-F>
##$PROCNO= 1
##$TYPE= <nmr>
##$USER= <she>
##$AMP= (0..31)
100 100 100 100 100 100 100 100 100 100 100 100 100 100 100 100 100 100 
100 100 100 100 100 100 100 100 100 100 100 100 100 100 
##$AQSEQ= 0
##$AQ_mod= 1
##$AUNM= <au_zg>
##$AUTOPOS= <>
##$BF1= 200.13
##$BF2= 200.13
##$BF3= 200.13
##$BF4= 200.13
##$BF5= 200.13
##$BF6= 200.13
##$BF7= 200.13
##$BF8= 200.13
##$BYTORDA= 1
##$CFDGTYP= 0
##$CFRGTYP= 5
##$CHEMSTR= <none>
##$CNST= (0..31)
1 1 145 1 1 1 1 1 1 1 1 1 1 1 1 1 1 1 1 1 1 1 1 1 1 1 1 1 1 1 1 1 
##$CPDPRG= <>
##$CPDPRG1= <>
##$CPDPRG2= <>
##$CPDPRG3= <>
##$CPDPRG4= <mlev>
##$CPDPRG5= <mlev>
##$CPDPRG6= <mlev>
##$CPDPRG7= <mlev>
##$CPDPRG8= <mlev>
##$CPDPRGB= <>
##$CPDPRGT= <>
##$D= (0..31)
0 1.2 0 0 0 0 0 0 0 0.06 0 0.03 0 0 0 0 0.0002 0 0 0 0 0 0 0 0 0 0 0 0 
0 0 0 
##$DATE= 1615448908
##$DBL= (0..7)
120 120 120 120 120 120 120 120 
##$DBP= (0..7)
150 150 150 150 150 150 150 150 
##$DBP07= 0
##$DBPNAM0= <>
##$DBPNAM1= <>
##$DBPNAM2= <>
##$DBPNAM3= <>
##$DBPNAM4= <>
##$DBPNAM5= <>
##$DBPNAM6= <>
##$DBPNAM7= <>
##$DBPOAL= (0..7)
0.5 0.5 0.5 0.5 0.5 0.5 0.5 0.5 
##$DBPOFFS= (0..7)
0 0 0 0 0 0 0 0 
##$DE= 6
##$DECBNUC= <off>
##$DECIM= 32
##$DECNUC= <off>
##$DECSTAT= 4
##$DIGMOD= 1
##$DIGTYP= 9
##$DL= (0..7)
0 120 120 120 120 120 120 120 
##$DP= (0..7)
150 150 150 150 150 150 150 150 
##$DP07= 0
##$DPNAME0= <>
##$DPNAME1= <>
##$DPNAME2= <>
##$DPNAME3= <>
##$DPNAME4= <>
##$DPNAME5= <>
##$DPNAME6= <>
##$DPNAME7= <>
##$DPOAL= (0..7)
0.5 0.5 0.5 0.5 0.5 0.5 0.5 0.5 
##$DPOFFS= (0..7)
0 0 0 0 0 0 0 0 
##$DQDMODE= 0
##$DR= 18
##$DS= 0
##$DSLIST= <SSSSSSSSSSSSSSS>
$$ [...]
##$SUBNAM2= <"">
##$SUBNAM3= <"">
##$SUBNAM4= <"">
##$SUBNAM5= <"">
##$SUBNAM6= <"">
##$SUBNAM7= <"">
##$SUBNAM8= <"">
##$SUBNAM9= <"">
##$SW= 16.9725357007746
##$SWIBOX= (0..15)
0 0 2 0 0 0 0 0 0 0 0 0 0 0 0 0 
##$SW_h= 3396.73913043478
##$TD= 16384
##$TD0= 1
##$TE= 0
##$TE2= 300
##$TE3= 300
##$TEG= 300
##$TL= (0..7)
0 120 120 120 120 120 120 120 
##$TP= (0..7)
150 150 150 150 150 150 150 150 
##$TP07= 0
##$TPNAME0= <>
##$TPNAME1= <>
##$TPNAME2= <>
##$TPNAME3= <>
##$TPNAME4= <>
##$TPNAME5= <>
##$TPNAME6= <>
##$TPNAME7= <>
##$TPOAL= (0..7)
0.5 0.5 0.5 0.5 0.5 0.5 0.5 0.5 
##$TPOFFS= (0..7)
0 0 0 0 0 0 0 0 
##$TUNHIN= 0
##$TUNHOUT= 0
##$TUNXOUT= 0
##$USERA1= <user>
##$USERA2= <user>
##$USERA3= <user>
##$USERA4= <user>
##$USERA5= <user>
##$V9= 5
##$VALIST= <valist>
##$VCLIST= <CCCCCCCCCCCCCCC>
##$VD= 0
##$VDLIST= <DDDDDDDDDDDDDDD>
##$VPLIST= <PPPPPPPPPPPPPPP>
##$VTLIST= <TTTTTTTTTTTTTTT>
##$WBST= 1024
##$WBSW= 4
##$XGAIN= (0..3)
0 0 0 0 
##$XL= 0
##$YL= 0
##$YMAX_a= 201022
##$YMIN_a= -135548
##$ZGOPTNS= <>
##$ZL1= 120
##$ZL2= 120
##$ZL3= 120
##$ZL4= 120
##$ABSF1= 10
##$ABSF2= 0
##$ABSG= 5
##$ABSL= 3
##$ALPHA= 0
##$AQORDER= 0
##$ASSFAC= 0
##$ASSFACI= 0
##$ASSFACX= 0
##$ASSWID= 0
##$AUNMP= <proc_1d>
##$AZFE= 0.1
##$AZFW= 0.1
##$BCFW= 1
##$BC_mod= 2
##$BYTORDP= 1
##$COROFFS= 0
##$CY= 11.3945322036743
##$DATMOD= 1
##$DC= 2
##$DFILT= <>
##$DTYPP= 0
##$F1P= 15.9154993809931
##$F2P= -4.1035820241983
##$FCOR= 0.5
##$FTSIZE= 0
##$FT_mod= 4
##$GAMMA= 1
##$GB= 0.15
##$INTBC= 1
##$INTSCL= 1
##$ISEN= 128
##$LB= 0.24
##$LEV0= 0
##$LPBIN= 0
##$MAXI= 10000
##$MC2= 0
##$MEAN= 0
##$ME_mod= 0
##$MI= 1.114404
##$NCOEF= 0
##$NC_proc= 0
##$NLEV= 6
##$NOISF1= 3.799351
##$NOISF2= 2.8
##$NSP= 1
##$NTH_PI= 0
##$NZP= 0
##$OFFSET= 15.70392
##$PC= 1
##$PHC0= -11113.58
##$PHC1= 2.40094
##$PH_mod= 1
##$PKNL= yes
##$PPARMOD= 0
##$PSCAL= 0
##$PSIGN= 0
##$REVERSE= no
##$SF= 200.130013532006
##$SI= 16384
##$SIGF1= 3
##$SIGF2= 2
##$SINO= 400
##$SIOLD= 16384
##$SREGLST= <1H.CDCl3>
##$SSB= 0
##$STSI= 0
##$STSR= 0
##$SW_p= 3612.71676300578
##$SYMM= 0
##$S_DEV= 0
##$TDeff= 0
##$TDoff= 0
##$TI= <>
##$TILT= no
##$TM1= 0
##$TM2= 0
##$TOPLEV= 0
##$USERP1= <user>
##$USERP2= <user>
##$USERP3= <user>
##$USERP4= <user>
##$USERP5= <user>
##$WDW= 1
##$XDIM= 8192
##$YMAX_p= 0
##$YMIN_p= 0
$$ End of Bruker specific parameters
$$ ---------------------------------
##NTUPLES= NMR FID
##VAR_NAME=  TIME,          FID/REAL,        FID/IMAG
##SYMBOL=    X,             R,               I
##VAR_TYPE=  INDEPENDENT,   DEPENDENT,       DEPENDENT
##VAR_FORM=  AFFN,          ASDF,            ASDF
##VAR_DIM=   8192,          8192,            8192
##UNITS=     SECONDS,       ARBITRARY UNITS, ARBITRARY UNITS
##FACTOR=    0.0002944,     1,               1
##FIRST=     0,             0,               0
##LAST=      2.4114304,     0,               0
##MIN=       0,             -135548,         0
##MAX=       2.4114304,     201022,          0
$$ Real data points
##PAGE= N=1
##DATA TABLE= (X++(R..R)), XYDATA
$$ [...]
1745b2j28k31K06M48n03j8L86j70l81L84M43n48j41N44k35k29K77J75l83Q2K80
$$ -22 -150 -381 -175 273 -230 -248 138 -32 -413 -29 414 -134 -275 269 34 -195 82 257 -126 -44 236
1766B36m06K87J06O5l92n0L06k50l6M54k45l53K57K69m74J2M69k48k00R2N8l47
$$ 236 -170 117 223 288 -104 -154 152 -98 -134 320 75 -278 -21 248 -226 -214 255 7 -193 -101 -43 -390
1788c90K39L52k51j18K70k12l17M81Q3k95P0K36q1k14N87k46k63n4KJ2J5M49k23
$$ -390 -151 201 -50 -168 102 -110 -427 54 137 -158 -88 148 67 -147 440 194 -69 -123 -121 -109 -94 355 132
1811A32o2j27L07l5k37M05j62l26K00o2j89qL39k88j06K67j78j16M36O3l99o4
$$ 132 70 -57 250 215 -22 383 221 -105 95 33 -156 -164 175 -113 -219 48 -130 -246 190 253 -146 -210
1833b10J93J34l10M16O9n56R4K77j90m9O34k82m96K6N02j98P5J91l56j77M40m4
$$ -210 -17 117 -193 223 292 -264 -170 107 -83 -132 502 220 -276 -250 252 54 129 320 -36 -213 227 183
1855A83k51L34J83o40n8L86k47j52K56qr7r2K74o5j26K33o2n27N18j5j63K21J63
$$ 183 -68 266 449 -191 -249 137 -110 -262 -6 -14 -111 -203 71 6 -120 113 51 -476 42 27 -136 85 248
1878B48m45q7L64R8l62J68M92m50n28M53J51k23L20J60n05J15K63n6k15K89K5
$$ 248 -197 -284 80 178 -184 -16 476 26 -502 -49 102 -121 199 359 -146 -31 232 176 -39 250 275
1899B75l49K6J49K14l57P7R2l95J51O8j0J16J58k19l36L5J92R6l2L50m48k39O14
$$ 275 -74 -48 101 315 -42 35 127 -268 -117 -49 -59 57 215 -4 -340 -305 -113 -17 -49 301 -147 -386 228
1922B28Km70M06m2j73j08N94L4m16j02K75j05l83M27j2l24K98J4o78K61O32l45
$$ 228 230 -240 166 124 -49 -157 437 471 55 -47 228 123 -260 167 155 -169 129 143 -535 -274 358 13
1944A3K5P5j53j81o0O15o57J91M54l89l34L39Kk9O5L16l96j34L63L7j88k3K95
$$ 13 38 113 -40 -221 -281 334 -323 -132 322 -67 -401 -62 -60 -89 -24 292 -104 -238 125 162 -26 -49 246
1967B46l31j31L39P9k04J1L7k22K66j7m5J9M9k69j00K94K08l68K27P5j04l67K52
$$ 246 -85 -216 123 202 -2 9 46 -176 90 73 28 47 96 -173 -273 21 229 -139 88 163 59 -308 -56
1990e6P6m8j29K00j31K0k0M5j30r4K14M9k55M65m06j69N77J22l40j18L10j0k27
$$ -56 20 -28 -157 43 -88 -68 -88 -43 -173 -267 -53 -4 -259 206 -200 -369 208 330 -10 -128 182 172 -55
2013e5J36M3j1k0K28l06P8Q1k10J44j24J63o1oK14n17j5L19o7k21N7K8J10j46
$$ -55 81 124 113 93 321 15 93 174 -36 108 -16 147 86 80 294 -223 -238 81 14 -207 -150 -122 -12 -158
2037a58J83k77M7K89M9j10J3J99n12J96K12l37j61L95K28j73q9K55r1k0j39K99
$$ -158 25 -252 -205 84 133 23 36 235 -277 -81 131 -206 -367 28 256 83 -6 249 158 138 -1 298
2059B98m07k4L24l27J0K00q4k4j47L51m24J19J93O6o08N15K13m03O1Q7J56k30
$$ 298 -109 -133 191 -136 -126 74 -10 -34 -181 170 -254 -135 58 124 -484 31 244 -159 -98 -11 145 -85
2081h5K33k69P1R9Q1k82J90j1J4k68M99p5l10K56K44l54L0J46Q4k18qJ73m16M8
$$ -85 148 -121 -50 49 130 -152 38 27 41 -227 272 197 -113 143 387 33 63 209 293 75 67 240 -176 -128
2105a28L23j46j87K51n4l39L41L4q7m63N31j40j65PP2K31p4M6k37J19K34j47J40
$$ -128 195 49 -138 113 59 -280 61 95 8 -455 76 -64 -229 -222 -150 81 7 53 -184 -65 169 22 162
2128A62k27J06o0k5K75j11n05K88o4L9L3L37r2k70K91q2p6Q3M5k4q0m4j11j89
$$ 162 -65 41 -19 -44 231 120 -385 -97 -161 -122 -89 248 156 -114 177 95 19 102 147 123 43 -1 -112 -301
2152c01L86J29m77L05J2j65j72L65Q1k21k73J72J31jJJ19l25L21r8n4R4K62j96
$$ -301 85 214 -263 42 54 -111 -283 82 163 -58 -331 -159 -28 -29 -28 91 -234 87 -11 -65 29 291 95
2175I5r5J73J37k79j47M76n77K28M5k8n7K5n2l8P3J88j15k45K99k3m10M23J84
$$ 95 0 173 310 31 -116 360 -217 11 56 28 -29 -4 -56 -94 -21 167 52 -193 106 83 -327 96 280
2198B80k51m48P06l36k33K06j6J73k9l4%k74L77k2k61K56pj09j98M06k33J27J82
$$ 280 29 -419 287 -49 -282 -76 -92 81 52 18 18 -256 121 99 -162 94 87 -22 -220 186 -47 80 262
2221B62r0q7p6J76Q3o44J83K04j28N0Q8j60N7L26j98l2l6Q9r0l39M07R5l45k2
$$ 262 172 85 9 185 268 -376 -193 11 -117 -67 21 -139 -82 244 46 14 -22 67 -23 -362 45 140 -205 -227
2245b27K75k7k78J87j03J82J31j39J7j12J12j23Q0R0P2k19L4K75m58J70J43j18
$$ -227 48 21 -257 -70 -173 9 140 1 18 -94 18 -105 -25 65 137 -82 -48 227 -231 -61 82 -36
2267c6l6J78q3k3Q8j72j1K44j42k09p8R9L76j12j19J07M5l71R8l3K1J63K24l1
$$ -36 -72 106 23 0 88 -84 -95 149 7 -202 -280 -181 195 83 -36 71 116 -255 -157 -190 -169 -6 218 187
2291A87q2Ok32J48j1k34L15k38K86l1l07N07k98m50N39M56o46K02j53O6k93K21
$$ 187 105 111 -121 27 16 -218 97 -141 145 114 -193 314 16 -434 105 561 -85 117 -36 30 -263 -42
2313d2K33l66K90ml21J09P1J42l42J34j0p2K8J53R1k26J22K59l48R4Q3n4P5K70
$$ -42 191 -175 115 111 -210 -101 -30 112 -230 -96 -106 -178 -150 3 94 -132 -10 249 -99 -5 78 24 99 369
2337C69l82r0J37l7M6k88M99j68l21L01J43p6k46J78j62J61o6J44l21o0J0J4K03
$$ 369 -13 -103 34 -3 43 -245 254 86 -235 66 209 133 -113 65 -97 64 -2 142 -179 -239 -229 -215 -12
2360a2M2M7k46K32k47RQ6O4J19l00L38j77l1o1N0J04M4k2j5r6J44q7J01J67k4
$$ -12 30 77 -169 63 -184 -175 -89 -25 94 -206 132 -45 -76 -137 -87 17 61 39 24 -72 72 -15 86 253 229
2385B29k9l83J42L02l00P7K6J09J14j98j81R6k2J40m07K55l7k4J87j78j57K38
$$ 229 200 -183 -41 261 -39 38 64 173 287 89 -92 4 -18 122 -285 -30 -67 -91 96 -82 -239 -1
2407al8J60l17P3J00J00j09J69o0m0o8L32j69j38J21k0l90J96K03j84p4M81l32
$$ -1 -39 121 -196 -123 -23 77 -32 137 77 37 -31 301 132 -6 115 95 -295 -99 104 -80 -154 327 -5
2430eQ6l01L22l1j05m9O1J36j50n3K05Q7j19m4j03R3L4j53O3j73K82k64L12m4
$$ -5 81 -220 102 71 -34 -83 -22 114 -36 -89 116 203 84 40 -63 30 64 -89 -26 -199 83 -181 131 87
2454H7j42P7J76j50J78o0j08Q2j12O5p1j6J62q6qJ19j21j12L8N8l7J88l18L6J21
$$ 87 -55 22 198 48 226 166 58 140 28 93 22 6 168 82 74 193 72 -40 -2 56 19 207 -111 -75 46
2479D6m62N13k78j3J51l1J14l4j37L01q9ok96J18L52o34L73P9j21O3j69J66o6
$$ 46 -416 97 -181 -194 -43 -74 40 6 -131 170 81 75 -221 -103 249 -385 -12 67 -54 9 -160 6 -60
2502f0J37J66o3j21J99l62J88m6J69j58j40L6J48j57r1J65L9l3p0j6q6J88l37
$$ -60 77 243 180 59 258 -104 84 38 207 49 -91 -55 93 -64 -155 10 49 16 -54 -70 -156 32 -305
2525c05R1J72J26J5k41K03J60q9k23j8P7N1m8K32l47K3L20j95R6j31l44K37Q3
$$ -305 -214 -42 84 99 -142 61 221 132 -91 -109 -32 19 -29 203 -144 -121 199 4 100 -31 -375 -138 -55
2548e5J40j73K8K32j35O5r9O4k00K05J6k35K05J85m88J16O2j31n1J33R0k46J77
$$ -55 85 -88 -60 172 37 102 3 67 -133 72 88 -147 58 243 -245 -129 -67 -198 -249 -116 -26 -272 -95
2571i5J09j89j44L21oj86M7K09k22j2R3k7J90L8j54j3K50j47J61k78L02k52k69
$$ -95 14 -175 -319 2 -4 -190 -143 66 -156 -168 -75 -102 88 126 -28 -41 209 62 223 -55 247 -5 -274
2594b74K00J87j45n7J13L76n03J79J28l54k17L25O7q6o6K18o9l4K07m18L34j41
$$ -274 -74 113 -32 -89 24 400 -103 76 204 -150 -367 -42 25 -61 -127 91 22 -12 195 -223 111 -30
2616c0r7k9J2L49m51M97l96K21k67K14J96m38M37j29P8k76L31K7m18J83K2k5k3
$$ -30 -127 -156 -144 205 -246 251 -145 76 -191 23 219 -219 218 89 167 -109 222 249 -169 14 36 11 -12
2639a2K20j92j13PL1P0q3K00j34J9j22K35Mk90J46R9j03q3K26k71Q2O1j93L28
$$ -12 208 16 -97 -90 -59 11 -72 128 -6 13 -109 126 130 -160 -14 85 -18 -101 125 -146 -64 -3 -196 132
2663A32l5j40K63k50M5Q6j08L01l10N0J72j27m9m2O7j10L9L5l6r3J87j93k5M0
$$ 132 97 -43 220 -30 15 101 -7 294 -16 34 206 79 30 -12 55 -55 -16 19 -17 -110 77 -116 -141 -101
2687a01J85r9k0n2p7o2J67K39k34N8J74k86J80k48K82j90J17L03m22q5J97o5n9
$$ -101 84 -15 -35 -87 -164 -226 -59 180 -54 4 178 -108 72 -176 106 -84 33 336 -86 -171 26 -39 -98
2710i8J37M13n39m3J02j04J95J5m9m3L0P8L3m16J41L12l13Q3J37j74J27J61q9
$$ -98 39 452 -87 -130 -28 -132 63 78 29 -14 16 94 127 -289 -148 164 -149 -66 71 -103 24 185 96
2733I6j32J19j42J34K7K2k82l5M55n0l03N3k2L1K43j24j73J60j27K52k67K26l21
$$ 96 -36 83 -59 75 102 124 -158 -193 262 212 -91 -38 -60 -29 214 90 -83 77 -50 202 -65 161 -160
2756a60J11m3K6J47p4q9K50j89j66J70J01j40N9J73l28L04L8n7j34j11J56k69
$$ -160 -49 -92 -66 81 7 -82 168 -21 -187 -17 84 -56 3 176 -152 152 190 133 -1 -112 44 -225
2778b25K0R7j68K34J63k44o6K57J00om6M4J13k61K57j93P5J76l33j09J34K2k59
$$ -225 -205 -108 -276 -42 121 -123 -189 68 168 162 116 160 273 12 269 76 151 327 -6 -115 19 41 -218
2801b18J90J81Q2k77p0K56l3k37J96j41j41J73K58j87L25l35L3r2Q5o8JJ48k16
$$ -218 -28 153 235 -42 -112 144 111 -126 70 -71 -212 -39 219 32 357 22 55 -37 48 -20 -19 129 -87
2824h7L0o6P3J81Oj26K50l50J86J38k14k22J03j78K10N6M3q6j54K63n2j45n7K13
$$ -87 -57 -123 -50 131 137 11 261 -89 97 235 21 -201 -98 -276 -66 -10 33 -53 -207 56 4 -141 -198 15
2848A5m9k50J74L4k1N4j87K74j00J09l45K57J08j40j5j01K27j11j27K56J6q1J24
$$ 15 -34 -284 -110 -76 -97 -43 -230 44 -56 53 -292 -35 73 -67 -82 -183 44 -67 -194 62 78 -3 121
2871A21nk24J59R4k29J56r8O3k49J48K49l55P7J00R6j58M2q5N6j43J33L1Q7k2
$$ 121 116 -108 51 145 -84 72 -26 37 -212 -64 185 -170 -93 7 103 -55 -13 -98 -42 -185 -52 -21 66 44
2895D4Q5l73L88m8k25r1J37P1j01o7J19J17r2K46j87j12J58r2K2k8M8J6J3Nl0
$$ 44 129 -244 144 96 -129 -220 -83 -12 -113 -180 -61 56 -36 210 23 -89 69 -23 -1 -29 19 35 48 53 23
2920B3r0Q3Q2j44Q4K3l08L80k23O5L1J37K7k59J44Nn0J7m9MJ23j86K4p2N0J52
$$ 23 -67 16 98 -46 38 61 -247 133 -90 -25 6 143 170 -89 55 60 10 27 -22 -18 105 -81 -57 -129 -79 73
2946G3K0po8J84k27j00L13j48J28L0k49J22j24K35r6j80L18j30p6k2R4N2r1j04
$$ 73 93 86 18 202 -25 -125 188 40 168 198 -51 71 -53 182 86 -94 224 94 18 -4 90 142 51 -53
2970e3L93k27r6j39J34j03K63j85j25K21q2l9J19Rk35j70L23R1j75J86o1lk7J85
$$ -53 340 113 17 -122 12 -91 172 -13 -138 83 1 -38 81 90 -145 -315 8 99 -76 110 49 46 19 204
2994B04K6l51K30j31O9o2J60j42k47L06k51J45%l6N8K04k19O9J79j48j0l9k08
$$ 204 230 -121 109 -22 47 -15 145 3 -244 62 -189 -44 -44 -80 -22 182 -37 32 211 63 53 14 -194
3017a94J65L3n1K22j04j41J35k77K7J95m7K05n8j84l1J85k79L34j81J37J39k63
$$ -194 -29 4 -47 175 71 -70 65 -212 -185 10 -37 168 110 -74 -105 80 -199 135 -46 91 230 -33
3039c3P1j2k2q4L0J59j37L2K18k01p7J09j1j07R4k9N3j32K23l00q2J11J29L9o0
$$ -33 38 26 4 -80 -50 109 -28 4 222 21 -56 53 42 -65 29 0 53 -79 144 -156 -238 -127 2 41 -19
3064a9P0J6l13k7J26K82J3k42J69k17o0J19L7o1M15k80j50J77Mn2R3L6q7k48K31
$$ -19 51 67 -246 -273 -147 135 148 -94 75 -142 -202 -83 -46 -107 308 28 -122 55 59 7 100 136 49 -199 32
3089C2J35j34J22m25L73k49K71l41J29m0J08J0q2O7j84K17j03j9O8J3N7j01k4
$$ 32 167 33 155 -270 103 -146 125 -216 -87 -127 -19 -9 -91 -24 -208 9 -94 -113 -45 -32 25 -76 -100
3112a00K63j29K96l05K21j24r2l1L4q6N5j29J3J46K30l6k46J0K25l77M9K73j21
$$ -100 163 34 330 25 246 122 30 -1 33 -53 2 -127 -114 32 262 226 -20 -10 215 -162 -113 160 39
3135C9j29K15j06j82J56J80j02r7J50m8j94J6Q1k08K27n5j3k6K75j08N4m33K49
$$ 39 -90 125 19 -163 -7 173 71 -26 124 76 -118 -102 -21 -229 -2 -57 -70 -96 179 71 125 -308 -59
3158e9K16K4j56K67k59n7n1n6L03J39l83j74K71n0k3N2j14J96J36j31j22j89n1
$$ -59 157 181 25 292 33 -24 -75 -131 172 311 -72 -246 25 -25 -48 4 -110 86 222 91 -31 -220 -271
3181b71K18j09k2N92m18L5Nj50p6R0Q3J32m8m1m7P9j00K2KL3R1O7j37j25j05J44
$$ -271 -53 -162 -184 408 -10 25 30 -120 -196 -106 -23 109 61 20 -27 52 -48 -26 -24 9 100 167 30 -95 -200 -56
3207e6l9j34L76k93L09k04N6L2k87J7L13j02j81P3K26j98O2lN4j82K64J06j54
$$ -56 -95 -229 147 -146 163 -41 15 47 -240 -223 90 -12 -193 -120 106 -92 -30 -33 21 -161 103 209 55
3230E5o9N3k90K03J13Q2m4l40N59m76L14J4k08j04J31M1J5j23K18j82q9Q0K05
$$ 55 -14 39 -251 -48 65 147 103 -237 322 -154 160 174 -34 -138 -7 34 49 -74 144 -38 -127 -47 158
3253A58jm53L5K41nj02J37k6j60K90m3r0K3m6K6k54M27k83Q6mO0k09R5P4o7J35
$$ 158 157 -296 -261 -20 -25 -127 10 -16 -176 114 71 -19 4 -42 -16 -270 157 -126 -40 -44 16 -193 -98 -24 -91 44
3279D4K6j80R8K48j79n4j26J72k13J64j69J69j19J38L8j62j03K10j02Q3K72k90
$$ 44 70 -110 -12 236 57 3 -123 49 -164 0 -169 0 -119 19 57 -105 -208 2 -100 -17 255 -35
3301c5M8J07r5k52k3N63n09L09m48N22j47j40J23k97K16K24j31M4J40nj29Rj93
$$ -35 13 120 25 -227 -250 313 -196 113 -335 187 40 -100 23 -274 -58 166 35 79 219 214 85 94 -99
3324i9K78m38L12J27j07k23K20n8n0RJ05j98rP7n3K50q5k15J3L62j19k34K3J90
$$ -99 179 -259 53 180 73 -150 70 12 -38 -29 76 -122 -131 -54 -107 143 58 -157 -144 218 99 -135 -112 78
3348G8k55L6J05r8K6J53M4K7k68J35j7L6J55k57P2jJ54j15m44M69J09j30K0L8
$$ 78 -177 -141 -36 -134 -108 45 89 116 -152 -17 -34 2 157 -100 -28 -29 125 10 -434 35 144 14 34 72
3372G2m5J44K4j05k20k00J22RR0J7J42k07J70n9J10n0j69q7qL50J32m11L7K04
$$ 72 27 171 195 90 -130 -330 -208 -199 -109 -92 50 -157 13 -46 64 14 -155 -242 -250 100 232 -179 -142 62
3396F2j24J20P5m5j46M58n33R0j20J97J1k51J49J8n0J62K25k45j16K47j16k28
$$ 62 -62 58 133 88 -58 400 -133 -43 -163 34 45 -206 -57 -39 -89 73 298 53 -63 184 68 -160
3418a60L98k98K91p0j40o0L0j14K43j47n5j6o1n4R2J28j74K44l4j97J35J3K2j05
$$ -160 238 -60 231 161 21 -39 -9 -123 120 -27 -82 -98 -159 -213 -121 7 -167 77 43 -154 -19 -6 16 -89
3442h9L22j01j04Q5j92Q9n1O6J89l89J3O0m6L26l12nK19j71lO2k4O5j25R5l2j4
$$ -89 233 132 28 113 -79 10 -41 25 214 -175 -162 -102 -148 178 -134 -139 80 -91 -94 -32 -56 9 -116 -21 -53 -67
3468f7j32Q2K11J72j50M14n65j70L21L8p6j10L3j57K30J85j90L3L0J0r8j60J37
$$ -67 -199 -117 94 266 116 530 -35 -205 116 154 78 -32 1 -156 74 259 69 102 132 142 44 -116 21
3491B1J58l87K30L0j43Q7k34N8K31m7k97K24j15N9P9JJ43j92J00q4J64l34L56
$$ 21 179 -208 22 52 -91 -4 -238 -180 51 4 -293 -69 -184 -125 -46 -45 98 -94 6 -78 86 -248 108
3514A08r6j70K29n4j14K8K73k68Q9jJ17j34n4J19R5J19k72J36Kj11J05K8m21Q8
$$ 108 12 -158 71 17 -97 -69 204 -64 25 24 141 7 -47 72 167 286 14 150 152 41 146 174 -247 -159
3538a59M17m04j97O06k35p4R2M8r7p0J20k97K16n8r4J53lK4M3j23J92j61L9N5
$$ -159 258 -146 -343 263 28 -46 46 94 -3 -73 47 -250 -34 -92 -186 -33 -36 -12 31 -92 100 -61 -22 33
3562C3J99l63J82m8O3j79J82j32k35L04K52n12KQ9L74k20l6J39l71P5J61k41J64
$$ 33 232 -131 51 3 66 -113 69 -63 -298 6 258 -254 -252 -163 211 -9 -45 94 -277 -202 -41 -282 -118
3585a18L62l03O8K7m8j70J38o5J40j99K71j85k26L86j6k90J94J18P5L1j89N9j21
$$ -118 244 -59 9 36 -12 -182 -44 -109 31 -168 103 -82 -308 78 62 -228 -34 84 159 190 1 60 -61
3608f1K19j81n6j06M93o3j02N4j66J00l72J99J07q0J8M6k63J39r6K2L8K40k65
$$ -61 158 -23 -79 -185 308 245 143 197 31 131 -241 -42 65 -15 3 49 -214 -75 -171 -149 -111 129 -136
3631a36J04k07J67rP0M1%j80L3J07m2L5K87J7l47J66n6j69qK41O7j30j35J87k51
$$ -136 -32 -239 -72 -81 -11 30 30 -150 -117 -10 -52 -17 270 287 -60 106 50 -119 -127 114 181 51 -84 103 -148
3656a48K46J57k54l8j1p7L28k18J72l82J23J26Rj98O9Q8j3K0p8K19k31J64on0
$$ -148 98 255 1 -37 -48 -125 203 -15 157 -225 -102 24 33 -165 -96 -8 -21 -1 -79 140 -91 73 67 17
3680A7L8m3j80J42n6N9P9Lo6J25M5p5j64J41N7k10N6p1J3J40j77M4j26N95l15
$$ 17 55 12 -168 -26 -82 -23 56 59 -7 118 163 88 -76 65 122 -88 -32 -103 -90 50 -127 -83 -209 386 71
3705G1o8j59K21J6j72q8J08k08L91j01K5j72J15p9j5K93k66L60l12k2J16%J02
$$ 71 3 -156 65 81 -91 -179 -71 -279 112 11 36 -136 -21 -100 -115 178 -88 272 -40 -62 54 54 156
3728A56P3j63k59L15n5k3J42j4j22K0k71L33rJ08l31j9M03j11k45K23nk47k0R8
$$ 156 229 66 -193 122 67 44 186 172 50 70 -201 132 123 231 -100 -119 284 173 -72 151 146 -101 -121 -23
3752b3j28J41k5K8k1J7Q2lK62m77j03J15J41O5mK50l41j13L90l45K69j02q3L8
$$ -23 -151 -10 -35 -7 -28 -11 71 68 330 -147 -250 -135 6 71 67 317 -24 -137 253 -92 177 75 -8 30
3776C0K35oj85ro5k61J92QJ0m5qK8Q4J28j95k42L47pl29K30K38J4k74Q5o7j84
$$ 30 265 259 74 65 0 -261 -69 -61 -51 -96 -104 -76 8 136 -59 -301 46 39 -290 -60 178 192 -82 3 -64 -248
3802b48K58K3O0R3j20J06l8j81J2J6P6k3K03k73J6L65m54N7M4J28p1j82L20k89
$$ -248 10 33 93 186 66 172 134 -47 -35 -19 57 34 237 -36 -20 345 -109 -52 -8 120 49 -133 187 -102
3826a02J25L9P4n50N50k07K05J8k00J91k88J59k4m4K38k6j07J23k97J91j67Q5
$$ -102 23 62 136 -414 136 -71 134 152 -48 143 -145 14 -10 -54 184 158 51 174 -123 68 -99 -14
3848a4Q2k02K63m9j05K97k68J11j44PK31k28n3J53ol33N3L3R7J08o0M9j04P3J55
$$ -14 68 -134 129 80 -25 272 4 115 -29 -22 209 -19 -72 81 75 -258 -205 -172 -75 33 -27 22 -82 -9 146
3873A46k07j13K07p8J19K6q0M9p9o5l6K7J48K89l00P1J66l86P5j22K80j44j61
$$ 146 -61 -174 33 -45 74 100 20 69 -10 -75 -111 -84 64 353 53 124 290 -96 -21 -143 137 -7 -168
3896a68J53J37J37l09K9l6J1n6QJ51m6j85L40k98m1L5J90l32K30J96q6j07L1M0
$$ -168 -15 122 259 -50 -21 -57 -46 -102 -94 57 11 -174 166 -132 -173 -138 52 -280 -50 146 60 -47 -16 24
3920B4J1o6K78q5k99M4Q0j8q2J39Q9m11K89K60k57J94k40J59j4K3k05M7k05J59
$$ 24 35 -31 247 162 -137 -93 -13 -31 -113 26 115 -296 -7 253 -4 190 -50 109 95 118 -87 -40 -245 -86
3944h6K3n7RJ43j62K10k91K21K24l01J42j0q7L8j58L79m36K00Pn7P8m7k08K87
$$ -86 -63 -120 -111 32 -130 80 -211 10 234 -67 75 65 -22 16 -142 237 -199 1 8 -49 29 -18 -226 61
3968F1K65k84M5n2J85k42m9K27l36J93j9n4JpJ04R0o7k65J45M45l08n5j61J75
$$ 61 326 42 87 35 220 -22 -71 156 -180 13 -6 -60 -59 -66 38 128 61 -204 -59 386 78 23 -138 37
3992C7j29J30j16O3N0L6P3j78K38m43J46J69n7o1K87j49n6k1MP8N8j82J08j05
$$ 37 -92 38 -78 -15 35 71 144 -34 204 -239 -93 76 19 -42 245 96 40 19 23 101 159 -23 85 -20
4016b0J99j85O1m4j22J58j45J63k03P5O3p7OJ87k48L53l85J62k36K91R0k63K46
$$ -20 179 -6 55 11 -111 47 -98 65 -138 -63 0 -77 -71 116 -132 221 -164 -2 -238 53 143 -120 126
4039A26q9j03J07n3o6NP9k73J40l0K75k06Q7R1O8m02K47l6r6K16j53p7K85j86
$$ 126 37 -66 41 -12 -78 -73 6 -267 -127 -157 118 -88 -1 90 158 -244 3 -33 -129 87 -66 -143 142 -44
4063d4j52K44j59J16N9J99j15l40M7PK09j36j1R4m8J27j08j11K5m3K97k49J79
$$ -44 -196 48 -111 5 64 263 148 -192 -145 -138 71 -65 -76 18 -30 97 -11 -122 -97 -140 157 -92 87
4086H7Q2l69M54m57P9J68N7R7k91J9J42K4j2J32O0j36k79K21L9j02j06P1m0K54
$$ 87 169 -200 254 -203 -124 44 101 198 -93 -74 68 92 80 212 272 136 -143 78 117 15 -91 -20 -60 194
4110A94j21m9J56k9k45K5Ql9K86k13J94j38K26k66N7r5q7m8J31J92o3J58l29N7
$$ 194 73 24 180 151 -94 -69 -61 -100 186 -27 167 29 255 -11 46 -49 -136 -184 -53 139 76 234 -95 -38
4134c8k38J46J97Q8k6n0m4n0m3n5O6Q2L9m22K96j7J65j02j55J34K5J24l11P7K22
$$ -38 -276 -130 67 155 129 79 35 -15 -58 -113 -47 35 74 -348 -52 -69 96 -6 -161 -27 -2 122 -189 -112 110
4159A10o4j20M4j31J27l2L3M0M9Lj58K18l18K59o9J84r8l06L06j03j48K37j30
$$ 110 46 -74 -30 -161 -34 -66 -33 7 56 59 -99 119 -199 60 -9 175 77 -229 77 -26 -174 63 -67
4182f7K40l8n9O8m37L49K6kJ02j43j17K07m32L39L1J08O6j87p8L0m3M4j63J46
$$ -67 173 135 76 144 -293 56 82 80 182 39 -78 129 -303 36 67 175 241 54 -24 6 -37 7 -156 -10
4206a0J42p1j9k67L73r6k41J23kJ03j60J03J74p7p5J53j14j5j8L9L0q5pJ78l10
$$ -10 132 61 42 -225 148 52 -189 -66 -68 35 -125 -22 152 75 0 153 39 24 6 45 75 -10 -17 161 -149
4231a49k28M64k98J05L4j52K88k81ON3K9L6j10J29O0j93J14Q5K38l59J50JR3Q7
$$ -149 -377 87 -211 -106 -72 -224 64 -217 -211 -158 -129 -93 -203 -74 -14 -207 -93 -8 230 -129 21 22 115 202
4255B02l04K92j12k11j2rL0K83j1k80L0K73k33N6J40j57j53R6Q1j28L7R4Q2j07
$$ 202 -102 190 78 -133 -145 -154 -124 159 148 -132 -102 171 -62 -6 134 -23 -176 -80 1 -127 -90 4 86 -21
4279b1j87R2J37l2J27k49K19r2L9q8n8K06j6L3j07M3O7Q7j30J6j87k3J87j29j42
$$ -21 -208 -116 21 -11 116 -133 86 -6 33 -55 -113 93 77 110 3 46 113 200 70 86 -101 -124 63 -66 -208
4304b08M44l29J47j77MJ93j72J83L5P8l32K6K35j82N1j8L0j16j15K12K4r8N4o7
$$ -208 236 -93 54 -123 -119 74 -98 85 120 198 -134 -108 127 -55 -4 -22 8 -108 -223 -11 13 -85 -31 -98
4328i8R2K39k65qL58m53K79j37j21L03j31p3j36J42k02K79J02j44Lj03L04m84
$$ -98 -6 233 -32 -40 318 -135 144 7 -114 189 58 -15 -151 -9 -211 68 170 26 29 -74 230 -254
4350b54N0O7L77k90n0J49j57N9n2R1j56J29j02K41j84Q9k09J02J71N6k60L45K7
$$ -254 -204 -137 240 -50 -100 49 -108 -49 -101 -10 -166 -37 -139 102 -82 7 -202 -100 71 127 -133 212 239
4373B39m16n6M41j80O7m9L2qO9l4j20OJ76j47Om34K34K85k40Q0Q3j40K17j69m9
$$ 239 -177 -233 208 28 95 46 78 70 139 105 -15 -9 167 20 26 -408 -174 111 -129 -49 34 -106 111 -58 -107
4398a07P9o8R9k8M4m7m5R4p1J29l38J11M1L07j15O6k79M04l22lk46M52M4k92L19
$$ -107 -28 -96 3 -25 19 -28 -73 21 -50 79 -259 -148 -107 200 85 151 -128 276 -46 -49 -295 157 201 -91 228
4423B28o05M81p9J19k93J24O3J85k59j80L82j87m1k09L01P9k18K68K8r6k16J37
$$ 228 -377 104 25 144 -149 -25 38 223 -36 -216 166 -21 -62 -271 30 109 -109 159 187 91 -125 12
4445A2j80J74M5k63K77J7k99J98OL19k08j01J27k73L07j58l7k56L74po8k21K40
$$ 12 -168 6 51 -212 65 82 -217 -19 -13 306 98 -3 124 -149 158 0 -37 -293 81 74 6 -215 25
4468B5j3k26K95k00k1M9J52k5k67O2J82Q3j55K30j12q7k9N0k07K62J4j2k29L6
$$ 25 12 -214 81 -119 -140 -91 61 36 -231 -169 13 96 -59 171 59 -28 -57 -7 -214 48 62 50 -179 -143
4492a43K85l57K95J53j7k75N6j3L1l8k2o6L5Q5J32l3J75j61j38N8j21j7J46p0
$$ -143 142 -215 80 233 216 -59 -3 -16 15 -23 -45 -111 -76 9 141 108 283 122 -16 42 -79 -96 50 -20
4516b0Q2q9l8j98L78p3p3k32J91p9K52j35K1j6R7J09k20K1k04K31M7j33M38l30
$$ -20 62 -27 -65 -263 115 42 -31 -263 -72 -151 101 -34 -13 -29 68 177 -43 -22 -226 5 52 -81 357 27
4540B7j53J91R2N7k53m6MK02j51n9J3P3J09l68J75K8L9o2K58j83N6K9M6N4j63
$$ 27 -126 65 157 214 -39 -85 -81 121 -30 -89 -76 -3 106 -262 -87 -59 -20 -82 176 -7 49 78 124 178 15
4565A5j20J47L6l2k6j02J59k9Jj25K78j58j4R4k4q1j07M2j08Q8J31j34L16k99
$$ 15 -105 42 78 46 20 -82 77 48 49 -76 202 44 30 124 100 19 -88 -46 -154 -66 65 -69 247 -52
4589e2K78k55K5Pj2J91j36J2q7j58L99k28k40J64l6J64k09J65jqj74M38l72K85
$$ -52 226 -29 -4 3 -9 182 46 58 -29 -187 212 -16 -256 -92 -128 36 -173 -8 -9 -17 -191 247 -125 160
4613A60j95j4Q5j57M1N5j7o2J31j14NJ85M4j68k87O45n05K31J11j34k28K49k07
$$ 160 -35 -49 36 -121 -80 -25 -42 -104 27 -87 -82 103 147 -21 -308 337 -168 63 174 40 -188 61 -146
4636a46K85k14m3J78mr3J75k96R8O0j14K10l50L75q6O6k12m5N2L20j39K4J02J4
$$ -146 139 -75 -118 60 56 -37 138 -158 -60 0 -114 96 -254 121 35 101 -111 -156 -104 216 77 101 203 217
4660B17k04J40j04m7J9K0J75k4j66R7j45J39m00N80m54Q6J11j24k8K86k10J22
$$ 217 13 153 49 2 21 41 216 192 26 123 -22 117 -283 297 -157 -71 40 -84 -112 174 -36 86
4682H6ol09M3L14j56J98j35ll8K38n51K21K04j03J41l74N5K44l3n6m8O7NMk2J00
$$ 86 80 -229 -186 128 -28 170 35 32 -6 232 -319 -98 106 3 144 -230 -175 69 36 -20 -68 -1 4 8 -14 86
4708H6K0J32m84K89o9L24l20q8K43k31K53P1m36M9L05j57r2Q6k07M10k90J34j80
$$ 86 106 238 -246 43 -26 298 -22 -110 133 -98 155 226 -210 -161 144 -13 -105 -19 -226 184 -106 28 -152
4731a52LL7K93r8J14r4lm5r3K71k98L8j42L56j85L09n03M64p1j50j19O6J05j14
$$ -152 -149 -112 181 83 197 103 100 55 -38 233 -65 -27 -169 187 2 311 -192 272 201 51 -68 -2 103 -11
4755a1R8j47J62k19j29J64L9K52l12J34m2L16k52RJ33l01J20j61K0J04J2q0J92
$$ -11 87 -60 102 -117 -246 -82 -43 209 -103 31 -11 305 53 62 195 -106 14 -147 -127 -23 -11 -91 101
4778A01O3k16j9j27P4l9J79j10N8J76n8j20K14j13K40j38p5p6JJ7N5k01L6K37
$$ 101 164 -52 -71 -198 -124 -163 16 -94 -36 140 82 -38 176 63 303 165 90 14 15 32 87 -114 -78 159
4802A59l73K96j52K72j07P1j87J88j78J17k23J89q4q9J11J15j0j74J95o4j32p1
$$ 159 -214 82 -70 202 95 166 -21 167 -11 106 -117 72 -12 -101 10 125 115 -59 136 72 -60 -131
4824a31R4j14J32J59o2l16M49l0k71lO5L3p7K7O1mK27m8j77j44k09K47l7P9Q2
$$ -131 -37 -151 -19 140 78 -238 211 181 -90 -93 -28 5 -72 -45 16 12 239 191 14 -130 -339 -92 -129 -50 32
4849C2q4NL5j73L74k19M6J76m80L17j37L76k38K08l68j30M79l03K68n2J8J04l05
$$ 32 -52 -47 -12 -185 189 -30 16 192 -288 29 -108 268 30 238 -130 -260 219 -84 184 132 150 254 -51
4872e1J63k13r7L46Q2l26LQ6P6j97J53J09N3j7m61M38k34J55j73k4J86o2J31j05
$$ -51 112 -101 -198 148 230 -96 -93 -7 69 -128 25 134 187 170 -291 147 -87 68 -105 -129 57 -5 126 21
4896B1n5q8K94k73K93K6k04L1J39P2l21j8j54K59l1L3j27L37k11k04L25k01P9
$$ 21 -34 -122 172 -101 192 218 14 45 184 256 -65 -83 -237 22 -9 24 -103 234 23 -181 144 -57 22
4919B2m7J32k27J60Lj31L65k66p0j96J86K60o0j61j9l7J65m6p7R3k32K73l6j26
$$ 22 -25 107 -120 40 43 -88 277 11 -59 -255 -69 191 131 -30 -49 -86 79 33 -44 49 -183 90 54 -72
4943g2Q7R4L8q9l7R3j05J95m32J07Q7J30r8L03k26J13l1m90L75n0J75l19J07l2
$$ -72 15 109 147 58 21 114 9 204 -228 -121 -34 96 -2 301 75 188 157 -333 42 -8 167 -152 -45 -77
4967g7r7P9J67j38K4P2j68l8R7L09q0J23m35J88pj52J43pq7J29N3o2k81M24j89
$$ -77 -174 -95 72 -66 -42 30 -138 -176 -79 230 150 273 -162 26 19 -133 10 3 -84 45 98 36 -245 179 -10
4992a0J46k88J83P3j40m6J68j45O8m6J13j75J62j62J38k0M6j8k20L13l01P2l8
$$ -10 136 -152 31 104 -36 -82 86 -59 9 -37 76 -99 63 -99 39 19 65 47 -173 140 -161 -89 -127
5015a27L07n07L71k8j14k1K83k17R0R4j62j28L69k38j08L96m55Q9j1M11k66p5
$$ -127 180 -327 44 16 -98 -119 164 -53 37 131 -31 -159 210 -28 -136 260 -195 -106 -117 294 28 -47
5037d7l54N61k19j52L48r4L9j23N0M1L7L2j95O0O5k21K80N7k38J33j04J34M8R8
$$ -47 -401 160 -59 -211 137 43 82 -41 9 50 87 119 -76 -16 49 -172 108 165 -73 60 -44 90 138 236
5061B36j30j68J83l30M23k20J7j68N8N9J96j94L18l52m4M7j56K78o8n3J94j56
$$ 236 106 -62 121 -209 214 -6 11 -157 -99 -40 156 -38 280 -72 -116 -69 -225 53 -15 -68 126 -30
5083c0j32j60N79l90R7r6L14l08Q2K04m77L35J31j48K4l6J2MQ8j31P8J10j07k26
$$ -30 -162 -322 257 -133 -36 -132 182 -126 -44 160 -317 18 149 1 25 -11 1 5 93 -38 40 150 43 -183
5107a83M28j18k25J05K29l16k54L09j55K67j26K82k51J31J2J43l07K5nO1K7L7
$$ -183 245 127 -98 7 236 -80 -334 -25 -180 87 -39 243 -8 123 135 278 -29 -4 -9 52 79 116
5129A16m1J6Ll9J7K9l42J61K0R8q6o3L6K0K3m8L61l28J12j52J16J18L3n08K89
$$ 116 75 91 94 55 72 101 -241 -80 -60 38 -48 -111 -75 -55 -32 -80 281 -47 65 -87 29 147 180 -328 -39
5154c9l03L88j42M4J03j71L65k94Q1J40J12l71K35k38j5K94J13l84j01Q5J95j28
$$ -39 -342 46 -96 -52 51 -120 245 -49 32 172 284 -87 148 -90 -105 189 302 -82 -183 -98 97 -31
5176c1j03K31k9j88J77r7J45M6j19j38OR9j55j19K75k78L88j55L4j37K31p1Nk65
$$ -31 -134 97 68 -120 57 -40 105 151 32 -106 -100 -1 -156 -275 0 -278 110 -45 -11 -148 83 12 17 -248
5200b48J20K61K29j85l82K74n4J97l45K34k53L10m4j13m1M4J05k46K84j02j13
$$ -248 -128 133 362 177 -205 69 15 212 -133 101 -152 158 114 1 -40 4 109 -137 147 45 -68
5221f8J31J22P6k69P3L0j03j6L5P4n8l5K05k25n3J55K4p6m3K26j03j48r0L27m25
$$ -68 63 185 261 -8 65 95 -8 -24 11 85 27 -8 197 -28 -81 74 98 22 -21 205 102 -46 -136 191 -234
5246b34K59p9O1o7K8j06J72j05K04%l8k30J94N1n17O85m02J34J15K3m4n6j2J7
$$ -234 25 -54 7 -60 -32 -138 34 -71 133 133 95 -135 59 110 -407 278 -124 10 125 148 104 48 36 53
5270E3n7k9O2p7Q6J07q6L3j00n9q4Q3P4m7j04R2K29j79m4O4K4r6m1l6J87q7J52
$$ 53 -4 -33 29 -48 38 145 59 92 -8 -67 -151 -68 6 -41 -145 -53 176 -3 -47 17 41 -55 -96 -132 55 -32 120
5297A20N3j08j49J34q6K5l2j22Q8q8J68j33J83qk8M1J11l35K07k6J30j95k22M35
$$ 120 173 65 -84 50 -36 -11 -43 -165 -77 -165 3 -130 53 45 17 58 169 -166 41 15 145 -50 -272 163
5321A63Jk1LN9j60r0K19l51L96j24j29O7j35J31N1N7k79K04lj38l2Q5K0P6n1J44
$$ 163 164 143 146 205 45 -45 174 -177 219 95 -34 33 -102 29 80 137 -142 62 59 -79 -111 -26 -6 70 19 163
5347A63j04j93o7K07N7j9Lp0L9J19j37P7j50r1J09J13p6O5O9j76L00j17j33r9
$$ 163 59 -134 -201 6 63 44 47 -23 16 135 -2 75 -75 -166 -57 56 -20 45 114 -62 238 121 -12 -111
5371a11N9K49j05q8q6l4J58p0L01n66K32K8j5J56L9r7J61j14j5q8k70K21M6l7
$$ -111 -52 197 92 4 -82 -116 42 -28 273 -293 -61 -33 -48 108 147 50 211 97 82 -6 -276 -55 -9 -46
5395d6m9r2K30j03J0R5j9%j0J15j80K58m21L09LJ02k66o0k8J97j84R2n5J51kj88
$$ -46 -95 -187 43 -60 -50 45 26 26 16 131 -49 209 -212 97 100 202 -64 -124 -152 45 -139 -47 -102 49 47 -141
5421a41K29J59j25M8j56M7o6kj67K67n5k48L98j91p6O6J85K3j69j2R0k88M25p0
$$ -141 88 247 122 170 14 61 -5 -7 -174 93 38 -210 188 -3 -79 -13 172 195 26 14 104 -184 241 171
5445A71j50j67K72k16L1L2M1j84R6M2P7K15j58j54M5j23M9qk0M0j2k3O7j46K42
$$ 171 21 -146 126 -90 -59 -27 14 -170 -74 -32 45 260 102 -52 -7 -130 -81 -89 -109 -69 -81 -104 -37 -183 59
5470E9kk7L5j43N8P1l9P7j77P1J29P8k76q0J36R7PP3k64J80j59n0L2K14k4j37
$$ 59 57 30 65 -78 -20 51 12 89 -88 -17 112 190 -86 -166 -30 67 74 147 -117 63 -96 -146 -114 100 76 -61
5496f1j95K32k8J34k79K87k03K66k46J74j7q8K01l29J28J65p9k20J94Oj71o1O1
$$ -61 -256 -24 -52 82 -197 90 -113 153 -93 81 64 -24 177 -152 -24 141 62 -158 36 42 -129 -190 -129
5519a29J67O7q6j11J44j84K05k54K97j84J65oK2p3J13k09N2M0j77J34r7L2k9J43
$$ -129 38 105 19 -92 52 -132 73 -181 116 -68 97 91 113 40 153 -56 -4 36 -141 -7 -104 -72 -101 42
5543D2n0m6J1N7NJ56k92j5K5%K41k09j48J08P1O5M7K5k64J49p0K3OJ11K37k70
$$ 42 -8 -54 -43 14 19 175 -117 -132 -107 -107 134 -75 -223 -115 -44 21 68 93 -171 -22 -92 -69 -63 48 285 15
5569A5J34N6k11R0n0j78P2P8j91K46j43J71J8k38J11qj79L13k57Jj43L49l28K06
$$ 15 149 205 -6 84 34 -144 -72 6 -185 61 -82 89 107 -131 -20 -28 -207 106 -151 -150 -293 56 -272 -66
5593f6J14J66k77p1L11k34J34O0l46J57j21K64P6q0oN9n9j40K36j40O9Q1k00K24
$$ -66 48 214 -63 -134 177 -57 77 137 -209 -52 -173 91 167 87 81 140 81 -59 177 37 106 187 -13 211
5617B11j16j45P9j36p9L5K21j21L8R8O5m00K08L16l97L58j08k20L5M9l8J41m7
$$ 211 95 -50 29 -107 -186 -151 70 -51 -13 85 150 -250 -42 274 -123 235 127 -93 -58 -9 -47 94 47
5640D7oj0q2K7m5M64l24N3n8o7K00O9l63m7J63q4O8q7J85K1q7j49K76o8j01j47
$$ 47 41 31 -51 -24 -69 395 71 124 66 -1 199 268 -95 -142 21 -63 5 -82 103 124 37 -112 164 96 -5 -152
5666a52J67j48l2J0j11M30l52O6J37O6m7J29j85j04K03p1p2J4l2J5J87o6j76J99
$$ -152 15 -133 -165 -155 -266 164 -188 -122 15 81 34 163 -22 -126 77 6 -66 -52 -84 -69 118 52 -124 75
5690G5k67J16J22k10K51qj94J70K33n17L03j21j12J01J06n4O8j05K35k79q2K00
$$ 75 -192 -76 46 -164 87 79 -115 55 288 -229 74 -47 -159 -58 48 -6 62 -43 192 -87 -169 31
5712C1j93J56m4R8j34J24m6J11j37M2M2R7k57L26n7n3k63L81j23O7j87j28Q9L6
$$ 31 -162 -6 -50 48 -86 38 -8 103 -34 8 50 147 -110 216 159 106 -157 224 101 168 -19 -147 -58 -22
5736b2J16j57J56r7J33k0J03k53J21k90J09K77k09r0J57q2n7J25k06OK99j86J52
$$ -22 94 -63 93 -4 129 109 212 -41 80 -210 -101 176 -33 -123 34 -48 -105 20 -186 -180 119 -67 85
5759H5j01J6j11J67k53L03l71J36Q1O1j02J80j21j58L50j62L2J18j96j12L02k47
$$ 85 -16 0 -111 56 -197 106 -265 -129 -48 13 -89 91 -30 -188 162 0 32 150 -46 -158 144 -103
5781a03L09l67K37l4lK3Q0q9K3r2J47m6j42J56k00K26l72N03k5m06L48l32n2L53
$$ -103 206 -161 76 42 39 62 142 53 76 -16 131 85 -57 99 -101 125 -247 256 231 -175 173 -159 -211 142
5805A42l08J37k63K91Nj75L28j49q5K9L03k19J17k68PK92k01R0J2j20P0o0J7j0
$$ 142 -166 -29 -292 -1 4 -171 157 8 -77 -48 255 36 153 -115 -108 184 -17 73 85 -35 35 -25 -8 -18
5829a8p2k7k0K29j7m3K03k98P1j19P7M4O5J79j05o9l1j10O8j13n9J23rJ27J59
$$ -18 -90 -117 -137 92 75 32 235 -63 8 -111 -34 10 75 254 149 80 49 -61 7 -106 -165 -42 -51 76 235
5854B35j62K61l88J37j58l6M8N4j41O9L6J25N5J52j49j50p0L06k85j13l0K19l5
$$ 235 73 334 -54 83 -75 -111 -63 -9 -150 -81 -45 80 135 287 138 -12 -82 224 -61 -174 -204 15 -20
5877b0o8L3K31l68m2q8L46Q6j52R7K15m66J44J49K03l93J37l79J30K08k39K46
$$ -20 -88 -55 176 -192 -234 -322 24 110 -42 55 270 -196 -52 97 300 -93 44 -335 -205 3 -236 10
5899A0J71k85P1J05p6P6k96K98l15K53K09l21J08R3Q6k23k51M25o9Q5k68J71p0
$$ 10 181 -104 -33 72 -4 72 -224 74 -241 12 221 -100 8 101 187 -36 -287 138 69 154 -114 57 -13
5922a3j21K14M4j79L05k50j62J50o8K47m74L15j62K16R2k76L11N3j87j22j16J69
$$ -13 -134 80 124 -55 250 0 -162 -12 -80 167 -307 8 -154 62 154 -122 189 242 55 -67 -183 -14
5944a4j96K56P9j03Ml8j77O0K83j30j08k4K0J54j2o3N9j17j03R3K15m12J97q2
$$ -14 -210 46 125 22 26 -12 -189 -129 154 24 -84 -108 -88 66 54 -9 50 -67 -170 -77 138 -274 -77 -159
5968a59K00n0n0J24j0j62%K07k33m2J80o1M7J35j48K1J61ok30J18j60J23K4L37
$$ -159 41 -9 -59 65 55 -107 -107 100 -133 -175 5 -56 -9 126 -22 -1 160 154 -76 42 -118 5 29 366
5992C66k88l6J12n1N7k68J09j58K32J44j88qj73M8N6P7m9j4P2o9m3K1J51j33J10
$$ 366 78 42 154 103 160 -108 1 -157 75 219 31 23 -150 -102 -46 31 -18 -32 40 -29 -72 -51 100 -33 77
6017G7k19J87J44k08l0J07k01K63l16J90Oo2j44L08k84L50k56j88M77j33k13N2
$$ 77 -142 45 189 -19 -49 58 -143 120 -196 -6 0 -62 -206 102 -182 168 -88 -276 201 68 -145 -93
6039i3K68l28m8K4J89k6M6J50j32n1l01K01K43oj74j69J39J39J30k83j67K28J45
$$ -93 175 -153 -201 -177 12 -14 32 182 50 -1 -302 -101 142 136 -38 -207 -68 71 201 -82 -249 -21 124
6062A24m30N23j69M4p5J64j33K5p3K9rl5k61J73J72k0J70j76m4k13J82P9K3j51
$$ 124 -306 217 48 92 17 181 48 73 0 29 20 -15 -276 -103 69 49 219 43 -1 -214 -32 47 70 -81
6086h1kK35p1l24M24m0j50q4K98l32lJ42J8O5K2Qn4r8Q7JL9L6Nk2q1Rn9J51k62
$$ -81 -83 152 81 -243 181 141 -9 -93 205 -127 -130 12 30 95 117 125 71 -27 60 61 100 136 141 119 38 47 -12 139 -123
6115a23M99l69J21K02k64o0k50L88k34K0K17k58Q8j5O4j63J56n3m9J30J32r0p8
$$ -123 376 7 128 330 66 6 -244 144 -90 -70 147 -111 -23 -38 26 -137 19 -34 -83 47 179 89 11
6138A1p2j79L22n6m1K66k96Q7p0kP4l51J96J67%j53j5p9L70m8j14j26K7N9J21
$$ 11 -61 -240 82 26 -15 251 -45 42 -28 -30 44 -307 -111 56 56 -97 -112 -191 179 131 17 -109 -82 -23 98
6163I8K9j83P4J65p7j14r0K12J1n4J88j70M7j23r8oJ68k69K02M7l8J41o0j76m5
$$ 98 127 -56 18 183 106 -8 -98 114 125 71 259 89 136 13 -85 -91 77 -192 10 57 19 160 100 -76 -121
6188a21O3J16j16P3Jk0j32K46O4j51k68K60J81o1k46J21J15m6j61K13j84Lk4K24
$$ -121 -58 58 -58 15 16 -4 -136 110 174 23 -245 15 196 135 -111 10 125 79 -82 131 -53 -50 -74 150
6212A50J0k54J65j99J96k05J99M4l39K44K1j27M9O0M1K8k22J57Qo6J27j86K61
$$ 150 160 -94 71 -128 68 -137 62 106 -233 11 32 -95 -46 14 55 83 -139 18 26 -40 87 -99 162
6235A62k45j9j1q5J12L58k14r0j6j5O1J8q5m5K2j0J53j11l3R8J39l18J35N2O0
$$ 162 -83 -102 -113 -198 -86 272 58 -32 -48 -63 -2 16 -69 -114 -92 -102 51 -60 -93 5 144 -174 -39 13 73
6260G3J70l46R8j94J91q1L2J07J20q6m5n9j74K48k75L5L97j27R7k68L11j94k03
$$ 73 243 -103 -5 -199 -8 -89 -57 50 170 84 39 -20 -194 54 -221 -186 211 84 181 -87 224 30 -173
6283a73r8M03j99k04Q9J61J57j99Q4o5L39l26J84k25J31p9o8q9m6Q7K94j53J9
$$ -173 -271 132 -67 -271 -182 -21 136 -63 21 -44 295 -31 153 -72 59 -20 -88 -177 -223 -136 158 5 24
6306B4k08J92q0rK95m51L27j43Ql0j18R4N3J71m88J68J65l5Nj9P1kn0J83k25O7
$$ 24 -184 8 -72 -81 214 -237 90 -53 -45 -75 -193 -99 -46 125 -363 -195 -30 -65 -60 -79 -8 -10 -60 123 -102 -35
6332c5P8j18J90m1J20l79K84K2J26l69j5L08k49K04k19j04k5K62l80J39K48k5
$$ -35 43 -75 115 74 194 -185 99 121 247 -122 -137 171 -78 126 -93 -197 -222 40 -340 -201 47 22
6354B2j3j60j0L03j56J09l2j4q8j22K87j27J69j92K70k28j5P6M0m2j48J32Pn9
$$ 22 9 -151 -161 142 -14 95 63 49 -39 -161 126 -1 168 -24 246 18 3 79 119 77 -71 61 68 9
6378IN2P7k23K66RJ12j88J93q4k27M4J48k26J21k53K3L09k76K1P7K16k35j47J60
$$ 9 61 138 -85 181 190 302 114 307 223 -4 40 188 -38 83 -170 -147 162 -114 -93 -16 200 -35 -182 -22
6402b2r4K43r7j76N1L4L61j68j95n2K44k07o8K28j70J60n2j16J2j28J58O0K01
$$ -22 -116 127 30 -146 -95 -61 300 132 -63 -115 129 -78 -146 82 -88 72 20 -96 -84 -212 -54 6 207
6425B07m00M22l52Q5k45K56J30j64j28K59R5k05K6j07K1K26k42%J8J82j14nJ34
$$ 207 -193 229 -123 -38 -283 -27 103 -61 -189 70 165 -40 -14 -121 -100 126 -116 -116 -98 84 -30 -35 99
6448I9n8k4j11M39l61L9n9or5O1q7K73k32J60j49J79m0N6m02M72Q9j48q8J69o8
$$ 99 41 17 -94 345 -16 23 -36 -42 -137 -76 -163 110 -122 38 -111 68 28 84 -318 154 243 95 7 176 108
6473A08k88J82k6K42l45L6M9r5j46J46K01k11J62k7J09J12k20j23P8pJ4R5O3J29
$$ 108 -180 2 -24 218 -127 -91 -42 -137 -283 -137 64 -147 15 -12 97 209 -11 -134 -56 -63 -49 46 109 238
6497B38k72K65l31K13j28n8j70J91K06P1j87R9k59O8QoK15k78O0lj2m6J36qLJ61
$$ 238 -34 231 -100 113 -15 -73 -243 -52 154 225 38 137 -122 -54 -46 -52 163 -115 -55 -58 -70 -116 20 12 15 176
6523A76k05k61J15M14j83P3k19p0K1J73O3Np3j95J97J26o8K2K60m24K20j15o4
$$ 176 -29 -290 -175 239 56 129 -90 -160 -139 34 97 102 29 -166 31 157 89 111 371 -53 167 52 -12
6546a2j90O8oM7J60L7j01j84J69J94n0l5j10k0j37K57l17K06k23N81k08j34K10
$$ -12 -202 -134 -140 -93 67 104 3 -181 -12 182 132 97 -13 -33 -170 87 -230 -24 -247 334 126 -8 202
6569B02l5m1k47L4J75r9l75M58K00j52l34K99j14Ok80K64K48j29o8n8j7J57N2
$$ 202 167 126 -121 -87 88 -11 -386 72 272 120 -214 85 -29 -23 -303 -39 209 80 12 -46 -63 94 146
6592A46J09l40J98k08J03n3O1J21j65J04Kj7j10J88n2j94J77n4j90J68M2pJ36
$$ 146 255 -85 113 -95 8 -45 16 137 -28 76 78 61 -49 139 87 -107 70 16 -174 -6 36 29 165
6615A65k71R9pj63L24j48K6n4j66K56J1k42j03K59J8j04J34N6j48l5M1L09m70
$$ 165 -106 -7 -14 -177 147 -1 25 -29 -195 61 72 -170 -273 -14 4 -100 34 90 -58 -93 -52 257 -213
6638b13P6M3K58l0l86L37O1j64j09J03r4J16q8o3J03k3k11M33j92J0n7J53J1r9
$$ -213 -137 -94 164 134 -252 85 146 -18 -127 -24 -118 -2 -90 -153 -50 -73 -284 149 -43 -33 -90 63 74 -25
6662b5J27r5J36k86KJ82N3l4M6j56L2K73k51Rj43K55R8j45J83j22j21r1J05j52
$$ -25 102 7 143 -143 -141 41 94 60 106 -50 -18 255 4 13 -130 125 223 78 261 139 18 -73 32 -120
6686a20J8P0J02j14k6L6j91L90o2k12J20j08o5q2L89p0l2j03K4p8L75m46N14l77
$$ -120 -102 -32 70 -44 -70 -34 -225 165 103 -109 11 -97 -162 -244 145 75 43 -60 -36 -114 261 -185 329 -48
6710d8L7j30K41R6j59O9j5k23J52O2pj79jR8J98m16J50j53J56J97J3j10p9J97
$$ -48 -11 -141 100 196 37 106 91 -132 20 82 75 -104 -105 -7 191 -225 -75 -228 -72 125 138 28 -51 146
6734A46l17K01J16j90k11J34J6j6J99J0l54K43j60K56R6k4M7r6Nj53r9o0K01N8
$$ 146 -171 30 146 -44 -255 -121 -105 -121 78 88 -266 -23 -183 73 169 145 192 96 101 -52 -151 -211 -10 48
6758D8N1l0rj23R5N2J7j19j12J49J1k52M11j67j20J19Q0L5l47J18J56M6j77J81
$$ 48 99 69 60 -63 32 84 101 -18 -130 19 30 -222 189 22 -98 21 101 136 -211 -93 63 109 -68 113
6782A13r8k36L07m4j71j12M91j46J70k21j23k7o6J03J71l4l84N96m11L91l44L09
$$ 113 15 -221 86 42 -129 -241 250 104 274 53 -70 -97 -163 -60 111 77 -307 289 -122 269 -75 234
6804B34j30n3k9n1PL7J3j14J29j27L10k63k55K87M6j07K1r1J63k92J36N5K86l02
$$ 234 104 51 22 -29 -22 15 28 -86 43 -84 226 -37 -292 -5 41 -66 -45 -136 27 -265 -129 -74 212 -90
6828i0J14L9j10L3m6J64Ql60K42k3R6r0M8K74m9k72J54k8o3L5j84K24M6j38j03
$$ -90 24 63 -47 -14 -60 104 112 -248 -6 -29 67 -23 25 299 250 -22 132 104 41 76 -108 116 162 24 -79
6853g9L3j79Q0K92k43Q7j31J95P3Oj82J65j67J26n1J01lk04Q7O1p7pJ40M4k34
$$ -79 -46 -225 -145 147 -96 -9 -140 55 128 134 -48 117 -50 76 25 126 123 -81 6 67 -10 -17 123 167 -67
6878f7R5N7k22J09P8K0P5k0Q2m1k69K8lJ84j0j04R5k1J05k71M2q9K49k78K49j39
$$ -67 28 85 -137 -28 50 70 145 125 207 166 -103 -75 -78 106 96 -8 87 66 171 -100 -58 -147 102 -176 73 -66
6904f6qj3J39k09J24K3L05l27n3j06K78j02p2j04M6K1N3q3J85J03j59J07j73j7
$$ -66 -74 -87 52 -157 -33 -10 295 -32 -85 -191 87 -15 -87 -191 -145 -124 -71 -154 31 134 -25 82 -91 -108
6928a08l2JJ37K78l38J75j50J44k13r2L34j20mN6l5j62J04k21M00k07K2R4J68
$$ -108 -140 -139 -2 276 -62 113 -37 107 -106 -198 136 16 12 68 33 -129 -25 -246 154 -53 -31 63 231
6951B31l13K4J54P3O5m97J80J93p0n3R2j33J01J12k35K7m2R3j6o8p5j8K08Q7k28
$$ 231 -82 -58 96 169 234 -263 -83 110 40 -13 79 -54 47 159 -76 -49 -91 2 -14 -82 -157 -175 33 120 -108
6976a08K00J9k66K57n0l0j33k4Q8k38K27M2k36L26l20N8P2O9O5N4J02k61p0L48
$$ -108 92 111 -155 102 52 22 -111 -135 -47 -285 -58 -16 -252 74 -246 -188 -116 -47 18 72 174 -87 -157 191
7000A91k44P8k5j55J47J15j20o6J05o1o7JO1OK8K2M9j1q8K00j31K1j61L57k42
$$ 191 -53 25 0 -155 -8 107 -13 -79 26 -35 -102 -101 -40 -34 -6 16 65 54 -34 166 35 56 -105 252 10
7025A0j06N3l7O8j38J22r8J43k09J09L0L2P9k92L59oj60J57rk06J4j7Q1RJ12r6
$$ 10 -96 -43 -80 -12 -150 -28 -126 17 -192 -83 -53 -21 58 -234 125 119 -41 116 107 -99 -85 -102 -21 -12 100 4
7051DJ16K5k48J02J14l08K88j51q7n9M8J35J55j35p4j2P9J04k86Q2L05k56K36
$$ 4 120 145 -103 -1 113 -195 93 -58 -145 -204 -156 -21 134 -1 -75 -87 -8 96 -190 -108 197 -59 177
7074A77k48J79j10J0R1j48J20j55J99o1Rj90J03Q3k5P4j80L14l65J39j74L29j55
$$ 177 -71 108 -2 8 99 -49 71 -84 115 54 63 -127 -24 59 34 108 -72 242 -123 16 -158 171 16
7097A6qJ24j77p9K27O3j17J17lL5k12Qlq4m3L19K3j22l42M3L35p7M0q2j89J85
$$ 16 8 132 -45 -124 103 166 49 166 163 198 -14 -6 -9 -93 -136 183 206 84 -258 -215 120 43 83 1 -188 -3
7123cj04K87j14lr0KK86m62M28k62l05M49k27Q7J48j23Lr2O0P0l8n2k9l7J6K02
$$ -3 -107 180 66 63 -27 -25 261 -201 227 -35 -340 109 -118 -31 117 -6 -3 -95 -35 35 -3 -55 -84 -121 -105 97
7149I7j11k9J92k76J67J83j15M1l09L73j84j3M3q9M8L6j23K41l84M14l2k29J56
$$ 97 -14 -43 149 -127 40 223 108 149 -160 213 29 16 59 -30 18 54 -69 172 -212 202 170 -59 97
7172I7j57J01j54J18j05Q3j46K97O8k52oR1j30J08L8j88L49q0j54j73kJ98P5J16
$$ 97 -60 41 -113 5 -100 -17 -163 134 202 -50 -56 35 -95 13 51 -137 212 132 -22 -195 -197 1 76 192
7196A92n27M29j52k07L15J04k5r0j29N0J65j2kk48M01j66K0k42J69j85K63l4j04
$$ 192 -335 94 -58 -265 50 154 129 39 -90 -40 125 113 111 -137 264 98 118 -124 45 -140 123 89 -15
7219a5K11l80K81J12j86j26L3n0M9K10m9m87L40O2J31J08l92K22q1J73k28J18
$$ -15 196 -184 97 209 23 -103 -70 -120 -71 139 90 -397 -57 5 136 244 -148 74 -7 166 -62 56
7241E6Q9k53N1j56L59k69J26j48K12j19j74om3K18J24O5r3j4j36O0J43j8jJ37
$$ 56 145 -108 -57 -213 146 -123 3 -145 67 -52 -226 -232 -275 -57 67 132 39 25 -111 -51 92 74 73 210
7265B10j50r1J05j82J55J18j24l1K35j87j47J66j11j91L71l25K31N1j26m4q0P2
$$ 210 60 -31 74 -108 47 165 41 10 245 58 -89 77 -34 -225 146 -179 52 103 -23 -67 -147 -75
7287g5J60j15O1n9l3J63j75K51p4j08r2M4J7J86m3J00j48M9j29O5K6L22k38l60
$$ -75 85 -30 31 -28 -61 102 -73 178 104 -4 -96 -52 -35 151 108 208 60 109 -20 45 71 393 155 -205
7311b05L50j26q8Q1K00l18qj7N1J75p4j14r0J80R8R4l02J42m7K4Q4o3k21K41j07
$$ -205 145 19 -69 12 212 -106 -114 -131 -80 95 21 -93 -183 -3 95 189 -113 29 -18 6 90 27 -194 47 -60
7336f0Q4j18J5R6L9O9k32R0J7j88J77k09M9L45j47j15K28k26J11j25K51m74K73
$$ -60 24 -94 -79 17 56 125 -107 -17 0 -188 -11 -220 -171 174 27 -88 140 -86 25 -100 151 -323 -50
7359e0K53j18q5K3lL5r5K32R7j66lK6k84K13q9K4J84k61Rj17K41k07LK29k54L7
$$ -50 203 85 0 23 20 55 -40 192 289 123 120 146 -138 75 -14 10 194 -67 -58 -175 66 -141 -138 91 -163 -126
7385a26j9J65K9k14L27j67r9p1J06L29k67o4R7R6R5n91L20J6kK7J5n4L8J42lk5
$$ -126 -145 20 49 -165 162 -5 -104 -175 -69 260 -7 -71 26 122 217 -374 -54 -38 -40 -13 2 -52 -14 128 125 100
7411A00K8r7n7j2j8J11q4J07k03Q3j81J44K7J35J09k54K04j04j01P2k36K46j9
$$ 100 128 31 -26 -38 -56 55 -29 78 -125 -42 -223 -79 -52 83 192 -62 142 38 -63 9 -227 19 0
7434@n8K82m10J56L2N8j46J51o0j04P9J25k18J51J41Lk60N8J77l22K17j19J33
$$ 0 -58 224 -186 -30 2 60 -86 65 5 -99 -20 105 -113 38 179 182 -78 -20 157 -165 52 -67 66
7457F6p4Q5m0j7k8O9j97K02j30M3n3l06M16J22l3j70j6p6Q8J59j90J10p1n5M2
$$ 66 -8 77 37 20 -8 61 -136 66 -64 -21 -74 -380 36 158 125 -45 -61 -137 -49 110 -80 30 -41 -96 -54
7482e4N0j15J07J84k26Q6j85J60K33l02j57L24p3j64J41j7J11j37j32J50L3M8
$$ -54 -4 -119 -12 172 -54 32 -153 7 240 -62 -219 105 32 -132 9 -8 103 -34 -166 -16 17 65
7504F5j89N2k1lJ12l0l07K54K50l05p4K29n8j57L27k61j28L39J0J3j20K2R0k06
$$ 65 -124 -72 -93 -96 16 -14 -321 -67 183 -122 -196 33 -25 -182 145 -116 -244 95 105 118 -2 20 110 -96
7528i6L51m52J31J64j53m2M3O1m9o0J08J2J86j05j43N8M4q2L6j6Q1j2r1MJ2Q2
$$ -96 255 -197 -66 98 -55 -97 -54 7 -42 -102 6 18 204 99 -44 14 58 -24 12 -4 77 65 -26 -22 -10 72
7554G2J18m07L34Q1j54J77m82M03j54O7j65pj07J15j29P0m2K47OO0J03j81j48
$$ 72 190 -217 117 198 44 221 -261 142 -12 55 -110 -117 -224 -109 -238 -168 -210 37 43 103 206 25 -123
7577a23K03l0k30j32K64Or9P6j62K50j03J05j56J29l0J47J00k24j1K58k86j70
$$ -123 80 50 -180 -312 -48 -42 -141 -65 -227 23 -80 25 -131 -2 -32 115 215 -9 -20 238 -48 -218
7599b18K18j56K24m5j30j21K46J09m7l56K97o7K41n05L44m6j51L64k78N4m5j5
$$ -218 0 -156 68 23 -107 -228 18 127 80 -276 21 -46 195 -310 34 -12 -163 201 -77 -23 -68 -83
7621h3j97M41j52N7l12j0Ro4K99j07J45K51k26o2k13L18Q6M5k23j40K20j03K9
$$ -83 -280 161 9 66 -246 -256 -247 -311 -12 -119 26 277 51 -11 -224 94 180 225 2 -138 82 -21 8
7644HM8j0n0m6L8k2j11L33k62o3K69j85J34j22r5M8O1Q9q6K01Q9k21k29K58m2
$$ 8 56 46 -4 -50 -12 -34 -145 188 -74 -137 132 -53 81 -41 -136 -88 -27 62 -24 177 266 45 -184 74 32
7669C2m3jq5Q3K1K23j32l54K4L35M0l86L60j67j28J75M5j84K70o6M9l17K14M2
$$ 32 -11 -12 -97 -14 7 230 98 -256 -232 103 143 -243 117 -50 -178 -3 42 -142 128 62 111 -206 8 50
7693E0Pj5J2n6p2O2K5nK3m2KR0j45K35k35L0J77j45K13p7j00p3RO5q2KK22m4j19
$$ 50 57 42 54 -2 -74 -12 13 8 31 -11 -9 81 -64 171 -64 -34 143 -2 211 134 34 -39 -30 35 -47 -45 177 133 14
7722A4p5J31L0m1k84M93k77M9J34k00N3P0O0n9j80qR5j37K05J03n1k35N99l78
$$ 14 -61 70 100 59 -225 268 -9 40 174 -26 27 97 157 98 -82 -90 5 -132 73 176 125 -110 489 111
7746A11r2pP4J29j05j33j93K45M6k71K56j01n2Q3J35j88R2M6r2p7K87k56N2l1
$$ 111 19 12 86 215 110 -23 -216 29 75 -196 60 -41 -93 -10 125 -63 29 75 -17 -94 193 -63 -11 -42
7770d2J06n9Q5j83l49N07k79K13O7j27j02J82j9p9j04J39R5J12m00J77K94j04
$$ -42 64 5 90 -93 -442 65 -214 -1 66 -61 -163 19 0 -79 -183 -44 51 163 -237 -60 234 130
7792A30p8%j91N3nK42q2K5O3l10k9L57l38K24j8K00p0k57K78j66R9J35j84J21
$$ 130 52 52 -139 -86 -91 151 69 94 157 -153 -182 175 -163 61 43 243 173 -84 194 28 127 262 78 199
7816A99M3P6k93P6j30J89k38J8M2J58j31j24K94k13K8j59K87l0k8j35K25k41r8
$$ 199 242 318 25 101 -29 160 -78 -60 -18 140 9 -115 179 -34 -6 -165 122 92 64 -71 154 -87 -185
7839a85K48p2o1J16j08K4P6q2j26O8R4J06k3k59K92J86k59j46J74P6J17k84R0
$$ -185 63 -9 -70 46 -62 -38 38 -44 -170 -102 -8 98 75 -184 108 294 35 -111 63 139 256 -28 62
7862F2Q4k55L04k5j97J65N9k82M3p2J19r3mJ01n9K82l24K87L8j98L9k2j9j78J38
$$ 62 146 -109 195 170 -27 138 197 -85 -42 -114 5 -88 -92 9 -50 232 -92 195 233 35 74 52 33 -145 -7
7887gO3nk02K10K6J47o2ml20J93j51J90R6k29M2K45k20j45J92q9P4j93K10r3L36
$$ -7 56 51 -151 59 85 232 170 166 -154 39 -112 78 174 -55 -13 232 12 -133 59 -30 44 -149 61 -32 304
7912C04j78j38J43k39K61j03K5q7k17Q9J15m6K67j07k48P8L52j69j52PM5l0K09
$$ 304 126 -12 131 -108 153 50 75 -12 -229 -140 -25 -71 196 89 -159 -81 271 102 -50 -43 2 -28 181
7935A81j81J7J59j08q3L6k23K19k05K32K16k3k98j76L02k08P7J47k3j43J65k4
$$ 181 0 17 176 68 -15 21 -202 17 -188 44 260 237 -61 -237 65 -143 -66 81 58 -85 80 56
7957E6j51K02n4j88k25J77K28o3J81o3P1j18l2r0m3J05J59M6j47j3J20k94lK20
$$ 56 -95 107 53 -135 -360 -183 45 -18 163 100 171 53 21 -69 -112 -7 152 198 51 38 158 -136 -139 81
7981H1N5j97j13lK39N3k21J39l24J87J80Rm7n1o8K49k44J94j3n7j58l9J31Q7L0
$$ 81 136 -61 -174 -177 62 115 -106 33 -291 -104 76 85 38 -13 -81 168 -76 118 105 48 -110 -149 -18 69 99
8006I9Q2j20j69j55K71k8k2J48L7l19K83L6j00K8q0k31J22J48j89J87j30K7J68
$$ 99 181 61 -108 -263 8 -20 -42 106 143 -176 107 143 43 71 -9 -240 -118 30 -159 28 -102 -75 93
8029I3m3l2k9k2J2L9p6J22r6j4j00K35l20J59K71k73O1K52l01n4QPK41m5J72j76
$$ 93 50 18 -11 -33 -21 18 -58 64 -32 -46 -146 89 -231 -72 199 -74 -13 239 -62 -116 -108 -101 140 95 267 91
8055I1l8LM5o8j35J52j04J67k5k44k4Q0p3L0K27l6J14j28j29J4j15J88O4j3J30
$$ 91 53 56 101 33 -102 50 -54 113 88 -156 -180 -100 -173 -143 84 48 162 34 -95 -81 -196 -8 56 43 173
8080A73o7k10J49q1Rn9J60k27J74J20j04j7j6O8j30J32J14k52J60k82K28K38k66
$$ 173 106 -104 45 -36 -27 -86 74 -153 21 141 37 20 4 72 -58 74 188 -64 96 -186 42 280 14
8103A4K07k39J37j18J28l27L28k03J63J52k33j28K04k79J3Jp3K68q9N3k10R8p0
$$ 14 221 -18 119 1 129 -198 130 -73 90 242 9 -119 85 -194 -181 -180 -253 15 -74 -21 -231 -133 -203
8126b03J4J39J24m2K06l32J80J28j01j66K04k33m3O3K91l04L0p1J57j27J74k4
$$ -203 -189 -50 74 32 238 -94 86 214 113 -53 151 -82 -125 -62 229 -75 -45 -116 41 -86 88 64
8148F4j25R8Q5j61K94j75k76R8J6K32Pj75N4o2K46l94L81j44o5J88p6n5m5j9R4
$$ 64 -61 37 122 -39 255 80 -196 -98 -82 150 157 -18 36 -26 220 -174 207 63 -2 186 110 55 10 -9 85
8173H5%m3l02L92Qj71ro2J27m5J01k11J3M7J49j01k5R3
$$ 85 85 42 -260 132 140 -31 -40 -102 25 -20 81 -130 -117 -70 79 -22 -47 46
8191D6
$$ Imaginary data points
##PAGE= N=2
##DATA TABLE= (X++(I..I)), XYDATA
0@%%%%%%%%%%%%qJ6j6J6j6K4l2L2m0M9n7P2q7R9j15J35j53J76k03K30k62K99l38
$$ 0 0 0 0 0 0 0 0 0 0 0 0 0 -8 8 -8 8 -8 16 -16 16 -24 25 -32 40 -47 52 -63 72 -81 95 -108 122 -140 159 -179
35a79L81m30M83n40O03o72P49q32R21j021J129j247J376j518J675j844K030k236
$$ -179 202 -228 255 -285 318 -354 395 -437 484 -537 592 -655 721 -797 878 -966 1064 -1172
53a172K465k722L010l333L700m124M617n203N907o771P868r310J1304j4265J9176
$$ -1172 1293 -1429 1581 -1752 1948 -2176 2441 -2762 3145 -3626 4242 -5068 6236 -8029 11147
68A1147k9287R0198j60773m6833J93368j09270K3437J75604l9185j82533j1618
$$ 11147 -18140 72058 -88715 -135548 57820 -51450 -28013 147591 108406 -74127 -85745
79h5745M3196L8792N2970L6564l5735q6429p3116N5745P7966K5453K4544m2969
$$ -85745 -42549 -3757 49213 85777 50042 -36387 -109503 -53758 24208 49661 74205 31236
91C1236j14972j179N5834L0768P2337Q832j19007l5360K8276j3754Q3500R4466
$$ 31236 -83736 -84915 -29081 1687 74024 82856 -36151 -71511 -43235 -56989 26511 120977
103A20977r1125q1866J6914k0411K2951J01113K1442o2873o4288l0149L3027N2424
$$ 120977 29852 -52014 -35100 -55511 -32560 68553 89995 27122 -37166 -67315 -34288 18136
115A8136L0045L1283m2455j11281J1193P0631j5135N7131O2380j37249q1414J00531
$$ 18136 48181 79464 37009 -74272 -63079 7552 -7583 49548 111928 -25321 -106735 -6204
127f204L923k8728J10002R227j48736l1790P5389J8940R082M1817n935q0941n7319
$$ -6204 -2281 -31009 78993 88220 -60516 -92306 -16917 2023 11105 52922 46987 -33954 -91273
140i1273N3489P1167J027L824o655p5051k9009O0608L5751K0920J8536o6439o0812
$$ -91273 -37784 33383 34410 38234 31579 -43472 -72481 -11873 23878 44798 63334 -3105 -63917
153f3917L5982K1112J7849O5230k6984r0711K18K1190q83N6841L8913n9479n9120
$$ -63917 -27935 -6823 11026 76256 49272 -41439 -41221 -20031 -20914 35927 74840 15361 -43759
166d3759l22J9187K6630L0904J6834k9319p3590j3950O5425K2804m749K9832l2875
$$ -43759 -44081 -24894 1736 32640 49474 20155 -53435 -67385 -1960 20844 16095 45927 13052
179A3052q1084J8054N8846O665K1130Q393o4972l7218L3076K9428K1335J9509
$$ 13052 -68032 -49978 8868 15533 36663 45056 -19916 -57134 -24058 5370 26705 46214
191D6214j7736m9287l2434K7934N3790R361j2237l536m1104m0438M2043N4600
$$ 46214 28478 -20809 -53243 -25309 28481 37842 25605 22069 -19035 -59473 -17430 37170
203C7170l637q568j8687m8531j257M2519J9499J5077j149n3299l1762K6348K7603
$$ 37170 33533 24965 6278 -42253 -43510 -991 18508 33585 32436 -20863 -52625 -26277 1326
216A326J9385J5205k0652m1600j7822J7430L8693K2561o580j9286l4790j9424
$$ 1326 20711 35916 15264 -26336 -44158 -26728 11965 34526 27946 8660 -26130 -45554
228d5554L5656L8078j416J3j2478n1812p303N6683K1888j2265L206k2619m2419
$$ -45554 -9898 28180 26764 26777 14299 -37513 -44816 11867 33755 21490 24696 2077 -40342
241d0342P547M3118K3164m820j9333k5013k0426Q810L9564K1329j4755j6923k1727
$$ -40342 -32795 10323 33487 28667 9334 -15679 -36105 -27295 12269 33598 18843 1920 -19807
254a9807k5335K4328M8639l71k0478m999k6489k0172L7699L8815n899j5094j8068
$$ -19807 -45142 -20814 27825 27454 6976 1977 -24512 -44684 -6985 31830 25931 10837 -7231
267g231k3951M490L2467K2561N15j6890k5648j7005J1060L6174J9035j6109j6468
$$ -7231 -31182 -26692 5775 28336 28851 11961 -13687 -30692 -19632 16542 35577 19468 3000
280C000j4224k0575J3375M4316Q233k4185j2593j6830j4904K7771L3959n628j4753
$$ 3000 -11224 -31799 -18424 25892 34125 9940 -2653 -19483 -34387 -6616 27343 21715 6962
293F962j2272k5532j785L7398K3464j1691j6265j1111j6486L37L5154K6794j8451
$$ 6962 -5310 -30842 -32627 4771 28235 16544 279 -10832 -27318 -26981 8173 34967 16516
306A6516k3463n381j0797N245L7000J4870k2606j5016r570j3283J9853L7441k890
$$ 16516 -6947 -12328 -23125 -17880 19120 33990 11384 -3632 -13202 -26485 -6632 30809 27919
319B7919k3731q288j1578r444K5200L0711p097k4845j2297n835j47K3260K4285
$$ 27919 4188 -4100 -15678 -25122 78 30789 23692 -1153 -13450 -19285 -19432 3828 28113
332B8113j1409k3920q497p407M753L1997J5043k3008j6484k402r688R389L5269
$$ 28113 16704 -7216 -15713 -23120 -18367 13630 28673 5665 -10819 -13221 -22909 -13520 21749
345B1749O541k6478j3355k552m315J6986K7286k209k2462j1505m752M34K1893
$$ 21749 28290 1812 -11543 -14095 -18410 -1424 25862 23653 1191 -10314 -15066 -14632 7261
358G261K3066j1988k4565m093k116j988K4605K1194k0095k4444n82l02M073K3516
$$ 7261 30327 18339 -6226 -10319 -12435 -14423 10182 31376 11281 -13163 -13745 -14047 -9974 13542
372A3542J1195k1142j7859k211p98J2978K3945p30k3342r689K16j488J5448K4645
$$ 13542 24737 3595 -14264 -16475 -17273 -4295 19650 18920 -4422 -14111 -13895 -15383 65 24710
386B4710o500k7389n647N469n65J6553K0796j3306k4800j470L541K938J9997J2566
$$ 24710 18210 -9179 -14826 -9357 -9922 6631 27427 14121 -10679 -12149 -8608 -5670 14327 26893
400B6893j9950j9878K267K376M833K0720N570k3176j6057L946M580P885J7127
$$ 26893 6943 -12935 -10668 -8292 -3459 17261 22831 -345 -16402 -12456 -7876 9 17136
413A7136p16k3049j0866N129M032J1921J6327r603k3199l150P535K409J3168J4563
$$ 17136 16420 -6629 -17495 -12366 -8334 3587 19914 10311 -12888 -16038 -8503 -6094 7074 21637
427B1637j3609k3537Q86J0424M264J1754Q362j5726j8160K137Q434P470J2771
$$ 21637 8028 -15509 -14623 -4199 65 11819 20181 4455 -13705 -11568 -3134 4336 17107
440A7107K61k0663j0912P670L000O453J7500n784k7886k973J3550q09N723J7423
$$ 17107 17368 -3295 -14207 -6537 -3537 2916 20416 14632 -13254 -16227 -2677 -3486 2237 19660
454A9660j0549k7249J283J4715J60O780J2620j4343k2207M817J2969L070P464
$$ 19660 9111 -18138 -16855 -2140 -1980 4800 17420 3077 -19130 -14313 -1344 1726 9190
467I190N836j5907j5575N931J1164O185P081k672j6235p145N708O780R851P096
$$ 9190 15026 -881 -16456 -10525 639 6824 13905 11233 -5002 -12147 -6439 341 10192 17288
481A7288j0889j6432n62P509M282Q223O104j2188j8016J777J2431M078L184M666
$$ 17288 6399 -10033 -10595 -3086 1196 9419 15523 3335 -14681 -12904 -473 3605 6789 11455
495A1455j1280j7408L696J4937L213K420K215j4773j2656J0673J0654O67O822
$$ 11455 175 -17233 -13537 1400 4613 7033 9248 -5525 -18181 -7508 3146 3813 10635
508A0635q90k0016o577J6609O218k069R025l551k2464r57J8736L265l153P533
$$ 10635 9745 -10271 -16848 -239 5979 3910 12935 9384 -13080 -14037 4699 7964 4811 12344
522A2344o752k0683K798J8376J350k384M529j0167j5533O740J3633K298L44k793
$$ 12344 5592 -15091 -12293 6083 7433 5049 9578 -589 -16122 -9382 4251 6549 6893 4100
536D100j1701o070P048Q508N208J322q040j2085N08R107M918M035K744r432j2937
$$ 4100 -7601 -13671 -6623 1885 7093 8415 375 -11710 -11202 -2095 2823 6858 9602 170 -12767
551a2767L065J3150M030j428K660p640j4236N096J6076R11l158J158q923j0956
$$ -12767 -9702 3448 7478 6050 8710 1070 -13166 -8070 8006 8917 5759 6917 -2006 -12962
565a2962P831J3778r25k907m87j0762p603J1228J1459l462k254j190j1622m764
$$ -12962 -5131 8647 7722 4815 4328 -6434 -14037 -2809 8650 5188 2934 1744 -9878 -14642
579a4642J5233Q619o516l84j884j2828O56J6525L731n988R30m912j0587N659J4170
$$ -14642 591 9210 2694 2310 426 -12402 -11746 4779 8510 2522 3452 -1460 -12047 -6388 7782
594G782J225m805q20p179o459Q516J0677p69l699k820p844k995J0166Q533l881
$$ 7782 9007 4202 3382 -3797 -10256 -1740 8937 8168 4469 1649 -6195 -9190 976 9509 5628
609E628k708k880r401q2J3101M814o042j471l002r538L440J3403K456o508j890
$$ 5628 2920 40 -9361 -9443 3658 8472 2430 959 -2043 -11581 -8141 5262 7718 1210 -680
624f80l238o745N336J2554L74o797j539l572n007Q330J1239l107o496l15n106
$$ -680 -3918 -10663 -5327 7227 7601 804 -735 -4307 -9314 -984 10255 7148 652 337 -4769
639d769l266J1367P526n627m977n05o583K44J2019M279p151l434j487n878K914
$$ -4769 -8035 3332 10858 5231 254 -251 -6834 -6590 5429 9708 2557 -877 -2364 -8242 -5328
654e328J1873J091q113k125j626m736N241J1162j770p457j132k275l336Q205R374
$$ -5328 6545 7636 -477 -2602 -4228 -8964 -3723 7439 5669 -1788 -2920 -5195 -8531 -326 9048
669I048m805o255K33l266j402J0171O283o462n232M5k702K64J0197L935q200l830
$$ 9048 4243 -2012 -1779 -5045 -6447 3724 10007 3545 -1687 -1642 -4344 -4080 6117 10052 1852 -1978
685a978R7l047K583R780O82q815k569K62k927M851Q993k979q269l96n05k314P136
$$ -1978 -1881 -4928 -2345 7435 8117 -698 -3267 -3005 -5932 -1081 7912 4933 -3336 -3732 -4237 -6551 585
702E85P351n619o692P39o55q27Q329N446p609n650K358j213M11R066K732q633
$$ 585 7936 2317 -4375 -3636 -4291 -5118 3211 8657 1048 -4602 -2244 -3457 -3046 6020 8752 119
718A19m007K441j564K354Q334j99q948j783J711j351L978P199l706p886m73J603
$$ 119 -3888 -1447 -3011 -657 7677 7478 -1470 -3253 -1542 -2893 1085 8284 4578 -3308 -3781 -2178
734b178r75N091N248n852o572J470N83m91O951L296p348n048K905l8P87P225J170
$$ -2178 -3153 1938 7186 1334 -5238 -3768 -3185 -3676 3275 6571 -777 -5825 -2920 -2958 -2171 5054 6224
751F224q545k708L449l58J908P270j708q404q97L464p45K898N844l458q274O65
$$ 6224 -2321 -5029 -1580 -1938 -30 7240 5532 -2872 -3769 -305 -1050 1848 7692 4234 -4040 -3375
767c375L110o50L838M091n383o794K096K041m01M768K344p316m718L507J395k7
$$ -3375 -265 -915 2923 7014 1631 -5163 -3067 -1026 -1427 3341 5685 -1631 -6349 -2842 -1447 -1474
783a474N601J83p774k631M354O47R79N258j495p942m31M351K04J990M402l706
$$ -1474 4127 4310 -3464 -6095 -1741 -1094 -115 5143 3648 -4294 -4725 -374 -170 1820 6222 2516
799B516o959J781L591k65K358L346n489o052L533K623q18L673J370o991l848M305
$$ 2516 -4443 -2662 929 664 3022 6368 879 -5173 -1640 983 165 3838 5208 -1783 -5631 -1326
815a326J878p22M060o56p183j774M851P73K47L592j806p104J78N220j11Q71L441
$$ -1326 552 -170 3890 3234 -3949 -5723 -872 -99 148 3740 1934 -5170 -4992 228 117 988 4429
832D429l750o165K499M302n62J666K587n116n047L843L724j056J805J175n738
$$ 4429 679 -5486 -2987 1315 753 2419 5006 -110 -5157 -1314 2410 1354 3159 4334 -1404
847a404l655N003K461j135J971l49o329j268M730J472n85J785j935n946R52M824
$$ -1404 -5059 -56 2405 1270 3241 2892 -3437 -4705 25 1497 912 2697 762 -5184 -4232 592
863E92J01J25J977l654m822K771M157l74L29J673m190l964M003M301j652M13J367
$$ 592 693 818 2795 -859 -5681 -2910 1247 873 1202 2875 -1315 -5279 -1276 3025 1373 1786 3153
880C153n140k524N199K653j866J246j38n610n67N481R05j809J452j518n272J132
$$ 3153 -1987 -4511 688 3341 1475 2721 2583 -3027 -3594 1887 2792 983 2435 917 -4355 -3223
896c223N277k4j784J356k516m651K912N096j706j046K014l587l797M600M214k350
$$ -3223 2054 2030 246 1602 -914 -5565 -2653 2443 737 -309 1705 -1882 -5679 -1079 3135 785
912G85j86J009l855j941M952K645k476P46p44l659J73M358J065j270L96j859l585
$$ 785 599 1608 -2247 -4188 764 3409 933 1679 935 -2724 -2551 1807 2872 1602 1998 139 -3446
929c446J904M323m12j563O84k102m051L564M159j986j242J535l448k809M537L279
$$ -3446 -1542 2781 2369 806 1490 -612 -4663 -1099 3060 1074 -168 1367 -2081 -4890 -353 2926
945B926k702r32J177k888k006M890K926l061r10J178k900r02N150J763l340j17
$$ 2926 224 -708 469 -2419 -4425 465 3391 330 -580 598 -2302 -3204 1946 3709 369 252
961B52L32l170J055N182o96k860Q93j204l097L059M182k305j836P29j913k007
$$ 252 584 -2586 -1531 3651 2955 95 988 -216 -3313 -254 3928 1623 -213 516 -1397 -3404
977c404L657K868k298j698N17j896p59L853J692k644p50O5k486R05M433K44k868
$$ -3404 253 3121 823 -875 -358 -2254 -3013 840 2532 -112 -862 -797 -3283 -2378 2055 2299 -569
994e69N75p42k188K291M166j422k220M74r20j745K897L440k094k376J020j152
$$ -569 6 -736 -2924 -633 3533 2111 -109 365 -555 -2300 597 4037 1943 -433 587 -565
1010e65j680L092L269l281k045J561j477j563M253J849l950j100J410j994K86
$$ -565 -2245 847 4116 835 -1210 351 -1126 -2689 1564 3413 -537 -1637 -227 -2221 -1935
1025a935L877Nl368N4N31j459J382L238r27k637M01J57j151J736L554j965k761
$$ -1935 1942 1947 -1421 -1367 -836 -2295 -913 2325 1398 -1239 -838 -681 -1832 -96 3458 1493 -1268
1042a268J000M15j623K933J843k607j790J142j104J23L138P05l309p34J041j253
$$ -1268 -268 147 -1476 1457 3300 693 -1097 45 -1059 -936 2202 2907 -402 -1136 -95 -1348
1058a348M87K915j2l560j74J052r48N39L420r20l332K41J158j203J604K777j917
$$ -1348 -861 2054 2042 -1518 -1692 -640 -1588 -1049 2371 1451 -1881 -1640 -482 -1685 -81 2696 779
1075G79k760J391K4p65K763J722k925j753J633P9m49K100J187l070j297J355j99
$$ 779 -1981 -590 -566 -1331 1432 3154 229 -1524 109 188 -261 1839 3026 -44 -1341 14 -185
1092a85j5K419M1l584l36J689q04L66K788j275l650J218J106r25J035K254k213
$$ -185 -200 2219 2260 -1324 -1660 29 -775 -409 2379 1104 -2546 -1328 -222 -1147 -112 2142 -71
1109g1k372J107R83q25K007J337k472j733J677O57o63J830J079l251j268K560
$$ -71 -2443 -1336 -353 -1178 829 2166 -306 -2039 -362 295 -368 1462 2541 -710 -1978 582
1125E82j05o75K395p2l380J03K061p84K74K000j466k604N47J633q62M61J806j910
$$ 582 477 -198 2197 2125 -1255 -1152 909 125 399 2399 933 -1671 -1124 509 -353 108 1914 4
1143Dk565J475J129p54R14J570k398k167K203R81j103J878K86k814q06K293J50
$$ 4 -2561 -1086 43 -711 203 1773 -625 -2792 -589 392 -711 1167 1453 -1361 -2167 126 276
1160B76m92K188l55l337P18J829rl22J532q06k615M83K118q94J85J240j332k598
$$ 276 -216 1972 1617 -1720 -1002 827 818 496 2028 1222 -1393 -910 1208 314 499 1739 407 -2191
1178b191J508J620j023M25J127k505j534K461M45q51R89M40k192p85J955M70o92
$$ -2191 -683 937 -86 339 1466 -1039 -2573 -112 333 -518 471 911 -1281 -2066 -111 359 -333
1195c33J168j80k458K77K302k02n75J484p87k490J076K123p65m95J825j580k271
$$ -333 835 655 -1803 -1526 776 574 -1 1483 696 -1794 -718 1405 640 145 1970 390 -1881
1212a881J755J520r32K82N44j829j280J910R85j031L83N04k194o09K076O03j316
$$ -1881 -126 1394 462 744 1288 -541 -1821 89 1074 43 426 930 -1264 -1873 203 806 -510
1229e10P66K43k300n3K402M6j054J308q34j784R88K116j193l3J041j228j356J513
$$ -510 256 499 -1801 -1854 548 594 -460 848 14 -1770 -782 1334 141 108 1149 -79 -1435 78
1247G8J434r23k93Q36j377j229J676J341j266l8O73j806o34K454o0j424N99N02
$$ 78 1512 589 296 1132 -245 -1474 202 1543 277 239 912 -894 -1528 926 866 -558 41 543
1265E43k287K48K370m49q78O88n76j407J005J615m30p47O06n73j659K013J029
$$ 543 -1744 -1496 874 425 -453 235 -341 -1748 -743 872 442 -305 301 -272 -1931 82 1111
1282A111p92n62J084j035j003J767Q20j342J97N12j321n99J977N24j378L04O8
$$ 1111 319 -243 841 -194 -1197 570 1390 48 245 757 -564 -1163 814 1338 -40 264 332
1299C32j360K51J592J22j312L77j01j490R52J608o59q60P83r13j168J754J441
$$ 332 -1028 -777 815 937 -375 2 -99 -1589 -637 971 312 -548 235 -678 -1846 -92 1349
1316A349j539k72R14r86r56K078O54j332o9O20q84l57J795N09j615J99M54j035
$$ 1349 -190 -462 452 -534 -1490 588 1242 -90 -159 461 -423 -780 1015 1524 -91 108 562 -473
1334d73N0J858n05j183L66j0q86N36J547j047q71M16j43r80J258J206j402m30
$$ -473 -423 1435 930 -253 113 103 -783 -247 1300 253 -618 -202 -345 -1325 -67 1139 -263 -693
1352f93P14p06m61J406P19j380j61P62r09j87J679N70j902M13M66q47L25J527
$$ -693 21 -685 -1146 260 979 -401 -562 200 -709 -896 783 1353 -549 -136 330 -517 -192 1335
1370A335j75j432N4P34r74M85J469r22j226Q75l1r47R96J054j110q69N25l0q70
$$ 1335 1160 -272 -218 516 -458 27 1496 574 -652 223 192 -755 241 1295 185 -684 -159 -189 -1059
1389a059J339P24j473n19R81o93j96J484K27j801L68P12o42K76J348m29j243M92
$$ -1059 280 1004 -469 -988 -7 -700 -896 588 815 -986 -618 94 -548 -272 1076 647 -596 -104
1407a04L77n77N39J175n44j350L94M38n82L92R91j024p62Q78l27k49P58N42j448
$$ -104 273 -304 235 1410 866 -484 -90 348 -234 158 1149 125 -637 241 -86 -335 423 965 -483
1426d83m64P64k45j36R05J02j148k37O78k90j65J429l22j169K54Q78p29L43J169
$$ -483 -947 -183 -428 -564 341 443 -705 -942 -264 -554 -719 710 388 -781 -527 351 -378 -35 1134
1445A134p92j107P08O15o94N55O56q03q30P05R0l62N35M86j213m58Q76Q7n39N71
$$ 1134 342 -765 -57 558 -136 419 1075 272 -558 147 237 -125 410 896 -317 -775 101 188 -351 220
1465B20L03j236j02R47k82k87J089p38r50K51Q28k92q1R67p33o78N21Q34o89K97
$$ 220 523 -713 -815 132 -150 -437 652 -86 -1036 -785 43 -249 -330 637 -96 -774 -253 581 -108 189
1485A89M45o39p57Q88L09n34P02N00j081m42R00n6m20N84J81j180j8R31m98l08
$$ 189 634 -5 -762 126 435 -99 603 1103 22 -420 480 424 4 588 769 -411 -429 502 4 -304
1505c04J055n11r85L47P16o14j6O59l36r91M97O06o30O64K29o16n66R39L29n32
$$ -304 751 240 -745 -398 318 -296 -312 347 11 -980 -483 123 -507 157 386 -230 -796 143 472 -60
1525f0L76N03j143Q8N82j9m94N48J95j034N1J086m12l16O18k03r11L55P77n14
$$ -60 316 819 -324 -236 346 327 -167 381 576 -458 -407 679 267 -49 569 366 -545 -190 587 73
1545G3j56L89k74r56M32Q40n16K5L81m63p44R79K26l87L20J29o40l85J059K39
$$ 73 -83 306 32 -924 -492 348 -168 -143 238 -225 -969 10 236 -151 169 298 -342 -727 332 571
1565E71q00N73L68p89j68N78N9m33M78M6j273O94P72p03N1L37m06p14P62L74m76
$$ 571 -229 344 712 -77 -245 333 392 -41 437 483 -790 -96 676 -27 24 361 -45 -759 3 377 -99
1586i9k29N89n70m39R49J74n74J72O7m17m22P71K21m03L13P2o38J68O87j43j94
$$ -99 -328 261 -309 -748 201 375 -199 -27 40 -377 -799 -28 193 -210 103 175 -463 -295 392 249 55
1607E5K39k30p06N47L77J92n40N50m57r3J10O64n81k68O86n13l92N24J89m49N3
$$ 55 294 64 -642 -95 282 474 -66 484 27 -66 44 708 127 -141 545 32 -360 164 353 -96 -43
1628d3L71q56r6O70L17p67K33K59m13K5O18k14n45K25L20n49J54R17m72l89M67
$$ -43 328 -528 -624 46 363 -404 -171 88 -325 -300 318 104 -441 -216 104 -445 -291 626 154 -235 232
1649B32k56k51M81L35p68K05J28K00o60O25K52n08J2M74p11N3L93L4n58K49K5
$$ 232 -24 -275 206 541 -227 -22 106 306 -354 271 523 15 27 501 -210 -157 236 270 -288 -39 -14
1670a4m01k15P48%n54K56Q9j97j92P72j60o45L40J39k58K15N38k72k77K58k38
$$ -14 -415 -630 118 118 -436 -180 -91 -288 -480 292 132 -513 -173 -34 -292 -77 461 189 -88 170 -68
1691f8j10L21L57o07Q3J58j70k09M84M2l56q5L05l86K35J93qm73L35J05l15n1
$$ -68 -178 143 500 -107 -24 134 -36 -245 239 281 -75 -160 145 -241 -6 187 179 -294 41 146 -169 -220
1713b20M41o6o48J78N4K0J14O15p13k40L84o7j73N66k4l51j16N16k94k53P12O6
$$ -220 221 155 -493 -315 -261 -241 -127 488 -225 -465 -81 -148 -321 245 221 -130 -246 270 -24 -277 435 501
1735E01o49J15L60m08k8M53q8l07J79J98n85N38K36p87l3J97J87m63L48K94l81
$$ 501 -148 -33 327 -81 -109 344 256 -51 128 326 -259 279 515 -272 -305 -108 79 -384 -36 258 -123
1756a23k30J81p1Q1J00L76n89P0N79n00k9K17K99o86K91J80m79K25M03M7o07L25
$$ -123 -353 -172 -243 -162 -62 314 -275 -205 374 -126 -155 62 361 -325 -34 146 -333 -108 295 342 -265 60
1778F0p3Q2k07M88r4n46J72K85M6k58J43k20k41N06k70n24Q11q4m29j52N52k4
$$ 60 -13 69 -138 350 256 -290 -118 167 213 -45 98 -122 -363 143 -127 -651 160 76 -353 -505 47 23
1800B3k83L17K27m66J6K45j40p3M14o1m23K94J06m06J74J20O3k89R3M29k27O4
$$ 23 -260 57 284 -182 -166 79 -61 -134 280 219 -204 90 196 -210 -36 84 147 -142 -49 380 153 217
1822B17J94l38j88K53j06K04M3Pm27O5K86k04k01M57k34l62L53p9j11j83L13K16
$$ 217 411 73 -115 138 32 236 279 286 -141 -76 210 6 -195 262 28 -334 19 -60 -171 -354 -41 175
1844A75l16q2K89k5l6J35nl16M13J27o14J98M16k58l00M99Nk28M4K72p48Q4L43
$$ 175 -141 -223 66 41 5 140 135 -181 232 359 -255 -57 359 101 -199 300 305 77 121 393 -355 -271 72
1867G2Q2l52K62K39o29L14K7l2l06N03l43m51P66j63j93N8J47Q9l47L63M4k69
$$ 72 154 -198 64 303 -326 -12 15 -17 -323 180 -163 -614 152 -11 -204 -146 1 90 -257 106 150 -119
1889a19K16O3l20L0K59l0j30K85ml62j28M47l36J07K25k15R1k77N09q5k86J60
$$ -119 97 160 -160 -130 129 99 -31 254 250 -112 -240 207 -129 -22 203 -12 79 -198 311 226 -60 100
1911A00k36j22K90j08p2j07M28k96j25K66o5j99o1N40k98k94K43j7L11j20p6r
$$ 100 -136 -258 32 -76 -148 -255 173 -123 -248 18 -47 -246 -307 233 -65 -359 -116 -133 178 58 -18 -27
1933b7M4R5j32M6L26j79j22n1J80q3m34N47k7n10K89M61l35j22J32k45Q1P0J01
$$ -27 17 112 -20 26 352 173 51 0 180 97 -337 210 183 -327 -38 423 88 -34 98 -147 -66 4 105
1956A05k21J12M6k77J40L58k28m40L32Mj67j51O21Qj37j33J65k18J8L44l43r7
$$ 105 -116 -4 42 -235 -95 263 35 -405 -73 -69 -236 -387 234 242 105 -28 137 -81 -63 281 -62 -159
1978a59M73l48q5K72J37l09q2L98k76q3l1L77l38J09J1J2k05J17J17J6j77k5q3
$$ -159 314 -34 -119 153 290 -19 -101 297 21 -62 -93 284 -54 55 66 78 -127 -10 107 123 -54 -79 -162
2001a62m7N22l12l44K26J5k20K74K60P5l75J7J53k69M54j22l9k70L06ll28L93
$$ -162 -209 313 1 -343 -117 -102 -322 -48 212 287 -88 -71 82 -187 267 145 106 -164 142 139 -189 204
2023B04l5j71k25L30L9l31L31m1k29N4L11m69J91J35L1j83m5N1j71j61N25j07
$$ 204 169 -2 -227 103 142 -189 142 101 -128 -74 237 -232 -41 94 125 -58 -103 -52 -223 -384 141 34
2045C4j62K43p8j03J57j35%K8L3J16k40J68J54l13k59K10L61k51K82j86r5L02
$$ 34 -128 115 37 -66 91 -44 -44 -16 17 133 -107 61 215 -98 -357 -147 214 -37 245 59 -36 266
2067B66k63l13J16L73J57l76l1L07k93j92L58J0j45M4j83J42m8J49j70n6L48m05
$$ 266 3 -310 -194 179 336 -40 -71 236 -57 -249 109 119 -26 18 -165 -23 -71 78 -92 -148 200 -205
2089b05J79J31j87k69QO86l36o8L58r4k97J73j7j09l4O9J09j18K32j04kJ1J68
$$ -205 -26 105 -82 -351 -343 343 7 -61 297 203 -94 79 62 -47 -81 -12 97 -21 211 107 105 116 284
2112B84j19n00L51Rj09P4K93l72k30L49r5rK3L79m81J38r2k72J09K69R9j55K18
$$ 284 165 -335 16 25 -84 -10 283 -89 -319 30 -65 -74 -51 328 -153 -15 -107 -379 -270 -1 98 -57 161
2135A61%o2k21L16k79Q4j23L81l86J72R7r8j74J22Q4k3J13k8k13j70M40k57j3
$$ 161 161 99 -122 194 -85 -1 -124 257 -129 43 140 42 -132 -10 74 51 164 136 -77 -247 193 -64 -77
2158g7K78j78k98nM02k44M8L84n04j65K32L65m18M2K36l2k90K94k2l03P8M47l06
$$ -77 201 23 -275 -280 122 -122 -74 310 -194 -359 -127 238 -180 -138 98 66 -224 70 48 -255 -177 270 -36
2181c6k15M30j34m3qK11j72M8Lk6j52J53LJ38l46J57ql9Q8M6l07J80k2K32j48
$$ -36 -251 179 45 2 -6 205 33 81 84 58 -94 59 62 200 -146 11 3 -36 52 98 -209 -29 -51 181 33
2206C3k54K84k99M65j92m01L85P4Jk32K69o3j71J9J98k25mK79J2j84N0Jj27J54
$$ 33 -221 63 -236 229 37 -364 21 95 96 -136 133 70 -101 -82 116 -109 -113 166 178 -6 44 45 -82 72
2230G2j06O1j50N8J27l8K4K91l22r3K69j76p6NJ40k59J56r6k2J38k4J09m16M25
$$ 72 -34 27 -123 -65 62 24 48 339 17 -76 193 17 -59 -54 86 -173 -17 -113 -135 3 -21 88 -328 97
2254I7k09j28N8K03J64m85M38L9j77j81J79J73k94Q0J01k58N17n9o7j81K58m14
$$ 97 -112 -240 -182 21 185 -300 138 177 0 -181 -2 171 -123 -43 58 -200 317 258 191 10 268 -146
2276a46j92K37K20j85%J21J71n28K33J69k92K11J05n60M9O13m1k21R7k7l0n0J46
$$ -146 -338 -101 119 -66 -66 55 226 -302 -69 100 -192 19 124 -436 -387 226 185 -36 61 34 4 -46 100
2299A00L1k61L25j48j61q9L78J6k97J43J90j63r7R9K1l47M85k40p6K52j58n0q6
$$ 100 131 -130 195 47 -114 -203 175 191 -106 37 227 64 -33 66 87 -260 225 -15 -91 161 3 -47 -133
2322a33p1L04j44J96J1j42R2k56K8j08K35J03j88J20p1k16j00K89M2j21L03r4
$$ -133 -204 100 -44 152 163 21 113 -143 -115 -223 12 115 -73 47 -24 -240 -340 -51 -9 -130 173 79
2344G9k34L11n4j00k24J43L63k41K10j5l4k35K16j32O5j44J67l38O8L40k74L5
$$ 79 -155 156 102 2 -222 -79 284 43 253 238 204 -31 185 53 118 -26 141 -197 -129 211 -63 -28
2366b8L48k51k45L2J39K4j40K13j64l21N52k46j38O7M01k10p2J77j1l05L00R4
$$ -28 320 69 -176 -144 -5 19 -121 92 -72 -393 159 -87 -225 -158 243 33 -39 138 127 -178 122 216
2388B16l03N8J63o4j58K83L9J1j35J39k12k23M54o3m27N0J7K97k22L09n10K29
$$ 216 -87 -29 134 70 -88 195 234 245 110 249 37 -186 268 205 -222 -172 -155 142 -80 229 -281 -52
2410e2Q2N9j61l0J44j94J51N3q6j40L12j24j87L56l32j85L88j13L9M0k3J11M8
$$ -52 30 89 -72 -102 42 -152 -1 52 -34 -174 138 14 -173 183 -149 -334 54 -59 -20 20 -3 108 156
2433A56k17J79K27m62J01L20n30K93k1J9P0j28Pk11J71N3J23k05K46m5p3m4l6
$$ 156 -61 118 345 -117 -16 304 -226 67 46 65 135 7 14 -197 -26 27 150 -55 191 146 73 29 -7
2456gj54P3J22j88M6K01p5k88L05J45l20J11J22P0k12K30L1j80j69K02K06l03
$$ -7 -161 -88 34 -154 -108 93 18 -270 35 180 -140 -29 93 163 -49 181 212 32 -137 65 271 -32
2478c2N8J32J35l65K23J46m13L20l67R3J15j33R0j12O5N3M3m5k8j00K52oK7k63
$$ -32 26 158 293 -72 151 297 -116 204 -163 -70 45 -88 2 -110 -45 8 51 6 -22 -122 130 124 151 -112
2502a12K25j13k19J99O6m1j84K24J7k82M80R2m41J64J45j15k5J07l4q0k6j71L08
$$ -112 113 0 -219 -20 46 5 -179 45 62 -220 260 352 -89 75 220 105 80 187 153 73 47 -124 184
2525A84k07o2K13p8K13k13j57qq6oJ02J50j31j00J32Q7o5j53K00j39m4P0K25k50
$$ 184 -23 -85 128 50 263 50 -107 -115 -201 -207 -105 45 -86 -186 -54 33 -32 -185 15 -124 -168 -98 127 -123
2549a23J27J6N7k37J92J87Pl4j84j69m8L50j76O4R5j54P3j2K77m47M09k06j20
$$ -123 4 20 77 -160 32 219 226 192 8 -161 -209 141 -35 29 124 -30 43 31 308 -139 270 64 -56
2572e6j35K3R7J34k89J96m2j28K12P0m45Q6M63l86J08J79J7m14L67p9j0j58K98
$$ -56 -191 -168 -71 63 -226 -30 -72 -200 12 82 -363 -277 186 -200 -92 87 104 -310 57 -22 -32 -190 108
2595A08q1k80K70J45k22l8m9L23r1N2l14K09J93q6j85M3K32l87J51J28j07L3j37
$$ 108 27 -253 17 162 -60 -98 -147 176 85 137 -177 32 225 139 -46 -3 229 -158 -7 121 14 47 -90
2618i0K36j30k00L66j99n4K08J4n3k94L95j40kR7j53q4p3L37j24M6j93J10j79
$$ -90 146 16 -184 182 -17 -71 137 151 98 -196 199 59 57 154 1 -83 -156 181 57 103 -90 20 -159
2641a59M61k33k67N2J52J7m0J3j21l5J90j63J96l6Q9j43M5j91J65j52l1K29J20
$$ -159 302 69 -198 -146 6 23 -17 -4 -125 -160 30 -133 63 27 116 -27 18 -173 -8 -160 -191 38 158
2664A58l52J76K3kk17L65n1k21K8J61J8J27J5k73r7MJ13l2k8M40j40k06j05J28
$$ 158 -194 -18 5 3 -214 151 100 -121 -93 68 86 213 228 -45 -142 -138 -25 -57 -85 355 215 9 -96 32
2688C2j40K05j63k12q5L91k42J18J76j93K5j60N36l18k14J46r8K13j89L52k74
$$ 32 -108 97 -66 -278 -363 28 -214 -96 80 -113 -88 -248 288 -30 -244 -98 -196 17 -172 180 -94
2709i4P6N5j13N0L66k83j78L82k41L8q9K44r3j56J45j18K4qK34j61j08K3o7j27
$$ -94 -18 37 -76 -26 340 57 -121 261 20 58 -31 213 120 -36 109 -9 15 7 241 80 -28 -5 -72 -199
2733a99K75j52j40K45k45N93n14K02J5k49K14j2j90k15L74j24J91j35J12k15l
$$ -199 76 -76 -216 29 -216 377 -137 65 80 -169 45 33 -157 -372 2 -122 69 -66 46 -169 -172
2754a72L35k59M00m4j43k08K65k51J37l62K61P4k22K03j0Q0j64J34J10j66Q4J4
$$ -172 163 -96 304 260 117 -91 174 -77 60 -302 -41 33 -189 14 4 84 -80 54 164 -2 82 96
2776I6lk31opO8j95K99j2M0r6k8l2J42j08j54J79Nk79K03K52k87j39N85j98q2
$$ 96 93 -138 -144 -151 -83 -278 21 9 49 -47 -75 -107 35 -73 -227 -48 -43 -322 -119 133 -154 -293 292 94 12
2801A2k2J23k20J92K7N8k49Q3R2l29K91M2j81k7K59j71k1j21J88O9l90K88N0j74
$$ 12 -10 113 -107 85 112 170 -79 4 96 -233 58 100 -81 -108 151 -20 -41 -162 26 95 -295 -7 43 -131
2825a31O4K32l06J21N7j99J07K03L1k89M2K06j68ML6J54q2R6k11k71N22j2n4j88
$$ -131 -67 165 -141 -20 37 -162 -55 148 179 -110 -68 138 -30 -26 10 164 82 178 -33 -304 218 206 152 -36
2849c6K36r9k40K87k56r1J93J01j75o9K07J43l01o4J30k50K19J12q8j9m5J63o3
$$ -36 200 101 -139 148 -108 -199 -6 95 -80 -149 58 201 -100 -164 -34 -284 -65 47 -41 -60 -105 58 -5
2872eQ4j49n9j15L11L6q0L3o2J3l76N35On0K%j18JJ57j50J53k82L02k10J01o7
$$ -5 79 -70 -129 -244 67 103 23 56 -6 7 -369 166 172 122 124 124 6 7 164 14 167 -115 187 -23 78 11
2898A1j36j06K43j27K3J09Q2L8k79J27M1j7pK3l26L11j54K52k10J08j1K4n1J82
$$ 11 -125 -231 12 -115 -92 17 99 137 -142 -15 26 9 2 25 -301 10 -144 108 -102 6 -5 19 -32 150
2922A50O3k69J09p0O7O7p6j14J14J5k08NR6j24J50j74L05qj4j7j11j40j5L78j67
$$ 150 213 -56 53 -17 50 117 41 -73 41 56 -152 -147 -51 -175 -25 -199 106 98 84 67 -44 -184 -199 179 12
2947A2j01J73k10P1j5J01p2R6m0q6N5j16R5K9k75L42O8m1K06j58j38J56j9m25
$$ 12 -89 84 -126 -55 -70 31 -41 55 15 -71 -16 -132 -37 -8 -283 59 127 86 292 134 -4 152 133 -292
2971b92M20l8k25K5K25j24l18J53M10j90j94K76j80L2j08L71l58J91j01J30l38
$$ -292 128 90 -135 -110 115 -9 -327 -174 236 46 -148 128 -52 -20 -128 243 -115 76 -25 105 -233
2992b33R3K1J28J5J93l44J37J57r5j91J62J25k52l3j96M86j66L6j51J27n5K6o5
$$ -233 -140 -119 9 24 217 -127 10 167 72 -119 43 168 -84 -117 -313 173 7 43 -108 19 -36 -10 -75
3015g5j3K59n13M23p4k0j12M0K22l21j00K53l20L64M1l7j12J97m20M53k91J11
$$ -75 -88 171 -342 81 7 -13 -125 -85 137 -184 -284 -31 -351 13 54 17 -95 102 -318 135 -156 -45
3037d5K9k17L61j40K56j68k5r3K19n7n6J7J74j72l06L06Or1M2j78J29J19l09K14
$$ -45 -16 -233 128 -12 244 76 51 -42 177 120 64 81 255 83 -223 83 89 -2 40 -138 -9 110 -199 15
3061A5j7L2j1J22k21p3L69j96L9m7M5k65J51J71j22O6j91K34j42J91K00m49K46
$$ 15 -2 30 19 141 -80 -153 216 20 59 12 57 -208 -57 114 -8 58 -133 101 -41 150 350 -99 147
3084A47j79P5M7oj03o2LJ46P5k34L3mJ37pk49J38m5k5J23oq7j95L07m8j9J9l90
$$ 147 -32 43 90 84 -19 -81 -78 68 143 -91 -58 -62 75 68 -181 -43 -88 -113 10 4 -83 -278 29 -19 -38 -19 -409
3111d09O07k01k2R0j43J47M2j0j50k77L77K4l44K61O3J38l6k26J96k74Q1J99j39
$$ -409 198 -3 -25 65 -78 69 111 101 -49 -326 51 75 -269 -8 55 193 157 -69 127 -147 -66 133 -6
3134fK35k89L7J35K6M0m50R6O2J31j20K6N4o6J19n5R9p3J27j62J46k33K29R3m66
$$ -6 229 -60 -23 112 138 178 -272 -176 -114 17 -103 -77 -23 -89 30 -25 74 1 128 -34 112 -121 108 201 -265
3159b65O51k75k58M1J79o8k11K25Q1j61L07o7k4p5J39l5j86M0l5J49j25o2rK7
$$ -265 386 111 -147 -106 73 5 -206 19 100 -61 246 179 155 80 219 184 -2 38 3 152 27 -35 -44 -17
3183a7J32j18l0J8O2m0O8j08J8j58K30o4j95jK20O7j03Q6r6q0j06K44k4M3n1j42
$$ -17 115 -3 -33 -15 47 7 75 -33 -15 -173 57 -7 -202 -203 17 84 -19 67 -29 -109 -215 29 5 48 -3 -145
3209a45K30j19l3j3lp0R7j23J61L2j21J31R5n3j91KQ4m1Q0j33M9J02K15L1k66
$$ -145 85 -34 -67 -80 -83 -153 -56 -179 -18 14 -107 24 119 66 -125 -123 -39 -80 0 -133 -84 18 233 264 -2
3234bJ9q1nj87K82l18L41j07J31j92K56k60j21K79J55n1j95QJ37j77L43j29l23
$$ -2 17 -64 -69 -256 26 -292 49 -58 73 -119 137 -123 -244 35 190 139 -56 -48 89 -88 255 126 -197
3257a97J60n8N8p1J0J11j65J75J77j82j68K44L9l09K81p7l45L86p5p3K9l8P0j60
$$ -197 -37 -95 -37 -108 -98 13 -152 23 200 18 -150 94 133 -176 105 28 -317 69 -6 -79 -50 -88 -18 -178
3281a78j46M44j53k83L09lO4Q0k09m3P7J95j26r5L99l84l4p1N15m13n9L78l84
$$ -178 -324 120 -33 -316 -7 -10 54 134 -75 -118 -41 154 28 -67 332 -52 -86 -157 358 -55 -114 264 -120
3304a20K64j94o3l0M2J64j63J07J43k17M2M3L6J04KRk67N9K08j45K0r4J69k91
$$ -120 144 -50 -113 -143 -101 63 -100 7 150 -67 -25 18 54 158 160 169 -98 -39 169 24 44 -50 119 -172
3328a72J55J33l36J12K6J44k81L38r4j20L3Q9k6p1L06l4l17O8j2L78n67K43K0
$$ -172 -17 116 -220 -108 -82 62 -219 119 25 -95 -62 27 1 -70 236 202 -115 -47 -59 319 -248 -5 15
3351A5j7j00J22J52o9m04K97k01J25J51k01K47Qpk32J69j43J27m8j4j53K97m1
$$ 15 -2 -102 20 172 103 -301 -4 -205 -80 71 -130 117 125 118 -114 55 -88 39 -9 -23 -176 121 80
3374H0L8l5j79J55j47l6J96J60l01M5J90j28M7M6J48m79J63J66l1O7o5Jl80K88
$$ 80 118 83 -96 59 -88 -124 72 232 -69 -24 166 38 85 131 279 -200 -37 129 98 165 100 101 -279 9
3398IL2J20j53K50l50o8L16k7k99K26r6PJ75j82Q1j31L15j78J75l12p9J87q8N9
$$ 9 41 161 8 258 -92 -160 156 129 -170 56 -40 -33 142 -40 41 -90 225 47 222 -90 -169 18 -70 -11
3422a1R6O9j97P3j36J52j78J47k36J8J26j22mL65j12j28j96L61j35o7J17r5J55
$$ -11 85 154 -43 30 -106 46 -132 15 -221 -203 -77 -199 -203 162 50 -78 -274 87 -48 -115 2 -93 62
3445F2m4K5j3k04J70J88k0J33m52J95l6L2J28N5k93N6JLQ8o1J69j99J00j60K71
$$ 62 18 43 30 -174 -4 184 164 297 -155 40 4 36 164 219 -74 -18 -17 -14 74 13 182 -17 83 -77 194
3470A94p7l36M08l35j54J05L19j29m9j92K35J12k9m6O9k05n7J96j28N13k72j54
$$ 194 117 -219 189 -146 -300 -195 124 -5 -54 -246 -11 101 72 26 95 -110 -167 29 -99 414 142 -12
3492a2JJ95k07RM2j89J22J9j4P8kk13K07k65L46o9k12K34k52J45q5K99j51P3j00
$$ -12 -11 184 -23 -14 28 -161 -39 -20 -34 44 42 -171 36 -229 117 48 -164 70 -182 -37 -122 177 26 99 -1
3517aJ39r4q3J61n9j42K54k03j21l9K23k87L60o4LJ45R9k73j27K97j64R4j22J49
$$ -1 138 44 -39 122 63 -79 175 -28 -149 -188 35 -252 108 44 47 192 291 18 -109 188 24 118 -4 145
3541A45k24Q8k7j05J81l8P2j24N1l3J48n63N10L5O8k05K4P4j01l2N1N7p3Q6r8
$$ 145 -79 9 -18 -123 58 20 92 -32 19 -14 134 -429 81 116 184 -21 3 77 -24 -56 -5 52 -21 65 -33
3566c3J09J80j11K0N3l0m6J23k20p3j03L1J82nj77P9O9Mo5Q7K98l49O4l53M94
$$ -33 76 256 145 165 218 188 142 265 45 -28 -131 -100 82 77 -100 -21 48 52 -13 74 372 23 87 -266 228
3591B28j25n1k45M00o5qj75r2L3Q0J79j18o5p6J56j4m5J65k38j28J73P9m0J13
$$ 228 103 52 -193 207 142 134 -41 -133 -100 -20 159 41 -24 -100 56 42 -3 162 -76 -204 -31 48 8 121
3615A21k18Q5l93N44j48JP0J31p5j42J52k76J6J64j6k32Q3j7K17m2P6j77p7M0
$$ 121 -97 -12 -405 139 -9 -8 62 193 118 -24 128 -148 -132 32 16 -216 -133 -150 67 25 101 -76 -153 -113
3639a13J4O6J08m8k51K22J9K80m71R3K97p6j94J81J21k85M6l5o9J88J84j22l7
$$ -113 -99 -33 75 27 -224 -2 17 297 -174 -81 216 140 -54 127 248 -37 9 -26 -95 93 277 155 118
3662A18Nl5P1j00J50k37J0L03k00k08j9P8k8J50j11%l7K64Jm25L24j47L8Qp9L43
$$ 118 123 88 159 59 209 -28 -18 285 85 -123 -142 -64 -92 58 -53 -53 -90 174 175 -250 74 -73 -35 -27 -106 237
3688B37n5j76J95k70%K62p4k6o2L1oj3J87j49j4N0O1l43j75K31K36o3K6j0j69
$$ 237 182 6 201 -69 -69 193 119 93 31 62 56 43 230 81 67 117 178 -165 -340 -109 127 64 90 80 -89
3713h9Q1J25j69k27K22Q1J78k28K5R4n7J61M8j79k83K49j06J03J00j15kN3j32
$$ -89 -8 117 -52 -279 -57 24 202 -26 -1 93 36 197 245 66 -217 32 -74 29 129 14 12 65 -67
3736f7r3J42N2J20n2LK5J5O2j02m2m1J50k98K34K0J21l84K26j3k49Q5J01j40M9
$$ -67 -160 -18 34 154 102 105 130 145 207 105 63 22 172 -126 108 128 249 -135 91 78 -171 -86 15 -125 -76
3761g6l53K77K30j38R4j58R7r9Q2L8J05lr5pj7rN5j4O4p5l21L27J52r1J24q3k35
$$ -76 -429 -152 78 -60 34 -124 -27 -126 -44 -6 99 96 1 -6 -23 -32 23 9 73 -2 -323 4 156 65 189 106 -129
3788a29J25J14j62n5K53j27j89J64J77m00K31N7Lk05K10n2o0o9K51k00J62k91
$$ -129 -4 110 -52 -107 146 19 -170 -6 171 -229 2 59 62 -143 67 15 -45 -114 137 -63 99 -192
3810a92K07p6J67m2n6J75j22O6P4j74K8k45J38K54l13L7J45j2J38l96J59R8j76
$$ -192 15 -61 106 64 8 183 61 127 201 27 55 -190 -52 202 -111 -74 71 59 197 -199 -40 58 -118
3833a18J43j50KJ14j4J5n5K39j87J2K18j30r8n7J21n4J15j31o4m4J19P0n0jK9
$$ -118 25 -125 -123 -9 -23 -8 -63 176 -11 1 219 89 -9 -66 55 1 116 -15 -79 -123 -4 66 16 15 44
3858D4m6J43R8k60L0M6K61q8k93K69k18M5O3P3j71O9J20k58J77k08J27m8K0P2
$$ 44 -2 141 239 -21 9 55 316 228 -65 204 -14 31 94 167 -4 65 185 -73 104 -104 23 -25 -5 67
3882F7rr3M2j3p6N8L22l81K34J42l06P0r6J09k61J48O5j12K27R2j37j72Q2kJ11
$$ 67 58 -35 7 -6 -82 -24 298 -83 151 293 -13 57 -39 70 -191 -43 22 -90 137 229 92 -80 2 0 111
3907A11k41M77k8m33J65L6p0k38L70k59mJ51j5j51K77j04o2J31j68q5O7Q0K5O6
$$ 111 -130 347 319 -114 51 87 17 -221 149 -110 -114 37 22 -129 148 44 -18 113 -55 -140 -73 7 32 98
3931I8lPj6k32K59l77J85J11q6J75j61R0J13k31J96r2K6k4K7j56Q0J06k05K51
$$ 98 95 102 86 -146 113 -264 -79 32 -54 121 -40 50 163 -68 128 36 62 38 65 -91 -11 95 -110 141
3955A41k06N1k0m0j66L81j26J79k75J18J79q0l46RL06n2r4Q8R9l7j60j56J44J16
$$ 141 -65 -14 -34 -74 -240 141 15 194 -81 37 216 136 -210 -201 105 53 -41 47 146 109 -51 -207 -63 53
3979E3n4j94jP4L45k55L7N9J28l57N0K44l46K38J17k19K0p7K23K56m54P0J24k63
$$ 53 -1 -195 -196 -122 223 -32 5 64 192 -165 -115 129 -217 21 138 -81 -61 -138 85 341 -113 -43 81 -182
4003a82l3J27J66K4l29J34R7Jp7r7K45L4J38j85l2j24K01K19k1m29J53K06n60
$$ -182 -215 -88 78 102 -227 -93 4 5 -72 -169 76 110 248 63 31 -93 108 327 306 -123 30 236 -324
4026c24L89k9L6J8j93K38k7l05L40j17o3J28o9J07k59K55l00j26L92l3K5J24k34
$$ -324 65 36 72 90 -103 135 108 -197 143 26 -37 91 22 129 -130 125 -175 -301 91 58 83 207 -27
4049b7j11L18k72QN3K44k59J42k46K97l7j46K60J27m8l22nj54J79Lj35O3J44J00
$$ -27 -138 180 -92 -84 -31 213 -46 96 -150 147 110 -36 224 351 303 -19 -24 -178 1 4 -131 -68 76 176
4073A76k64K4J44j53J43J45l61J37j92K54M9m4j88O2l7M6M2J39j47M2J53j79J
$$ 176 -88 -64 80 -73 70 215 -146 -9 -201 53 102 58 -130 -68 -105 -59 -17 122 -25 17 170 -9 -8
4096hJ5N2q5j83K22j60J73Lm1P3K8m9lJ04j10P0M2k81K35k42L36m8j0r3l01K29
$$ -8 7 59 -26 -209 13 -147 26 29 -12 61 89 40 37 141 31 101 143 -138 97 -145 191 143 133 40 -261 -32
4122c2J0J33q0P6k08J69K4o5j29K5nJ05o6J13j91K08k01j34J98J28K23j92R5P8
$$ -32 -22 111 31 107 -101 68 92 27 -102 -77 -82 23 -43 70 -121 87 -114 -248 -50 78 301 109 204 282
4146B82j39l2j34J49l5j85J14O5M7q2j37P1j58J25J55n2r3j59K76K7k14K14k63
$$ 282 143 111 -23 126 91 -94 20 85 132 50 -87 -16 -174 -49 106 54 -39 -198 78 105 -109 105 -158
4169a58L02k03k16K60l9l7L03m67K58N2J11k00o4J43j27M0J16k2n3J55j13j0o0
$$ -158 144 -59 -275 -15 -54 -91 212 -255 3 55 166 -34 -98 45 -82 -42 74 52 -1 154 41 31 -29
4192b9K27KQk73L20j41q2j20j47K92K0K1n4J58j26q7L4k24J91j41J38J05o4M6
$$ -29 198 200 208 -65 255 114 32 -88 -235 57 77 98 44 202 76 -11 23 -201 -10 -151 -13 92 28 74
4216G4j58J04J29j25j8K67r6k78L20M6n01L73j34K38n10J01K03J51k22k1j59K52
$$ 74 -84 20 149 24 6 273 177 -101 219 265 -236 137 3 241 -269 -168 35 186 -36 -57 -216 36
4238C6p3k1j79m0L97k31J43J34j39K2j75pj31M4L40j70N0%k01J67J35j87j01K90
$$ 36 -37 -58 -237 -277 120 -111 32 166 27 49 -126 -133 -264 -220 120 -50 0 0 -201 -34 101 -86 -187 103
4262A03p3L5J7j21K44l48L07n6j12L9%L7J78k94L4%j82K75j04J00j25j11L61m00
$$ 103 30 65 82 -39 205 -143 164 108 -4 35 35 72 250 -44 -10 -10 -192 83 -21 79 -46 -157 204 -196
4286a96K58k74M75l96P9J77j82j2k33K36j00jO9Q0k9j35L59j4J37j75p7R3m87
$$ -196 62 -212 263 -133 -54 123 -59 -71 -304 -68 -168 -169 -100 -20 -49 -184 175 161 298 123 46 139 -348
4309c48L44K20p4j38R0k04J96K0k68L01k29J2J83j15M3J7k80J19nP4O4j13l0K29
$$ -348 -4 216 142 4 94 -110 86 106 -162 139 -90 -78 105 -10 33 50 -230 -111 -116 -42 22 -91 -121 108
4333A08k5m8M2p5k97M91o8r6K8j34K04j84k0J69l7R6k12m6J63k7j83K99k22J47
$$ 108 83 35 77 2 -295 196 128 32 60 -74 130 -54 -74 95 58 154 -58 -104 59 32 -151 148 -74 73
4357G3k97J15L54k89R0j23K81k17j28J02J78j90j67J53J23J44k74j56l5J28P3
$$ 73 -224 -109 245 -44 46 -77 204 -13 -141 -39 139 -51 -218 -65 58 202 -72 -228 -263 -135 -62
4378f2J76k38O6N0r0J21K16j20j65rJ72n7j25M9J22l17K8L58k71k2J40L07n86
$$ -62 114 -124 -58 -8 -98 23 239 119 -46 -55 117 60 -65 -16 106 -211 -183 175 -96 -118 22 329 -257
4401b57K88J13l48J46O5k65J03K1N3P5J12r1j19J54l96L87k46L94j23P6j27L5
$$ -257 31 144 -204 -58 7 -258 -155 -134 -81 -6 106 15 -104 50 -346 41 -205 189 66 142 15 50
4423E0o1n9J57k12O7K9K47l13J93k94K64k8ml6Rj5rj10K45k48J87O9j97q8J1J73
$$ 50 -11 -70 87 -125 -58 -29 218 -95 98 -196 68 40 36 0 9 -6 -15 -125 120 -128 59 128 -69 -157 -146 27
4449B7J09j25J9O3J91l78J57j04k43J55N9J68o7q0O8R7q8R6q0j58R6ONK05l20
$$ 27 136 11 30 93 284 -94 63 -41 -284 -129 -70 98 31 -49 19 116 28 124 44 -114 -18 -12 -7 198 -122
4474a22K39k62K92k15pR9q5J56j87L02k14N1M7k41L30k48J09j2k52K25j46K47
$$ -122 117 -145 147 -68 -75 24 -61 95 -92 210 -4 47 94 -147 183 -65 44 32 -220 5 -141 106
4496A06j19J87l35L61j56k94L61j73M8r6J39O3q3k96K11K86r8n8J79mj01M5l10
$$ 106 -13 174 -161 200 44 -250 111 -62 -14 -110 29 92 9 -287 -76 210 112 54 233 229 128 173 -137
4519a37L13k08K8K86l10l12K51M5P7k26L15k7l1j75J10PJ37k44K10k50J68R1l03
$$ -137 176 -32 -4 282 -28 -340 -89 -44 33 -193 122 95 64 -111 -1 6 143 -101 109 -141 27 118 -185
4542a85J78O0L8k79K52K95n52K04q2m4M28l88J1K26p4O4qr1j40Q1J6K35l20q8
$$ -185 -7 53 91 -188 64 359 -193 11 -71 -115 313 -75 -64 162 88 152 144 53 -87 -6 10 245 -75 -163
4566a63L29l16K77j73M9P8J31l9l41K49L5q6p5r8K24p2R3j06J32j4k1R7k88j53
$$ -163 166 -150 127 -46 3 81 212 173 -168 81 116 30 -45 -143 81 9 102 -4 128 114 93 190 -98 -251
4590b51J11K25q8Q1m2o9l8R1jQ9j48K46k36r7J81L8R4l40J21l4p1j84L40J37k47
$$ -251 -140 85 -3 78 36 -33 -71 20 19 108 -40 206 -30 -127 54 92 186 -154 -33 -67 -138 -322 18 155 -92
4615i2j90L04o1jK55Np3j71L3j03J9J02j88K69l5kn5J6J57k45RJ21J88m16K57
$$ -92 -282 22 -39 -40 215 220 147 -24 9 -94 -75 27 -161 108 73 71 16 32 189 -56 -47 74 262 -154 103
4640A03l43K81L2l60L10m7j8j1J16j41r8J68J69j96P3L2k59R0J11j49O9P9j90
$$ 103 -240 41 73 -287 23 -24 -42 -53 63 -78 -176 -8 161 -35 38 70 -189 -99 12 -137 -68 11 -179
4663a79K66m6r1J21K2l7j69J10j04J78k56L28O3l6j97J53O3o9o9q7j8J04j44J09
$$ -179 87 41 -50 71 93 56 -113 -3 -107 71 -185 143 206 170 -27 126 189 120 51 -36 -54 50 -94 15
4687A5j09J45O9l81K69k41M14p4k6m03L41o7Q6j06K6j55J80K5K4j08L32j14n8
$$ 15 -94 51 120 -261 8 -233 181 107 81 -322 19 -48 38 -68 -42 -197 -17 8 32 -76 256 142 84
4710H4M2k23L2k1M8J10P4l64J04J78P2k98J31L1q1J80J8k25J14J8N5j79Q0P4r0
$$ 84 126 -97 -65 -86 -38 72 146 -218 -114 64 136 -162 -31 0 -81 99 117 -108 6 24 79 -100 -20 54 -36
4735c6J68k16L0l6J20j46r4K05J28k24J70j5Q6j86J43k10j11K07n2L79l11j55
$$ -36 132 -84 -54 -90 30 -116 -210 -5 123 -101 69 54 140 -46 97 -113 -224 -17 -69 310 -1 -156
4757a56P0o8L59k40J03q2n5J5K63m94K90j96J75QJ04j20r4m0K41n6n7r2R9R4l11
$$ -156 -86 -154 205 -35 68 -14 -69 -54 209 -285 5 -191 -16 -8 96 -24 -118 -158 83 27 -30 -122 -23 71 -240
4782b40L99j66J2J36k90K05k51N1qM9K14j49o0J07j1jR4j16J00J02j99R3l0n2
$$ -240 159 -7 5 141 -149 56 -195 -144 -152 -103 111 -38 -98 9 -2 -3 91 -25 75 177 -22 71 41 -11
4806a1J62k25j95L66Q9j05j03l6M2J35q0r9K51l30K7K17K0n0q7l1K27k35N0o1
$$ -11 151 -74 -269 97 186 81 -22 -58 -16 119 39 -60 191 -139 -112 105 125 75 -12 -43 184 -51 -1 -62
4830f2P0M3j22M3K9r8K36l47J25mj63L71O9k29P3j17k30J83K77j35j84J62L0J36
$$ -62 8 51 -71 -28 1 -97 139 -208 -83 -87 -250 121 190 -39 34 -83 -313 -130 147 12 -172 -10 20 156
4854A56K8k3k71K7J40J2j09J13j8Ml1j40K96j54r1N9J0j50j1RK17p2Q7k03L02
$$ 156 184 161 -110 -83 57 69 -40 73 55 59 28 -112 184 30 -61 -2 8 -142 -153 -144 73 1 88 -115 187
4879A87P3k57J00l82L02N5j69M3R2P6Oj76J23R5mj12n6QOk02R2P9j85O2O8J81
$$ 187 260 3 103 -279 23 78 -91 -48 44 120 126 -50 73 168 164 52 -4 4 10 -192 -100 -21 -206 -144 -76 105
4905A05k3m9j00K42oM1j37j21K09k30K37k45K01k62K98o8n3j62J48j35K86l2o1
$$ 105 82 33 -67 175 169 210 73 -48 161 -69 168 -77 124 -138 160 92 39 -123 25 -110 176 144 83
4928H3o2j92J12N2R3k98J47J35j44J8N4K0J02j24L1j51L27m03L30k28R3q3j14
$$ 83 21 -171 -59 -7 86 -212 -65 70 -74 -56 -2 18 120 -4 27 -124 203 -200 130 -98 -5 -88 -202
4951b02J21jN7J90j48O5j70pj1k0L08k69K16j47J27m0qr9N8j22%K05k85K10k35
$$ -202 -81 -82 -25 165 17 82 -88 -95 -106 -126 182 -87 129 -18 109 69 61 -38 20 -102 -102 103 -182 28 -207
4976b07J24o2K08j03Q3J20l04q8J94m9K0m4J29j99K25j37P9J07m3P3j50j8N1K9
$$ -207 -83 -145 63 -40 43 163 -141 -229 -35 -84 -64 -108 21 -178 47 -90 -11 96 53 126 -24 -42 9 38
5000C8j18j08J16R2l05K80j30J07K69k23k21L90j49p3K4J25j71kR4J09j66r4N8
$$ 38 -80 -188 -72 20 -285 -5 -135 -28 241 18 -203 187 38 -35 -11 114 -57 -59 35 144 -22 -116 -58
5023e8M7K04j44J52n5q6m7j73L31j46J3j66L2R7kM4J37j89k9Q1r4j3K3mm7M1Q5
$$ -58 -11 193 49 201 146 60 13 -160 171 25 38 -128 -96 1 -1 43 180 -9 -38 43 -51 -64 -41 -45 -92 -51 34
5050C4n8l3J82j69R8j27J41j57n8J92j52J41j52L1n9J01J14j15J52j90J41j16
$$ 34 -24 -57 125 -44 54 -73 68 -89 -147 45 -107 34 -118 -87 -146 -45 69 -46 106 -84 57 -59
5072e9K11j0J12j36jo7k1J18o4p8l8jJ51r5O1j17n0J18l5R8k28j05J75J01j13
$$ -59 152 142 254 118 117 50 29 147 83 5 -33 -34 117 22 83 -34 -84 34 -1 97 -131 -236 -61 40 -73
5097g3J44m0m4J29J0j11jp3p8O1J45o7K15k51J1J38k63K14J42J61j78j60%p9K93
$$ -73 71 31 -13 116 126 15 14 -59 -137 -76 69 2 217 -34 -23 115 -148 66 208 369 191 31 31 -48 245
5122B45l36M5m5O8N2l3J91j63k03l3K23r0o0J15L3J46l6j09Q7m2q0l7Q5l1j64
$$ 245 -91 -46 -91 -23 29 -4 187 24 -179 -212 11 -79 -139 -24 9 155 119 10 97 55 -25 -62 23 -8 -172
5147a72K68k39K55lj84O3k6q6Q8k8K6J47k4l6oK01k11j7K59l87l4M17l60m2l1
$$ -172 96 -143 112 109 -75 -12 -38 -124 -36 -64 -38 109 85 49 43 244 33 16 275 -112 -146 271 -89 -131 -162
5172a62K39j34Q3n9L01M0l33R7j16K84j82j09L65k76o3j13L97j42Kq0K9j40rr2
$$ -162 77 -57 26 -33 268 308 -25 72 -44 240 58 -51 314 38 -25 -138 259 117 119 39 68 -72 -81 -173
5196a73K58j97J95n4Ko8M9k65K96M2l4N6k54K33O7j20m6J9J08k6j26%M4k84K97
$$ -173 85 -112 83 29 31 -37 12 -253 43 85 51 107 -147 86 153 33 -13 6 114 88 -38 -38 6 -278 19
5221A9M9K04k94K1lj8N5P1j48j23K27m1Mo2kL0K5J04j05j43K62k66j61N65k20
$$ 19 68 272 -22 -1 -4 -22 33 104 -44 -167 60 19 23 -39 -41 -11 14 118 13 -130 132 -134 -295 270 50
5246E0Q7l01M02r3n5j93OL96l41J86k4k23L15j63j92J57R9l24J55p6J9J15Mj09
$$ 50 137 -164 238 145 90 -103 -97 299 -42 144 120 -103 212 49 -143 14 113 -211 -56 -132 -113 2 6 -103
5270a03K31n6j04J71k99J87j66J49L7J43j9o3k74o3K68l1j62J74J65k69K68l57
$$ -103 128 72 -32 139 -160 27 -139 10 47 190 171 108 -166 -229 39 8 -154 20 185 -84 184 -173
5292a73J44J31l46K07r4J11n1J37k67J99j21j56L07l05J99l4M0O9r4J39M4l5J1
$$ -173 -29 102 -244 -37 -131 -20 -71 66 -201 -2 -123 -279 28 -277 -78 -112 -72 -3 -97 42 86 51 62
5315F2o5p2K8j31J64j27K40J39m4j4o50M59J51K1k57p3J41K16k37J3K18k69J75
$$ 62 -3 -75 -47 -178 -14 -141 99 238 194 180 -470 -11 140 161 -96 -169 -28 188 -49 -36 182 -87 88
5338H8pj9P5j43P1L%q7L7m4Q7j82R7Q4N9o1p9J95rl73N0j6M5J6o4J78j81L12P9
$$ 88 81 62 137 -6 65 68 68 -19 18 -26 61 -121 -24 60 119 58 -21 174 165 -208 -158 -174 -129 -113 -177 1 -180 132 211
5367B11m41J89K10j96M6l9J12J2j20K72l49J37j50K99j24j12J07n1m1J7j39j4
$$ 211 -230 -41 169 -27 19 -20 92 104 -16 256 -93 44 -106 193 69 -43 64 13 -28 -11 -150 -164
5389a64K47N4n8l6P0k57J83k7Q1q8j33O2J52o8j5P5k12K1L7J47J28k90K42p4q5
$$ -164 83 137 79 43 113 -144 39 12 93 5 -128 -66 86 18 3 78 -134 -113 -76 71 199 -91 151 77 -8
5414hj35J14K44l20N0R1oK65n16J26L30j36q8j73n2K78J80l51R8j18L54k32o2
$$ -8 -143 -29 215 -105 -55 36 30 295 -221 -95 235 99 11 -162 -214 64 244 -107 -9 -127 227 -5 -67
5437f7O5ql7J16j19J69j84J94r0M6n6j36J06l5Q0k3M7Q9j92j98J43K38k40J36
$$ -67 -2 -10 -47 69 -50 119 -65 129 39 85 29 -107 -1 -36 44 21 68 157 -35 -233 -90 148 -92 44
5461D4j83J5k8K18j88K25j16n2J25k52K87%q4R2j47J81j96M6J06j25j12J82o7
$$ 44 -139 -124 -152 66 -122 103 -13 -65 60 -192 95 95 11 103 -44 137 -59 -13 93 -32 -144 38 -29
5484b9N0Rj3K3R1J06j44K66n79L31p9R7j96RK54j38p4K22l00k13M26J29r7k59
$$ -29 21 30 17 40 131 237 93 359 -220 111 32 129 -67 -58 196 58 -16 206 -94 -307 119 248 151 -108
5508a08M48m50K51o5j33K0J02J8J8l05K38rj26K02P7r9j21J82Lo6r4J32p8n8J34
$$ -108 340 -110 141 76 -57 -37 65 83 101 -204 34 25 -101 101 178 79 -42 140 143 77 -17 115 37 -21 113
5533A13k38L01k95J29M0j26j09N0K18J8J9M1j82J07m05L13J8j33m3R7Q3k86L10
$$ 113 -125 176 -119 10 50 -76 -185 -135 83 101 120 161 -21 86 -319 -6 12 -121 -164 -67 16 -270 40
5556D0j43J81J9P3l3o9j75j01K75O3n69K62K67l13M61j52k52L05Oj13K3j7R1k50
$$ 40 -103 78 97 170 137 68 -107 -208 67 130 -439 -177 90 -223 238 86 -166 139 145 32 55 38 129 -121
5580a21k2M08j38n5n7M9Q8J91k49j53l8K88k23Q6n9jl9j71k0L07o0o2R9j17J45
$$ -121 -143 265 127 72 15 64 152 343 94 -59 -97 191 -32 54 -5 -6 -45 -216 -236 71 11 -51 48 -69 76
5605G6q7p1R9J3k2m3J40Qk65J33Rl5R0J9r5m2R4J40k35K07Q5o8k73J26OJ00J08
$$ 76 -11 -82 17 30 8 -35 105 113 -152 -19 -10 -45 45 64 -31 -73 21 161 -74 133 218 150 -123 3 9 109 217
5632B17j05Q9l07J54j32J24m3j39J37o4K32k4j01j05J43j30K49k65J57N5J6N4
$$ 217 112 201 -106 48 -84 40 -3 -142 -5 -69 163 139 38 -67 76 -54 195 -70 87 142 158 212
5654B12k17K3jJ30K6j24r9j01p3K89j54J49j58K18J09l34k7k53K74N7j88L72k26
$$ 212 -5 18 17 147 173 49 -50 -151 -224 65 -89 60 -98 120 229 -105 -132 -385 -111 -54 -242 130 -96
5677i6K58p6j01KO3n6j72P4j35K82J75k16M1j16J39J01j41n6J5k52J46J03N3J3
$$ -96 162 86 -15 -13 50 -6 -178 -104 -239 43 218 2 43 -73 66 167 26 -30 -15 -267 -121 -18 35 48
5701D8m7Q2O5%k29K00k89J23K9J57O0k08j6k15M15l11j20K30L7k36K44j65K8Q0
$$ 48 1 83 148 148 -81 119 -170 -47 -18 139 199 -9 -25 -240 175 -136 -256 -26 11 -225 19 -146 -118 -38
5725c8J66n7k81K11j50J75K6NJ53j28m5j3j9M2O7J6K6r7J83j91j90P3l7O2l5N5
$$ -38 128 71 -210 1 -149 26 52 57 210 82 37 24 5 47 114 130 156 59 242 51 -139 -66 -103 -41 -76 -21
5751b1j97J66J04q8Q3Nk28J44K00j85K33k61j36K79k89M34l01j69M86j0P6k44
$$ -21 -218 -52 52 -36 47 52 -176 -32 168 -17 216 -45 -181 98 -191 243 -58 -227 259 249 325 81
5773H1J47j22n0j91NK40k5J1n9k1q8j5l0P5L8k07K92J7j29J79j03k30K45j00j50
$$ 81 228 106 56 -135 -130 110 85 96 37 16 -72 -87 -117 -42 -4 -211 81 98 -31 148 45 -185 60 -40 -190
5798a90L69j87m3o4L48j27J02r2m3k4j06N3m0J55j59J97k98J00n1K8q5lL83j7
$$ -190 179 -8 -51 -115 233 106 208 116 73 49 -57 -4 -44 111 -48 149 -149 -49 -100 -72 -157 -160 223 206
5822B06j66J84j94j43L40m25O8J61j6M3j71J86p4o9J33nK1o9k95N26l20k9J40
$$ 206 40 224 30 -113 227 -198 -130 31 15 58 -113 73 -1 -70 63 58 79 10 -285 241 -79 -108 32
5845C2M7o2r9L8K73l87l2J56o7K58Qq5k00L62l52J43Q2n4j00J88p8L6k18J07m7
$$ 32 79 17 -82 -44 229 -158 -190 -34 -101 157 165 80 -120 242 -110 33 115 61 -39 149 71 107 -111 -4 -51
5870e1J55j66J6j91JJ58J83k6j16RJ53m22L87j37j9L44k12j4j52m3K96q8J46l05
$$ -51 104 -62 -46 -237 -236 -78 105 79 -37 -28 125 -297 90 -47 -66 278 66 52 -100 -143 153 65 211 -94
5894i4M51m81j24M06k82J57k2j90K10q9J58m7k21L10n1j73L09l27L87k70k67L35
$$ -94 357 -124 -248 158 -124 33 11 -179 31 -58 100 53 -168 142 91 -82 227 -100 287 17 -250 85
5916H5p4j17q7R4jP8NK30k62N0j47j84K97k48K49P7j61k9J09J42p8nj36J37j11
$$ 85 11 -106 -193 -99 -100 -22 -17 213 -49 1 -146 -330 -33 -281 -32 45 -116 -145 -36 106 28 23 -113 24 -87
5941h7j39J80n8j12J3L14M5r0J45j4k05j82PL97l59L42k82J04l0Q8j15J8J86n2
$$ -87 -226 -46 -104 -216 -203 111 156 66 211 197 -8 -190 -183 214 -145 197 -85 19 -11 77 -38 -20 166 114
5965A14p0J50l22J62lj59J94j53K52j19j91P3J75op8P0j0J81k27k3K9N7j0k80
$$ 114 44 194 -128 34 31 -128 66 -87 165 46 -145 -72 103 97 19 89 79 260 33 10 39 96 86 -194
5989a94K42J8j3p9j25N2pK29q6k47J62JJ96j42j17o7K80oj4k66K43j01R2k6J7
$$ -194 48 66 53 -26 -151 -99 -106 123 37 -210 -48 -47 149 7 -110 -177 103 97 83 -183 60 -41 51 25 42
6014D2Q7k66M40j14j44J54p2k59K18J83k35k11J21J53MJ1J29k63R6J59k10j17
$$ 42 129 -137 303 189 45 199 127 -132 86 269 34 -177 -56 97 101 112 241 -22 74 233 23 -94
$$ [...]
8191b3
##END NTUPLES=NMR FID
##END=
