##TITLE=1H_Pr 5018
 CDCl3
 8 sc, 
 8.12.2021
##JCAMPDX= 6.0         $$ Bruker NMR JCAMP-DX V2.0
##DATA TYPE= NMR FID
##DATA CLASS= NTUPLES
##ORIGIN= UXNMR, Bruker Analytische Messtechnik GmbH
##OWNER= root
$$ XWIN-NMR		Version 3.5
$$ Wed Dec  8 13:48:12 2021 Russian Standard Time (UT+4h)  she@DPX200
##.OBSERVE FREQUENCY= 200.131346
##.OBSERVE NUCLEUS= ^1H
##.DELAY= (6, 6)
##.ACQUISITION MODE= SIMULTANEOUS
##.ACQUISITION SCHEME= undefined
##.AVERAGES= 8
##.DIGITISER RES= 18
##SPECTROMETER/DATA SYSTEM= spect
##.PULSE SEQUENCE= zg30
##.SOLVENT NAME= CDCl3
##.SHIFT REFERENCE= (INTERNAL, CDCl3, 0, 15.7039)
##AUDIT TRAIL= $$ (NUMBER, WHEN, WHO, WHERE, WHAT)
$$ ##TITLE= Audit trail, XWIN-NMR		Version 3.5
$$ ##JCAMPDX= 5.01
$$ ##ORIGIN= Bruker BioSpin GmbH
$$ ##OWNER= she
$$ F:/spectra/data/she/nmr/H-F/1/audita.txt
$$ ##AUDIT TRAIL=  $$ (NUMBER, WHEN, WHO, WHERE, WHAT)
(   1,<2021-12-08 13:47:28.15 +0400>,<she>,<DPX200>,
      <created by zg, POWCHK disabled, PULCHK disabled
       configuration hash MD5:
       00 E9 B6 7A A2 85 ED C7 34 08 36 98 17 FE 4E 26
       data hash MD5: 16K
       56 FF 99 23 80 B1 F0 BC D4 34 46 76 91 DC 1C 6C>)
$$ ##END=
$$ 
$$ hash MD5
$$ 22 5E B6 97 31 D0 34 CF 38 DC 23 8B 67 5D 70 DE
##$RELAX= 
##$RELAX= 
##$RELAX= 
##$RELAX= 
##$RELAX= 
##$RELAX= 
$$ Bruker specific parameters
$$ --------------------------
##$DU= <F:/spectra>
##$EXPNO= 1
##$NAME= <H-F>
##$PROCNO= 1
##$TYPE= <nmr>
##$USER= <she>
##$AMP= (0..31)
100 100 100 100 100 100 100 100 100 100 100 100 100 100 100 100 100 100 
100 100 100 100 100 100 100 100 100 100 100 100 100 100 
##$AQSEQ= 0
##$AQ_mod= 1
##$AUNM= <au_zg>
##$AUTOPOS= <>
##$BF1= 200.13
##$BF2= 200.13
##$BF3= 200.13
##$BF4= 200.13
##$BF5= 200.13
##$BF6= 200.13
##$BF7= 200.13
##$BF8= 200.13
##$BYTORDA= 1
##$CFDGTYP= 0
##$CFRGTYP= 5
##$CHEMSTR= <none>
##$CNST= (0..31)
1 1 145 1 1 1 1 1 1 1 1 1 1 1 1 1 1 1 1 1 1 1 1 1 1 1 1 1 1 1 1 1 
##$CPDPRG= <>
##$CPDPRG1= <>
##$CPDPRG2= <>
##$CPDPRG3= <>
##$CPDPRG4= <mlev>
##$CPDPRG5= <mlev>
##$CPDPRG6= <mlev>
##$CPDPRG7= <mlev>
##$CPDPRG8= <mlev>
##$CPDPRGB= <>
##$CPDPRGT= <>
##$D= (0..31)
0 1.2 0 0 0 0 0 0 0 0.06 0 0.03 0 0 0 0 0.0002 0 0 0 0 0 0 0 0 0 0 0 0 
0 0 0 
##$DATE= 1638956847
##$DBL= (0..7)
120 120 120 120 120 120 120 120 
##$DBP= (0..7)
150 150 150 150 150 150 150 150 
##$DBP07= 0
##$DBPNAM0= <>
##$DBPNAM1= <>
##$DBPNAM2= <>
##$DBPNAM3= <>
##$DBPNAM4= <>
##$DBPNAM5= <>
##$DBPNAM6= <>
##$DBPNAM7= <>
##$DBPOAL= (0..7)
0.5 0.5 0.5 0.5 0.5 0.5 0.5 0.5 
##$DBPOFFS= (0..7)
0 0 0 0 0 0 0 0 
##$DE= 6
##$DECBNUC= <off>
##$DECIM= 32
##$DECNUC= <off>
##$DECSTAT= 4
##$DIGMOD= 1
##$DIGTYP= 9
##$DL= (0..7)
0 120 120 120 120 120 120 120 
##$DP= (0..7)
150 150 150 150 150 150 150 150 
##$DP07= 0
##$DPNAME0= <>
##$DPNAME1= <>
##$DPNAME2= <>
##$DPNAME3= <>
##$DPNAME4= <>
##$DPNAME5= <>
##$DPNAME6= <>
##$DPNAME7= <>
##$DPOAL= (0..7)
0.5 0.5 0.5 0.5 0.5 0.5 0.5 0.5 
##$DPOFFS= (0..7)
0 0 0 0 0 0 0 0 
##$DQDMODE= 0
##$DR= 18
##$DS= 0
##$DSLIST= <SSSSSSSSSSSSSSS>
$$ [...]
##$SUBNAM2= <"">
##$SUBNAM3= <"">
##$SUBNAM4= <"">
##$SUBNAM5= <"">
##$SUBNAM6= <"">
##$SUBNAM7= <"">
##$SUBNAM8= <"">
##$SUBNAM9= <"">
##$SW= 18.0517287032376
##$SWIBOX= (0..15)
0 0 2 0 0 0 0 0 0 0 0 0 0 0 0 0 
##$SW_h= 3612.71676300578
##$TD= 16384
##$TD0= 1
##$TE= 0
##$TE2= 300
##$TE3= 300
##$TEG= 300
##$TL= (0..7)
0 120 120 120 120 120 120 120 
##$TP= (0..7)
150 150 150 150 150 150 150 150 
##$TP07= 0
##$TPNAME0= <>
##$TPNAME1= <>
##$TPNAME2= <>
##$TPNAME3= <>
##$TPNAME4= <>
##$TPNAME5= <>
##$TPNAME6= <>
##$TPNAME7= <>
##$TPOAL= (0..7)
0.5 0.5 0.5 0.5 0.5 0.5 0.5 0.5 
##$TPOFFS= (0..7)
0 0 0 0 0 0 0 0 
##$TUNHIN= 0
##$TUNHOUT= 0
##$TUNXOUT= 0
##$USERA1= <user>
##$USERA2= <user>
##$USERA3= <user>
##$USERA4= <user>
##$USERA5= <user>
##$V9= 5
##$VALIST= <valist>
##$VCLIST= <CCCCCCCCCCCCCCC>
##$VD= 0
##$VDLIST= <DDDDDDDDDDDDDDD>
##$VPLIST= <PPPPPPPPPPPPPPP>
##$VTLIST= <TTTTTTTTTTTTTTT>
##$WBST= 1024
##$WBSW= 4
##$XGAIN= (0..3)
0 0 0 0 
##$XL= 0
##$YL= 0
##$YMAX_a= 89142
##$YMIN_a= -113241
##$ZGOPTNS= <>
##$ZL1= 120
##$ZL2= 120
##$ZL3= 120
##$ZL4= 120
##$ABSF1= 10
##$ABSF2= 0
##$ABSG= 5
##$ABSL= 3
##$ALPHA= 0
##$AQORDER= 0
##$ASSFAC= 0
##$ASSFACI= 0
##$ASSFACX= 0
##$ASSWID= 0
##$AUNMP= <proc_1d>
##$AZFE= 0.1
##$AZFW= 0.1
##$BCFW= 1
##$BC_mod= 2
##$BYTORDP= 1
##$COROFFS= 0
##$CY= 11.3945322036743
##$DATMOD= 1
##$DC= 2
##$DFILT= <>
##$DTYPP= 0
##$F1P= 2.36226072786647
##$F2P= -0.459571619588291
##$FCOR= 0.5
##$FTSIZE= 0
##$FT_mod= 4
##$GAMMA= 1
##$GB= 0.15
##$INTBC= 1
##$INTSCL= 1
##$ISEN= 128
##$LB= 0.24
##$LEV0= 0
##$LPBIN= 0
##$MAXI= 10000
##$MC2= 0
##$MEAN= 0
##$ME_mod= 0
##$MI= 1.114404
##$NCOEF= 0
##$NC_proc= 0
##$NLEV= 6
##$NOISF1= 3.799351
##$NOISF2= 2.8
##$NSP= 1
##$NTH_PI= 0
##$NZP= 0
##$OFFSET= 15.70392
##$PC= 1
##$PHC0= -15512.9
##$PHC1= 12.4008
##$PH_mod= 1
##$PKNL= yes
##$PPARMOD= 0
##$PSCAL= 0
##$PSIGN= 0
##$REVERSE= no
##$SF= 200.130013532006
##$SI= 16384
##$SIGF1= 3
##$SIGF2= 2
##$SINO= 400
##$SIOLD= 16384
##$SREGLST= <1H.CDCl3>
##$SSB= 0
##$STSI= 0
##$STSR= 0
##$SW_p= 3612.71676300578
##$SYMM= 0
##$S_DEV= 0
##$TDeff= 0
##$TDoff= 0
##$TI= <>
##$TILT= no
##$TM1= 0
##$TM2= 0
##$TOPLEV= 0
##$USERP1= <user>
##$USERP2= <user>
##$USERP3= <user>
##$USERP4= <user>
##$USERP5= <user>
##$WDW= 1
##$XDIM= 8192
##$YMAX_p= 0
##$YMIN_p= 0
$$ End of Bruker specific parameters
$$ ---------------------------------
##NTUPLES= NMR FID
##VAR_NAME=  TIME,          FID/REAL,        FID/IMAG
##SYMBOL=    X,             R,               I
##VAR_TYPE=  INDEPENDENT,   DEPENDENT,       DEPENDENT
##VAR_FORM=  AFFN,          ASDF,            ASDF
##VAR_DIM=   8192,          8192,            8192
##UNITS=     SECONDS,       ARBITRARY UNITS, ARBITRARY UNITS
##FACTOR=    0.0002768,     1,               1
##FIRST=     0,             0,               0
##LAST=      2.2672688,     0,               0
##MIN=       0,             -113241,         0
##MAX=       2.2672688,     89142,           0
$$ Real data points
##PAGE= N=1
##DATA TABLE= (X++(R..R)), XYDATA
$$ [...]
1309g30N13M97n87l17O01L70o34K2N54R1n45K04M66n4m62J97K47j94k86K55L44
1330E52m12k61L24p8m58o6N79l86k10K18J10m10M3L45M8n39L96M84l99m0L57K07
1352D04m08J73O4L41n34o3N61k17m32K6M65k74m12L22J79n60j93M66J43m12j55
1373e16M60j36k21J35L63j66j66M16J27k29R2J14J65l30J15L08k49l34P1J47J06
1394B72k46k2q8k6j18K71k48j39K88j01j92n0J64K83l59K34J69n4n0M2J63j60
1416C3J74Q1J29j71k71M31k2k76k33L10K20n23j67L61Nm33k5K51j51j69L29k1
1438a38k1k5J6K17K15l56O3J79J90j70n7K01k9jj66J27qj27j63J93k41j52K2K13
1462a8k5k88k0K61J04l73j36N51j68k88J56M87q1k03J34K09M9j98o5L06q1j59
$$ y = [-730, -217, 280, -307, -624, -23, 347, -287, -265, 289, 380, -165, 39, 505, 451, -11, 186, 433, 239, -47, 208, 552, 140, -121, 203, 125, -333, -399, 180, -206, -416, -198, -88, -498, -455, -110, -62, -601, -205, 279, -120, -160, 197, 404, -4, 169, 233, 574, 40, -23, 538, 321, -111, -85, 380, 106, -306, 16, 195, -365, -558, -92, 51, -361, -516, -56, -192, -413, -278, 85, -81, -247, 169, 296, 67, 159, 273, 438, 108, 223, 531, 282, -52, 19, 166, 272, 26, 4, -84, -110, -228, 43, -205, -344, -56, -157, -349, -399, -235, 48, -311, -77, 92, 38, -12, 30, 193, 33, 207, 288, 417, 246, -25, 406, 384, 108, -125, 185, 405, -118, -285, 76, 81, -352, -377, -126, -277, -446, -117, -138, -159, -184, -168, 49, 264, -92, -29, 150, 340, 170, 113, 314, 285, 284, 118, 245, 237, 110, -53, 140, -101, -253, -231, -18, -43, -331, -351, -90, 14, -359, -495, 56, -112, -400, -244, 243, 162, -41, 93, 302, 351, 153, 88, 394, 313, 154]
1484A54j05M72m24k89J36L00l2p26L60K55l17k81K45J92j63j66J94L70l51j65
1504c41L53K47k85p0M48J63l86j92M75K6m05j37N82j22l53j63L23j18k19n3J99
1525b8p2p1k22L29pn29J76M74l00j99K19M71ok16j28K89J52k40q1L63N8m17o2
1548d7L08P8m28J13O6j47j71m8M09m95j12J00M51l45k25K76L97l16k34L17J04
1569E1No2K28K39l38j98L71R0m68J21L40r9l76J88j2J04m24M8K79j40l20P7J77
1592a19j74p1K14P9l2k02K51K55k81j32L43K19k46J41J0m4K7n1k10K51m0k35J37
1615I0l01K25l05J95J36j41l16J94J01j54L0k0L59m9k23o0L88p1k25K13J58q1
1637A43j35L09J09k44n1O8R6l21j02K51Lk17k30J10J81q2k22L30K6l06L4J43o6
$$ y = [154, 49, 521, 97, -192, -56, 244, 212, -514, -154, 101, -216, -497, -252, -60, -223, -389, -195, 175, -176, -341, 12, 259, -26, -96, 352, 515, 129, -63, 412, 438, 33, -104, 478, 356, 3, -160, 163, 45, -174, -227, -28, -100, -171, -393, -64, -71, -600, -424, 50, -250, -449, -230, 241, 235, 19, -109, 180, 332, 92, 11, 374, 432, 15, -47, 261, 339, -89, 24, 90, -57, -228, -276, 133, -362, -474, -374, 77, -268, -493, -217, 180, -136, -370, -53, 51, 56, -6, 222, 461, 123, -75, 296, 386, -82, 39, 379, 280, -96, 92, 80, 184, -240, -192, 87, -53, -373, -296, -119, -293, -364, -150, -71, -103, -305, -54, 201, -80, -212, 131, 350, 104, 245, 255, 211, 238, 187, -23, 228, 188, -47, 90, -211, 14, -291, -96, 40, -101, -417, -223, -122, -276, -246, -266, 93, 44, -179, -239, 149, 78, -147, 66, 224, 143, 8, 317, 426, 182, 131, 199, 295, -26, -128, 123, 126, -91, -321, -211, -30, -112, -334, -4, 22, -284, -250, -107, -173]
1660a73j42M01k0q3J14J28J01j87K05j27Mj45L03l80o8J56r1j5K2j83m4O8j49
1683c05J73j08QP9P9k45J07N7J82k00p0L74p3r8J88Q8j3j14J45m5N1k18N1R7j62
1708B8j25m2K14k06o0n9K21l9j16NL3l21K65P2J23j16p7L33j78l0L22q1O0l3K
1733A95p2R3qj09L5J8j96m6J82j68l5N4p7J31j5k60J13J12j61M7j9J69r2j01K03
1758gJ39l2j12J78R0l80K50P1O6n7j01k1r1K8p0J47k69J9m0J78P0l91N2J26j56
1783c13K14Q2M9j11J7J42j09K38l27J14J15N6J41k11P5N4j45o3j1m3l0Op0j3j23
1808b66J22K0j48L13l75J64K2O5r1J03NJ18o2J58K0n2r1J97j26%M6K1M3j58j59
1833a11L46l5k04k26K24J2j75j2Ol2R1o7K5R7j86J97r3K21K6j10R6NJ0O0J26r
$$ y = [-173, -315, 86, 66, -17, 97, 225, 326, 139, 344, 217, 221, 76, 379, -1, -69, 87, -4, -19, 3, -180, -224, -156, -305, -132, -240, -232, -153, -74, -319, -212, -155, 27, -173, -243, 131, 58, -40, 148, 236, 223, 109, 254, 209, 260, 42, 93, 190, 28, -97, -139, 75, -131, -191, -250, -29, -68, -184, -179, -146, -467, -202, -130, -7, -123, -200, 133, -45, -75, 247, 166, 226, 193, 195, 123, 216, 208, 99, 134, 152, -44, -90, 92, -76, -111, -57, -134, -3, -18, -278, -165, -53, -214, -167, -186, -17, -109, -210, -7, 132, 100, -12, 166, 256, -124, 126, 197, 263, 206, 105, 84, -7, 21, -49, 98, -171, -152, -192, -14, 56, -335, -283, -157, -313, -99, -17, 32, -79, -62, 80, -29, 209, -118, -4, 111, 167, 308, 97, 172, 226, 81, 18, 7, -36, -66, -60, -130, -143, -266, -144, -124, -272, 41, -334, -170, -148, -83, -174, -71, -66, 52, -10, 148, 168, 116, 25, 222, 96, 96, 142, 163, 206, 48, -111, 235, 200, -4, -230, -6, 6, -169, -181, -175, -207, -116, -183, -158, -61, -247, -50, -143, 78, 104, -6, 90, 95, 105, 165, 291, 282]
1859B82k13N5P9j75K4j75N7J26j33j04J10p4m5j35J63Q4r2K0m5K07j13M2K05p1
1883G9j10LJ24J42j15j17J57J89k90qK12j3j99q2J24j67k84K84l3j60LR2PL3r6
1908b25J22R0q0j44K69j7jj06J73J02N4k55J16R4M6n3j3J18j36p8r4O9j54P9j96
1933b20P0N7k22J90J12j53L3j39J06J54K5j40L50K2k19p2L23p8o1J33j4m8k61
1956e2K71l2k44j74K50Q6k28j0J52O9k11j29J64l5j57J29M9rQ0m3J35J18j36n4
1980a1N5n1J41j23P5J67j82P6j7O5j12j87Q7J12j56j23RPO0k05K85J4j14j4J74
2005C2N4j37j1K27j14j16J59K5R4r3q5K8o0k22L81lr5K8k82L62k74j77K81l3p1
2030a02rJ04N9j31J22N7j42p4m6J47N7J46j06K0N8n3j12K09p3k2Q2k49J41p7j23
$$ y = [282, 69, 124, 203, 28, 52, -123, -66, 60, -73, -177, -67, -141, -186, -321, -158, -74, -166, -146, -191, 16, -97, -55, 150, 79, -31, -28, 96, 238, 123, 6, 163, 352, 62, 54, 266, 253, 54, -28, 96, -71, -355, -71, -104, -264, -261, -169, -162, -129, -225, -103, -13, -93, -237, 32, 15, 14, -92, 81, 183, 237, -18, 98, 192, 238, 185, 172, 290, 154, 76, -18, 51, -103, -24, -220, -150, -93, -315, -125, -13, -166, -133, -272, -166, -12, 13, -127, 223, 245, 26, -46, 277, 199, 138, 271, 257, 209, -52, 219, 187, -57, -231, 19, 105, -123, -133, 19, 88, -123, -252, -88, -123, -280, -151, -102, -111, -31, -74, 61, 179, 43, -11, 44, -7, 134, 11, 86, 253, 71, 147, 130, 195, 83, -104, -17, 95, -61, -184, -175, -168, -108, -313, -28, -14, -128, -142, 32, 86, -51, -62, 165, 51, -65, 94, 119, 213, 120, 35, 63, 3, -219, 162, 159, 64, 92, -190, 172, -102, -279, 2, -31, -102, -111, -7, 52, -79, 43, 100, -42, -116, -162, -15, 42, 188, 82, 102, 160, 107, -5, 204, 131, 109, 191, -58, 83, 6, -117]
2055a17j10J45M0j36N6J50k19p5Q9J6J04j84J27K72q5k85L38Q9k01O7J10k0j55
2078A6J12N4j79J47j27K94k31j59L1J12k01j45J51J50j57k21K53J06j57m4M81
2099B86k72k21J62K11j27r7K75j33N1p4K15j50j33J44K21l51o1K93j86j29M4q0
2121a12j25K0pJ98j07j3kJ76k48J8K37q6j35J95J76j07k71K13J52k30J6J72K1
2144A51kj71J73k3k07O3N6mj03J11k41o6O1J34M0j88n2J87k8K5J41Q9j01Q2K8
2169A55l6j96J00L42p7l01J40N4j05r4L8Kj27L9K21k49j00N9J64j29j09R5K20
2192A06l12L1J23J35j36l6L01r5p6K6K13j53l6J33J61m24O2K75j43l59J57J21
2214G4j16j80J95q1m3j28Q8J75j22N0L75o1m14K35J09j79k27N41r4j89J22P9j61
$$ y = [-117, -227, -82, -42, -178, -122, 28, -191, -266, -177, -161, -57, -241, -114, 158, 73, -212, 126, 215, 14, 81, 191, 171, 16, 128, 182, 3, 150, 23, 317, 86, -73, -42, 70, -131, -276, -125, 25, -132, -353, -100, 6, -151, -195, 286, 14, -207, -45, 166, 39, -58, 217, 84, 135, 61, 276, 126, -7, 137, 358, 7, -54, 239, 53, -76, -32, -112, -237, -217, -224, -26, -133, -146, -148, 28, -220, -202, 35, -51, -186, 9, 185, 78, -193, 20, 172, -58, -42, 130, 151, 149, -22, 151, 128, -79, -16, 40, 36, -67, 44, -197, -263, -202, -68, -28, -216, -268, -81, -109, -84, 57, 146, 45, 127, 155, 119, -77, 23, 365, 288, -13, 127, 181, 76, -18, 20, 22, -105, -66, 155, -94, -194, -135, 29, -100, -209, -114, 106, -206, -175, -52, 83, -53, -89, 212, 117, 41, 67, 280, 127, 91, 224, 385, -39, 23, 298, 155, -204, -47, 74, -42, -222, -27, -108, -151, -279, -191, -16, -138, -88, 287, 226, -188, 47, 156, -23, -250, 291, 197, 8, 130, 209, 48]
2237D8j3P6L9p6k57J21J69m6k41K43l1l51K53J56p5j23p8K07j26p6L19o8k24J84
2261C0RJ27j52J50J2j14j17J85j0j55J92m4m8q4Q4R9l64J3O7n2J21j02K91j33
2285El3pJ40j05j49N5K57p7KJ64j05j77L3J19n5j62K37J39Mk37n2M3j92P0J60
2310G7k64k5N9L6R1l14L10J1K1j67K55M6j73Q6ML6N4mR5j02kJ14r9j87J78%m9
2337H7j96OMJ67k36M8J6O4j54K61j08n9j06K67m1j14NJ92N1j27J08J74k75j09
2361g5J78K3l8j05K90k24r4j55L69l59J37mO3j75n0N7M1J29j63J15p0o8J12J38
2385G2k06J47o6K60j47K3ln5J4N0l1J7r1M3k02J50N1j94J59pr3R3j02Q4o5K16
2411A17j00L1K9o9j21K37l8p4J24p0J27j51J34p8O8j46L6j35J77k85Q8K43k15
$$ y = [48, 35, 111, 150, 74, -183, -62, 107, 61, -180, 63, 32, -319, -66, 90, 15, -108, -186, 21, -105, -181, 138, 70, -154, 30, 39, 166, 14, 164, 176, 62, -55, 130, 120, -35, 157, 113, 65, -19, 65, 164, -200, -187, -120, -172, -51, -153, 138, 5, -28, -35, 105, 0, -149, -94, 163, 86, 88, 252, 147, -30, 3, 122, 67, -95, 142, 281, 285, 48, -4, 39, -153, -83, 77, -187, -212, -153, -117, -26, -340, -30, -19, 2, -165, 90, 136, -37, 49, 53, 89, 143, 139, 234, 132, 130, 244, 145, -42, 136, 136, 87, -109, -103, -99, 68, -168, -120, -104, -40, -194, 67, -41, -100, -206, 61, 20, -94, -89, 103, 154, 27, 135, 309, 34, -75, 103, 126, 88, -17, 273, 49, -45, -200, 169, -190, -53, -57, 6, -169, -219, -162, -121, 8, -155, -40, -110, -178, -66, 72, -134, 13, -53, 207, 60, 83, 80, 25, 39, 89, 58, 75, -16, 27, -175, -25, 26, -168, -9, -16, -109, -16, -118, -34, -99, 117, 17, 48, 77, 8, -113, 124, 86, 12, 136, 66, 193, 42, 176, 98, 166, 20, 56, -79, 98, -187, -99, 144, -71]
2434g1K4j35J36k75J30P4J58M1j43N5n5N5o4k2JR5M6J4O3QP9q9j47l0J28j4j48
2461h6K38k53J44r2O3o5l4q4M2Jn7K6k0M3J51L4j13j03N7oK35j74J94j02M2j44
2487f3K55O2l77K07L3j60j12L69l44R4j38N7q3M2J00j03J46J10k59K41n0K6o0
2510gQ3mk06MK03R6q8J03j20Q0p9r0J33j08o9K77j97J7j65L4N7k16J03N8R3p7
2536h5J96k19%L4j31J22M6J35p1J0Q3J14j00Q0j89J42r8qj64J25M8n1j19j30Q9
2561a41J37pj20J56j54k3N5M1J4Q4K2o8nm0K36j67M6J40j84K49k23K1l1K0Q2j25
2587A5Q0M3k11j06J31m8M7j14M3J59k31Q9K2O0j24kJ23j2%j41J82n9m6O6J11O9
2613A46q7k5k8K18j58p5n9J1p2L8j8m3N1j8J64j58P4m7J04k25P8Q7J53j16j36
$$ y = [-71, -47, -182, -46, -321, -191, -117, 41, 82, -61, -6, -61, -6, -70, -92, -91, 4, 50, 64, 127, 135, 214, 125, -22, -52, 76, 62, -86, 152, -101, 43, -49, 14, -51, -85, -169, -127, -126, -183, -157, -177, -134, 17, 51, -62, -165, -108, -114, 121, -53, 141, 39, 81, -63, 192, 254, -123, 84, 117, -43, -155, 214, -130, -36, -174, -117, -200, -158, -58, -161, -15, 95, -164, 77, 27, 53, -7, 76, 72, -134, -130, 73, 169, 81, 184, 64, 144, 65, -25, 108, 0, -69, 208, 11, 28, -137, -103, -46, -262, -159, -101, -8, -85, 111, -108, -108, -74, -205, -83, -37, 98, 27, 37, 120, 234, 134, 214, 25, 167, 69, 61, -103, 22, 70, 19, -100, -230, -141, -4, -11, -131, 25, -129, -152, -97, -56, -42, 42, 64, -4, -9, -49, 187, 20, 66, 206, 22, 271, 48, 69, 38, 58, 140, 15, 95, 138, -73, -179, -48, -96, -49, -163, -120, 39, -192, -103, -81, -21, -145, -147, -24, -36, -36, -177, 5, -54, -100, -34, 77, 146, 59, 34, 6, 224, 66, -9, -68, -57, -129, -91, -109, -152, -101, -119, 45, -113, -39, -86, 18, -207, -129, -42, 111, -5, -141]
2638a41K69r3n7L1O5J27j45P7p2%J41j67J0j42J02l4Q2j60K17k17n0R7o1J05j85
2663b01J53J9P6o0l3K38j95l4K08j30Rj91K59%j05N7j16J4J3Q4k9j04j52L40j33
2688a3k21J19oJ06k8M3rL1j05L3J07n5j86K15J32nj07j17J48N1o6l8m0J71k58
2713i8k6K64j40K20m60K24n5J16k90J26L6J17k83J96m7k1M2O7P1R6k61rL89j24
2737A50j09J00qQ9k44O3Rj59k08L38N9k83K81k61J17L0j05J59m8l9J86m2q3L4
2761B6k1k6J06m0L5k3P3j2L1j12j01J3K02k46J81l7j14j4o7J56k40M0O2J78j07
2786e7l4J15j06J17p4J0o3J9K78j19o7Q3rr3L3J34nl4l3J33j06j12k4Q6j21k3
2812g2kj02K0L8m5J11P7j77j55L03L9j39K11J19k64J64m2J10j24J0O0m6M0k24
$$ y = [-141, 128, 35, -22, 9, 74, 201, 56, 133, 61, 61, 202, 35, 45, -97, 5, -29, 53, -107, 110, -107, -157, -60, -121, -16, -201, -48, -29, 47, -13, -46, 192, -3, -37, 171, 41, 50, -141, 118, 118, 13, 70, -46, -32, -19, 65, 36, -68, -220, 120, -13, -234, -115, -121, -15, -43, 0, -9, 22, -83, -50, 57, 2, -184, 31, 163, 158, 51, -66, 82, 133, 67, 29, -11, 160, -98, -124, 140, 0, 220, -240, -16, -71, 45, -245, -119, -83, 34, -249, -53, -100, -121, -79, -12, 59, 155, -106, -115, 274, 150, 41, 141, 133, 222, -22, 41, 50, -109, -317, 21, 80, -203, 78, -183, -66, -36, -141, 18, -30, -69, 117, 75, -8, 26, 5, -21, 85, 45, 80, 57, 130, 118, 149, 37, -64, -51, 151, -95, 86, 49, -65, -79, -146, 10, -230, -190, -128, 50, -57, -91, 24, -82, 35, -39, -29, -92, -73, 205, 86, 19, 102, 93, 0, 33, 167, 162, 128, 95, 228, 122, 10, -14, 72, -49, -72, -74, -176, -156, -118, -163, -52, 25, -152, -307, -4, 35, -104, 107, 226, -38, 126, 84, 194, 70, 80, 140, 94, 134, -90]
2836i0r4J42j9P4L2pk45K15m9rJj50J81R4p2j17j8J68M9j10m4K53j01m1j01K79
2862B21O1l90K31m6K4r7L4P1jl57L25r9J07p5k8k28K27m4O0p1LJ34J73k31j97
2887a93K03L0j26J09O5k9N1Rm8k0q1J08n4R4nn7j35R9q5k8O2J62j64j7j99J93
2913e6j23rN3J54J7j20J9p5K10k52J88J6J46k5j20O8j50P2J25n4p2o8J79j4j10
2938aj61R8k6j6m1K53j93k5J32j1p1k6K02N1m9P6p8Km9j14J69J8j76J8P8n5k9
2965b4o7J08p3Q6j06j04J51O8j6P7j82K9J65o1o5J4r0J26%m2P0K2j0l0k51K10
2991El9P2R9k13J6k5J04j27J58j06n9J31m9R6k7n7J87k07o5K61J6l93J93l8J66
3016I9n8r5N9Q1K4j83J32M4j15M2j47J77N8j95j7M8Q6J4j08P7k65J36rP2o7J09
$$ y = [-90, -184, -42, -61, 13, 45, 38, -207, 8, -41, -50, -49, -199, -18, 76, 4, -113, -131, 37, 86, -24, -68, 185, 84, 43, -58, 221, 282, -108, 123, 77, 101, 4, 38, 109, 108, -249, 76, -23, 84, 9, -19, -247, -20, -64, -4, -75, -72, 62, 235, 4, -193, 10, 40, -86, 23, 88, 59, 110, 119, 71, 51, -30, 78, 24, 118, 113, 56, -79, 20, -65, -93, -31, 131, -33, -50, -249, -56, -179, -188, -135, 19, 36, -84, -65, -140, 70, -182, 6, 22, 168, 143, 23, 91, -59, 13, 138, 84, 12, -56, 123, 109, -1, -162, -64, -90, -106, -147, 106, -87, -112, 20, 9, -62, -88, 114, 165, 116, 192, 114, 116, 67, -47, 122, 140, -36, -18, 60, 5, -24, -91, 17, -56, 30, -76, -180, -29, 39, 23, 100, -82, -53, 112, 51, -14, 0, -90, 36, 36, -6, 64, 86, 76, 46, -205, 5, -34, 38, 137, -76, -60, -85, 19, -108, 50, -56, -115, 16, -33, 63, 36, -21, 166, -41, -106, 155, 171, -222, -29, -67, 99, 41, -54, 5, 86, 110, -73, 59, 103, -12, 30, -117, 60, 118, -77, -94, -46, 40, 54, -54, 23, -242, -106, -115, -43, -110, -1]
3042ao2K4J78q3o0R6l5n8O3qN5k6j5p9K0j37R6K7O7Q0j67q9N2J8o4k0J03o8J30
3071C7N1k09J72p7Kk7P3l5P0l5M8j19J08k8L2r7O0M4n7J2O5j59kO3q7N3L1Kj11
3100a20J04j1j62J5N9K53j16R2L5m3L5j64K7J11k14K49j28k0J0J9N6j05J7j4p1
3125h6P7n8J4J14j09n4O0j1jJ04j52L4QN8R8p1M9m9R1j10j9J84l96R8K27j02j05
3152a07J42l8j29J38q9J0J2q1N2L6q9K05o4r1oN0Mk23K02O7P7o1J03p8j7N5o9
3179A1K0p8K1J29j03j10Q4k7J03m9r9O7L7j93K4O8L7m5R5p6L7J0K44j97pO4L5
3206A02j82L9K9m7L08m56K66o5n2M4n5J5n4O7jLj63K02J2p4L6Q9kj81J18Pm0J44
3234A09l9L3o9o5Q8M1j50J24j56M0J12r5N2j58j78K24J92j85j08L15j68l7Q9M4
$$ y = [-1, -63, -39, 139, 56, -4, 92, 57, -1, 62, 54, 109, 83, 68, -11, 9, -128, -32, -5, 62, 142, -25, -114, -62, -44, -108, -128, -25, -93, 37, 88, -121, 51, -26, -24, -51, 22, -13, 57, 22, 70, -49, 59, 31, 63, -34, 26, 70, 13, 25, 90, -69, -71, -8, -95, -42, -11, -9, -120, -16, -27, -189, -174, -115, 138, 22, 114, 149, 106, 141, -23, 4, 115, -99, 150, 22, 2, 12, 31, 87, -18, -1, -15, -86, -9, -67, -53, 61, -48, -102, -42, -53, -54, 50, -102, -68, -60, -2, 96, 25, 74, 25, 116, 6, -13, 171, -225, -127, 100, -2, -107, 35, -3, -132, 6, -83, -73, -61, -142, -90, -54, -143, 62, -2, -93, -99, -49, -45, -268, -66, 1, 78, 17, 120, 42, 25, 80, 11, 31, -47, -26, 103, 0, -110, -26, -53, 50, 1, -98, -31, 6, -187, -163, -95, -58, -103, -8, -84, -47, -37, 207, 10, 3, 67, 102, -80, -41, -12, -59, 249, -207, 59, -6, -58, -14, -69, -54, -108, -41, -42, -39, -202, 0, 12, -62, -26, 63, 61, -120, -2, 5, -35, 109, 70, 103, 34, -31, 57, 98, -52, 72, -84, -44, 68, -27, 25, -133, -311, -87, 105, -80, -188, 127, -41, -78, 11, 55]
3258E5k75K29qj48R4oM2J84O7q5j39M9q8J45k20K80o9j3J7j00J4J68k55K0J92
3283A50k58J46j92J14P6r3KP0j29k2K85j40K6L5j30L1r6M0M2J80k60K55p7j62
3307a07L4J19n2M0nJ69k32Lk1P6O3l7n7N9j48R0p8K34j94K6K0o1J41p8K1J52k21
3334d4l1M1Q7P0k35J74N3j43J38k04j0K23j29n5j15P0J97j29kJ19k04L2J94o6
3358C1l4J28p5L1m4p7l5K88k16qJ72r9p8K9J6O6r4k4Q3k03L7J19Rnj22L8J80n3
3386F0J1n2J00j91J21N0n4L3K9q6L9M3r4L6j03R0jm5ln0k4J19o9N3N7k23pJ89
3414B8q8n9J96l6k17P0J07r8j5J11J72k38R4Q5R1k83N7K95Ml74Q9j02J71r9L5
3439dJ13k1k16J1K09j06p9N7K5n8J38m4l8q4lK5K47r0o6jP9j08M3k4M6o1M2J4
$$ y = [55, -220, 9, 1, -147, -53, -59, -17, 167, 234, 149, 10, 59, -29, 116, -104, 176, 107, 94, 111, 11, 25, 193, -62, -42, 150, -108, 38, -154, -40, 36, -57, -55, 15, -114, -136, 149, 9, 35, 70, -60, -29, -125, -85, -43, 137, -123, 132, 55, -107, -73, 46, -6, 34, 29, 198, -34, -31, -52, 24, 87, 50, -7, 52, -96, -6, -84, 150, -44, -18, 2, -59, 82, 4, 25, 177, -44, -75, -34, 53, 123, -112, 62, 115, -28, 110, -94, -104, 119, -10, -65, -180, -110, 87, -42, -44, 75, -129, -97, 97, 31, -3, 125, 50, 81, 37, -40, -75, 213, -3, -11, 161, 62, -16, 13, 29, 95, 1, -23, 60, -143, -106, 13, 22, 17, -105, -67, 113, 60, 71, 19, 119, -72, 49, 99, 45, 78, 107, 21, 60, 103, 9, 45, -58, 32, 31, -14, -17, -67, -91, 28, -41, 12, 69, -154, -161, 28, -60, -119, 77, 41, -176, -106, 1, -97, -112, -1, 171, -67, 27, 112, 203, -80, -23, 272, 276, -98, -9, -111, 60, -39, -4, 109, 88, -128, -117, 92, -14, -93, -36, -11, -69, 69, 25, -13, -97, -100, -75, 172, 82, 16, 15, 94, -14, 29, 5, 51, -10, 32, 46]
3467D6o5J06j13p4J33j3K5R8p6q3j35K76q0p2J59k05J13q5j11MK31M3j93R4j37
3492a14J55o7k1J09n7l4k7K1j3NJ37k9n3r5R3k0l3m2J46j03j4N7M0j5Q8n2n5j4
3520gJ7o5J77r4r9K42j88Q0%r8n2kk1J06m9j8J74k9j37N1N1l3p9J74j45j3Q6J48
3548A77j87O4N7o8Nj1J40j85O7O6n3NP6k37P7j51Q4P6k03m1J97j04J38j06J08
3573il3J75j62K8P3j56qJ70N1o0J8k1M2r6PN2l5j02P4oj04R4j4J3M9J58k00Q5
3601H3k7j40K36k33mj1k7Q0N6O4O0m1o3Ol6K23k38n5J6l6J95j04M4NQ3j24Kj04
3629i0K54k25J05n9k3j8J16j17Rk5M4J03j14J18J4r3N6p0L7Q9j61J62k50K37q
3654I1M8k29J23k25J16R3r1l4J75l1m2N7j35J16M7j52l7Q2p9K20pj45O7K8k01
$$ y = [46, -19, 87, -26, -100, 33, 20, 45, 143, 67, -16, -151, 125, 45, -27, 132, -73, 40, -45, -156, -152, 79, 122, -71, 23, -114, 41, -26, -47, 62, 5, -29, -56, -35, -48, -43, 94, 65, 12, -83, 10, -10, -43, -85, 61, -42, -56, 1, 41, 26, 114, 62, 7, -7, 10, -55, 122, 28, -71, 171, -17, 63, 63, -35, -87, -89, -110, -4, -53, -71, 103, 74, -63, -12, 39, 6, -73, 101, -44, -57, 29, 177, -10, 54, 111, 43, 48, 37, 177, -8, 59, 125, 72, 77, 153, -84, -7, -158, -74, 2, -201, -242, -45, -149, -11, -117, -9, -42, 133, -29, -1, 72, -84, -92, 78, 129, 69, 87, 66, 108, 12, 19, 71, 36, -66, 8, 2, -102, -8, -22, -9, 40, 198, -2, 83, 56, -84, 152, -81, -85, -96, -123, -43, 13, 77, 137, 96, 33, 39, 3, 226, -12, -67, -51, -87, 108, 4, 48, 53, 136, 12, 14, -90, 164, -61, 44, -15, -38, -56, 60, -57, -48, -73, -29, 74, -40, 78, 92, -1, 55, -15, 22, 111, -50, 112, -138, 99, 91, 139, -90, 33, -192, -76, 17, -74, -108, 67, 36, -6, 51, -84, 32, 79, -73, -110, -28, -107, 113, 106, -39, 28, 56, -145]
3679a45L27j48K2j7R4qm6r1K65l18rP3O8l6r8RN9M1j89K10j09j84L49kj49o7K20
3706A21j08J32j59%J95r9J50k37N0o0M7m8j4K1j60J23J8j28J11o6M5R7j68j18
3730b55L49m5j02q0R1J91j2j01N6j33RK6J1Q0k89L24m9k42Q1K36j88j04m5J26
3754f5PN2j01K20k9k81K32j33Kj0J3Q0j12J24P3J47l25M8J29l7qJ92k94J15M9
3779H8j29n4J00n7O7j07J9J26j22J4M3n9K0N8j61J11J10Q1j43%J05j67K22k05
3803d0L5M2J11m8n3R0k70N2l3K18l9j06l5K77k05r9Q6J11j84j12J64J60l9j08
3827b5j5KJ3J8O3j1j29NK11Lp6n5J21j71O5oP8J3j50R5k5j3M9j26L8R6j89K38
3855A17j75J09P5o6o3Q3r6K6l2N2q0P6K4p2K08k22j52J64J36j69P9N5k08L03q3
$$ y = [-145, 182, 34, 56, 39, 133, 125, 79, -12, 253, -65, -74, -1, 67, 31, -67, -58, 1, 42, -147, 63, -46, -230, 119, 117, -32, -99, 121, 13, 145, -14, -14, 181, 82, 232, -5, 45, -15, 32, -16, -30, -9, -169, -46, -28, -156, -45, -111, -66, 31, -137, -255, 94, 49, -53, -133, -42, 149, 137, 36, 92, -41, -32, -6, 5, 85, -204, 120, 71, -171, -90, 146, -42, -146, -191, -65, -58, -6, -107, 113, 84, -197, 35, -98, -96, -106, -93, -13, -125, -1, 72, 219, -106, -58, 71, 34, 26, 218, -76, 39, 88, -41, -95, 5, -52, 15, -92, -73, 53, -69, -55, -12, -71, -51, 7, -154, -43, 67, 148, 5, 5, 110, -57, 165, -40, -5, 37, 148, 100, 47, 137, -133, -81, -114, 104, 65, -41, -76, 201, -4, -103, -17, 94, -90, -202, -38, 122, 83, -25, -40, -38, -25, -7, 56, 45, -84, -79, 132, 135, 59, 4, 125, -46, 19, 13, 91, 104, -46, 49, 24, 11, 60, -66, -28, 68, -121, 117, -58, 51, 126, 60, -3, 80, -16, 10, -22, 30, -50, 26, 50, -22, 186, -36, -188, -24, 112, -57, 22, 77, -131, 172, 89]
3880H9nj26p0O2M3m2J62k14M7O5j28J52J9r7J33Oq0j28J41m8R1Pm4j74K10j11
3906d0Q5j60J22j5J07n3om8o7O0K06j60j02J03J5j05J42o5j70k6J8L00q9j27k6
3931a01K17j35O6r5L4L5O9l2j04j74J08J37KN1j38Q6O7qKj59P8p0K7J32MM1k36
3958i6j24K86o1p2K05j38M5m1J10j55LK2o6NJ12%r9R8k43K22L0j37P1M1Jj1L0
3985C8p3J92j36j33P5K2P6m5p2N8J04j69J42j15R0J33j31j70L9P4K2o5L3l2n3
4010i6J72m3J16p7j44R8ko5O7qj05n1J63J6p1O8m9K25l89K83k9j74J2J45k13K77
4036A26j54J0j8N0J3q1p8J41o4R8K9Qj5j69K0jJ23j19J06O7O5m9q3N9j83J3R8
4063A2L7j56M5K50q6j54J3r1J9N3J37nrR6q0j40%r5J23j3J07j86J25Kj55R5O4
$$ y = [89, 84, -42, -112, -50, -7, -49, 113, -101, -54, 11, -117, 35, 54, -43, 90, 96, 16, -112, 29, -19, 72, 79, 35, -139, 71, -40, 45, -115, 7, -8, 99, 46, 40, -8, -75, -15, 191, 31, -71, 32, 47, -58, 84, 19, -151, -177, -159, 141, 52, -75, -101, 116, -19, 47, -48, -14, 21, 90, 58, -46, -220, -112, 25, 27, 78, -60, 26, 93, 85, 87, -72, 6, -64, -37, 95, 99, 140, -96, -220, 66, 5, -67, 138, 0, 45, 4, 114, -41, -38, -16, -82, -77, 35, 35, -64, 34, -209, 13, 43, -94, -23, 18, 19, 8, 38, -35, 157, 21, -112, -37, -15, 61, 16, -56, 2, 106, -63, 79, -36, 54, 187, 56, -114, -75, -1, 21, -44, -11, -43, -96, 76, 33, 149, 72, -72, 26, 24, -41, 26, 18, -87, -138, 25, 41, -30, 38, -11, 214, -175, 108, 79, -95, -83, 62, -151, 126, -28, -18, -36, 14, 27, -54, -132, 9, -55, 43, 72, 80, 65, -104, -84, -85, 38, -81, 25, 92, 157, 108, 25, 84, -99, -86, 12, 49, -107, -62, 188, 102, -52, -39, -130, -111, -58, 79, 74, 65, 161, 81, -59, -59, -154, -31, -44, 63, -123, 2, 4, -151, -56, 8]
4090HK5K2m7J9P2j51J26k5k9M8j37R2j3j29R2p2m6J33P1j2j01lJ4J75o9j59L1
4117f5J7P5m3J87j63q0l5l0L7R9J56j04J4o2M6j37J42r3O9r9l4P5n2N7j16R8Q
4144c3J72K7o8OJ7j47j1J96l00J51R4j28R1o3n3R3m0n3J58n1p9%M6q1J26j8m7
4171EL3O3l3l7m6k5O2K9j93K21j6M3j92K47j40j28O0N3K9J1K4n2K9r4L3M5l8j04
4199a11J22MJ4J60k79J56n9k1L1O3j32J38m0p9r9N4K0NJ22Mn1l5K25j79qj53J5
4226a13J84j64m7P3J35m2j11Q3j2O2j40K62j29j8K1l3O0j64K17j35qO4o9L7J72
4251A85k66J58j39P2j01j0K9p3J60M7Mj17Pj12K46p4j11K02k89O2J55j24R0O4
4275F5j4M4q0J87j47L2k46J61k3J03o7J7j28J02j9m9K1k8P8j23Q3O6j16J54L6
$$ y = [8, 33, 55, 8, 27, 99, -52, 74, 49, 20, 68, -69, 23, 10, -119, -27, -99, -145, -12, 59, 47, -54, -57, -43, 132, 63, -96, -65, -48, 27, -16, 171, 8, -72, -107, -137, -100, -1, 155, 51, 65, 3, 49, -88, 54, -39, 30, -69, -103, -28, -80, -23, -139, -41, -33, 139, 166, 98, 104, 121, -26, -37, 159, -141, 10, 104, -24, 67, 4, -49, 44, 4, -49, 109, 58, -21, -21, 25, -56, 70, 52, 5, 38, 101, 68, 31, -15, -40, 22, 51, -142, 79, 63, 106, -86, 161, 21, -107, -47, 6, 35, 46, 70, 18, 47, -47, -14, 31, -7, -111, 11, 15, 29, 189, -90, 66, 7, -14, 17, 80, -52, 86, 46, -33, -132, -78, -58, -53, 69, 73, 22, -13, 212, 33, 25, -128, -113, 71, -93, -140, -67, 68, 26, -85, -2, -14, 48, -92, 170, 41, 23, 44, 11, 71, -93, 124, -11, -19, 45, -24, 13, 185, -81, 77, -62, 10, -91, -101, -72, -145, 15, 62, 66, -51, -44, -156, 90, 16, -95, 107, -182, -120, 35, -89, 1, 65, 51, 95, 15, 202, 55, 87, -159, 2, -21, 82, 15, 32, -96, 6, -13, -62, -41, -69, 9, -114, -31, 35, -81, 73, 109]
4300A09j71Q4n8O8O2j39J55j16O7J7j40O2Q4m4p3m8N8j4q3K60k05K6qJ90j00o0
4326a7k5O1Jj30Q6k5L2J56j64j5P7L7k8j16P1N0k3L6j3K6q0q4M2%M1M6p0m0R9
4355C1J5j16K66k31p2K39k88J87j15J18j06J54j41JO8l8Q4J6N6j03J40k38J31
4378E8L0j69N7j8l9J52k17K23j35J41k12jK13j43J33k79J23m8n3J39nO0J34n2
4402I2q0q2M0J6J94q0j32P3p5L2o1j0jJ88l53K12P8n2J42j09p5q0O6P2j57J40
4428bK9J32k91J85M0k12L72k95O9q6J48j39K02k10K00j48m0O2p6N1q2J08l5j00
4452a18J14o9K03j42m4m3Q8J25j42Q4n2O9j44p3L26j93q4J19on3o1J32R8k8J2
4477A18j66m7K35k78L15k28mkO2m8l9J99r4K7j2P2j80O8L9rQ5j92N7O3l5M9J4
$$ y = [109, -62, 22, -36, 32, 94, -45, 110, -6, 61, 78, -62, 0, 84, 40, -33, -81, -23, -37, -120, 140, -65, -39, -47, 143, 43, -17, -42, 19, 20, -110, -24, -49, -17, 139, -25, -40, 37, 74, 46, -70, 1, 51, 28, 64, 51, 77, -3, -87, -45, -45, -4, 42, -28, -68, 31, 46, -70, 196, -35, -107, 132, -156, 31, -84, 34, -72, 82, -59, -58, 10, -28, 56, 72, 128, 25, 165, -73, 58, 88, -81, -24, -42, -81, 71, -146, 77, -58, 83, -129, -130, 83, -60, 73, -206, -83, -131, -184, -45, -50, 10, 144, 92, 12, -70, -30, -14, 180, 100, -32, 41, -34, -2, -63, -73, -74, 114, -239, -27, 51, -1, 141, 32, -43, -123, -57, 15, -142, -2, 27, 159, -132, 53, 93, -119, 253, -42, 27, -59, 89, -50, 152, -58, 142, -6, -46, 16, -60, -9, -91, 17, -18, -118, -4, -73, 130, -12, -56, -99, -11, 114, -28, 56, 4, 73, -71, -144, 182, -11, -95, 24, 18, -35, -96, 36, 134, 106, 118, -48, -95, 140, -138, 177, -51, -55, -57, 5, -43, -82, 117, 23, 50, 38, 110, -70, -2, 37, 28, 113, -79, -22, 41, 6, 55, 69]
4504F9j68J11j30J3K6K7j43J57NJ7O4l3J7m5l7J00l03L11m0N1j17M7N3lR9j41
4530GL0l3K4j72N8K08r0o8J56j28J61j28J83j53p2N0j60J52K8j47J13j38l3K34
4554H2n1q9K06j15l1j9O5n0j57J56j17R7pJ26l1o7J40j62JK3N0k46K08j5J14j69
4580e8O5l1q9J76j51J87n8L4K2j82J55q3R1n1J07l55K35Mr4K8j23J51r6R6N9N3
4606I2j56k6l1J7J17j53K11M3j1on1j16j0Q0J01q1M6j13J46O3l7L2k17J18n0L7
4632D5o3J37k17J73j52J53j35j13n3K40k45K03p9P9rR3M5n2o7K2r7P6O2j03J5
4657d2J34MMl21K20J6k30L69k21J86j78K33p1o2p8n6O9k4J71j08j42J40k6M4k1
4682A0J75k70J03J0qJ8p1J0K6P1qmk56K31N3m2m5j25n4K32K5j68N2QK05k43J2
$$ y = [69, -99, 12, -118, -105, -79, -52, -195, -38, -33, -16, 48, 15, 32, -13, -50, 50, -253, 58, 18, 69, -48, -1, 52, 49, 148, 7, 37, 4, 28, -144, -86, 122, 32, -36, 120, -8, 153, 25, 208, 55, -17, 33, -127, 25, 53, -94, 19, -119, -152, 82, 31, -58, 148, 33, 2, -17, 48, -2, -159, -3, -120, -23, -30, 96, 65, -2, 138, -24, -23, 0, 50, -196, 12, -3, 111, -58, 7, -24, -113, 63, -88, 99, 41, 75, 97, -85, 70, -13, 78, 27, 134, -221, 14, 18, -76, -48, -171, -20, -116, -20, 39, 92, -64, -90, -121, -104, 13, -140, 71, 114, 103, 97, 46, -70, -80, 0, 101, 20, 66, -47, 99, 162, 125, 157, -60, 58, 8, 45, -18, 119, -98, 75, -77, 76, -59, -172, -225, 15, -230, -27, -106, -27, -36, 57, 102, 50, -17, 5, -92, -16, 46, -57, -42, 92, 96, 100, -221, -1, 15, -215, 154, -67, 119, -59, 174, 103, 41, -37, -93, -24, -48, 123, 15, -127, 13, -13, 31, 10, 185, -85, 18, 28, 20, 38, -33, -23, 3, 74, 66, 62, -194, 37, 90, 48, 3, -122, -176, 56, 81, -87, -35, -27, 178, -65, -53]
4709e3K96k55oL4Pn6L5N5N1o9k3kj16l1J59l2M9k0LJ5Mj08j0n0J44R3n8j63J74
4738F7k8o1J7o3M1N5P9p8L4P9j68K5K4L0j63N1L9On2M1N2j2k7MR9j93K56p2k01
4767a19QP9N8j33L0J80q1J6q7j5l7O6M6M6N2k11J21j08J13Q9Kj55k2J68k3O8k19
4794f8lk0R3j1J14j67LJ80j34L1j23K8j4J48q4Q3R0Nj25j3n7k6K3j01J29k5R3
4821D9lO4r3P6r4lkO5N1Q3j82j09K17j79LJ58Lj95l0K57k25M0m7J2Q5n8J27q0
4849a0J2l7o6k7J18OMm0p9K32n8j75R1j1K02k94J68Qn0J09m6j00J82J2n5o2O1
4876I5k03J15qj84K90k12j2J13n9l6R8j94L08j24p7pP7n7n5O1Q4J36j93K11j92
4901b5O8M7p0N9n6J13j31j08R5NL8R9l25K32jO0Jj85O2R6j95J01m9K44k48J9j4
$$ y = [-53, 243, -12, -18, 16, 23, -33, 2, 57, 108, 39, 16, 14, -102, -133, 26, -6, 43, 23, 26, 41, 45, -63, -73, -123, 21, 114, 56, -107, 67, 39, -22, -5, -68, -27, 28, 107, 29, 63, 142, -26, -1, 23, 53, -110, -59, -20, -14, -66, -25, 27, 15, -12, -8, 91, -102, 154, 82, -119, -111, -32, 26, -107, -77, 103, 22, 38, -49, -64, -101, -35, 11, 57, 109, -102, 19, -89, 24, 113, 115, -40, -62, 106, 83, 151, -68, -71, -91, 2, -9, 105, -62, -59, 121, -13, 18, -105, -77, -91, 57, -27, 56, 146, 151, 26, 13, -44, -70, -47, -148, -19, -44, 49, 46, 110, 17, 93, -1, -4, -6, 59, 110, 193, 11, -98, 119, -60, -57, 101, 104, -91, -121, 136, -89, -49, -96, -84, 1, -57, 70, -10, 2, -35, -101, -128, -10, -4, 0, -40, -119, 113, 55, -120, -29, -40, 162, -132, 36, 44, -6, 103, 57, -43, 139, 151, 96, 34, 95, -108, 7, -1, -185, 105, -107, -119, -6, -65, -101, -3, -197, 111, -13, -90, -97, -20, -77, -132, -71, 13, 149, -44, 167, -25, 43, 90, 20, 79, 23, 136, 5, -103, -8, -3, 35, 134, -191, 41, 40, 100, 101, -84, -22, 74, -121, -20, -69, 175, -73, -54, -68]
4928f8J05P3M6n4j45J19m8q3n4L33k05mq9Q7p8P4J21j29j41J34q1R2m9o9J58k5
4954B0nL0m5j27J43nQ6m1q7j2K07o6j86J82rJ7L1Mj12n9L0Rn8M2q7Q5P8j4q1j30
4984a60J40q7J10J38k53J86o9J6p9RJ26J7J21j87q6o7K01Nj16J11n5n6M1k2O7
5009E1l4j55O1P1k3rn7q8J16Q1OL0j33l8J81j44J87j62L3K5j28KO4M4j44J96Q7
5036A20M3l01o8K07m9J07j8o0m5k6O0r2J0J67p1K0K5K9k2r5P3q2J1J27j25K79
5062B24l42J69J7O6j83R7j72k0K18l1n7k4j0nO3q0K5J42j35L6n0K1O0Q6p2k9O4
5089G8O7m4k8q6K8O3N5n2j08J71j27j41J62lJ5l4j31J30J1o3O8J53k42K2j2r4
5115a42J24J78k07P8K0k6j4O6q0J4J96m43K72J38j60m5J51j93J26%k0k17J53J27
$$ y = [-68, 37, 110, 156, 102, -43, 76, 28, -55, -109, 224, 19, 15, -74, 13, -65, 9, 130, 1, -140, -6, -87, 5, -44, -113, 45, 20, 15, 45, 0, -127, 16, 11, 97, 56, -31, -43, 164, 98, -88, 94, 85, 102, 133, 137, 25, -34, -4, 5, -53, -11, -98, -13, 65, 51, -30, -160, -20, -107, 3, 141, -112, 74, 5, 21, -58, -49, 77, 94, 215, 28, -58, -125, 76, 81, -35, 76, 21, -35, 6, -16, 51, 17, -138, -77, -6, -29, -38, -95, -183, -67, 14, 20, 50, -83, -121, 60, -84, 103, -59, -26, -1, -129, -127, -63, -19, -163, 33, 120, 163, -138, -206, 1, -48, 59, 41, -19, -64, -90, -30, -122, -112, 55, -16, 4, 29, 58, 36, -59, 14, -68, -57, 70, -55, 224, -118, 51, 68, 134, -49, 48, -124, -144, 74, 43, -14, -38, -48, -53, 10, -70, -45, 97, -38, -2, -52, -31, 29, 115, 43, 14, 78, 145, 101, 73, -13, 15, 78, 133, 81, -27, 144, 17, -124, 38, 35, 50, 16, -115, 15, 26, -37, 31, 184, -58, -36, -48, -142, -18, 160, -47, 31, 51, 25, 11, 77, -3, 11, 207, -236, 36, 174, 14, -31, 120, -73, 53, 53, 33, -184, -31, 96]
5139I6j24O9J12k23j0QK3l1L2j44J84o5M6m0R2j60J15n3L6P3r2M7M4j2j25J09
5165Gj31R5%P3r2q2n0J75Q5o6K8R6j51N6o2nR1R0j12J62p9r6J41j34m1Oj3oj57
5194a72P1J14N3O0j08j88J11J35j20J00n7n6K06j39J35k29L9Q6r4P3k49K69j68
5217a28L1J5J39m6j6J06j92J27n7n0K3J01j24Q8L3k8k69Q1J23J09l3n4n0m8o4
5242a83J85M3j78J71R8j41o5J83o3jj08o3J57K4j36J71j04M3K0k9J10k42J04R2
5266H8L5j90K43q4j63m0M3K41l19K27q9J8m3O2j24j5K03q7k7n4J29o3o3K7J1n1
5292h5J5k6L0J1O8K5K0o5Jn5kop3J73J37m8j35n0J06m9n3N5J43k8j65m9J46J33
5320A74j39l8p5o1J42M4k72L07Q0j91J6kon4J22q8Q7N9j80J45j1j18N3k7j9J28
$$ y = [96, -28, 41, 153, -70, -80, -72, -49, -80, -48, -192, -8, -73, -27, -67, 25, -135, -20, -73, -37, 36, -56, -9, 35, 23, -102, 7, -124, -29, -29, 44, -48, -130, -180, -5, 80, 14, 42, 138, -13, 43, -19, -24, 67, 157, 45, 207, 128, 32, 173, 39, -2, 4, -9, -15, -172, -101, 13, 66, 126, 18, -170, -59, 76, -44, 56, -1, -57, 149, 10, 145, -84, -45, 41, -53, 20, -229, 40, -128, -97, -82, 57, 11, -5, 101, -91, 36, -21, -71, -48, 53, -71, 17, 50, 22, -247, -166, -43, 66, 33, -21, -71, -119, -183, 2, 45, -133, 38, 136, -5, -70, 113, 50, 49, -59, -122, 35, 59, -77, 94, -10, 33, 53, 24, 134, -108, -4, 88, 123, -67, 176, 92, -71, -111, -68, 173, -146, 81, -8, 10, -33, 29, -95, -110, 93, 6, -21, -75, 54, -9, -72, -45, -34, -85, -70, -96, -66, -55, 13, 38, 58, -7, -6, -61, -63, -69, -142, 31, 168, 120, -15, -65, 41, -8, -61, -6, 137, 109, -56, -105, 41, 174, 35, -3, -78, -139, 3, 47, -225, 82, 162, -29, -13, -15, -21, -75, 47, -41, 46, 105, -75, 70, 59, -59, -6, -33, -52, 76]
5346G6k16K60n1M0o6j46J50j11N3N4r6J24K9l0p7MK3K9j13M0J90j40l4M2j95J28
5372c3J23jj29J07p2L0j35J57j3Kj4N9nj35J69r3j02N5j7J44j63Q2J41k22P8j
5398A2o5N4p7M4j8J45j12m7J65l4Q6j75P0j6p5Qm0RR3l6N6p1m8N9J4r0NJ79k4
5427G1Pk01K05p6L7q1R7N8k37J69n8J2p2j4R0j3N0p6k5o9K89j50j19J25k09J56
5453c4J08j75N2j6J37o1l9k6K49k78K8J4J18Jp0k36K35j05J86m4j27J05m0P5k11
5478a54R3J17J34k07j62P9O8J73j38o8Q1On6J03R2k10j54K38q2O7M0q1J0O1p3
5503b3M7j21J25n5J90n2l3q6j52K9K10o1J84k01k5J05k22K47K1j05q9R7Mr2Q4
5528B6j6k1K3N5j59P3J24j8qk13Q2k6P4k3L8j76L04j07n5O9J14j3l33K73j59M9
$$ y = [76, -140, 120, 69, 109, 43, -103, 47, -64, -11, 43, -53, 71, 100, 70, -7, -3, 20, 49, -64, -24, 166, 26, -8, 34, -161, -33, 90, 89, -40, 67, -5, 25, -110, 47, 34, 36, 22, 81, 76, -59, 110, 17, -85, -30, -47, 97, -66, 16, 157, -65, 13, 12, -53, 1, -76, -32, -50, 95, -17, -64, 101, 67, 153, -22, 48, 32, -43, -35, -75, -66, 27, -9, 47, -24, -72, -13, 1, -89, -84, 95, 71, 78, -123, 82, 6, 43, -38, 59, 117, -120, 49, -9, 3, -69, -83, 7, -6, 44, -32, -57, -126, 163, 13, -106, 19, -190, -34, 74, -101, -49, -65, 72, 11, -28, -54, 195, -83, -55, -41, 77, 78, 8, -228, 7, -98, 88, 44, -83, 22, -18, 57, -154, -61, 56, 190, -17, -179, -100, -32, 141, 3, -65, 16, 22, -34, 69, 161, -49, -203, 35, -47, 20, 60, -21, -11, 50, -23, 24, -97, 28, -27, 163, 111, 78, -8, -160, -131, 79, 18, 202, 1, -24, 81, -141, 106, 127, 22, -67, 30, 34, -58, 26, 10, -11, 12, 67, -92, -19, 105, 87, 79, -134, -52, -78, -4, -27, 11, -165, 139, 32, -23, 46, 160, 147, -186, 87, -72, -23]
5554b3rl5K04j96l8J66q3K9r1M7m3J21p2N2%nPj7M5p6J55k67J07r4J05r2l5J75
5582C7K6j95K61n7J6j66K57j8j03J3j76J1J24l3P9q4n2R1P8j01j07L4J66o7Pp7
5608c6J0j93J20K15j94R6k8ON5k03J10J12k3p3Q6M7j8k60J48J20p1j0J22j41o9
5633g2R9o8Q5O4j59J09j51K05l8k8o3n6J78k26M0j4mN8J27j49RQ6J3j23J6J33
5659G1j47j28K32O4j28J22j38Q0j71J25J6j95P1J36j45K72j80K37o6p5M5k26L66
5682B38q8k09J14q0M8O3K5j56j43L35n7j19n8J66j55Q9m1K15j96j10R7j22J42
5705br2K4M1oP9j8N2j53N1qJ0rLO4q1l9J05J13j74J3M8M7j36J38k78K49l9j3O
5734ep5J36j40O0n7N9N1j1No7mJ82j26J3J5l5K6Qj70J13J19j88J51k10K91j57
$$ y = [-23, -32, -67, 137, -59, -97, 69, -14, 15, -76, -29, -72, 49, -23, 29, 29, 24, 31, 14, 59, -17, 138, -129, -22, -116, -11, -103, -138, 37, 63, -132, 129, 72, 88, -78, 179, 161, 58, 71, -105, -94, 30, -3, 76, -8, -60, 31, 109, 8, -99, -65, 101, 34, 41, -36, -26, -219, -99, 116, -78, 18, -10, -4, 51, -152, -42, 70, 47, -26, 60, 107, 89, -171, -23, 97, 26, 16, 138, -3, -72, 27, -41, 44, 108, -51, 58, -93, 112, 74, 46, -17, -73, 105, -121, -81, -95, -99, -41, 86, -63, -54, 32, 45, -78, -62, 71, -76, -204, 28, 92, -36, 86, -52, 28, -143, -18, -2, -197, -126, 10, -135, 137, -43, 194, 128, 53, 98, -128, 238, 150, -59, 55, -25, 23, 86, 111, -45, -188, 147, 90, -29, -87, 79, -76, 13, -28, 187, -9, -119, -22, -144, -2, -94, -70, -29, -35, 44, 26, 78, -75, -24, -32, -22, -31, -28, 36, -45, -84, 21, 134, -40, -27, 21, 68, -68, 70, -208, 41, 2, -11, -5, -80, 56, -84, -24, -81, -22, 29, 18, 23, -44, -48, 134, 8, 21, 36, 1, 27, 35, -135, -22, 97, -91, 60, -150, 141, -16]
5760a6n2O3R7j21m7O3o0J56n2n1P7m5M1l3k9rJ35j16j03J94k05J9L2N4N2r7R3
5787D0q3p6J34L2J08k12K1JQ8L7m3n3P8r0L0o1O0J75k82J19q5J71j46Q9j7O4q0
5814A9k6M7O3p3N7l7J3k04K44k94K34j09l2K33l6k03K44j41J75j90L8j1J4J24
5838A49k73J30K0m8K6M8P7j08m8J42k48J31n6M7L5ok6N9l9J9j10P0l3J04p1n2
5864f1J43j30l3j47K44m8O9k15J42M3j05J61p9Q6J0J17k86P4L0r4K2Q0l5%K9J0
5890B7M3k7p0R1r5R1j36J44k6K6l7K1j6M7j95J51j41J64J8j08J41p9Qn3k9J59
5916A19j14J9r3J03p8J41j76J60p2j26j2Q6P7p5P7j68R4n1J22r0J03q0K68m22
5940a88L96j33j56L4j9Pr2J26J6j10R8R3k30R6m1J46k7L0r5j4K3J10j56J40J9
$$ y = [-16, -68, -5, 92, -29, -76, -13, -73, 83, 31, -20, 57, 12, 53, 20, -9, -18, 117, 1, -102, 92, -113, -94, -62, -8, 44, -53, 40, -43, -119, 15, 47, 155, -57, -36, -35, 53, 90, 47, -6, 72, -18, 12, -49, 11, 186, -96, 23, -62, 109, -37, 52, 35, 99, 19, -7, 40, 103, 30, 87, 50, 63, -141, 103, -191, 43, -66, -98, 135, 99, -104, 140, -1, 174, -16, 22, 11, 25, 149, -124, 6, 26, -22, 4, 52, 129, 21, -27, 115, -133, -2, -58, -11, 24, 18, -8, 51, 12, 31, -79, -9, -42, 62, -9, -61, 82, -48, -81, -228, 16, -32, 37, -178, -36, 7, -98, 63, -16, 70, 80, 197, -89, -15, 15, -79, -57, 23, -12, -12, 17, 27, 70, 43, -27, 64, -31, 60, -76, 68, 42, 68, 31, 52, 36, 83, -112, 39, -102, 62, 80, -28, 113, 34, 42, -11, -40, 119, 5, 24, -69, 34, -44, 97, -79, 81, 9, -117, -129, -43, 34, -41, 36, -132, -38, -89, 33, -57, 46, -34, 234, -188, 208, 75, -81, -47, -66, -59, -151, -25, -9, -119, -21, 72, -158, -62, -103, 43, 16, 46, -49, -63, -40, 70, -86, 54, 73]
5965G3Q0k43J35M0m2J27k19Q7j4R0j20J19j49Ol9J14O8R6k10R0l3j1r1k7Q6n2
5991c9%on2J36j07J68n2j26K6O2m1Q0l6J84j69r8n7J41P6q9J67j54L3N4q8j34
6017a21J38o3o9K37j12l9P2r9N3k9n0M2R5n7pm7M0m0J97j88N6n8n5N6J26l9M3
6044H2j48m5K2Q5kK08l3j39J01j73L3K6J08N0k2o2M9j62J29j75R6j7q1J70j36
6069c6j28J02R4J50j19j73L57k20k1p4K2k0J04k8R4j28J70J12l91K97j73K0K56
6092B67l36N8oP9l3k2J30j9j86J03%j06o8J05N9j4K23l38K32k94R0J57n4L9m0
6117B6k1Kp4LM1J34j39m5M1K41k31K06l09j30J99K7N5J84j85k4N4Nk13K02k6N1
6143G4j08o9K2M1J0PR9j7j05P5j9k8N3mo6m1r8J98J4j53J1J41m1p0R9j77J07J46
$$ y = [73, 153, -90, 45, 85, 43, 170, -49, 38, 24, 114, -6, 113, -36, -30, -69, 45, 113, 209, -1, 89, 56, 45, -46, -73, 13, -39, -39, -45, -97, 39, -68, 100, 48, -78, -52, 10, -31, 49, 13, 197, 28, -70, -127, 14, 90, 1, 168, 14, 47, 101, 13, -121, 17, -46, -115, 122, 10, -29, 43, -56, -3, -32, -82, -40, 55, -2, -9, -56, -16, -56, 141, -47, 9, -49, -104, -48, 78, 39, 82, -66, -111, -89, -4, -6, 202, 169, 30, 131, -42, -9, 17, 125, 175, 153, 91, 140, -22, 107, -68, 28, 11, -70, 100, -36, -164, -62, 32, 182, 63, -110, 247, 27, 6, -68, -46, -66, 38, 10, 104, -24, 146, 258, -133, 164, -9, 11, 267, -69, -11, -17, 62, 29, 7, 137, 118, -68, 35, 35, -71, -139, -34, 25, 11, 234, -104, 128, -166, -76, 81, 27, 66, 26, 5, 7, -67, -64, -23, 111, -28, -73, -32, 209, -22, 184, -125, -255, -56, -29, 26, 210, 25, 1, 55, 60, -153, 49, 23, 74, -34, -103, -81, -40, -30, -23, 76, 59, -46, 29, 10, -18, 35, 31, -35, -76, -174, 24, 38, -115, -104, 37, -4, -74, 25, -152, -45, 101]
6171A01j14l3J00r3L6J11j87J04Q4r1Q1j83L34l17Q5R6j22P0k8k3o7P9K1P0j10
6196Dp3R3O8N0k17j5j6J48r9P2o1n3K08j81J63k8k9j8m3J53Jj18J0L8k9o6M6J29
6224A37k81J90j62jQ0m3k1J39Q1k54K86j33L3n6L7n7J2J00K6k4n6p5K18k29J39
6249H6l3k3J6n2J4L9p6jj76J72N8k03K28J2Q4n1j45R3q2J9N8o5k39K71J58K9j50
6276D1m0m3K7o1L5J74r7L0q1rJ33o3j37J06j20O0k0N3K5J44j34k2p6R0P1p3j16
6303a03J99Kj5n7j30L4R9q5JJ4jL13k17k07J34k1j2J8Rj8j38K63l08L28j39J8
6329a9J3j44M02l24k8J0J02l4P2p6N2K0J09p3j61L6L8o7R5L0oj33M7o0J46j6q9
6356e8M7LJ79k82J13K6o0L8pK1N9o2J7J16k46m0J51P3k33J56j01J71j54J77j86
$$ y = [101, -13, -46, 54, -39, -3, 108, -79, 25, 109, 18, 99, -84, 250, -67, 18, 114, -8, 62, 34, 11, -56, 23, 44, 114, 4, -69, 24, 92, 142, -75, -90, -106, 42, -57, 15, -46, -99, 109, -72, 91, 63, 34, 16, -27, 126, 127, 9, 19, 57, 28, -38, 8, 137, -144, 46, -116, -117, -37, -80, -101, 38, 119, -135, 151, 18, 51, -5, 32, -25, -13, 87, 113, 89, 33, -42, 176, -53, 86, 53, 30, 46, -6, 8, 47, -29, -30, -206, -34, 24, -179, 49, 61, 145, 94, -51, 42, -40, -21, 37, -28, -267, 4, 162, 191, 41, 1, -42, -15, -76, -41, 133, 36, 66, -15, -24, 109, 46, -91, 15, -105, -45, -65, -12, 13, 157, 23, 1, -75, 15, 86, 13, -103, 96, 98, 83, 26, -104, -70, 29, -56, -55, -41, -42, 271, 54, -153, -19, -40, -52, -34, -25, -43, -181, 82, -226, 102, -37, -19, -6, -150, 252, -72, -100, -90, 12, -22, 50, -26, 26, 46, 155, 82, -79, -43, -5, -72, 23, 53, 47, -86, -39, -99, 47, 31, -58, -11, -8, 171, -111, 2, 28, -32, 6, -1, 20, 79, 17, 34, 150, -96, -136, 15, 88, -145, 11, -90, 81, -73, 104, -82]
6381h2J08p1j8j4P3R8j90J49j48Q5Mk1J76j91Q4n6M1j8K2J11o6p1O4J0L6j21m7
6408e3R3J22n1r0j09QQ2J33l6m4l6j6J6q3RJ03J07p9k04K0N8J95j12k32N3Q7K8
6435c1Q5k9L6MJ55k40qJ36j39K2O1m6k2K26l06J02L9j03Q2K9k07J16L0J02j59
6460f5Lm7L6mK9L2M4J88j92Q1j37N0J26k38J84Jo6k5j8K24j61k8J49j71q3J07
6486A9k9N1j47L1P6o1M0L6J8M8j39J08j98MO1q5K60m2J28l04J95j39J3Q8r9J14
6512D7r1j0l7l2J37j41J59r4k1J08o3R7qR1k29K44j32k7J37j23j52L84j67qj09
6537d0M3m7k13J54J30j7o5O1j9m3n8J01j08J83m2j2j04j2J81j00J43j51J63k81
6561a53J00O4P2o7j36J24M0m6n2J8J2p7K89k13k8L8k23K10J14k09J12%O2j10o
$$ y = [-82, 26, -45, -63, -77, -4, 94, -96, 53, -95, -10, -6, -27, 149, -42, 42, -14, 27, 9, 31, 142, 76, 5, 69, 79, 115, -6, -53, 40, 162, 111, 21, -88, -80, 2, 135, 99, 55, 19, 3, 19, -64, -55, 48, 155, 76, -128, -108, -50, 145, 33, -199, -146, -59, -31, 54, 25, 61, 65, 220, -20, -28, 108, -31, -9, 52, 6, -16, 210, -96, 6, 45, -58, 24, 53, -154, -38, -8, 94, -65, -62, -109, -73, -77, -48, -16, 28, 216, 24, 105, -32, 18, 144, -94, 90, 91, 25, 0, -18, 206, 45, 17, 166, -5, -88, 19, -10, 41, -106, -75, 1, -60, -20, 16, 34, 82, -57, 51, -147, -143, -82, -167, 93, 51, 179, -125, 70, -69, -56, 32, -67, 47, -44, -54, -91, -123, 14, -127, 32, -62, -83, 25, -38, 59, 51, 142, -87, 157, 25, -2, 135, 12, -140, 244, 77, 69, -40, 3, -44, -257, -103, 27, 10, -55, 6, -13, -56, -114, -13, -121, 62, 20, 8, -96, -108, 73, -27, 116, -35, 128, -153, -53, 11, 83, 16, -120, 4, 44, -2, -54, -36, -24, -101, 188, -25, -53, -15, -238, -28, 86, -123, -11, -11, 51, -59, -65]
6586f5P5K9j08J76l4o0j5j33J10k49O1K57q6o5N8J56p8j41J18o8J76j01J07k64
6610a44J44r6J57n5P2j24P3J20j17qMN5j1j55K4J22L6N4l56N4J28R1p4k0k5k0
6636g1J42j30k2J10q1M7o2N1O0l7J78j44J23k9k61J38m7J55k27J06J91j83m1q
6660d2O1j7J7j09m1J81l1r4o9R8l2O2J08p7m5q5K33j71k6J72J37j34j23O8o7n0
6686g6J14R8k31l2L93j56j00j30J76JJ5j52N4J8n6K50j52p8p1J70j5N3q5j64J44
6711a2K9l9n0O7JJ41j31O4n0j66J09M0Q0N7j81n3J54N3p0J5m6O9j06R5m7j9m9
6738d5M2k3K2J9O7j8n8j6j4j36R5Q8j23O8K4POo1l1L2O3p5J11Q3k71K71o9k82
6766b24J70P3K1k9k08K33l1O7j07Q7j07L0J14j26Q1j4O1j45j75K09O7q3M2p7K74
$$ y = [-65, 10, 39, -69, 107, 73, 13, -2, -135, -25, -274, -213, 44, -42, -107, -49, 107, 29, -112, 6, -62, 114, 13, 120, -144, 0, -96, 61, 6, 78, -46, 27, 147, 30, 22, 26, 81, 70, -85, -61, 61, 97, 151, -205, -151, -23, 68, -6, -26, -51, -71, 71, -59, -81, 29, -52, -5, -67, -16, 44, 7, 185, 41, 164, 135, -126, 12, -35, 120, -107, -1, 190, 7, -34, -42, 19, 2, 19, -90, -131, 50, 19, -75, -144, -46, -78, -16, 92, 15, -30, -115, 118, -53, -79, 93, 230, 96, -27, 41, -26, -76, 38, 136, -95, -127, 266, 110, 10, -120, 56, 57, 72, -80, -26, -8, -64, 186, 34, -44, -115, 55, 40, 93, 8, -156, -12, 17, -22, -72, -5, -4, 137, 6, 70, 20, -146, -37, 3, 83, 140, -41, -94, 60, 113, 43, 58, 12, 81, -25, 70, 23, 4, -45, -3, -26, -4, 15, 82, 64, 6, -10, -24, -160, -65, 23, -100, -32, -8, -1, 5, -56, -87, -55, 8, -67, 44, 127, -144, 127, 58, -224, -54, 19, 40, 11, -197, 36, 5, 72, -35, 52, -55, -25, 89, -37, 44, 30, 91, -54, -229, -20, 47, -36, 6, -71, 203]
6791B03j03j10j16J22j42K8N4Q5o1J8j14J71r2k8M5lL7Q5J3J7m5O8o6l21L24J39
6817B08j06oQ4j77o7N8J75qk83J43j2%m1Q7J14j18M3J42k73j3QJ21l13K09R3j62
6843i4J31mj0j64p0K64j25P8P3m1k9M0p5J23k04K52nl6j52J52j34L0k9K35l5j05
6869F6j12J34j4m6qQj9P7j66J96k40P2L0r2J11q6J13j30Q1K51l17k4O7J96j70
6894b2J03j35O0l6K4j1j5R7q0L3q0J5O2M0k36O8n3K23p6n1J8K8J84q2j11J08j76
6921a01%J08j35J08kL2L8J09k6r4j5pr7J9J5J60k37J87lOp4j06P8j3K7Q6p5K9
6949A7k4j0r8J56k04J00J7P7R5j15Q4lj39K56j41n2Q0n2M8j25J03j60J14n7O5
6974C2j45J41j11J35j03O3J44j58K1K9R3j23J14j48J29r0r4p7P4J16k4j6n8J25
$$ y = [203, 100, -10, -126, -4, -146, -118, -64, 21, -40, -22, -136, 35, -57, -85, -40, -43, -6, 79, 92, 109, 64, 132, 66, -255, 69, 208, 102, 96, 180, 3, -64, -6, 169, 161, -122, 21, 9, 9, -32, 55, 169, 51, 94, 236, -37, -50, -42, 79, -234, -25, 68, -94, 37, 33, 23, -141, -211, 53, -72, 6, 79, 38, 9, 49, -26, 97, -107, 145, 140, 104, -48, 104, -30, 0, -29, 206, 171, 66, -46, 88, 74, 28, 20, 28, 9, 86, -80, 116, -124, -52, -22, -114, -3, -89, 24, -106, -25, 226, -91, -115, -48, 148, -22, 81, -54, 6, -30, -6, -17, -32, 65, -15, 18, -62, -47, 15, 55, -181, -113, -166, 57, -19, -70, -52, -24, 160, 78, -33, 75, -101, -101, 7, -128, -20, -22, 10, 48, 157, 131, 37, 22, 15, -82, -63, -48, 112, -125, 62, 59, 65, -9, -115, -37, -50, -23, 63, -12, 17, -7, -17, -115, 41, -163, -63, -46, 31, 126, 11, 95, 92, -47, 209, 68, 16, 96, 44, 92, -33, 70, -90, 24, -33, 32, -113, 28, -83, 52, -51, 12, 156, -2, 19, 48, 141, 18, 132, -16, 113, 23, -71, -148, -74, 42, 18, 2, -56, 69]
6998F9J7n7m6J04Rj28j07Q6K68j40o9J46j68Q7m5l3K4l7k1R8o0O2l7r5J27P7r
7025A22j79L9R1n4J28k40J64J05j23k3j0K9r5M5rJ6M8J19k04J13j86O4RO9r8n8
7051a18L11j78jL0j01L8k9J00J34k27oJ54Jj12k07N6J67J87k39JJ74r8J32j48
7075B1Q1q1l6o5J60P0j41m4L12p6k52J21k4o9O3m3J4j3p2P0N0k90L47oqj22L0
7102cQP9Qj23j20J08l9J43Q0r0K2n8l1M2N9p3q3R5K4P2r4J6q6OO4n7J50j20j39
7131a40K18o8jo1J46j93O6pJJ39r2K1o1N0k06K30l4p8q7J47k1M0l2J10k1j28J29
7158F7K7k33J77q3J20j27P9j38J34N5j89J52J40k97O5N1j20R5Qo8jJ20pp4k9o9
7184a45P4J86k58K51j01p7J8p0K24j53j83L66j11j40J29K3N3k67K9P0K65j17j25
$$ y = [69, 86, 29, -17, 87, 96, -32, -139, -53, 215, 75, 6, 152, -16, 71, 26, -7, 17, -20, -41, 57, -3, 59, 22, -73, 54, 131, 122, -57, -18, 73, 19, 147, -93, 71, 176, 53, 30, 20, 49, -46, -1, -10, 6, 54, 173, -31, 82, -104, -40, -31, 38, -60, -118, 193, 15, 14, 44, -57, -19, -48, 52, 186, -41, -47, 107, 108, -4, -211, -155, 12, 199, -40, -39, 135, 37, 169, 21, 102, 21, -15, -80, 80, 150, 9, -35, 277, 201, -51, 70, 46, -23, 40, -3, 11, -2, -74, -4, 46, -244, 103, 97, 89, -33, -3, 5, 84, 92, -31, -151, -43, -82, 61, 141, 51, 73, 15, -16, 26, 85, 12, -71, 24, 48, 120, 26, 42, -44, -38, 26, -31, 119, -1, -140, 78, 10, 9, -52, 94, -99, -33, -40, -39, 100, 8, 29, -32, 18, -188, 42, 8, -70, -157, -10, -31, 9, -23, 87, 66, -62, 67, 94, -139, 38, -45, 75, -52, 27, -111, 23, 78, -111, 41, 181, -116, -51, 0, -120, -25, -17, -85, -86, 34, 27, -47, -76, -145, -71, 115, -143, 108, 7, -70, -52, -122, 102, -51, -234, 132, 21, -119, 10, 33, 86, -181, -152, -82, 183, 66, -59]
7207e9J60kk91J68Qk0J38l4j77K36j31q4K5J14q5q5J58M9q9m8jo6J44r5p5K80
7233A38j53J1J66p3o5NP7o4JJ13j90L6J50k19J20r3J34j43M9o9m1O9k1m5K34j71
7259d4J00q0n8J07j34K08j58M4O8R1j3j93L5n2M7p1P5J17j24L8K2j53J47K9m6
7284BJ15j35O5K5p3Q4m4K1orL3k25J70p4J12j08J30o8j46Q6j45J04Q5o9K07k6
7310A11j64J08j69J76k7n3J33j44m1L4P3Pj40K31k67L5O9rN6Qo8P1K83k99lO1
7336G2j18L1J00O4k65J65o4N1j02L7Mj31J26l5N4N5j15Oo3J23J6JQ6j37r9N1L2
7363e5k6J60q1oj6K7Q7k9l7k3R7j3m2O5j36O8j01J29J7k21K7J98N3l67K55J4M4
7390H8m5j16O4J03r2k3L5j1p1qK5m3j8r2J71J03j38J54n9q1L1O9j29J46Q9k11
$$ y = [-59, 101, 99, -192, -24, -16, -36, 102, 68, -109, 127, -4, -88, -63, 51, -34, -119, 39, 88, -1, -49, -50, -116, 28, -67, -142, 138, -15, -4, 162, 89, 24, 29, 106, 42, 43, 156, -34, 2, 152, -67, 53, -40, 94, -49, 0, -69, -110, -41, -62, -107, 127, -44, 56, -24, -82, 25, -109, 99, -59, -15, 53, 144, 131, -62, -27, -79, -32, -103, -28, 89, -35, 3, 25, -128, 19, 48, 2, 117, -18, 47, 72, -1, 83, 39, 60, 54, 45, 78, -147, 23, -51, 61, -47, 83, 15, -131, -45, -190, -86, -1, -70, 137, 111, -53, 55, -114, 62, 35, -18, 115, -29, -70, -36, 37, 44, -96, 135, -132, -97, -28, -37, 19, 27, -41, 30, 313, 14, 11, 72, -46, -15, 85, 149, -116, 49, -15, 36, -66, -29, -25, -156, -30, -65, -11, 44, -71, -65, -128, -5, 11, 12, 98, -39, -138, -87, -55, -81, 79, -2, -8, -24, 3, 90, 61, 24, 1, 98, 85, 43, 108, -28, 40, -61, 68, 85, -136, -109, 89, 142, -225, 30, 44, 88, 43, -73, -9, 94, 2, -21, 14, 3, -68, -76, -51, -94, -112, -204, -33, 70, -68, 86, 27, -54, -23, 46, -83, 63, 152, -59]
7416e9o8J37k7j3R9M4r2j16Q4J02j36J67k20L7L6o9L4K20j35m3J46j99K1k9Q0
7441Ak16L17j12J3J1j11j36J67J69o2j4J08j89m8J06l7l5J33j09K5O5k30J43J06
7465F5K5Q5j81Q7j04o0J36ljp8L5p8J11N3j13j0M6j46P7J0j85K28N1L7P4r6k0
7492D5J1j33J17j32J29K7k04J64Pj3n4P4%%o9J46k31k7M9Q7O2K2K0o1o9J83j43
7519GP2o2K05k15p9K11j19L1K5k03J96q0J93Lk43J03k5O3qM2j16J12n0P4j47N
7545ej42L12r1r5O6m2r9o5J84j49J17J14j28M0J0j41K42j15p6P5Q9n1k3k3M3L0
7571G7J3q4L1k0kJ10q2P2k07J82o5jp5M4M3r4N7O7R9k18Q4K8o5L3k1K2k7j33M6
7600h6NJ26j2M6j05K6j41K16p5QR1j46R3o5N0r9O7J3K9J05k83R5L8K9l8o9K08
$$ y = [-59, -127, 10, -17, -30, 69, 113, 21, -95, -11, 91, -45, 122, -98, -61, -25, -94, -60, 160, 25, -18, 128, -71, -50, -79, 1, -215, 102, -10, 3, 14, -97, -233, -66, 103, 41, 27, 135, -54, -102, 4, -33, -68, 65, -44, -19, 46, -184, -41, 65, 90, 175, -6, 81, -23, -83, 53, 50, 49, -29, 6, -72, 39, 92, -21, -31, 15, -131, -54, -44, -229, -1, 50, 87, 161, 65, 45, 56, -77, 40, -92, 37, 64, -140, 24, 31, 18, -36, 38, 38, 38, -31, 115, -116, -143, -94, -7, 55, 77, 97, 36, -33, 150, 7, 79, 17, 222, 7, -72, 139, 20, 51, 76, -127, 69, -11, 182, 185, -58, 45, 20, 83, 75, 117, 1, 113, 63, 137, -10, -5, -147, 165, 74, -21, 45, 3, -96, -161, 23, -126, -9, 105, -23, 17, 27, -114, 128, 13, -63, 12, 101, 50, 27, 4, 47, 77, 90, 6, 37, 17, 15, 125, 43, 115, -92, 90, 25, 24, -51, -7, 36, -58, -1, 66, 165, -53, 31, 59, -6, 27, 6, 28, 1, -132, -86, -81, 45, 33, 79, -26, 0, -141, 75, 0, 8, 99, -47, 46, -19, 31, -68, -1, 12, 41, 146, -137, -42, -4, 25, -13, -82, 126]
7627A26o3j16J93j61O8N3j43N7M7r6J20n9j81K05J51k17rL1Km5Q9k8Pm7K0j7M3
7654C0j0mOm8M6Q5o4n1K17o5l0k3q5J12j06J18j35p7J57L3q4j71K54j18M5k2l3
7681b3p1J14j17R5M9j47J84k02J71n7j14J44n7J03j58J22N8q4k4R4o4r2P4P5k05
7706a32K13j42K29n1o0o5m8N5m4K2O3k7K8J6j54J93j29P2o5jJ49r0r4l6R9q9K28
7733A40k93O4O4j9J63j95J84j49J13jN5p5Rk0k08K01l4N1P2j90N5M6K6P5k72J67
7759B9k1j7j4M2k32J61K12k96J07j8K3N9p2L7kO4q6K3N4k50J39M0J7k3J75k65
7785a14J36N9j29kJ44J9r4p9J43j21n3J84j73LJ25J6j20J05L2P1k20JJ14P3j23
7810cM4L4q0r6R6O8RJ6j14N9kj60L34j16Lj31p8J38j32K29nr3k3l8M7q2P2l8K30
$$ y = [126, 63, -53, 140, -21, 47, 100, -43, 14, 61, -35, 85, 26, -155, 50, 201, -16, -25, 6, 8, -37, 52, 24, 31, -16, 4, -13, 30, 20, 16, 22, -26, 20, 105, 41, -10, 207, 142, 112, 89, 4, 116, 10, 128, -7, -84, 73, 106, 22, -149, 105, -13, 32, 10, -23, -94, 20, -97, -2, 47, -100, 84, -118, 53, -4, -118, 26, -31, 72, -86, 36, 94, 10, -14, 80, 16, -76, -2, 73, -132, 81, -61, 168, 117, 57, -8, -56, -1, -45, -23, 40, 13, 41, 57, -97, 96, -33, 39, -26, -27, 122, 32, -62, -98, 1, -88, 140, -153, -89, -25, -44, 119, -76, 108, -41, 72, 71, 126, 51, 60, 40, -168, 33, -1, 50, 122, -68, -13, 33, 59, 134, -138, 29, 8, -9, -23, 19, -213, -52, 160, -136, -29, -47, -24, 35, -37, 0, -2, 62, -24, -1, 53, -197, -58, -18, -1, -24, 151, -114, 22, 81, -48, -50, 94, 113, 19, -60, 83, -38, -91, 93, -80, -77, 48, 64, -56, 49, 81, 152, -68, -67, 47, 120, -3, 41, 75, -5, -101, -5, 63, 72, 88, -26, 33, 31, -129, 205, 89, 92, -39, -117, 21, -111, 118, 113, 20, -3, -41, 6, -76, -4, -42, 188]
7839A88r6J00o7o2M1p4J4J44m0j06l9m5l1K12j51j05J90K1j98J01L5j07l6J51
7863D0J16k13L6J17q9p0l3O2L5q1Q6K6j0j26J16M9j08K39k30k5M7n6P8l9p8R0
7889b1q2P6J32m8j48K53j14l0l5p2j13J31J59j45n4R5N9R0k1j18J07j02r6KJ15
7914B0J4j31J13k9O7k2M4j16N9q0J84j83J38l6K0j00J54j71Q9Oj26J39L6j98P0
7939c9P9j30J67qj4n8J32k07K5J12n2n2K7R8j05m4J72j54J21k83K05k0k13J75
7963f6K6l6Q1P9J22k57QR2r8J22J62l03J84j10l1m5K02j31M5j10N3Kj37NJ96j78
7989a23J19O2j06J28Rk03J78K7j23R7j7q0RJ16q9L1n9K66j89m0P5k1k3o2m9oQ9
8016A6jj3j7mj0l6Q5L8j03L4j67R6K03j35l6N3r9J16p6O7j2M5mq0N2K42k02n7
$$ y = [188, 92, 192, 125, 63, 104, 30, 44, 188, 148, 42, 3, -42, -73, 139, -12, -117, 73, 94, -104, -3, 32, -75, -111, 40, 156, -57, -21, 96, 7, -63, -96, -34, 1, -80, 6, 32, 22, -104, 12, 61, -47, 192, -38, -63, -16, -72, 6, -33, -111, -21, -103, -27, 105, 57, -91, 162, 48, 18, -17, -89, -202, -71, 88, -57, -111, -16, 43, 133, 112, -6, 101, -1, -97, -95, 20, 34, -97, 16, -13, 54, 32, 76, -40, 19, -61, 123, -60, 78, 42, 62, -38, 116, -55, 34, 40, -86, 53, 89, -109, -39, 40, -90, 77, 69, 55, -3, 129, -78, -53, 59, 7, -45, -18, 80, -25, -69, 103, -51, 70, -213, -8, -28, -241, -66, -40, -76, 5, 84, 206, -51, -43, 49, -49, 73, 235, -68, 116, 6, -25, -70, 132, 1, 46, -64, -11, -9, -146, -141, 55, -123, -4, 58, -48, 80, 89, -114, 64, 91, -32, 65, 48, -32, -23, 93, 4, 35, -24, 242, 53, 13, 88, 67, 44, -18, -67, -73, 16, 15, 2, -15, -19, -29, -65, 20, 58, -45, -11, -178, -82, 121, -14, -50, 3, -96, 20, -56, 11, -1, 44, 40, -40, 12, 254, 52, -5]
8044eO5j32J31q2J11j11L7K7m1l2k5L0J19j78J45j01L4M9k5L5m2n9p5L10k86l4
8070a35K36j62R1M7r6m4J81j76J32j04K9O7J18k40J45j34J64o4j11K53k78L1K05
8093A55k27J96k5J6j6rNj34K3L4l5M0R1j5k0l6j94J88p7O8l4q9J14j8j2Q0L6J10
8121B15j28j46P2m9P5jj05J34j00L6j11J74n7L2J7n4o7J26nj2j8m0n2rj16J08
8147h1J27p0l1Q7P4R3l18J2J45j08K5q2K19j07pJ40j14j14J59l1j07K13j57r1
8171a24J96j04m2J17j10J69j01Mm5J29m0o7o5J7J60lj49R5o5P6
$$ y = [-5, 60, -72, 59, -23, 88, -23, 14, 41, 0, -32, -57, -27, 92, -86, 59, -42, -8, 41, 16, 51, 9, -50, -125, 185, -101, -135, 101, -61, 30, 77, -19, -63, 118, -58, 74, -30, -1, 66, 184, -56, 89, -45, 119, 55, -56, 197, -81, -50, 155, -72, 124, 99, 115, 99, 90, 95, -39, -16, 18, -17, 23, 114, 99, 79, 43, -151, 37, -40, 28, -6, -95, 19, 1, -11, 69, 105, 215, 87, -59, 13, -36, 39, 38, -67, 67, -33, 3, -108, 66, 9, 41, 58, 4, -63, 63, 58, 46, 28, -12, -64, -73, -189, -81, 46, -24, -55, 32, 106, 199, -119, -107, 38, -70, -45, -127, 92, -15, -22, 118, 4, -110, 49, 18, -89, 124, -33, -124, 72, -32, -74, 43, -67, 102, 1, 5, -40, 89, 49, -18, -83, -66, 94, 91, -58, 37, -28, 48]
8191D8
$$ Imaginary data points
##PAGE= N=2
##DATA TABLE= (X++(I..I)), XYDATA
0@%%%%%%%%%%%%%%%%%%%qJ6j6J6j6J6k4L2l2L2m0M8n5O3p1P9q8J02j10J20j36
40g2J52j68J87k10K31k54K82l10L41l77M14m56N04n56O15o81P56q43R46j066J211
61F46j391J621j923K339k955L955n842J0577m2134p8134J25312P7071q1806o6079
75e8743N8240L9664l8235k6055K5455J4197k145J212j5949l1721J9511N4911n494
88C4848o3772r116N0731J1014l5942k798K5369m437j7416O250J689p428K0047
101I039J9399l4846l4181L5100M2799k3209l4122J4212J8543j2070o262J1475
113E877J467n925L306m978j6584R860L1170o688m0383J28L7887l321l2695J5337
127e542L1980k8314l5516L5309L6094l5460k8766L8483K0341m2426j6250M5237
$$ y = [0, 0, 0, 0, 0, 0, 0, 0, 0, 0, 0, 0, 0, 0, 0, 0, 0, 0, 0, 0, -8, 8, -8, 8, -8, 8, -16, 16, -16, 16, -24, 24, -31, 32, -39, 40, -48, 54, -56, 64, -72, 80, -88, 99, -111, 120, -134, 148, -162, 179, -198, 216, -240, 264, -292, 323, -358, 398, -445, 501, -565, 646, -745, 876, -1047, 1292, -1663, 2292, -3550, 7027, -35107, -113241, 12071, 89142, 7336, -58743, -503, 39161, 926, -25129, 326, 14523, 12378, 13590, -2359, -34080, -14569, 40342, 34848, -28924, -38040, 12691, 23705, -12237, -15035, 10334, 5897, -11519, -5269, -3580, -11008, 9039, 28438, -6408, -40589, -5489, 37310, 14101, -20021, -5809, 12734, 664, -5598, 5877, 7344, 1419, 4725, -253, -16837, -6977, 24193, 17505, -22878, -22750, 15137, 11816, -20879, -5542, 26438, -1876, -37392, -2083, 34011, -1449, -30215, 8268, 28609, -13817, -30067, 15170]
139A5170J8327l7730j7992K3819J1015j2098K10O506r129n162J1155k54j3743
152i906P531J9124j3919k7257J3463L0213j0527k4999J0606J5833j4887q277J9463
165F461O144j7687k190J2370l278p206J0091P132j2060p806R052M674n917R15
179F95N863o563r253P285Q844p532m984R755j739j5789N602K1071o703k2234R236
194f446K0807j3060j9154J7830K0750j7309k0649J2741J8047o245j1243K391M628
207C088j055r86p50k604L153P023n968j4572M214J9854j171k1206j440J8364L10
222F254j4696L011J2334m578q594M875L697m555L096P215o215r983O045J1283
236I189l433q885J346N500j793l809J979J708j780M64nn307j375J0005L968j3056
$$ y = [15170, 33497, -4233, -22225, 1594, 12609, 511, 721, 7227, -1902, -7064, 4091, 3837, -9906, -2375, 16749, 2830, -24427, -10964, 19249, 8722, -16277, -5671, 10162, -4725, -13002, 6461, 12605, -5082, -7272, 5098, 1820, -5386, 4705, 11837, -223, -8029, 1023, 5697, -220, 695, 6558, -5, -9258, -1973, 6871, -661, -5645, 4110, 2371, -13418, -7816, 13255, 6552, -15682, -6446, 14361, 1301, -17853, -23, 20727, 3418, -17231, -4490, 13557, 7312, -3931, -1540, 3088, 2033, 1047, 297, -2307, 846, 7869, 1901, -12671, -8457, 11397, 10226, -10980, -12420, 5944, 6254, -8442, -5431, 6903, 2325, -6269, -1394, 2303, -2252, 844, 8059, 1844, -8139, -2094, 9189, 5756, -3129, -1783, 3717, 1924, -1885, 94, 1802, 22, 486, 481, -4826, -6201, 3804, 7772, -5284]
252e284o278J2975O374j1627l748J1261J917j0037m22Q073P71l598R93L05l131
267a456R41M902l68m964n00L245n05l274J798L162l293l894L119K103l969O54
283b299N753l344p668M289Q665l725p074M593N374m312m060M372M137k472k450
298b21l7N16J326J291r30k795n44K703K45l782J26M444n83o358J32O118m6m787
316c182J265K792k845q08M197Q79l732N49L007j237k098K371K209j721k060M60
332D6J293J74p81M8m23j397J87J413n83j887J083J556k878j746L903J836l657
349a813j102L274J10j975J365K033j217r58Q01M69k2Q82p7j157n56K54R50q2j454
368b75j59P99m97j850J010J787j348j287P84j05r12J770J220k108j366K909J166
$$ y = [-5284, -11562, 1413, 7787, -3840, -7588, 3673, 5590, -4447, -4869, 3204, 3975, 377, 1370, 1675, -1456, -515, 4387, 4019, -945, -1445, 1800, 1295, -1979, -181, 2981, -312, -4206, -1087, 1016, -2953, -2299, 3454, 110, -7558, -3269, 5396, 1671, -5403, -810, 4564, 252, -3808, 564, 4701, 2229, -221, -258, 258, 1584, 2875, 1945, -850, -1394, 1309, 1554, -2228, -2102, 2342, 1759, -4599, -4467, 1651, 1605, -3182, -1917, 875, -1970, -2778, 1419, 2298, -1434, -885, 2122, 885, -1213, 1158, 3367, 1646, -414, 46, 1339, 1513, 732, 780, 357, -1040, -853, 560, -23, -1910, -827, 729, -2149, -3895, 8, 1844, -1813, -2915, 359, 469, -1506, -141, 1892, 675, -283, 518, 987, 965, 1847, 1770, 613, 57, 311, 1261, 1179, -275, -434, 365, -132, -1982, -972, 815, -533, -1820, -1036, -1141, -2053, -283, 937, -1171, -2537, 372, 1538]
385A538j833n36J700R61m19j423o28J766K047j285l251K09K538R90k040k457O76
402a447L044k94m351m83M408J161l878j759K266K058J73j171j692O63K870M80
418B048k472n08K148J195r47j940l42K605J505k705k624J836K257j300j531N3
434g22km4M28m27q64M53R51P1o85q87N20J987J112k367j642K658J983j449j163
453h9O04Q9O77P42j055k162Q34K997l21m134j825M022M055m080o650K622P852
470D178j127p884n26P060K181n150k834K705L820L29k901k398J629M114O92l742
486A46l372K659N231n89p016j252P123K805p227m450N445M755l186m970O79L807
502E88R71k321j827J007J777K45l3r17j200J957L151k027m091J947M864j119n113
$$ y = [1538, -295, -831, 869, 1830, 1411, -12, -640, 1126, 3173, 1888, -1363, -1154, 1384, 2374, 334, -2123, -1447, 1597, 1303, -3048, -3531, 877, 2038, -1840, -3599, -1333, 725, 898, -273, -1965, -1302, 1568, 2048, -424, -932, 1216, 2411, 1464, -476, -818, 1787, 3292, 587, -2037, -201, 2056, 756, -775, -722, -724, -768, -340, -767, -1631, -1178, -227, -156, -841, -1728, -1208, 779, 1891, -476, -2118, 540, 2523, 1074, -89, 515, 604, 1281, 2023, 968, -1194, -360, 2637, 2316, -1818, -3643, 379, 4434, 354, -6296, -3674, 4178, 3051, -4833, -5359, 1701, 3882, -1268, -4102, -1397, 2423, 2752, -149, -2547, -918, 3196, 3888, 146, -3226, -567, 4664, 4075, -2941, -4193, 2930, 5735, -1492, -5942, -497, 4258, 1072, -3898, -3219, 588, 1559, -762, -2589, -1582, 195, 440, 407, -510, -1710, 247, 3398, 1371, -2720, -773, 4091, 2972, -2141]
519b141Q43M364n91m032K85L560r85l846O71M430j535n652K003O133j790p206
535e489J716P304n76o582K0N230R58k612r66Q80Q53J066K8j528k017K315L712
552D312j613o444M50P457N68p943k588O925L592n547m250K874M403m19l839j435
568c497K745K680q66k363l54J173K564Q79l520k207L497M233l125n292J955N886
584D388r24n942o99N238J524m936k321L826K191l825j615L700M23l766N50M026
600A838j072l483J445L445p87k643P45J977j68r30J36O6l95M88J452r22k969Q64
618i13L563r42m612L60M551J62m245j108K728J964j413k117k05J979J963j340
634C75k355O60K658P71j664j761O93K626R79l001k282K614L129j619l841k47L755
$$ y = [-2141, -1298, 3066, 2475, -1557, -1272, 2288, 1303, -2543, -1872, 2558, 1023, -4629, -2626, 3507, 1717, -5489, -3773, 3531, 2955, -3627, -3607, 1623, 2581, -31, -997, -117, 736, 1802, 1830, 302, -1715, 600, 4312, 2699, -3745, -3295, 4162, 4730, -3213, -5801, 1124, 4716, -831, -5081, -2207, 2196, 1777, -2062, -3497, -752, 1928, 1062, -1301, -1655, -482, 2082, 2961, -559, -2766, 731, 4964, 1839, -3453, -1498, 4388, 3464, -2478, -3177, 2061, 3585, -1351, -3672, 154, 2345, -1480, -3095, 605, 1028, -2738, -2188, 1838, 766, -2717, -1272, 2173, 1386, -1257, -512, 1465, 1297, 367, 503, 569, 174, 662, 2114, 1192, -1777, -913, 2650, 1708, -2904, -2544, 2007, 2169, -2076, -3184, -456, 1508, 95, -2022, -2227, -248, 1715, 375, -1980, -1320, 1338, 2109, 445, -1316, -623, 2003, 2982, -19, -2301, 313, 3442, 1823, -2018, -2265, 1490]
651A490J353l742k811L077L283k641l503J740L034p41j925J73P83M07O23l21j122
668h43M57J501K85j550k50J389P23j230p55P44N31n31o94M87j30q06L70N87j162
687h77o10J467M13j702k16J420K05q17K60K71J91L66o3l07L87M69m32O1K51J49
707H86l58r5l2q1Q1n17p0L77k20p97K3R82o06j054Q24R21r93n93J161L25l71j33
729c40M53J86L40l60l8K93M08j85o45L65M84k92l08o14J32J109o69j305K36J149
749C99n17j191O51N70n02j82M75K3l52N17J47j70K29L84k35J55N4p1J08J99n4
770F37k26K6j9j08R0m82m56L98M35q05n23P95K15p64PM32l61K55K61l7j19L60
792A1M29m39J78L69N3j24J12j80K12K29l06k51mJ5k78J31j77n60M27K26o27o14
$$ y = [1490, 2843, -899, -3710, -633, 2650, 9, -3494, -1754, 1280, 539, -1386, -1213, -430, -23, 600, 279, -843, -386, 1115, 1400, -150, -400, 989, 1712, 482, -273, 471, 1002, 471, -223, 264, 134, -672, -302, 285, -877, -1487, -20, 393, -1309, -1525, -105, 100, -717, -457, -186, 5, 371, 308, 1, 388, 857, 425, 486, 737, 886, 528, 433, 401, 320, 401, -116, -186, 191, -29, -826, -803, 179, -427, -1481, -657, 264, -729, -1322, -161, 164, -207, -340, 113, 299, 639, 279, 241, 534, 942, 757, 112, 477, 961, 669, 361, -253, -121, 988, 319, -986, -750, 399, -118, -1309, -658, -88, -590, -772, -297, -274, -626, -109, 38, -132, 97, 481, 246, 401, 455, 384, 492, 691, 637, 411, 437, 418, 310, 400, -82, -538, -140, 295, -510, -1033, -238, -23, -787, -780, -348, -709, -454, -193, -230, -349, 11, 440, 1, 179, 548, 601, 477, 589, 409, 621, 850, 544, 293, 289, 304, 26, 157, -20, -580, -153, 73, -554, -1168]
814a168Q18M20q58l24P14M50k25o0N7L76K17K9n56M51N21N7l33l43L61K18j98
835F24p20kP77l15r20m6Q27k27p83K00L39k92J06O4l58q0P57K81n08j34L68M84
857D42k1k14M0L04J82k13j05oN4j47K16m14n33N70P9p82k82P60Mo83J06N32n22
880f33OO51j12o42M40P60r9n77J75N97K28n99k50M97K93j44k65Pk82qN62m39j005
903h39L61J149p07j135L68Q92j97m74pJ36K05M63r2r00N81Q78j66p08J91Q20R2
924I11p15j23M08L41q06J48M30o13n33R29K14j702j6J563j32j427N9J096p2q20
944h60M36N69p26K5J233K4j135k85J553N67j530o19J536R92j506q95Q07O68n73
963B81m30j41j54M38M93p06j059Q62P72m90q22J57O12N74o1p56o14J299J025r83
$$ y = [-1168, -350, 70, -788, -1112, -398, 52, -173, -233, -176, 200, 417, 446, -110, 341, 862, 919, 586, 243, 604, 822, 624, -96, -98, 679, 364, -556, -602, 225, -2, -785, -585, -246, -538, -432, -368, -726, -806, -49, 232, -276, -410, -42, 442, 421, 207, 247, 551, 733, 520, 415, 409, 463, 316, 532, 118, -415, 155, 234, -548, -830, -70, -66, -749, -643, -111, -633, -627, 24, -88, -730, -290, 470, 371, -206, -31, 566, 794, 195, -55, 442, 735, 591, 326, 333, 51, 43, 605, 166, -839, -478, 671, -36, -1171, -803, 89, -108, -582, -589, -453, -248, 215, 123, -777, -196, 682, 516, -192, -1, 819, 911, 196, 73, 481, 822, 16, 164, 594, -19, -552, 377, 591, -1111, -1127, 436, 304, -1123, -1064, 32, -40, -860, -424, 145, -581, -556, 677, 701, -434, -719, 834, 1401, -129, -748, 788, 1780, 274, -621, 186, 854, 281, -149, -290, -444, -6, 487, -219, -1278, -416, 356, -134, -956, -799, -187, 387, 326, -430, -1044, 255, 1280, 297]
983B97j390R07J950m97k221L87J856j86j562j26J622o24j102P99M74j398j16J775
1001H45l96k549Q74K327n42k229N87K143n99j802R97J581q94j210J126J195j461
1018gn60J480P64j730q87J839L71j746j87J011j15n78m0J38m07J27O68n82l38
1037g79M83L52K9l63j59J26P81L58q09o70R61J280p29j603M63K072o23k127Q0
1056h77K258m43k025M49J471r75q72J103K96j516J49J926p93j966P18K558r59
1073E02k138J036K108o56j779P37J688q69j094J021P67j371m65J397kj760M64
1090d14J312q50j158Q38P64r77n00P59L72q50J96M47j44k59M92K10k99P4L93k2
1110C84m45N26N67j088j73R33N20j634l55J529J09j611pJ489o12j356Q68Q98j154
$$ y = [297, -1093, -186, 1764, 1267, -954, -567, 1289, 1103, -459, -585, 1037, 413, -689, 110, 584, -814, -930, 845, 449, -2100, -1226, 1101, 559, -1670, -1083, 1060, 461, -1341, -344, 1237, 343, -867, 259, 1454, -7, -567, 913, 1677, -53, -940, 899, 1270, -476, -663, 348, 233, -345, -385, -247, -654, -527, 141, -441, -779, -296, 56, 85, -278, -437, -311, 470, 828, 19, -651, 310, 1590, 861, -742, -279, 1793, 1170, -957, -877, 1381, 938, -1087, -638, 833, -142, -1014, 89, 385, -1131, -982, 944, 151, -1815, -1097, 1461, 502, -1636, -600, 1508, 852, -927, -190, 1498, 629, -465, 556, 1323, -48, -513, 884, 882, -878, -414, 898, 48, -1110, -272, 492, -485, -985, -226, 146, -704, -508, -61, -205, -464, 28, 238, -61, 13, 406, 384, -61, 465, 1032, -56, -229, 704, 1224, -410, -765, 764, 873, -738, -745, 744, 132, -1224, -356, 542, -612]
1129f12k62J143j02j184L03J355p9j601Q77J228m27j272P52J094q20r37J075N46
1147A077j133k84J201j90j433M18J196r08j037R98O33j111m79J065K78j195J33
1164g71J076l08o78N23O03m56k85Q04K57o72j27P80m7r38K93J087q59q86Q36M63
1184F95j028m68J032j98p89L14N45n01m68O05N45q12j69J061k8p55O6J004j68
1203D83q22M33Q59m31r04P79N42j027m73J303R9j520J74J083m55j077M82Q00o81
1222c53m73Q11J93p78R1P50j55p41L88R82m68p65P56N32m73n90Q16K97j034O3
1242a51Q74l99q53M95P80r58n16Q52J90r78j2P50k19p15N31O25n56j78N07K61
1262C30m14j62O56J37o89J32O86p8p56L35N38o13m53Q70Lq62j61R70l09r74N02
$$ y = [-612, -874, 269, 167, -1017, -714, 641, 562, -1039, -162, 1066, 639, -633, 119, 1213, 393, -544, 531, 1077, -56, -340, 861, 671, -762, -344, 852, -56, -1093, -95, 538, -573, -1052, 13, 291, -904, -771, 305, -3, -681, -158, 445, -11, -296, 508, 765, 93, -34, 746, 699, -239, 54, 1141, 282, -604, 232, 695, -333, -801, 231, 33, -756, -442, 103, -398, -866, -261, 284, -528, -697, 364, 336, -419, -353, 651, 483, -339, 94, 953, 522, -382, 397, 939, -88, -561, 742, 841, -679, -505, 578, 123, -954, -472, 328, -353, -826, -15, 178, -600, -509, 241, 86, -655, -267, 715, 247, -518, 238, 770, 297, -293, 523, 820, -214, -151, 723, 324, -529, -34, 746, -212, -728, 124, 314, -664, -676, 74, -145, -860, -329, 296, -260, -438, 69, 330, -84, -246, 410, 547, -142, -10, 676, 598, -158, 177, 715, 102, -351, 519, 522, -340, -501, 469, 160, -814, -312]
1283c12M74k19n75L88L90n87k67O74J00m99L51L29J1n27K73P61m59m30M87K38
1303F01n10k83P55p4q29J50O31n05m79M32L49p22l07O47J44p23J93P11k03l36
1323c58P3N19j30k35L24K34l99q6O61j23m34m5O61m09l10J75L00m57k68M57j10
1344D0n95L05K17l99J5J36J94k78j30N72N2j68k1K75J44l99L2M16q9l90L19L26
1366E74k80m39M56L00p45j02M68r0m57L8J89q1k79K09J70k89k7J80K37q8j32K46
1388E8K3m3M3L16Q0j98r9K27m7j59R0k54k9J13K33n58k8K87J3m54K07K2j59J65
1412a51k10K20j41O5N6K33r1k36K74M19l94k5K76K23l05k28K99J77m94J28J46
1433B41m9l03J44J44l85o1N0j0Jj53n3K60J73l90M8K72J16m9o5J88J67j14L6R6
$$ y = [-312, 162, -57, -632, -244, 146, -441, -708, -34, 66, -433, -82, 247, 258, -269, 4, 765, 306, -124, 363, 601, 91, -192, 563, 489, -340, -190, 441, -64, -543, -111, 238, -484, -791, -144, 0, -723, -530, 181, -22, -358, -285, 234, 104, -131, 193, 427, 28, -58, 603, 480, 46, 1, 662, 253, -57, 118, 418, -39, -307, 150, 40, -555, -250, -33, -432, -417, -281, -87, -365, -495, 77, 129, -39, -60, 215, 359, -40, -8, 408, 319, -71, 248, 574, 294, -145, 311, 611, -134, -236, 232, 142, -315, -277, -88, -169, -448, -239, -69, -358, -385, -205, 32, -56, -188, 58, 81, 38, 81, 397, 477, 279, 180, 407, 360, 201, 291, 37, 8, 121, 354, -204, -232, 55, 68, -386, -179, -157, -316, -151, -361, -141, -282, -217, -161, 72, -19, -255, 19, 438, 44, 19, 295, 518, 213, -15, 284, 461, -33, 95, 241, 192, -111, 33, 177, -208, -269, -219, -229, -228, -381, -434, -174, -1, -391, -343, -71, 45, -4, -69, 119, 286, 172, 208, 304]
1457C04k53K21Q6j19j71K9r7L27j85m62J52M20l09l87O6L74j54k89J17K12J74
1478E6l99M8K25J4n7J16K15L3l00J74L58k11l75L76J59j87m09K52L30l60k29P
1500a64K47j10l42K41K83k18m72M44K69m84j90L79K49k97NM43N6k84K12kJ33k89
1522A09l1K94k1m77Q8L76k06m34L2M36j32l52rK72j89j87Q0J81J03p8l8J97J85
1545A99k75N6K92Q9k97J86J62j94k32K29K15j67l55O3K49j87k13K1K05j89k88
1566d31Q2K75j42k91K80L28l40j56O23p3l36J20L33J5k37o4K72j9j97n2L55j91
1588A54j74M0J77k7n42L09l7L3k87O3K46q2k22J07K7j32K98K2J7J31p7J14n4J24
1612B28R1j40K56k51j08Q8J08j21k47N9J09m6j69j38J67l9k56O1K65j33j95J34
$$ y = [304, 51, 272, 358, 239, 68, 97, 0, 327, 142, -320, -168, 252, -57, -444, -378, -4, -158, -447, -330, -118, 56, -343, -295, -70, -56, -113, 3, 218, 251, -49, 125, 483, 272, -103, 273, 432, 245, -164, 88, 418, 58, -171, -164, 83, -27, -369, -128, 155, -63, -535, -91, 178, -306, -496, -117, 132, -165, -160, 283, 339, 55, 267, 265, 398, 109, 78, 372, 351, -126, -38, 338, 132, -302, -270, 166, 34, -318, -327, -55, -244, -431, -351, -170, -67, -145, -183, 14, 199, -76, -20, 272, 361, 64, 250, 412, 218, -14, 215, 430, 263, -92, -29, 220, 33, -180, -159, 46, -143, -431, -349, -74, -216, -507, -227, 101, -239, -395, 228, 155, -181, -61, 272, 287, 50, -14, 258, 239, 42, -10, 345, 154, -20, 20, 197, 170, -372, -63, -100, -67, -354, -291, -45, -127, -349, -242, -215, -347, -49, -27, -10, 121, 44, 158, 104, 228, 319, 179, 435, 184, 76, 164, 272, 151, -96, -37, 72, 26, -143, -281, -114, -153, -409, -348, -83, -216, -411, -277]
1634b77L56j87l8K44J21l06M8M76k56KP5J08r5p4J0J03k41N1j80K22j20j29r3
1657a80O1j31J12J1J33k53p5J66MJ65r7q0J34L2Q3J19j16J14j68J11kL2R0k12
1681E3J54p3N5j85r1K65k83rk37K51j80j44K67L3j74N3K62r9p5J68J85j06o6J70
1705A94J5K4j86J81q3N0m0m9R7j07k42P4J20j40J54L8k02k33J71n8J42j48%J27
1729a01q8J30j22K21J18N4j35M2R7m7M5N1L4o8oj63nJ0q3k55K18N3k17j7J89k2
1755f7j26k2K35j64j34K87j7j28J34J15j72K01M8k5NJ32k84R0J94k17j28L32k87
1778BoL2o7j03m4k5k9j44J86P2j06N7K0K45k42J84r1n6O7O0J28j38K5n9K25K7
1804B20O2J4n9j35j7P0p4o9j74J72l7PJp0k31Q1J05O8p3L6j7o0L16j80o2K76J6
$$ y = [-277, 79, -108, -146, 98, 219, -87, -39, 437, 181, 183, 258, 366, 271, 197, 207, 310, 69, 120, -60, 162, 42, -87, -180, -119, -250, -138, -127, 6, -247, -322, -156, -152, 13, -84, -164, -30, 2, 85, 204, 88, 202, 34, 145, 143, 175, 265, 53, 207, 134, 189, 4, -87, 178, -105, -114, -351, -100, -280, -424, -157, -124, -298, -245, 17, -82, -157, 11, 196, 90, 24, 194, 209, 233, 47, 228, 145, 195, 155, 106, 203, 96, -146, -72, 48, -92, 62, 100, -102, -335, -164, -222, -80, -228, -228, -101, -189, -59, -181, 40, 158, 212, 77, 119, 216, 169, 214, 265, 299, 231, 225, 62, 57, 67, -16, -271, -53, 0, -217, -234, -45, -67, -193, -215, 20, -144, -278, 9, -8, -136, -2, 113, -59, 142, 190, 165, 170, 302, 18, 108, 302, 85, -43, 289, 2, -4, 28, -39, -142, -186, -211, -240, -384, -198, -126, -232, -175, -155, 90, -152, 32, -59, -115, -48, 12, 140, 2, 27, -32, 193, 220, 282, 296, 237, 102, 85, 155, 81, 12, -162, 10, -27, -20, -19, -89, -320, -239, -134, -66, -139, -103, -120, -180, 136, -44, -106, 170, 186]
1831A86j51K67j12L2j85R0Rl3j04J82q3j96j0R4N9j41r5m5rJ13j73Q0J81o5j5
1856a24P1K9j58P7K84m9Jj0j25J94o7l8R4L5q8j60L1J47l5k00J37K8k63J5J29
1881d5mj41j33L20j21J56j52Q9p2J76j31K10L9j16MJ41k5j78J86K0j26k43K06
1904F0O6r2l16K06J07j50Qn6j13J2l9K8K62j74J07K5n1L7N9R2N0J24j50m1K03
1929B64m7p6r6K54j45k63O3J85r3j20L8K78k53k37J17J0JLj18K56j65n4J95J22
1953A19m0k5P9o9j15J98K4j4N1r4K8j4p3j31J1J95l03Q4j16J12j42N6j66K81j24
1978a88r0K21J34l65K33N2mQ3j28J94p6J53k45J98J08k50M3J36j50O3k17J35J7
2001E7j54Q5o6R8k54o4J78K6K21n22N26j44k61J82K19j33j10J89J84l6k19J33
$$ y = [186, 35, 302, 190, 222, 37, 127, 136, 103, -1, 181, 98, -98, -108, -14, 45, -96, -191, -236, -245, -132, -305, -225, -44, -109, -124, -53, -24, -182, -105, 179, 130, 131, 121, -4, 190, 123, 85, 179, 214, 126, -34, -3, 144, 109, -91, 46, 74, -189, -174, -45, -49, -190, -323, -3, -124, 32, -120, -31, -103, 73, -58, 152, 191, 75, 79, 220, 195, 17, 203, 223, 97, -146, 60, 126, 34, -282, -76, 31, -119, -111, -167, -280, -268, -307, -279, -17, -191, -84, -59, -110, -73, -14, 78, 128, 252, 102, 61, 264, 217, 141, 45, 299, 154, -109, -46, 139, 46, -74, -36, 242, -11, -248, -131, -121, -120, -117, -235, 21, -144, -198, -3, 119, 79, 54, 133, 64, -51, 147, 171, 157, 208, 114, 142, 128, 55, -76, -65, 130, -173, -89, -205, -93, -235, -179, -345, -64, -188, -278, -57, 77, -288, -55, -3, -7, 76, -52, 142, 66, 219, -26, 172, 280, 30, 73, 209, 59, 122, -95, 40, 57, -97, -12, -78, 20, -234, -298, -120, -94, 127, -395, 131, -13, -274, -92, 127, -6, -116, 73, 257, 221, 2, 135]
2023A35O7Q4l10K4P9j09j19K40o7n7k1JJ99l82M1J38k1L8k42K12oM3J53oJ2j07
2049A9J14p8Q4K7JK8kn4n9j10K92j45p7M4p3l4m8n3M0j55RO9J84j84J4R0N9j89
2077a87j5K69j36j92J29K39o8n3Q8J42k64P6J27o7j1j7j20J16j51O1O0j92N4q
2101a20q3m3K22M5n6k7j58J87J55j54J27Q6K3RR8k09o0K30m8o0j97J1K11j86k9
2126b6j5J42k49n9J41J29l16P9K21k50k4Q0K81j72j77M24j40r3l2K10N8k25L5
2149B2K72j86m1O7k7k5k27L56k13j97J04J12j63J9M3l4j16j11L08J1l12K64J25
2172E1L0j31J6J59L2j06J62j25m6J45J72k93J2Q3J96m76J4J55J25k03r9J35n2
2195d4j86r4L51j44j53O8L25j90l9P9J91k90m8K11J83k89J22Q3o5n0O6l1J1j07
$$ y = [135, 202, 286, -24, 0, 79, -30, -149, 91, 24, -33, -54, -53, 146, -236, -195, -57, -78, -40, -282, -70, -76, -33, 120, 114, 126, 19, 133, 55, 139, 166, 167, 195, 193, 139, 80, -30, 262, 117, 40, 84, 11, -23, -71, -124, -84, -239, -230, -161, 23, -161, -147, -57, 2, -187, -202, 67, -69, -261, -132, 107, 39, -14, 74, 216, -48, 28, 155, 88, 77, 60, -60, 56, -95, -34, 26, -166, -112, -120, -203, -246, -24, 21, -35, -62, -220, -33, 122, -32, 95, 181, 204, 213, 311, 102, 42, 272, 224, 164, -33, -22, 189, 3, -26, -41, 101, -148, -207, -66, 63, -253, -174, 47, -203, -227, -147, 134, -38, -215, 209, 69, -24, -56, 154, 212, -13, 22, 294, 108, 67, 134, 107, 82, -145, 211, -2, -199, -95, 17, -146, -127, -84, -118, -234, -345, -37, -26, -338, -74, 51, 81, -50, -34, 125, 157, 51, 213, 88, 42, 187, 359, 66, 78, 161, 357, -119, -105, 50, 175, -28, -127, 8, -44, -230, -324, 27, -117, -270, -202, 123, -67, -106, -27, 164, -126, -174, 37, 220, -69, 53, 136, 71, 21, 87, 56, 67, -40]
2219d0N0Q6j82M5J6K8k42J17J2L7pJ43J3q3q0K61N3j74jJ43Jo6N5N5j18j81K34
2246A75m1l17K09K52m11j29J59m4o6j62K40J28j92rK18J21j85j14K68o3k16J70
2268iJ12r7P8N9Lj92J64J52j71O2r4J36j45j39J5p1O9m2K9M5j13J8K17j42n2O3
2294d5k6j68J92L05p7m56K62K27r4j31J39J22n7k06J6J16o3Q6o1q8j3m7j9M2j53
2319a97J9J99n3m4Q6J49l52J40J51o8j25R1J39k6j57J59J0r2l9J68n5k8M5Ll6
2344H7j10j28J02n7l8J01O0k53J80J26j92r2M3K33M2j58J05L3j72K89j17J15k06
2367gR4J37k28N5P1n8L9n9q3J12k24m5J15K11k91q8K87j35q8lJ62J7l0J41q8R4
2393A08N2J59k24p2k0l4J10n0l0J09o4K3Lr0K3O5O9j69j28K21r1j22l8K04p3j49
$$ y = [-40, 10, 96, -86, -41, -25, 3, -239, -122, -110, -73, -80, 63, 76, -7, -87, 174, 227, 53, 52, 195, 196, 130, 185, 240, 122, -59, 175, 134, -183, 26, 278, -133, -262, -103, -147, -213, -375, -135, -7, -199, -208, 10, 131, -54, -168, 100, 37, -179, -9, 103, 6, 84, 143, 146, -46, 118, 270, 99, 161, 67, 203, 58, -81, -66, -137, -68, -110, -81, -36, -149, -131, 86, -56, -108, -45, -71, -239, -47, 258, 181, -275, -13, 214, 120, -11, 128, 250, 193, -13, 3, 119, 56, 142, 81, -7, -20, -67, -86, -44, -197, -178, 21, -32, -76, 10, 159, -193, -53, 98, 30, -95, -4, 135, 109, -48, 111, 121, 29, -10, 158, 103, 75, 120, 123, 87, -23, -151, -49, -106, -144, -43, 17, -236, -56, 70, -122, -214, -171, 62, 104, -54, 51, 84, -88, 201, 84, 199, -7, 87, 224, -4, 51, 122, 64, 103, 44, -39, 73, -151, -196, -81, 130, -161, -249, 38, -97, -185, -188, -26, -9, -39, 102, 14, 108, 160, 319, 95, 23, 3, -31, 79, 29, -1, 108, 44, 67, 70, -20, 3, 68, 137, -32, -160, 61, -30, -152, -190, 14, -59, -208]
2419b08J56J70k16k11L42J40p7j28J09l5N2j03NN8QJ25L8k45j76J10K43k35q3
2442a61J65K5o5r7J11j31J45J43o9p4J00k8J64k21J0l6O3R1J3l2J07j17K7p4l5
2467B4l6P6lj35q2K13k12J57L7j03Jj95K22J22j44j33K61k38J00L5K37l27K14
2490I1N4k1j5j7K25j98L4r5nJ13m10K84q7J16j56J28k04J32j13J03n4k9o5nJ87
2515gJ4R6j09Q9j70O2L8Q2OJ04j62J24l0j27L1l1k4m7k2J76j70J22j33p9K09r2
2541e0j46J08j8k8J62o0n2p7J58k3m6J39J40j11k5L5k0R5j37M2j2lj9k87K86L5
2567H6j27r2K07j50l4p5K42j61R6j31J67Qj36K28j64J35o1j6j6J11j37l7J92k56
2591a21K16j00o8q5J71p0L9nQ7n2qj49l0J64k08K30k15K70j30J42j10J15k2K4
$$ y = [-208, -52, 118, -98, -309, 33, 173, 96, -32, 77, 42, 94, -9, -4, 54, 62, 187, 225, -20, -196, -86, 157, -78, -161, 4, 29, -36, -133, -22, -153, -8, 135, 66, -8, 92, 64, 228, 7, 17, -19, 44, 135, 148, 116, 223, 106, 133, 59, 24, -12, 64, 61, -74, -156, 57, -155, 2, 39, -64, -63, -258, -36, 86, -58, -191, 70, -168, -68, -33, 204, -123, 91, 145, 124, 109, 92, 317, 119, 153, 58, 53, 166, -244, 40, -47, 69, -87, 41, -163, -31, -144, -41, -95, -124, -189, -194, -7, 7, 103, -6, 83, -87, -25, 13, 95, 101, 205, 43, 167, 137, 10, 41, 10, -14, -61, -83, 93, -77, 45, -88, -167, 42, -50, -196, -88, -106, -134, 28, -32, -84, -161, -3, -26, -72, 67, 207, 96, 71, 106, 86, 181, 44, 86, 74, 71, 52, -235, 51, 86, -41, -133, 74, -76, -110, -185, 57, -104, -8, -139, 28, 36, -100, 128, -36, 99, 38, 22, 6, 117, -20, -57, 135, -121, 95, -5, -73, -158, 13, -57, -18, -23, 64, 12, 4, -145, -175, -11, -219, 11, -204, 66, -64, 78, -32, 83, 61, 85]
2615H5r5N7R4j32R7n8%k1J69j18k5m4o6j65J41m8J36j84R3L7j15q3J47J23j21
2640i6P0L1L9q4R1k5P0k39K87q2M6j5J57j29j49LP6J10j65n4R1q2R0m8q2R2p5
2667g2l7r8L1K26j1r3R0Lp8JJ49pK5j46R1J56l99K70M4qj97O6K10k22j03J50j01
2694f0q7R4L3O4j58R6j24J62r6J78j66QQJ30p5N3Q6j12m9jJ91n1m5R3q8n9L3k35
2722a77J91k21J01J94k36Q0j05K51k91J60n1Q3R6j07o4J80m9N4M2K9q1k14L16
2745A81N0j01j9o1j04J49j05q8J57q6r5P8k1L4k00L7J25l0q2J13l0M7L11p4j32
2770E4j08K27rQ4k38qK52l50J19j30K32Q8j63k19K25o0n0n5J85k09RkO4J8j4P0
2796A2k4j32K38l14L46o9j41J54M2J20l21K8J65N8k41J6P2m7M4N9j5j26o3R5N5
$$ y = [85, -10, 47, 141, 9, 106, 48, 48, 27, 196, 78, 53, 9, -57, -222, -81, -129, 7, -177, -84, -47, -162, -245, -98, 25, -96, -26, 5, 44, -40, 51, 26, 96, -143, 144, 62, 108, 93, 250, 121, -28, -25, 51, 161, -4, -58, 33, -49, 41, -7, -89, 3, -72, -109, -207, -176, 50, 39, -54, 36, 39, -39, -38, 111, 104, 129, -17, 74, 230, -169, 101, 145, 137, -60, 6, 216, -6, -109, 41, -60, -147, -53, -20, 44, -114, -18, -142, 20, -76, 102, -64, -56, -48, 82, 7, 60, 146, 34, -15, -16, 175, 124, 79, 172, 84, 25, 58, -177, 14, -207, -106, 88, -148, -68, -173, 78, -213, -53, -104, -21, 75, -32, -96, 84, 35, 89, 131, 160, 79, -135, 181, 231, 130, 111, 50, -54, 95, -10, -98, 59, -27, -122, -44, -65, -31, -231, -194, -69, -99, -181, -68, -98, -51, 260, 186, 54, -54, 173, 164, 248, 10, 2, 254, -96, 23, -107, 125, 213, 50, -169, 56, -4, -54, -109, 76, -133, -124, -126, -62, -44, -58, 12, -12, -144, 94, -220, 126, 57, -84, 70, 112, 232, -89, -61, 104, 162, -79, -63, 9, -38, 6, 65, 50, -76, -139, -44, 11]
2821A1j03n1j1J7J45j6j29J77JR4k29k5L34k95J36o5P4J9o2l8L7nJ48l16J07J4
2847c1j2O2j22M7Jj02K10j64K1r2J84k2k08K90k09J70l3Q4L0pO7l7J10k08J08
2872A37j94L6o6K15o7k32L13k20KN0j68L41%k51J19n8j9o8j53L47j80J01N8j25
2896h2J74j34QJ83o0j37J32JN5j88J41j18Q1k5j27P9k2J18%q3r5P7oK0p4lj6R0
2924a1R1k88J71l9K58j22M4J48j44n7O2m4m4J06Pj10r5LJ6O8j3q8O0j1j95K03
2950b4N0j34R9k1j6K7rj5N6j5M5J50k0j40N3j26K32j87L8J35j55j9p0J33j07J24
2976H4j38p3%J5K6J45N3k73O9J80j56J36j4l8O7k8n6R8k26J20J38q0K19k19K5
3001G4q3K1L4o9Q7Kj20P4J35k07p1k7J95j58J04kJ6J7j25J19M2n2j4OM1o2J1k0
$$ y = [11, -92, -143, -154, -137, 8, -8, -137, 40, 41, 135, -94, -119, 215, -80, 56, -9, 65, 84, 22, -16, 21, 16, 164, -152, -45, -31, -43, 19, -103, -56, -55, -157, 53, -111, -90, -182, 2, -20, -228, 62, -147, 23, -10, 74, 104, 97, 164, 127, 237, 29, 137, -57, -21, -87, 128, 61, -171, 142, -78, -76, -26, -194, 147, 147, -104, 15, -43, -62, -130, -283, 64, -116, -15, 43, -82, 92, -42, -34, 149, 89, -48, 84, 85, 140, -48, 93, -25, 56, 31, -96, -17, -39, 79, 79, -4, -99, -22, -28, -8, -82, -85, -101, -11, 80, -208, -37, -76, 182, 60, 104, 252, 108, 51, 113, 69, 25, 131, 138, 28, -67, -64, -48, 20, 7, -81, -21, -32, -227, -24, 26, -108, -9, -30, -46, -19, -28, -43, 13, -2, 43, 193, 173, 33, 86, -40, 192, 5, 43, 178, 23, 4, -66, 67, -40, 84, -54, -127, -127, -112, -86, 59, 112, -161, -92, 88, -68, 68, 54, 16, 83, 55, -1, 97, -129, -9, 129, 49, 268, 49, 74, -9, 12, 46, -23, 64, 66, -54, 20, 155, -52, -123, -150, 45, -113, -9, -11, 5, 22, -103, 16, 58, 6, -8, -2, 39, -23, -12, -32]
3029c2n5P3J1J47j17o4j3j5N8k0P2r3m2K4J87j88j80N0j5P2P7l7J30O9n5m8P1
3056F7m0l1q5J81j29M4Q9J4j66l3j7J02M7j88J47ml0n8N2k6K1L7j79O0J16J30
3082A21k07J85Pk41J93N3r3jN7J9j3j20K7Q0o2m8J06p3O0j51m9J99n1j43J14J5
3108a6K6Rm1K8j3R2r6P6r7J45k09K96m17K07M9K12j44j54J65j46k5n2J45o2j55
3133a77J66M2n3o7K9m0P2l6j29O7J46Mk6L1L0J59N0l11mM7J7m3L4J48j36k9n5
3160f4J54l8j62J24n2j21J91j17lp7R7K1k32K54L0P1k58K54p4L9j33K04j28M5
3184B5N0j26J06j17o4K17j9j38J03p9J10j63K7O0j27J35M9n7j41RJ98j1j42J5
3208h0J34o9J25o3J52j65L1n8J9J32j12j70K08k29L48k39j64J63j35p4K55Q3P3
$$ y = [-32, -87, -14, -3, 144, 27, -37, -50, -65, -7, -27, 45, -48, -90, -66, 121, -67, -247, -197, -212, -140, -63, -100, 30, 99, 44, -4, 67, 27, -4, -89, 92, -37, 7, 96, 110, -56, -89, -106, -4, 43, -145, 2, -2, -32, -90, -38, -64, -43, -6, -185, -125, -9, 121, -86, 99, 106, -135, 58, 111, 18, 17, 74, 93, 80, -40, -13, 67, 5, -43, 63, -10, 50, -101, -150, 49, -2, -145, -31, -16, 10, 19, -22, 6, -7, 85, -11, 65, -32, 113, -96, 200, -217, -10, 39, 251, 107, -47, 118, -28, -53, -105, 40, -22, -177, -11, 31, -22, -89, -60, -100, -28, -64, -193, -126, 20, 24, -2, 29, 59, 218, 268, -43, -47, 0, 17, -26, 8, 156, 20, -9, -64, 90, 52, -110, 14, -38, -159, 32, -85, -88, -165, -68, -47, -279, -25, 5, 76, -182, 72, -2, 37, -96, 108, -20, 25, 75, -51, 55, -62, -126, 91, 72, -66, 37, -42, 68, -95, -68, -8, -135, 0, 49, -8, -149, -140, 58, 47, -95, -80, 54, -15, 110, 47, 199, 34, 65, 7, 26, 158, 46, -124, 84, -145, 203, -36, -200, -37, -172, -246, 9, 92, 165]
3231A65l59K36M1l4j7K2p5J40j90Q9J75k31J12n2R0L7l9j00L6p7K30q9j75J4J86
3256A35k09J13p5J22j93Q1l0M2j58J32q6M0J93k96P0J94o8j00J38J3k6N8oj35
3280e1K43k50J20r6J91j04k64K61j07M5K1j56J84r6pO9m8N4J1l8jJ82j08j10P9
3305B4j8J4Q3L1n6r3J00n7r0J07M3J7pj88j10J50P8k31J47k0L7j90L32k46J59
3330A6q9kk5P2J89j93N7P4m9j76R2J34j34L1L5j08K54k92R3K56k63K6J0q4l1q8
3356a95J48K9o0j31K63j0j45O6K0n4J11N2Kj43j4M3K44k12M1M6j6q6m1QP5n1J10
3383A00j77o6J7PQ9j18J04K0m7K3j0R6R9j75r5N4Q5J31Q7j99K3N8M2j89q2J91
3409F8j11J08r7N3p2kM0Nj3q8P7j46J16J60k1j36K2pJ08j25j1J43R4q9J9J55k07
$$ y = [165, -194, 42, 83, 49, 32, 54, -21, 119, -71, 18, 193, -38, 74, 22, 112, 149, 110, 10, 46, -31, 199, 110, -65, -51, 135, -74, 39, -36, 86, -107, -26, -56, -14, -172, -40, -126, -86, 107, -189, -119, 75, 7, -93, 45, 58, 32, 90, 84, -51, 192, -58, 62, -34, 157, 53, -211, 50, -57, -12, 9, -147, 37, -59, -66, 3, -45, 9, 20, -18, -19, 163, 55, -55, 24, 6, 20, 103, 134, 78, -15, 85, 28, -62, 45, 88, 105, 98, -90, -200, -50, 28, -203, -56, -76, -39, -229, 103, -143, 16, -73, -75, -100, -28, 161, -32, 25, 99, 50, -126, -34, 100, -34, -3, 32, -76, 178, -114, -21, 235, -28, -2, 8, -76, -107, -195, -47, -18, -78, -209, 54, 44, -101, -35, -15, -69, 42, 94, 96, -47, -61, -18, 226, 14, 55, 101, 85, -1, -42, -34, 41, -10, 100, -77, -143, -126, -119, -30, -148, -44, -24, -71, -48, -58, 38, 137, -38, -133, -79, 6, 137, 224, 25, 48, 106, 148, -41, -123, 68, -43, 65, -32, 21, -51, -53, -13, -8, -21, -109, -32, -178, -62, 98, 77, -59, -37, -44, 64, -61, -72, 71, 165, 76, 95, 250, 43]
3436D3j53R7J33j12j05K19r8M3j07n3k7j5O3J69j04k7L5n3RM7Kj4j06N0R1Q7k54
3463a40nJ22M7n0J06l9P6j90J5L2N1J4j32J01J8m0j2j20K4J09l2J06k10K89r8
3488D2l6qN6r8J12n5J69j30j03Q3p7J95l2j20K5Kl6K3O2j86J17K3Mj8JR9j51N8
3516B1j75K40j13J47n1j67M6K3Q3M2n3K98l99M9J0l4J44k07L03l03J01j50K63
3539A18k00K3J42r8o4P3J4Or4J62j98O6Oj14J01J05j6qK0l7Kj42K21k74J65L5
3565A4O6k3j63J42n2l4L7j41o1O4n9K27M5m7m7j5m6R8j66O4L6OJ73j40K19j20
3591G7Q4j80Q2L7j40O1m5R4j10R8k4j00L3j22J68r7M1l1L3PQ3m2J6m8l1K5m8K0
3619e9K06r3p5J97M9k51M4N7K5J0r0J08k60J23k6j27K24r5J5J82r1Jk02K70k25
$$ y = [43, -110, -13, 120, 8, -97, 122, 24, 67, -40, -93, -120, -135, -72, 97, -7, -34, 1, -52, -43, 4, 6, -8, -114, -64, 27, 114, -140, -145, -23, 24, -26, 80, 41, 117, -73, -58, -26, 25, 39, -93, 8, 26, -14, -26, -146, -122, -13, -45, 61, -149, 140, 42, 6, -2, 54, -44, 68, 13, 182, 52, -51, 32, -45, 150, 118, -2, 23, 25, -11, 12, 74, -112, 5, 28, 32, 14, 15, 114, -37, 21, -154, 86, -27, 120, 69, -98, -52, -29, 54, 96, 43, 341, -58, -9, 1, -33, 111, -96, 207, -96, 5, -145, 118, -82, -59, 83, -15, -79, -6, 8, 14, -80, 82, -116, -50, -44, -158, -57, 48, 32, 24, 44, 7, 9, -133, 88, -186, -21, 14, 80, 57, -106, 36, -16, -50, -13, -154, -215, -151, -210, 17, 62, 15, -32, -47, -93, 5, -161, -97, -61, -55, 118, -22, 197, 77, 161, -19, 63, 100, -40, 21, -24, 70, -40, 58, 34, -66, -33, -155, 13, -84, -43, -74, -41, -34, 49, 7, 23, -25, -56, -31, -79, -59, 147, 54, -21, 176, 225, -26, 18, 75, 100, 110, 20, 128, -132, -9, -35, -162, 62, -33, -18, 164, 73, 74, -128, 142, -83]
3644h3J19n5n0J69k9J0k4j50R5j10P2J48N2k94J9J30O5j92K92j88k1j49K66K00
3668B92m01J07j06O0J48L2r3k04J12R0k6o9m2J19P3k09MM4J6J18j55K04j71J37
3692H0m0j15K05p6j52J28Nj83L2Q0J38j86M4p1P9O4j28P2q8J42q1K5l4K1p6J55
3718D0m6q1J20M1kj8j29K17q5n5j04Q5N0j22J44j09J36j65j8K15l13K45n6M3j67
3743a34M0J63k4M6j23J31j77J07K01m4q7j29J39j3j67m4J42l6m2K0J52n9j10K2
3767b6l7Q4r6p7J47j47N8J82o9Q0l9o5J9n4K42k63LJ64kj12oR4n2qm9j1r4J7L5
3796h2j9%n9K12O6J6k12RK6J01K6j53J55L4o4J57j34q3J61j03J14j66l0L8LN1
3822F4P8j92O5J0m9N1k0j18J32P3j03p2J9j15J70j55J87n7R3O7j5j21J41o2j43
$$ y = [-83, 36, -19, -69, 100, 71, 81, 57, -93, 2, -108, -36, 112, 164, -130, -111, 19, 84, -108, 184, -4, -25, -174, 92, 292, -109, -2, -108, -48, 100, 132, 39, -165, -53, 37, 11, -58, -100, 19, 92, -117, -113, -69, -53, 65, -90, 114, -57, 80, 40, -75, 130, 54, -98, 30, 35, -148, -116, -36, 102, -84, -40, -111, -32, 32, -96, -24, -112, 30, -51, -26, -60, -39, -115, 40, -6, -87, 33, 74, 72, 54, -75, 142, 57, 2, -102, -17, 33, -89, 55, -54, 82, -83, -101, 114, -199, 46, -10, 33, -134, -94, 69, 45, 91, -32, 99, -78, 29, 230, 186, 99, -30, 109, 96, -71, -115, 27, -9, -51, -31, 121, 62, -48, -26, -63, 21, -75, -152, -5, -152, -94, 88, 19, 99, 60, -5, 14, -40, 202, -61, -58, 106, 104, -8, -14, 80, 28, 20, -29, -40, -134, -117, -82, -101, -101, -160, 52, 118, 134, -78, -69, -43, 58, 84, -69, 86, 120, 56, 213, 79, -4, 157, 54, 168, 2, -28, 10, 13, 64, 142, -50, 15, 25, -24, 27, 7, -111, 21, 94, -9, -81, -62, -177, -7, -162, 25, -32, 61, 128, 113, -8, 133, 71, -72]
3847g2J09j14M2J94k62N7jQ7k3O6j20Jj2pLr6K92n3j52k6L23j72p4l1R6j16J35
3874G4m6NN5O2j7l22J37O2On3J82j94J60p5r2o2K00k31J65j85K19l9l2K7j26J00
3900b0NK8n2Om1O3m6j5J69k14K25j79N0K6m4N9q5j83K48p8K26r3l8M8j26R3J46
3927A78j62n4qO7Pk07K12n4K03l20J64Q5r8j7R3j46J01j49m4K71k9p0j11Q0ql1
3953d7M8j66J09K2k6J38j47J08Nk7r8R1J69j64r6J30J36r2j2j14K24k36L1P1j66
3978a09L5pk0k2L08o1k61R0P8k6O3J3k46k9K63o4l1O1J6J19k11J1J42j50J29j84
4004i3P0N3Q6k2j02l9K93k65J5J5Q5m5j33J32r3q4K58j3k20J50nj6M7j50J03k19
4030a92J89L8mML5%l7q7M8k4R9q4M9j08J9j00L08j56n9J23j75J04J33j72P8j5
$$ y = [-72, 37, -77, -35, 159, -103, -46, -47, 40, 17, 83, -37, -36, -48, -55, -52, -148, 144, 91, -61, -87, 236, 64, -10, -41, 55, -61, 74, 28, 33, 88, 150, 133, -189, -52, 10, 16, -37, 145, -49, 111, 36, -56, -118, 82, -149, 16, -169, 50, 11, -21, 6, -120, -20, -15, 13, -39, -33, -74, -11, -57, -72, 97, -117, 108, -71, -21, 5, -39, 20, -65, -248, 0, -78, 148, 55, 17, 65, -61, 32, 178, 16, -38, -46, 21, 28, -179, 33, -21, 182, -138, 26, 111, 13, -4, 89, -57, 44, -105, -149, 122, 93, 23, -88, -8, -16, -47, 1, -165, -56, -34, -60, 78, -69, 39, 44, 17, -81, 10, 179, 15, -81, 49, 185, 93, 81, -33, 191, -45, -14, 57, -109, -74, -81, -101, -123, 185, 124, -137, -47, 31, 5, 68, 81, -165, -194, 69, 5, -26, 35, 51, 170, -41, -30, 112, -38, 91, -93, -23, 30, 116, 94, -8, -47, 246, -19, -4, 11, 96, 51, -82, 50, -43, -127, 131, 118, -102, 48, 43, 27, 74, -76, 27, -192, -3, 35, 31, 35, 70, 70, 33, -54, -6, -30, 69, -15, 34, -74, -55, -155, 153, -3, -62, 61, -114, -10, 123, -49, 29, 14]
4056A4oq8K0K3j6J30j88J2J50M1j76J71J17k00l2J33j70K3Q6o6M1K9o5J81k36
4081g2K9M5o6k6j01J17J0M8J46k2lr2L3ln8M4m7L4q4K9q9N4J26j05J50q8n2p9
4109a22K0J12j99J95r6J45j78M4o5R3K58k89l7J65Q2k75J53l2J77r7j63K22k00
4132h7J01L5j37O0j13N8J58k3J8m1Nr9J1J84k10O5l9R4L8P3j1m7j92K4J95q0K4
4159F4n4P9j39K61j42j0m8N1k21J27K0k0L2J88j27J2j14P1m6O2j29R8J2n6n9J27
4185C9j55K20k28J38J12j79L9l7J05P5k45J68j59J82j46j9k7J11J19j38l0N3m0
4208d2K6N5M6j24R2P9j87M4J10j44J53j07m3J6J97Mj49P9k30J65j02m6K25n9k36
4233a78K13q2J70k24K11q9n1m3J01J14j54j30K11j61j06K80k95K10j2M4J7j26
$$ y = [14, 8, -80, -60, -37, -53, 77, -111, -99, 51, 92, -84, 87, 204, 4, -28, 105, -65, -42, 44, -22, 19, 48, -17, 164, -72, -43, 2, -64, -90, -191, -74, -64, -16, 130, 108, 105, 13, 46, 43, -15, 29, -18, 16, -68, -39, -128, -74, 52, -53, 97, 9, -43, -122, -102, 10, -189, 6, -90, 55, -123, -79, -144, -51, 207, -82, -119, 46, 128, -147, 6, -26, 151, 54, -109, 113, -87, 14, 49, -88, -28, -141, -83, 75, 52, 70, 29, 34, -65, -54, 130, -80, -15, -54, 40, 78, 151, 140, 93, -99, -75, 120, 40, 64, 10, 89, -50, 211, 69, 59, 11, 62, -159, -32, -12, -32, 0, 188, 61, 73, -41, 30, -16, 46, -83, 15, 27, -29, -88, 39, -116, 104, -124, 14, 126, -53, -14, -51, 54, 129, -116, 52, -107, 75, -71, -90, -117, -6, 113, -25, -55, -2, -42, -16, 39, 85, -39, 53, 132, -55, -11, 99, -45, 108, 1, -42, -26, 171, 175, 26, 105, -125, 40, -62, -108, 117, 58, -178, 35, -47, 123, -101, 110, 21, -30, -73, 28, 142, -12, -142, 69, -92, -198, 82, -213, -3, -15, 29, 46, -80]
4255h0J79k53P8L5J35r8kj8P4j1J3j87oJ84p8O1o4J9r9O2M4k7J07j74R6N7j31
4282h4J78j19J00n1Jj16J88mj66J24l15J90J19j7L8j3Oq2j60J06Q6n0N1k1r7J10
4308BK3m3PN3o2J05j50N6m8Q7r2j03J84J6K0o2K0p9M4M2M7j07j32N3K1K0J35j22
4336f5K00q5o9j68Q3J26Nk5J08j04P3r6%l4J89j31j84J79j65J82r9K8j54K20k70
4361b56L82j77P1o0l2P3K87j54j38J3j79J27k0J64jn0k1Jj46K9J79k5n9p1L0j3
4387d6K0N6j14K50j21M7r1K4q5O4o2km4K28j66J15j51K46j43jO4j01o7Q3j9o9
4413h5L2J51j69Q4M7J22k79L2O9o0M1r5K3n6J02kL7k5J30j56J06j25J84j76J61
4438I3j59Q6P8k4N7k2Kj09q2J05o7l6J45O6j28N5l0r2K3M3K4Om8k4R5l7J2n8j6
$$ y = [-80, 99, -154, -76, -41, 94, -4, -6, -24, 50, 39, 52, -135, -141, 43, -35, 26, -38, -19, -118, -56, -12, -39, 68, -106, -10, 47, -84, 94, -25, 75, 24, 25, -91, 97, 93, -73, 51, -264, -74, 45, 28, 66, 53, 59, -23, -183, -77, 9, -41, 10, -11, -108, 2, 25, -18, -11, 42, -20, 85, -65, -9, -57, 30, -62, -165, 19, 35, 55, -7, 13, -66, -22, 20, 67, -40, -172, -119, -98, -78, 57, -65, 135, 50, -19, -187, -104, 22, 27, 2, 110, 6, 79, -17, -17, -51, 138, 7, -177, 2, -163, 19, -80, -52, -206, 14, -256, 126, -51, 20, -40, -72, 1, 288, 134, -4, 9, -170, -43, -63, 101, 100, 50, 29, 30, -116, -87, 92, 67, 8, -63, -33, -46, -26, 30, -84, 166, 45, 92, 1, 25, -60, 4, -58, -60, -104, 124, -42, 73, -78, 168, 25, 24, 88, -13, -80, 3, -16, -85, -53, 98, -71, 13, 60, 182, -97, -65, 4, -56, -15, -110, -87, -143, -41, -43, -6, -31, 99, -57, 49, -76, 108, -68, 93, -66, 20, 98, 74, 131, 109, 111, 2, -80, 25, -42, -78, 67, 133, 5, 60, 30, -62, -39, 4, 28, 34, -14, -38, 57, 20, 32, -26, -42]
4467d2oJ61j0j66L4J26j56nP9N7p4l3O1o0M7j18J35n4krJ75k76R2J12q5J05q0
4494Hk2j17N0J42K3o0p6J23J2n4J00L0j78k4n6K09p2m4J10q2K6kJ22l5q4j93R4
4521e0J8J3O0j42J41k3p1J98k87P2J11j70P9m2L9K6l7K76j22j87K2M4P6q2J69
4546A31n2j24J14q6R3J5r8l7J06j13o2J31O3l3j55J06j2J33r4K34k01q6P5K2n0
4571B0n3M5n7J7K1N1J01l39R5J13m3J19j31j7L2M8noK2J19l03J25J45j30J09m8
4597E0L1o6p5R6k48K72k38K56n4qk0N5N3k13L09j13j57N5j60K16Lp6P6J1k14R0
4623f9K9J22N2j66mQ7RL9j1j91K0J8J1J58k32L35r2k00K2R3L4oj5M0j28M9rJ46
4651A41o8P5j71j14J88K6k75K19m8ML1M7j9K5q0P5p2L3j8j7K6l8K2p0QJ55m2j0
$$ y = [-42, -48, 113, 103, -63, -29, 97, -59, -64, 15, 72, -2, -35, 26, -34, 13, -105, 30, -24, -26, -35, 140, -136, -44, 68, -17, 88, 8, -14, -131, -81, 61, 84, 24, -52, 71, 83, 29, 129, 159, -19, -43, -99, 110, 38, -6, 104, 22, 48, 46, 168, 133, 49, -144, -50, -32, -19, 41, -101, 40, 17, -54, 144, -143, -71, 40, -130, -51, -93, -54, -28, -65, 211, 89, -98, -76, -32, 44, -38, 131, 79, -45, 69, -17, 76, 91, -7, -44, 62, -51, -113, 18, 81, 48, -107, -1, -13, 120, 26, 260, 59, -27, 48, 70, 20, -33, 12, -45, -28, -7, 44, 145, -194, -99, 14, -29, 90, -41, -58, -26, 22, 17, 11, 33, 152, -151, -26, 119, -11, 98, 50, 81, 15, -60, 36, -212, 60, -178, 78, 24, 16, -4, 51, 104, -109, 200, 87, -70, -15, -175, 41, 44, -32, 44, 55, -159, -69, -40, 82, 134, -32, -36, 51, 60, 99, 88, -103, -83, -65, -54, 104, -128, 207, 115, -85, -63, 30, 64, 58, 43, 83, -45, 4, -5, 141, 73, 148, -23, -137, 51, 77, -198, 21, -27, -23, 8, 55, 36, 61, -19, 56, -16, 17, -1, -18, 8, -30, -8, -78, -70, 85, 43, 33]
4679C3k8P3n3L9j28K5j28J62J02nn2p5L0R8m5m5k6N8j65J31N1j00n8J8M2j37K19
4706C6j44J1J17m2K6J74j33q7j40O6J42J57l70L03p3J31k83Q6K5p5J5N3o5O6J4
4731A0l6J52j83M4l4KP7P8j23k5L3lqO2j38J84j39L1J8l6k2j25L5J74l29J77O7
4758e7R3K6l1L8j22O6q0Q8km5J14j80j2J86l0j27n7J17P6j60Rk6J78q5M5M8n1
4785A9m1p0J76j18oj34N3M8J06j25J14m1o8K26j91L2n2J28j28M7L5l6J1NJ2j39
4811a37J6K11r4J2%N7J1r5L4k8N0j21J37j42K07j07L5n5j53K14r3J14k68J98L1
4836C4j9n0j00R6J53l2j81K7m0J57J8n6Q4k25R4L11l56J24r3o7J06j5Q0L8o2Q9
4862A15j38P6j10Q1J01n5j75K01j8j73J17o4L6o7J07n3NJ25j80J26j28J31K5j07
$$ y = [33, 5, 78, 25, 64, -64, -39, -167, -5, 97, 92, 40, -35, -5, 93, 48, 3, -23, 35, -130, 1, 52, -48, -106, -88, -46, -183, 36, -108, -97, 20, -22, 4, 178, 45, -42, -182, -116, 26, 183, -187, 116, 43, 174, -109, -23, 2, -73, -58, -5, -70, -4, 10, -26, 126, -57, -13, -47, -45, 32, 110, -13, -38, -5, -8, -16, 46, -92, 92, -47, -16, 2, -34, -56, -181, -146, 28, -301, -124, -57, 36, 62, 31, 69, -53, 13, -67, 21, 19, -26, 88, -92, -104, 82, 52, -75, -132, -15, 61, -99, -90, -116, 62, -23, 22, 70, 19, -22, -92, 84, -34, -40, -174, -121, -73, 33, -92, 22, -19, -87, 139, -52, -20, -72, 56, -72, -25, 10, -26, -15, -10, 2, -137, -121, 90, -4, 8, 8, 65, 76, -19, 15, -13, 37, -84, 53, -89, 118, 11, 46, -9, -162, 52, -41, 73, -195, 3, 34, 15, -35, -135, -39, 114, 82, -99, -72, -112, 45, 63, 7, 91, -134, -40, 271, -85, 39, -54, -121, -15, -30, 50, 88, 26, 115, -23, 53, -57, 24, 125, 70, -105, 96, 78, -95, 22, -42, -6, -73, 34, -19, -14, 111, -69, 57, -71, 60, 85, -22]
4886b2j07J6j3O3J56j35K19l84J64L1q7J75j70P8J38L2j77O5j53J29Q4o6P1k02
4910i5J60j90J01q8R8n3J72j96M2K54k24j35J10r9o5K35K0J01j71m0J18K2K0k27
4934a30J45J03o6l1L8j09K37j55J34k14m8K84k7j89L0L7j21O0J16k43kJ82j36
4957a05Q3Q6k87K08J5l0M2n5O8j87O7K03O5j29r6J41j13m0R7Q3j66N6j1n7O0k8
4983c0J08j17J89j85O5q1k6Q0nl1R2p6n0R9l3k2P4K5%q4j65K36j4k2n3N7j3r7
5011g9O5j11K13j23n4n8K09k01K68R4j85m8r8o0J13L1J30p2l3o9J32j37jmk2J68
5037F8j09J56j59mJ13k85J92QM0q2L7q8j41J60K15j15j82J82J00j19L9j70J69
5060B5q4R1O0j00L1L2k8j7J16l0n6p7o5J60j34R7l1j5N7k28J93n2Q9R8j91J4J61
$$ y = [-22, -129, -113, -126, -63, 93, -42, 177, -207, -43, -12, -99, 76, -94, -16, 122, 154, -23, 42, -111, 18, 102, 36, 107, -95, 65, -125, -24, -112, -14, -67, 105, -91, -49, 205, -19, -154, -44, -143, -208, 27, 47, 148, -23, -63, 55, 77, 97, -130, 15, 118, 52, 21, 59, -50, 187, 32, 166, -48, -96, 188, 161, -28, 2, 39, -82, -22, 94, -149, -151, 31, -105, -22, 64, -223, -15, 0, -30, 12, -43, 25, -162, -95, 108, 173, 44, -52, 89, -24, -64, 33, 116, -50, 6, -5, -62, -2, -30, 78, -39, 150, -35, 30, -51, -77, 3, -2, -33, 59, -17, -67, 32, -1, -23, 51, 76, 76, -8, -173, 63, 49, 27, -26, 31, 18, -79, -14, -125, 88, -35, -89, -147, 62, -139, 129, 223, 38, -10, -108, -168, -55, -24, 106, 34, 1, -68, 64, -73, -74, -78, -100, 68, -41, 115, -44, -48, 65, -220, -28, -20, 20, -62, -25, -113, -254, -94, 121, 6, -176, 6, 106, -13, 26, -144, 25, -59, 32, 92, -8, 23, 55, 27, 10, 126, 96, 40, -37, -102, 58, -76, 21, -10, -25, 32, -196, -3, -55, 34, 132, -59, -45, 116]
5087A16k00J13j97K81j72O8L6Pk7j14J02L1N0j29P6J01j54q2J30J71k26L1op0
5111f4L9J3K8j64K33j23L9O8j83J53q0P6j9n6n9J65R5j09n1n5J80j20J26M0p7
5136I5o6m9M9j18M7J56k84J75p7J19q7P0j19L2J11N8m1j65R6k0j3J06j52J90j07
5161FK1M1jj29J08o4K1M2k4M7j53J37O7o8j74J45K09l02R3j65J72j85J71r5J67
5186H7Kj28M6j59K26j57J28o4j50K24j07L8P3r6J68k49J78K7j00J52k96J98n9
5209a8J2ll2q7N9J71r4N7j01n3K2Q3j26Q4L1o6l5RJ27o1K8K2j65J55j3q0J16j32
5237i0n8J35j46J27Pj5j18L46l13M2J82j42J89j36J9r3J11j60J14L2L9j70P1Q4
5261E7K4n5j52J71j17L3J8n6O7j27J27L5J2O6Pk0k2j05P3j31J42r9J23k3o3J57
$$ y = [116, -84, 29, -168, 113, -59, 9, 45, 52, 25, -89, 13, 44, 94, -35, 41, 142, -12, -94, 36, 207, -19, 12, 6, -64, -25, -12, 16, -148, 85, -38, 1, 69, -114, 39, -41, 35, 16, -40, -99, 66, 161, 52, 1, -54, 126, 6, 132, 172, 95, 29, -20, 29, -89, -42, 114, -170, 5, -72, 47, -40, 30, -89, -57, 54, 112, 71, -94, 2, -18, -31, 75, -77, 113, 6, 27, 68, 67, -62, 46, -18, 3, 45, 21, 68, -85, 52, 119, 51, -123, 22, 231, -71, 22, -143, 29, -156, 15, -80, 87, 89, -39, 7, -152, 74, -83, 45, -19, -169, 55, -52, -14, 59, -37, 131, -118, 60, 87, -13, 139, -157, 41, -18, -6, -9, -41, -128, -69, 102, 8, 65, -36, -89, -67, 16, -110, -26, 5, -61, -96, -87, 40, -21, 7, 29, -136, 19, 6, -74, 42, -90, -148, -13, -159, -32, -25, -40, -158, 188, -125, -83, 99, -43, 146, 10, 29, -64, 47, -113, 1, 33, 72, -98, -27, 57, 81, 26, -126, 45, -72, -39, -21, -77, -10, -137, -10, 25, 37, 103, 110, 90, 68, -37, 36, -95, 47, -52, 71, 48, -15, 142]
5287A42O5k06p7J72j66J28j19K2JK07j06%j78N7J77j74j18K01j41P6o9N9l9Q3
5311cK2q5J31n3n3j18K69q0J72k65J81p8Kn1P4k48J63J11r5R8j23k8J51j2p2Q8
5337I8j80j4J12q8K7J36j89J42l1n8L5L8J6j32J6N7J40q1N7j44pm7O9J63q2J3
5363F6j99J25r0L9J14r4j0J5K2L6p2L2K06j62o5P5L4p9M4q8J27r8m0o7J45L8j29
5390g5J19j10O3N3j48O0j3J48j83L0NL2J52k05N9K1M0M0j04k6J02j40J05M3J1
5415G9o0J42Ol4j00M4k8j5j19J47o7k2n0K02r1kL0QO1j29K3n1l6K53j17p1j27
5442a24L0j3R9J14j08O7r8J43k68l5J66q0M7J3l0J20J0j06J4j32J45J01j53N6
5466b2OJ42j08p6J37m0l7j5P0q2q5N7j12J36J03n9jj16J64m5J69j51p9J30j49
$$ y = [142, 207, 1, -76, 96, -70, 58, -61, -39, -38, 169, 63, 63, -115, -58, 119, -55, -173, 28, -113, -37, -106, -47, -86, -3, 19, -66, 65, 12, -41, -159, 110, 30, 202, -63, 118, 40, 42, -9, 65, -183, -20, 91, -4, 94, -29, -57, 94, 82, 10, 98, -82, -96, 16, -72, -45, 91, -98, 44, 13, -45, -10, 28, 44, -88, -72, -15, 125, 44, 101, -43, -50, -97, -28, 135, 53, 66, -133, -8, -98, -59, 55, -39, -49, -34, -12, 24, -48, -16, 190, 28, -37, 38, 72, -7, 37, -51, 76, -22, -62, -129, 16, 54, -75, 44, -66, -3, 50, -98, -38, -51, 97, -86, -56, -51, -19, 133, -72, -13, 8, 48, 88, -16, -42, 60, -80, 25, 68, 79, 19, 161, 167, 133, 33, 77, 49, 34, -85, 62, -5, -27, -77, 125, 34, 32, 62, 70, 131, 2, 25, -26, -62, 191, 74, 3, -124, -94, -107, -8, 106, -2, 65, -33, 110, -158, -193, -27, -107, -60, -47, -77, 43, 53, -53, -39, -171, -26, 75, -78, -22, -16, 126, 18, -58, 79, 39, 2, -13, 57, -25, -110, -53, -165, -29, 74, 15, 14, -102, 62, 17, 186, 35, -44, 86, -63]
5491f3O2mPJ34k04L1r1j7J89j21J05r9J06jn8N6m9j47J73j91P0J22M5MMo8Q0j09
5519c4jjK26k21j9O4J08k26J54j83J16p3J9K8K9m0O7l9J10J3l6J37k08r4N8K03
5545A57o8l8j18O1Nk7N7R8k28J8J14J14j44J19m7l2n0j3J60j92q5J00K05q9j53
5570g6L0P7L0oj22P2M7L3j18O5l3p2K9P3M6j13J34j8j09L0J02k34l5J29K8J00
5596H9n3M7j64m9P6NJ84j31k8r4J15Q5j81r5K63J8j9N4j85l0J78M6j43P5j15O5
5622A3k0QK5j5N1j3k16J18J35J7j89J24l1J05p7lK8n9R5O4j70L8j00J50j93Q5
5648c0k7J31j2O2j11L8j75K81k60J90p5j04K10j33N0q3N7J20j32j37J83r2P5K5
5672E1j63O6J01O2k44O8L9o0M4l8l8K7NM6J56j59P2J10L7k33J74r5J09n0j71J05
$$ y = [-63, -1, -5, 2, 136, -68, -37, -128, -145, 44, -77, 28, -71, 35, 34, -24, 32, -17, -164, 9, -182, -112, 10, 55, 59, 63, -5, 75, -34, -35, -36, 190, -31, -50, 14, 122, -104, 50, -133, -17, -90, -71, -43, -14, -54, 13, -26, 84, 97, 61, 198, -10, -104, -46, 157, 89, 51, -67, -6, -1, -28, 29, 127, -101, -83, 31, 145, 1, 120, 73, 41, -9, -22, 138, -54, -139, -39, 166, 77, -76, -46, 31, 61, 55, -67, 5, 52, 85, -33, 32, -1, -73, -44, 29, 75, -38, 96, 78, -31, -1, 101, -133, -168, -39, -11, 89, 36, 83, -81, -130, -54, -49, 135, 4, -24, -118, -3, 82, -99, -194, 69, 87, 68, 122, -63, -93, 85, 131, -12, 63, -52, 13, -7, 1, 26, 11, 62, 49, -167, -49, 86, 103, -86, 38, 7, 112, 35, 32, 60, 1, 96, 160, -10, 28, -72, 78, -115, -30, -57, 74, 62, 124, 13, 51, -124, 157, -103, 87, 12, -92, 118, -15, 35, -48, 9, 129, -3, -140, 43, -49, 26, 51, -112, -46, 55, 117, -127, -59, -20, -80, -36, -74, -112, -85, -80, -34, 122, -37, 35, 145, 182, -51, 123, 28, 137, 87, -84, 21]
5698B1j6J43o5m2L3j06N6J5J3On7j3poJ6K6q4J65L5q5J3p0kJ3J5n0pR6q3n7R3
5729IP9j75L4o3K48j82J45o7jq9nM1PN1q5J8Qq1j8K06R7Lj54j44R3p8L23l12O6
5758b6R7j59q0J52K8L7j25j59K19O3j11J63K0J8j11J9l5j22L2P2m%Oj9M9J0p7
5785d3O9nj08K13j50k6M7M2k7J4j87j2J62J10j06Lj3L0J85j93K9j46P9R8r9R0
5811E6Rj42qL0l8P5R4k49J21J02M7k2j58N6p2L9M7J00j12P5J05q2p5K1j72J29
5837b4NJ24j51J93k17k4L4R1q4N8j66J24N2j3m4N6l6N7M1q1J03j4j68J0J14q8
5863d8L1J03l0j73O4J5rJ01j22J74j58O6n6r8Q0L7J2J71j36j06K19j33J5j28J75
5888F6r2P9r5mP2o6O3p2J38k3J1r3Q8j61K3J01j8l9K8j00J50k42K26o0O5RJ33
$$ y = [21, 5, 148, 83, 41, 74, -32, 24, 39, 52, 58, 1, -12, -19, -25, -9, 17, -67, 98, 133, 48, 61, -9, -11, 2, 17, -33, -40, 56, -27, -84, 9, 88, -87, -53, -116, 132, -50, 95, 28, 27, -62, -67, -26, -19, 32, -53, -35, -27, -108, -126, 80, 177, 180, 26, -118, -25, -103, 220, -92, -26, 71, -88, -168, -16, 12, 49, -76, -235, -16, 47, -64, 99, 119, 137, 26, 45, 10, -112, -80, -8, -12, -12, -6, -25, 24, 34, -43, 26, 21, -87, 126, -24, -50, -3, 39, 12, 26, -161, -173, -11, 99, -7, -4, -17, 13, 198, 5, 34, -112, -33, 65, -34, 56, 65, -77, -85, -55, -93, -18, 76, -173, -52, 50, 97, 75, -83, -27, -99, -60, -13, 87, -25, 50, 155, 73, -2, 19, -153, -24, -19, 105, -46, 147, -70, -94, -60, 31, -53, 5, -161, -37, 15, 2, -42, 14, -22, 35, 76, -5, 98, 84, -84, -74, 40, -48, -17, 86, 56, -117, -53, -38, -47, 54, -68, 106, -52, 14, -42, -140, -60, -23, -11, 160, 24, -82, 137, 4, 19, -109, 66, -26, 53, -42, -46, 26, -40, 23, -49, 89, 66, 77, -16, 72, -89, -66, 35, 17, -22, 6, -94, 56, -186, 40, -20, 45, 54, 187]
5915A87j23k36L23k64J09Mk2n9Q7Rq5L1Q4N3m7l8p8J4R4j66J34K2l8P9k65L10
5941A19j92QJ40j3j70J46j00r4J25R6j32J62m1O0k93L71k47J46pk9o8OO6j8jj03
5967f3K01n8j78O1J00K1j00J97k57O3p7K9mP2K07m38J14L1L4P7L0J6J3l2j43J04
5993B0M2j70J71k3j05K0JR2n6lJ2J09J20k70J97o1j60K21j17j1j2N0j4k07J18
6018c6l8L3l1J75n9j79J80O4j90j4p5K39j2o3k2M1k7R4j31J23L2n6j46K14j25
6043iL3j3K1J77k41k6J26m5o3K8L3J12N6j23o3j1Pk14L47j64Q7n8j30L01J5j80
6069Cl2m8jnQ0j16J6K04K2j03j22K13K6j20J2r8J13M8p1K5l7J03p6kk6NL3j03
6097e7OJ39o3kJ3n0L9J99j03j64Q6r2R3n8l2N3r5J40K1j51J6J12j14J42n6O5r5
$$ y = [187, 64, -172, 151, -113, -4, 0, -22, -81, 6, 15, -70, -39, 45, 98, 51, 13, -65, -51, 43, -123, 11, 33, -5, 74, -191, 119, -73, -65, 75, 62, -108, 38, -62, -156, -31, 65, -67, 95, 54, 114, -179, 192, -55, 91, 84, 55, -13, -7, 59, 41, 40, -63, 138, 80, -98, -37, 63, 84, -16, 181, -76, -13, -90, -61, -65, 7, 214, -224, -110, -79, -45, 32, 62, 78, 91, 59, -84, 20, 62, -108, 63, 40, -65, -45, -44, 48, -8, -11, 1, 110, 230, -40, 157, 96, -64, 157, 40, 29, 17, 67, 53, -154, -36, -74, -41, -72, 103, 44, -135, 45, 109, -81, -95, -170, 69, 57, -6, -28, 13, -14, 80, -51, 72, 104, 48, -98, 116, -9, 24, 11, 32, 209, -32, -58, 68, 23, -40, -12, 21, 133, 189, 66, 3, -8, -1, -215, 132, -32, 55, -3, -133, 168, 183, 3, -29, -77, -78, -83, -3, -119, -103, 101, 123, 20, -102, 111, 137, 17, 29, -69, 44, 92, 21, 46, 9, 112, 36, 34, 8, 13, 46, -57, -51, 88, 25, 23, 36, -14, 25, 224, 121, -43, 43, -49, 44, -14, -46, 7, -88, 52, 73, -78, -62, 50, -64, 78, 22, 87, -8]
6124hN7Jq6L7K7J15k02J42r3m4j77J49J6J12j40J37q0j80Q6K6J18n8q4m9J07j19
6150a90J44K2p6J35k03J86j40K07o6j41K46j41N9j50J72j79J42m2K3L2p2N9N0
6173G7j43M8j36J87m1J49k48p1K22j38J12P9k4j11Q6M8J08k53J5O5J0j45J69p5
6197a0r4O8N4j39N5J65pj07n8j7N6J82j45K00k22J02k76J33J11l0j23J37J3J6
6221F4r3k7J81j61N7r3J2O9r9pK15j79j4J36p1l2n4J97L1j01J13K5j48K7k6N3
6247G5j93P7J23j05QQN1n3q1J31J42j41j07Q7o5J96l05J69pL3n9ML5j44J21l07
6273c07L76r0Q1j16Q4o0j46J33J22k55J78J31r7q0p1O4K1R3r5k4J24M7j30J09
6297I2jr8n1J43q7J63k31J08j57K96k93J70J15j58o0O2o7J30r1j53J16m9J17O8
$$ y = [-8, 49, 50, -36, 1, 28, 143, -59, 83, -10, -54, -231, -82, -66, 46, -94, 43, -37, -217, -131, -105, 13, -45, -129, -178, -71, -190, -46, -24, -100, 35, -168, 18, -122, 85, 19, -122, 124, -17, 42, -108, 64, -115, 27, -15, 8, 40, -32, 27, 77, -66, -18, -154, 33, -8, 141, -107, -178, 44, -94, 18, 97, 73, -38, 48, 96, 204, -49, -34, 31, 41, -104, 65, -10, -104, -36, 18, -121, -66, 99, 92, -15, -73, -90, -34, 148, 3, 203, -19, 83, -193, -60, 51, 21, -102, 35, 48, 64, -29, -56, 125, -36, 21, -72, -60, 9, -90, -97, 118, -61, -75, 61, -10, -42, -96, 101, 132, 31, 144, 169, 21, 48, 22, 75, -118, -41, 82, -23, -15, -7, 44, -9, -90, 41, 183, 42, -65, 22, -43, 153, -152, 17, 10, 43, -16, -12, 23, -121, 0, -307, 69, -21, 60, -56, 28, -32, -178, -45, 77, -178, 0, 131, 34, -46, -117, -53, -32, 61, -34, -58, 66, 113, -17, 92, 91, -7, -58, 85, -2, 161, -70, 38, -119, 177, -116, 54, 169, 11, -49, 13, -54, 76, -15, -168, -52, -101, 16, 84]
6321H4k6j59K40k33MN1J03j39m2J99p5K5j42j02K65j23J71j52J39o9p1JJ29m2
6345C6O0k21Q8J35k13J4J89m2q2Q9j20O3j26L4N6M4L9j22J62j30P3P2j37j35J25
6370d9R5n1J3L6o2J6J7p4R9j8%q9Q9J04r6j7k2j11K39j66J53j28L3j77J17K4J19
6397I4j44J15q6Q5l1O7j24J11m0k3P0p3%m2O1Qp4O2l5q7J60L4j14M4j58Q7Q7j07
6425e3J15J6j61J03R8n7M0qL4k10o3K13j20J68q4l7OJ5L5j02J32j44R1p9R9r9
6451e2o5K29j36J7J9j26J77L2j7n4O2J2o1J26p7M2k22rm6K56j79O4P9k15J75r
6477B2L2l7l3J4%Q6o1p4K38j86J5J09k55j7J49N4n8m5L4P9K1n0j1L9j37O7p4J23
6505D4j23M1jO0p8L9pm8K08o8r1J03l5j35R2J12j75N7M6q2J26j02R7n4o8J5J2
$$ y = [84, 58, -101, 139, -94, -90, -39, 64, -75, -117, 82, 7, 32, -110, -212, 53, -70, 101, -51, 88, 19, -52, -51, 78, 36, 96, -125, -37, 98, -115, -101, 88, 46, -36, 53, -67, -4, -130, -96, -40, 4, 43, -79, 83, -47, 26, 98, -39, -174, -49, 46, -5, 8, 44, -18, -2, 15, -59, 40, 22, 22, -67, 22, 126, 30, 13, -9, -120, 119, -47, 106, -22, 11, -166, -49, -25, 94, -50, 65, -21, 64, 33, 100, -24, 87, 47, 24, 94, 21, 21, -21, 40, 48, -26, 36, 1, -86, 74, 108, -6, 38, -120, -33, 54, -53, 62, 78, -83, 20, 118, 61, 101, 93, 127, -83, -146, 67, -53, 115, 31, -6, 0, 15, 50, -52, 80, -64, 27, -52, 47, -52, -117, 112, -24, -7, 12, -114, 63, 95, 78, 24, 86, 98, 37, 163, 86, 128, -94, -103, -149, 107, -72, -8, 71, -144, 31, 22, 54, 17, -16, -2, -2, 84, 23, -51, 187, 1, 16, 125, -130, -147, 2, 56, -2, -47, -13, 66, 87, 37, 26, 65, -72, -5, -79, 44, -79, -38, -39, 21, -57, -18, -25, -73, 135, 67, -24, 79, 44, -91, 1, 113, -62, -5, 41, -41, 85, -17, 80, 26, -42, -27, -15]
6532a5j23M7J86q7R9n5q5p9K2N3l3Q1L6j92L62j30o0kK4K7r3l1r7J57J1L6r0M4
6560A3rr2J29k09K45q7M0L0l2No2P5L4j97L1J32nMj02j25R8J22l5Qm0pJ98j14
$$ y = [-15, -138, -91, 95, 8, 107, 52, -33, -112, -90, -37, -70, 11, 47, -145, 217, 87, 27, 25, 49, 76, -17, -48, -145, 12, 23, 59, -31, 13, 4, -88, 41, -168, 77, -10, 30, 60, 28, 33, -29, 46, 80, -117, -86, 46, 41, 45, -57, -182, -84, 38, 3, 11, -29, -36, 162, 48]
$$ [...]
8191a2
##END NTUPLES=NMR FID
##END=
