##TITLE=1H_Pr 5016
 CDCl3, 8 sc, 
 24.12.2020
##JCAMPDX= 6.0         $$ Bruker NMR JCAMP-DX V2.0
##DATA TYPE= NMR FID
##DATA CLASS= NTUPLES
##ORIGIN= UXNMR, Bruker Analytische Messtechnik GmbH
##OWNER= root
$$ XWIN-NMR		Version 3.5
$$ Thu Dec 24 10:43:52 2020 Russian Standard Time (UT+4h)  she@DPX200
##.OBSERVE FREQUENCY= 200.1315066352
##.OBSERVE NUCLEUS= ^1H
##.DELAY= (6, 6)
##.ACQUISITION MODE= SIMULTANEOUS
##.ACQUISITION SCHEME= undefined
##.AVERAGES= 8
##.DIGITISER RES= 18
##SPECTROMETER/DATA SYSTEM= spect
##.PULSE SEQUENCE= zg30
##.SOLVENT NAME= CDCl3
##.SHIFT REFERENCE= (INTERNAL, CDCl3, 0, 15.7039)
##AUDIT TRAIL= $$ (NUMBER, WHEN, WHO, WHERE, WHAT)
$$ ##TITLE= Audit trail, XWIN-NMR		Version 3.5
$$ ##JCAMPDX= 5.01
$$ ##ORIGIN= Bruker BioSpin GmbH
$$ ##OWNER= she
$$ F:/spectra/data/she/nmr/H-F/1/audita.txt
$$ ##AUDIT TRAIL=  $$ (NUMBER, WHEN, WHO, WHERE, WHAT)
(   1,<2020-12-24 10:42:42.60 +0400>,<she>,<DPX200>,
      <created by zg, POWCHK disabled, PULCHK disabled
       configuration hash MD5:
       00 E9 B6 7A A2 85 ED C7 34 08 36 98 17 FE 4E 26
       data hash MD5: 16K
       98 52 77 FE CF F2 C1 E6 79 D8 E7 36 B6 54 0C BE>)
$$ ##END=
$$ 
$$ hash MD5
$$ 1B 3C D8 95 2B A6 0E 1C 51 94 3D CD 72 05 6F 2A
##$RELAX= 
##$RELAX= 
##$RELAX= 
##$RELAX= 
##$RELAX= 
##$RELAX= 
$$ Bruker specific parameters
$$ --------------------------
##$DU= <F:/spectra>
##$EXPNO= 1
##$NAME= <H-F>
##$PROCNO= 1
##$TYPE= <nmr>
##$USER= <she>
##$AMP= (0..31)
100 100 100 100 100 100 100 100 100 100 100 100 100 100 100 100 100 100 
100 100 100 100 100 100 100 100 100 100 100 100 100 100 
##$AQSEQ= 0
##$AQ_mod= 1
##$AUNM= <au_zg>
##$AUTOPOS= <>
##$BF1= 200.13
##$BF2= 200.13
##$BF3= 200.13
##$BF4= 200.13
##$BF5= 200.13
##$BF6= 200.13
##$BF7= 200.13
##$BF8= 200.13
##$BYTORDA= 1
##$CFDGTYP= 0
##$CFRGTYP= 5
##$CHEMSTR= <none>
##$CNST= (0..31)
1 1 145 1 1 1 1 1 1 1 1 1 1 1 1 1 1 1 1 1 1 1 1 1 1 1 1 1 1 1 1 1 
##$CPDPRG= <>
##$CPDPRG1= <>
##$CPDPRG2= <>
##$CPDPRG3= <>
##$CPDPRG4= <mlev>
##$CPDPRG5= <mlev>
##$CPDPRG6= <mlev>
##$CPDPRG7= <mlev>
##$CPDPRG8= <mlev>
##$CPDPRGB= <>
##$CPDPRGT= <>
##$D= (0..31)
0 1.2 0 0 0 0 0 0 0 0.06 0 0.03 0 0 0 0 0.0002 0 0 0 0 0 0 0 0 0 0 0 0 
0 0 0 
##$DATE= 1608792162
##$DBL= (0..7)
120 120 120 120 120 120 120 120 
##$DBP= (0..7)
150 150 150 150 150 150 150 150 
##$DBP07= 0
##$DBPNAM0= <>
##$DBPNAM1= <>
##$DBPNAM2= <>
##$DBPNAM3= <>
##$DBPNAM4= <>
##$DBPNAM5= <>
##$DBPNAM6= <>
##$DBPNAM7= <>
##$DBPOAL= (0..7)
0.5 0.5 0.5 0.5 0.5 0.5 0.5 0.5 
##$DBPOFFS= (0..7)
0 0 0 0 0 0 0 0 
##$DE= 6
##$DECBNUC= <off>
##$DECIM= 32
##$DECNUC= <off>
##$DECSTAT= 4
##$DIGMOD= 1
##$DIGTYP= 9
##$DL= (0..7)
0 120 120 120 120 120 120 120 
##$DP= (0..7)
150 150 150 150 150 150 150 150 
##$DP07= 0
##$DPNAME0= <>
##$DPNAME1= <>
##$DPNAME2= <>
##$DPNAME3= <>
##$DPNAME4= <>
##$DPNAME5= <>
##$DPNAME6= <>
##$DPNAME7= <>
##$DPOAL= (0..7)
0.5 0.5 0.5 0.5 0.5 0.5 0.5 0.5 
##$DPOFFS= (0..7)
0 0 0 0 0 0 0 0 
##$DQDMODE= 0
##$DR= 18
##$DS= 0
##$DSLIST= <SSSSSSSSSSSSSSS>
$$ [...]
##$SUBNAM2= <"">
##$SUBNAM3= <"">
##$SUBNAM4= <"">
##$SUBNAM5= <"">
##$SUBNAM6= <"">
##$SUBNAM7= <"">
##$SUBNAM8= <"">
##$SUBNAM9= <"">
##$SW= 16.9725356469052
##$SWIBOX= (0..15)
0 0 2 0 0 0 0 0 0 0 0 0 0 0 0 0 
##$SW_h= 3396.73913043478
##$TD= 16384
##$TD0= 1
##$TE= 0
##$TE2= 300
##$TE3= 300
##$TEG= 300
##$TL= (0..7)
0 120 120 120 120 120 120 120 
##$TP= (0..7)
150 150 150 150 150 150 150 150 
##$TP07= 0
##$TPNAME0= <>
##$TPNAME1= <>
##$TPNAME2= <>
##$TPNAME3= <>
##$TPNAME4= <>
##$TPNAME5= <>
##$TPNAME6= <>
##$TPNAME7= <>
##$TPOAL= (0..7)
0.5 0.5 0.5 0.5 0.5 0.5 0.5 0.5 
##$TPOFFS= (0..7)
0 0 0 0 0 0 0 0 
##$TUNHIN= 0
##$TUNHOUT= 0
##$TUNXOUT= 0
##$USERA1= <user>
##$USERA2= <user>
##$USERA3= <user>
##$USERA4= <user>
##$USERA5= <user>
##$V9= 5
##$VALIST= <valist>
##$VCLIST= <CCCCCCCCCCCCCCC>
##$VD= 0
##$VDLIST= <DDDDDDDDDDDDDDD>
##$VPLIST= <PPPPPPPPPPPPPPP>
##$VTLIST= <TTTTTTTTTTTTTTT>
##$WBST= 1024
##$WBSW= 4
##$XGAIN= (0..3)
0 0 0 0 
##$XL= 0
##$YL= 0
##$YMAX_a= 117606
##$YMIN_a= -144700
##$ZGOPTNS= <>
##$ZL1= 120
##$ZL2= 120
##$ZL3= 120
##$ZL4= 120
##$ABSF1= 10
##$ABSF2= 0
##$ABSG= 5
##$ABSL= 3
##$ALPHA= 0
##$AQORDER= 0
##$ASSFAC= 0
##$ASSFACI= 0
##$ASSFACX= 0
##$ASSWID= 0
##$AUNMP= <proc_1d>
##$AZFE= 0.1
##$AZFW= 0.1
##$BCFW= 1
##$BC_mod= 2
##$BYTORDP= 1
##$COROFFS= 0
##$CY= 11.3945322036743
##$DATMOD= 1
##$DC= 2
##$DFILT= <>
##$DTYPP= 0
##$F1P= 15.9154993809931
##$F2P= -4.1035820241983
##$FCOR= 0.5
##$FTSIZE= 0
##$FT_mod= 4
##$GAMMA= 1
##$GB= 0.15
##$INTBC= 1
##$INTSCL= 1
##$ISEN= 128
##$LB= 0.24
##$LEV0= 0
##$LPBIN= 0
##$MAXI= 10000
##$MC2= 0
##$MEAN= 0
##$ME_mod= 0
##$MI= 1.114404
##$NCOEF= 0
##$NC_proc= 0
##$NLEV= 6
##$NOISF1= 3.799351
##$NOISF2= 2.8
##$NSP= 1
##$NTH_PI= 0
##$NZP= 0
##$OFFSET= 15.70392
##$PC= 1
##$PHC0= -10770.97
##$PHC1= 20.40095
##$PH_mod= 1
##$PKNL= yes
##$PPARMOD= 0
##$PSCAL= 0
##$PSIGN= 0
##$REVERSE= no
##$SF= 200.130013532006
##$SI= 16384
##$SIGF1= 3
##$SIGF2= 2
##$SINO= 400
##$SIOLD= 16384
##$SREGLST= <1H.CDCl3>
##$SSB= 0
##$STSI= 0
##$STSR= 0
##$SW_p= 3612.71676300578
##$SYMM= 0
##$S_DEV= 0
##$TDeff= 0
##$TDoff= 0
##$TI= <>
##$TILT= no
##$TM1= 0
##$TM2= 0
##$TOPLEV= 0
##$USERP1= <user>
##$USERP2= <user>
##$USERP3= <user>
##$USERP4= <user>
##$USERP5= <user>
##$WDW= 1
##$XDIM= 8192
##$YMAX_p= 0
##$YMIN_p= 0
$$ End of Bruker specific parameters
$$ ---------------------------------
##NTUPLES= NMR FID
##VAR_NAME=  TIME,          FID/REAL,        FID/IMAG
##SYMBOL=    X,             R,               I
##VAR_TYPE=  INDEPENDENT,   DEPENDENT,       DEPENDENT
##VAR_FORM=  AFFN,          ASDF,            ASDF
##VAR_DIM=   8192,          8192,            8192
##UNITS=     SECONDS,       ARBITRARY UNITS, ARBITRARY UNITS
##FACTOR=    0.0002944,     1,               1
##FIRST=     0,             0,               0
##LAST=      2.4114304,     0,               0
##MIN=       0,             -144700,         0
##MAX=       2.4114304,     117606,          0
$$ Real data points
##PAGE= N=1
##DATA TABLE= (X++(R..R)), XYDATA
0@%%%%%%%%%%%%pJ5j6J6j6K3l1L2l9M7n5P0q0Q8j03J20j42J65j87K11k38K71l06
35a62L44l88M35m84N38n98O66p40Q17r03R99j102J212j334J471j620J784j965
53a030K166k393K649k939L273l664M124m673N349o198P297q788J0926j4253K0142
68A1988l3463J11583P146k41954J76011K5002q7763J6677K6561j1222M0372q5757
80d4819N3520M9669j06796M7799K8627k7148k6322M4102J0325n2754J5138M2321
92C3662k2680o1962Q0690k4485j2811J2948k5928N2341k5808l2144K8414K3406
104B5643m9841K1198j197k578L6977p0546M6010J9875m2145l80L0393j8637j4875
117b0103L2642k6175J8124j1286J3056j0115m297J6224k4264K8381k8452R181
$$ y = [0, 0, 0, 0, 0, 0, 0, 0, 0, 0, 0, 0, 0, -7, 8, -8, 8, -8, 15, -16, 16, -23, 24, -31, 39, -41, 47, -56, 64, -78, 87, -100, 111, -127, 144, -162, 182, -206, 229, -255, 283, -315, 351, -389, 428, -475, 524, -578, 634, -700, 771, -849, 935, -1030, 1136, -1257, 1392, -1547, 1726, -1938, 2186, -2487, 2862, -3336, 3961, -4827, 6099, -8154, 11988, -21475, 90108, 97254, -144700, 31311, 56313, -31450, -14773, 11788, 566, 40938, -44819, 8701, 58370, -48426, -627, 28000, 852, -25470, 18632, 28957, -23797, -8659, 33662, 10982, -50980, 29710, 5225, -7586, 5362, -20566, 31775, 5967, -26177, 2237, 25643, -24198, -3000, -4197, -6775, 30202, -40344, 5666, 25541, -16604, -16984, 13409, -5228, -20103, 12539, -13636, 4488, -6798, 6258, -3857, -8154, 8070, -16194, 12187, -16265, -7084]
129g084K7425k0827k9800N5460o679o1787O8579k9575p715K5619k2356L231K5405
142A9896j9701j8812M5799l5691J0123k998l716J9991k0906R427n399J4424j3894
155a457M353n528Q508k729j2453K7597l1049K5672n478j6827J6527K789j5237
168e312m599K3668k2761J9876k0429R313J5384k7169J6060n833l32l773J5039
181I132k3460J4790J0857k4198J5012n540J4075k4497Q273R260m514l349n243
194i402J8576j4741Q481j3790J7065q587q417J9815j9472J2526j03Pj2946K0515
208I527p788j1856J5181j3221J7264j5913P415O45K160j354n049R251j1689J5125
222I698j7697J2100q91L2J77j1056K3179j6029j046k787J5285j2718n74Q814r619
$$ y = [-7084, 20341, -486, -30286, 25174, 18495, -43292, 25287, -4288, -12003, 13616, -8740, -5509, 19896, 195, -18617, 27182, -8509, 1614, -1384, -5100, 14891, -6015, 3412, -1987, 12437, -1457, 2896, -2632, 5876, 3147, -9306, 18291, -12758, 12914, 7436, -9391, 7136, 9925, -5312, -9911, 13757, -9004, 10872, -9557, -244, 15140, -12029, 4031, -1802, -2134, -5907, 9132, -14328, 462, 11319, -12879, 2133, -3407, 10668, -13829, -5556, 3704, -810, -4159, -9402, 9174, -5567, 2914, -10876, 6189, -2398, -10815, 9000, -10472, 2054, 1951, 1958, -10988, 9527, 1739, -10117, 5064, -8157, 9107, -6806, 609, 1254, 3414, 2060, -2989, 6262, -5427, 9698, -7999, 4101, 3210, 3242, 3419, -7637, 15542, -487, -1533, -4320, 10965, -1753, -2327, 6487, -3132]
237c132J4747j9185J4396m911l159L119j474k69m875J7360k1993J3205j976M0
251A893l052p330J5145j1531O227r173J4924q827q07L643l843Q199j7053J5771
265D186q507M923l031j180N805n109N429j2146J6234j3707O565J021o482R325
279C326p276Q027j0169J1358q946M728l162m94J1151j6565J2044n778R596j1180
293c340J988O386n585K697p820J5053j3336Q404l682l00N937j1087R197p494Q893
308E911q557O750n150K786N585j3152J1590q723Q344q531L336J113n64J880q590
323e972J3558j0552O264r346O102L871r078N911n718J1273j1361N609l878M670
337A353j992o340J1135j1487J0902r159N579q95N40j88o269J0802r801R491j1085
$$ y = [-3132, 11615, -7570, 6826, 1915, -1244, 1875, 401, 132, -4743, 12617, -9376, 3829, 1853, 1893, -1159, -8489, 6656, -4875, 1352, -7821, 7103, -1724, -2531, 1112, -2731, 5468, -11585, 4186, -4321, 602, -2429, -3609, 2196, -2913, 2516, -9630, 6604, -7103, -538, 483, -5999, 3326, -3950, 4077, -6092, 5266, -3680, 1048, -2114, -2608, 8543, -8022, 4022, -1756, 7840, -3340, -1352, 5034, -551, 2146, -5674, 9379, -3957, 4447, 765, 465, 6402, -4685, 4512, -2982, 5911, -2646, 4104, -1046, 1740, 7325, -5827, 5763, -2960, 5384, -3147, 189, 1302, 738, 2618, -5972, 7586, -2966, 3298, -6048, 54, 3925, -5153, 758, -4960, 6313, -5048, 561, -3317, 1353, -639, -6979, 4156, -7331, 3571, -5588, -9, -904, -364, -552, -6821, 3981, -5820, 3671, -7414]
352g414Q067J138m501L456n565J0841j1223O891m981O662k836m249Q384p674J0027
367G023j1920P098k160K109p55m221P438o692R277j1924Q806k335j714J647l987
382b310Q655r619O475m533P133o329j219N079n107P085j0483R517n746L519j718
397C99j716M702p193Q266r733Q227n532L557j721l733R284q456M587p190J0671
412D419o864r82K855j769O183j1413J0010m664M445p038K486N520p380N613p109
427e688J0428q203M147j920l16M005o561P121p957R567o941L094R1j929N576q546
443d032O912n167Q310r044K348M041k733K692q281J1389p867M360l702J937K496
458C659m907M365n878J0343j0344M569j955Q15L322p857O266m565P959r636L697
$$ y = [-7414, 653, 1791, -2710, 746, -4819, 6022, -5201, 1690, -3291, 3371, 535, -3714, 4670, -3004, 7023, -4897, 2201, 41, 2150, 1395, -2826, 4612, -2080, 7197, -4727, 4079, 1744, 30, 1677, -2310, 6345, -3274, 3201, -1332, 5801, -528, -1747, 3332, -1775, 5310, -5173, 4344, -1402, 2117, 399, -1317, 3385, -3808, 4458, -5275, 2952, -2580, 977, -744, -4477, 4807, -3649, 938, -6252, 4419, -2445, -3427, -572, -2341, 3842, -7571, 2439, -2225, 2220, -4818, -2332, 3188, -4192, 1421, -5688, 4740, -3463, 684, -1236, -1552, 2453, -4108, 3013, -4944, 4623, -2318, 776, 867, -1062, 4514, -4032, 2880, -2287, 6023, -3021, -673, 3368, 635, 3327, -4954, 6435, -1432, 2928, -774, 1163, 3659, -1248, 3117, -2761, 7582, -2762, 1807, -148, 667, 3989, -3868, 2398, -2167, 5792, -3844, -147]
473a47J499r24J79n600J0722j0348O606l772J566L51j475K529o724R372p476N199
489A557o697N083L222p619M265l742R603j0775K663K628J847m696k376J1112j1035
504d960O436m677M322j334j312K231m515Q277p718O586o232M949j142k318M367
519B960o740R815q810M154j190L022k597k085N591n811P761r844O297j147J034
534B410k005l164R420q313L155l631P309o828k08M911m566N237p756O960m989
549b058M117k736j448L812m942O876p512N523m207M656l279k631P628o990L330
564A39m414Q107p439K760O88l210O538p212M487m673P230n301M18K588k804N073
580B975q070P416l692L470n230K129N345p059M268m588Q026p349L543m19r93L175
$$ y = [-147, 1352, 428, 607, -4993, 5729, -4619, 1987, -1785, -219, 132, -1343, 1186, -5538, 3834, -3642, 1557, -5140, -57, 3165, -4454, -189, -3931, 5672, -5103, -2440, 188, 2035, -2661, -5037, 6075, -4960, 1476, -3201, 1121, -213, -1525, 706, -3809, 4468, -3250, 3336, -2896, 2053, 911, -1407, 2960, -3780, 6035, -2775, 1379, 189, 3211, 614, -1471, 4120, -1691, 6070, -3774, 2523, 1376, 2410, 405, -2759, 6661, -1652, 1503, -2128, 5181, -1647, -1855, 3056, -1510, 3727, -4029, 2931, -2058, 2059, -677, -2125, 1687, -3255, 3621, -3891, 1632, -2575, 2081, -1198, -3829, 3799, -3191, 139, -4275, 3832, -3607, -847, -159, -3369, 3169, -4043, 444, -4229, 3001, -2300, -1882, 706, -2098, 2975, -5095, 2321, -1371, 2099, -3131, -1002, 4343, -2716, 1552, -3036, 4990, -2359, 1184, 765, -228, 2947]
596B947n338O468o391N900m420K379r51r25M515p233O359m397N822o031M73M029
612C206k093J70n526J0610q189K041k10J565Qn069O584n674N616o437M143j173
628d28o38K666m877N168o168P818o931J904K170j742N55l665P812p569N225m133
644b833K948M41l672L785m302O701o028L852l161K607J186n134N743m191N014
659B956o843N128m51j170J390k740N806o560N168m716M449j694j336L093m580
674b100O778o432M648l711K998j422k251M620l922N007o870N323k457J489o50
689A048l220O013n296M099n238N434k651p30J021j926N065p703N201l059L518
704A576l938J080L487m726M468n067M767m561L185k049o89L499m642O264p068
$$ y = [2947, -2391, 4077, -2314, 3586, -834, 1545, 594, -331, 4184, -3049, 3310, -1087, 4735, -1296, -823, 3206, 1113, 1283, -4243, 6367, -1822, 219, 9, 1574, 1582, -3487, 3097, -2577, 3039, -3398, 745, -428, -1066, 1600, -3277, 1891, -4277, 3541, -3390, -1486, 684, -1058, -503, -4168, 3644, -3925, 1300, -2833, 115, 556, -3116, 669, -3633, 3068, -2960, 892, -2269, 338, 1524, -3610, 2133, -2058, 2956, -3887, 1241, 790, -380, 1010, -1730, 4076, -2484, 2684, -2032, 2417, 723, -613, 2480, -2100, 4678, -1754, 2894, -817, 2181, 759, -1492, 3128, -794, 4213, -2657, 2666, 209, 1698, 1048, -2172, 3841, -1455, 2644, -2594, 2840, 189, -541, 480, -1446, 3619, -4084, 1117, -1942, 1576, -2362, -1282, 2205, -2521, 1947, -3120, 1647, -2914, 271, -1778, -2467, 1032, -3610, 2654, -4414]
719d414N968l099R35j47j367M590o250N350m682N610l923Q9J707j819L510o139
735d081O965m553K875k473J458J602l697M428n182O813n788L507j370l30K566
750B740l993M158n211O017l952Q46j44K05K325n575N916m426L898n009L054J156
766B005k451J949l995O269o052M129k959J608R51l743M114m652N213n502M500
781A384k161P1J609l911N007n150N137m625K224J45q68K008m827N904m570L936
797A313m438L539r5k794L104l348N577o096M240k454J887j17k278M151m128M474
813B537n047M414k176M68R55k704M776n274M824m347L823j582l17J278l014M666
829C280n217M723m004L308j020j855K832l354M690n876M693k384J271r86j409
$$ y = [-4414, 1554, -1545, -610, -757, -2124, 2466, -3784, 1566, -3116, 2494, -1429, -1340, 367, -1452, 2058, -4081, 2884, -1669, 1206, -1267, 191, 1793, -1904, 2524, -2658, 4155, -1633, 1874, 504, 174, 2740, -1253, 2905, -2306, 3711, -241, 605, 461, 666, 2991, -2584, 3332, -1094, 2804, -2205, 849, 2005, -446, 1503, -2492, 3777, -2275, 1854, -1105, 503, 1454, -2289, 1825, -2827, 2386, -3116, 1384, -777, -706, 903, -3008, 1999, -3151, 1986, -2639, -415, -270, -1138, 870, -3957, 1947, -2623, 1313, -3125, 414, 319, -2475, 629, -2719, 2858, -3238, 1002, -1452, 435, 318, -1960, 2191, -1937, 2537, -2510, 1904, -272, 196, 1151, -1553, 3223, -2051, 2773, -1574, 2249, 667, 350, 1628, -1386, 3280, -1937, 2786, -1218, 2090, 1070, -785, 2047, -1307, 3383, -2493, 2200, -184, 1087, 101, -1308]
844a308M449n003L965m653M784k751p3M89j475L824n433N188m151L220k565L30
860a163J750l078M130m867M742l930L045j889k79K480l541M618n641N170k681
875a134J373j503M4L445n171M515l761M694m073J132J208j665K989m820N288l692
891a131K906l055K169Q76l388M517m656M615m099K806j673K14K190l418L793m294
907a628M890m269K671j917K12L018n261M292l150L674m334K104R00k159K028l590
923b519N207m510K668k690K738j91l085L556l631M086m538L900k581N66J597k654
939b081L382l787M080l916K070n86J16J086k986M500m081M897n253L275K04j794
955h74J953l060M452m765M228l039K151l31j935M165m155L775m637L635j873N82
$$ y = [-1308, 3141, -1862, 2103, -2550, 2234, -517, -590, -101, -1576, 2248, -3185, 2003, -2148, 1072, -1493, -1163, 587, -2491, 1639, -3228, 1514, -2416, 629, -1260, -1539, 941, -2600, 2018, -3623, 1547, -1134, 239, -1264, -1220, 2225, -2946, 1569, -2192, 2502, -1571, -439, 769, -896, 2093, -2727, 2561, -1131, 1775, -1280, 889, 1765, -1623, 2894, -1762, 2853, -1246, 1560, -113, 101, 2291, -1127, 2666, -1628, 3262, -1007, 1664, -253, -41, 2977, -2284, 2008, -1142, 2532, -1802, 302, 1202, -957, 1071, -2519, 2688, -1822, 846, -1844, 894, 703, -2382, 1174, -2457, 1629, -2909, 991, -1590, -1024, 573, -2081, 1301, -2486, 1594, -2322, -252, -838, -722, 364, -2622, 1878, -2203, 2694, -2559, 716, 920, -874, 1079, -1981, 2471, -2294, 1934, -1105, 1046, 715, -1220, 2945, -1210, 2565, -2072, 1563, -310, 272]
971B72Q51k039K758l310M534m592L734j596O4M42k601M251l651K975l895L770
987A967j271j655K381k071L212n299N138l490J559o40m02K068m041M781n073M199
1003A363k294J108m90j287K956l949L976m436M125j768o20J158j613L206m618
1018c183M662l144K366k119N10J965l328L969m397M210k949J926j039J32J393
1033I74k654L581m096M396l341J412r8o12K437l828M213l571L348k995J794J68
1049A128j335K823l959L804l253L047l212R31J851k842L152l297M046m424K866
1064A326j730j18K116l024M344m375L332l389J804N55r44R11l225M262l789K981
1080A037k431J624K99k078K623l258L591l501K979j801K43O53j458K899l928M050
$$ y = [272, 1123, -916, 1842, -1468, 3066, -1526, 2208, 612, 676, 1118, -1483, 2768, -883, 2092, -1803, 1967, 696, -959, 1422, -649, 2563, -2736, 2402, -1088, 471, -169, -571, 1497, -2544, 2237, -2836, 1363, -931, 177, -313, -1600, 1356, -2593, 1383, -3053, 1072, -696, -1316, -158, -1771, 1435, -3183, 1479, -1665, 701, -1418, -908, 1057, -2271, 1698, -2699, 1511, -1438, 488, -551, -419, 974, -1680, 1901, -2195, 2201, -1140, 272, 174, -438, 1999, -1829, 2384, -1187, 2161, -834, 960, 1128, -207, 2616, -1343, 2461, -792, 2255, -957, -26, 1825, -1017, 2135, -1162, 2884, -1540, 1326, -404, -522, 1594, -1430, 2914, -1461, 1871, -1518, 286, 841, -103, 808, -2417, 1845, -1944, 1037, -1394, 230, 529, -1549, 1074, -2184, 1407, -2094, 885, -916, -673, -20, -1478, 1421, -2507, 1543]
1096A543l869K644j210O84N36k601L783l263K952l436L136q28o80J406k234L703
1112B266m242L516k236J603o30o76K370l436L837l700L127k114J223O5j962K932
1128A943k471K906l791L147j521K21L55j570L324m226L587k776K530j937j55J716
1144A282k176K672l739L695k997J887j120m29J991l107L597l834L110k361K021
1159D92r40j029K529k813L061l923L851k408N78L86j085K547l718L525k631K460
1175H82k517J176J294k348L065l580L619k650J383j050Q51L47j599K814k643L098
1191B142k722J627o91o46K621l310L522l082L056k512L9Q35n50J336l158M009
1207B516l443K582k002R64N15j876K224k885L626l514K459j329K47P74k095K592
$$ y = [1543, -2326, 318, -892, -208, 328, -2273, 1510, -1753, 1199, -2237, 899, 71, -609, 797, -1437, 2266, -1976, 1540, -696, 907, 277, -399, 1971, -1465, 2372, -1328, 1799, -315, 908, 973, -989, 1943, -528, 2378, -1413, 1734, 213, 434, 789, -781, 2543, -1683, 1904, -872, 1658, -279, -434, 1282, -894, 1778, -1961, 1734, -1263, 624, -496, -925, 1066, -2041, 1556, -2278, 832, -1529, 492, -448, -1477, 1052, -1761, 1300, -2623, 1228, -1180, -602, -216, -1301, 1246, -2472, 1053, -1578, 882, -1635, -459, 835, -1513, 1552, -2028, 1591, -1059, 324, -726, 125, 472, -1127, 1687, -956, 2142, -580, 1047, 356, -290, 2331, -979, 2543, -539, 2517, 5, 44, 879, 329, 1665, -1493, 2516, -927, 1655, -347, 617, 1132, -744, 1480, -1405, 2221, -1293, 1166, -163, 84, 858, -1237, 1355]
1223A355l064L465l276J838q00n8J185k734L323k787K748k842J529Q0j154J524
1239C32k304L408l543K552j853J467N2j447K271k594L120l346K782j719O96N51
1255D25j471K111k617L231l131K303j147K28Q10j884K961k901K596k594K378r58
1271C40o09J165j820K960l360K994k214J534l82r34K114k682K375k629K585j700
1287b63R11m43j044K381l138K916k490K169j506N05R42k150K545l323L293k637
1303a332K191j167j44J078k517L203k897K685k440J522r52o8J465k335K710l072
1319b070K892j367M50j79q01J560k252K869j846J300j279R69q2j018K110k188
1335i32L044k941J575n14J01L16j294K146l055L394j820Q44p77L29J049k178K275
$$ y = [1355, -1709, 1756, -1520, 318, -482, -540, 645, -2089, 1234, -1553, 1195, -1647, -118, -38, -1192, 332, -1972, 1436, -2107, 445, -1408, 59, 111, -1336, 935, -1659, 1461, -1885, 897, -822, -126, 425, -1046, 1065, -1552, 1679, -1452, 851, -296, -68, 742, -1142, 1819, -1082, 1514, -1080, 1298, 340, -269, 896, -924, 2036, -1324, 1670, -544, 990, 608, -326, 1788, -894, 1481, -1148, 1437, -263, 648, 205, -839, 1542, -1596, 1320, -1170, 999, -507, -2, 940, -1210, 1335, -1988, 1305, -1332, 859, -308, -452, 626, -1891, 1312, -1585, 1100, -1340, 182, -770, -838, 627, -1708, 1002, -2070, 822, -545, -95, -274, -1075, 485, -1767, 1102, -744, 556, -723, 246, 164, -854, 1256, -932, 2112, -829, 746, 232, 333, 649, -645, 1501, -1554, 1840, 20, 864, 87, 416, 1465, -713, 1562]
1352A562k125K420k514J378K17p91J012k027K504k730K065j985K184m60j541J959
1368A128j417J831k749K077k105M01Q69j164K437l100L412k717J492j125r7J132
1384C05j315K045k071J492k460K104k22l85O25j802K958k910K293j538J459j281
1400g03l66J686j877K259k202K030j271Q99R1r17J269j533K309j570P00p63j10
1417f9O5j337L168k003J810k069J961j012k14K19n22J027j652K241j966J413p05
1434C55k90J476k514K082j755K684k521R25Jm53J258l232K765k486K676j079N49
1451D41j22j160K096k904K056j725K248j533l28J365j491J717k103K124j559R57
1467G9o54J46Q20j532K005k239K261j779P52k40m09J464j635K057k215K008j626
$$ y = [1562, -563, 1857, -657, 721, 938, 147, 1159, -868, 1636, -1094, 971, -1014, 1170, 710, -831, 1128, -289, 1542, -1207, 870, -1235, -834, 35, -1129, 1308, -1792, 1620, -1097, 395, -730, -827, 305, -1010, 1035, -1036, 456, -2004, 100, -122, -507, 118, -1684, 1274, -1636, 657, -881, 578, -703, -1069, 617, -1260, 999, -1203, 827, -444, 455, 546, -371, 898, -635, 1674, 104, 804, 41, -69, -4, -1341, 1827, -176, 1634, -435, 1526, 514, 300, 519, -3, 1024, -628, 1613, -353, 1060, 355, 65, 1541, -973, 1109, -646, 2038, -483, 442, 443, -10, 1248, -1984, 781, -1705, 971, -108, 441, 319, -841, 1255, -1649, 407, -1318, 930, -603, -931, 434, -1057, 660, -1443, 681, -878, 79, -575, -429, 391, -1141, 864, -1375, 886, -893, -141, -381, -790, 674, -961, 1096, -1119, 889, -737]
1484g37Q47J10m64J188j747K032k034J946j399O01K89q02J421k023K314k312J975
1501A205j113J97L30j088J480j926K405k295J489o61J40N77j384K013k213K027
1517A183j916J139l30n30J195j572J832k237K114j814J109k08o96J290j997K355
1533I17j988J531j245P59k6r66J724j965K079k417J888r42r6P87j162J972k042
1550a192J925j856J532n26l74J185j585J704j728J910j607R72j49m58R82j369
1566f34K171k290J677j337Q00j3q08J667j722J593j754K016j333R7M66q10J541
1583A327k296K288j798J175p72J37N67j378J685j930J754j560J293q53j39R82
1599D82j417J909k381K066j232P32n00m29J503k029J763j614J816j498M53L92
$$ y = [-737, 110, 220, -244, 944, -803, 1229, -805, 1141, -258, 343, 632, -170, 1251, -772, 1542, -770, 1205, 92, 289, 619, -469, 1011, -915, 1490, -805, 684, 23, 163, 740, -644, 1369, -844, 1183, -733, 406, 76, -454, 741, -831, 1001, -1236, 878, -936, 173, -35, -731, 559, -1438, 917, -1071, 460, -785, -26, -52, -1018, 706, -1259, 820, -1597, 291, -651, -747, 40, -1122, 850, -1192, 733, -1123, 409, -117, -491, 694, -891, 813, -915, 995, -612, 360, 211, -247, 735, -634, 1537, -753, 924, -413, 387, 374, -434, 1233, -489, 1104, -650, 1366, 33, 130, 596, -214, 1327, -969, 1319, -479, 696, -76, 61, 628, -750, 935, -995, 759, -801, 492, -361, -500, 482, -935, 974, -1407, 659, -573, 159, -341, -770, 733, -1296, 467, -1147, 669, -829, -376, 16]
1615A6q94J476k328K412j908J510j010N51M49j167J713k139K381j964J331n15
1631h6j26P04j409K028j978J918j575J028n62J76Q96k036K218j664J641j621J085
1648F37R0o15R24j659K007j808J331r40L24L43j026J457j650J681j691J120q39
1665c14L98O54j581J605j831K103k005J290p97K29L97j194J978j866J600j774
1681a108J159l05n57R99j271J771j954J694j275R42k79m77J208j614J698j777
1697a146J321q65P63J00p27J166j569J892j941J569p83J45M65j106J982k036J618
1714H48j545J338n49k84P39j030J677j872J578j191N80J61n92J191j696J752j790
1731f85J897j317J84J46o40J483j764J952j948J539q88j55P02j127J595k220J896
$$ y = [16, -878, 598, -1730, 682, -1226, 284, -726, -175, 274, -893, 820, -1319, 1062, -902, 429, -86, -212, 492, -917, 1111, -867, 1051, -524, 504, -58, 118, 1014, -1022, 1196, -468, 1173, -448, 637, 727, 112, 1036, -623, 1384, -424, 907, -33, 291, 634, -392, 1065, -585, 1096, -595, 525, -314, 84, 738, -843, 762, -1069, 1034, -971, 319, -478, -249, 148, -1046, 932, -934, 666, -1108, 51, -254, -811, 188, -1083, 688, -1266, 428, -847, 95, -184, -661, 547, -1067, 631, -1146, 175, -690, 73, 173, -554, 612, -957, 935, -1006, 563, -220, -75, 390, -716, 1266, -770, 848, -697, 641, 92, -192, 547, -483, 1194, -678, 900, -291, 289, 450, -142, 1049, -647, 1105, -685, 1212, -105, 79, 225, -415, 1068, -696, 1256, -692, 847, -41, -196, 506, -621, 974, -1246, 650]
1748F50j821J504m86k11O51j204J754k187K111j457Q56o16j06Q54j219J534j843
1765a236J988j397M75Q9o05Q11j220J738j608J604j333R40j52p95J277j592J898
1782H82j478J178q04K20L17p61J331j661J831j400J044o43J03N30j187J840j758
1799d16J299j462J339l83m73R57j491J723j828J780j624J208l82n87J378j987
1815i49J808j584J096p92O31k2r46J179j334J616j701J282n43J80J83j263J823
1832F64j625J163j203J346n56l47N43q63J417j620J484j068Q51n28j1Q23j611
1849a141J864j658J460j285Q38L2m70R20j166J652k144K021j097N25j91m39J145
1866H66j834J903j665J327n54J85O54j259J565j804J696j603J114n45KN99j288
$$ y = [650, -1171, 333, -153, -364, 287, -917, 837, -1350, 761, -696, 160, -456, -562, 292, -927, 607, -1236, 752, -645, -170, -81, -686, 125, -1095, 643, -965, 639, -694, 246, 94, -701, 576, -1016, 882, -596, 582, -222, -2, 315, -446, 885, -776, 1055, -345, 699, 56, 159, 689, -498, 1342, -416, 883, -579, 760, 377, -96, 861, -630, 1093, -735, 1045, -579, 629, 247, -340, 1038, -949, 859, -725, 371, -421, 210, 188, -758, 421, -913, 703, -998, 284, -259, -79, 104, -1159, 664, -961, 202, -1001, 345, -211, -558, -15, -878, 539, -1081, 403, -665, 186, -342, -353, 470, -1141, 723, -935, 525, -760, 78, 110, -360, 560, -606, 1046, -1098, 923, -174, 351, 160, -279, 866, -968, 935, -730, 597, 43, 228, 882, -377, 1188, -616, 1080, -523, 591, 46, 48, 647, -641]
1883f41J734j896J371j061R17k42n43R92j435J527j511J558j272L56J48m79R69
1900D92j559J679j486J607j360M52L31q37J224j744J767j451J051n00m4P13j273
1917i38J762k021J865j546J020k92j23M59q77J355j488J392j252Q92j56l02R40
1934F90j544J643j181J028p01M17K45n43R13j468J828j532J066j035L77L60r89
1951d26J326j295J350j262J098q03K3O46j206J549j831J936j755J120l58j54O40
1968E98j428J432j460J367j266P59K8o79J046j548J777j756J603r21J28J01n42
1985g61J246j683J706j365J290p52q8O87j165J614j723J639j287J029p20J61M68
2002B96j187J701j782J591j542J150j83n16J423j542J729k034J539n22R6L3l36
$$ y = [-641, 1093, -803, 568, -493, 424, 182, -361, 631, -804, 723, -788, 770, -502, -146, 2, -477, 492, -1067, 612, -874, 733, -627, -175, 156, -681, 543, -1201, 566, -885, 166, -334, -378, 335, -938, 824, -1197, 668, -878, 142, -150, -273, 186, -691, 664, -824, 568, -684, 208, 52, -250, 690, -854, 789, -392, 636, -65, 352, 597, 54, 967, -501, 1327, -205, 861, -174, 203, 563, -426, 900, -395, 955, -307, 791, -12, 11, 657, -549, 1000, -831, 1105, -650, 470, 112, -42, 598, -830, 602, -858, 509, -757, 2, 30, -649, 397, -1151, 626, -1130, 473, -448, -320, -219, -761, 485, -1198, 508, -857, 433, -319, -407, 280, -885, 729, -994, 645, -642, 387, -333, -172, 296, -891, 810, -972, 619, -923, 227, 44, -472, 951, -591, 1138, -896, 643, 121, 217, 250, -86]
2019h6J371j906J652j290P10l37J19K65q94J056j021J537k288J499j306N11J379
2036I71q59P81j853J287j031J384j006n2R44j125R99j287J654j376N69j35k28
2053c63P70j538J690j445J460j493R46J73j189J542j504J667j525J340j156M08
2069b17L69o65Q99j408J749j327J033o84P0O62j300J439j146J296j407R67l08
2086B2r7O46j190J801j775J328j079N49N5n70J179j539J726j575J369j126L84
2103A08N58r65R83j243J512j461J125r10J63O85j184J429j468J574j565J050m29
2120c8k50M24j069J628j472J173j338J105l32k70O99j141J448j647J838j466Q99
2137A91k69n94J195j441J252j204J275o79J94j85m87J097r16J164j162R05o37
$$ y = [-86, 1285, -621, 1031, -259, 451, 114, 233, 498, -396, 660, -361, 1176, -1112, 387, -919, -408, 971, 112, 893, -960, 327, -704, 680, -326, -378, 566, -559, 440, -847, 807, -569, 0, -135, -363, 407, -1131, 559, -886, 574, -919, 27, 200, -989, 553, -951, 716, -809, 531, -625, -217, 152, -513, 386, -1022, 727, -600, 433, -251, -181, 481, -819, 620, -526, 770, -637, 330, 22, -75, 571, -619, 1182, -593, 735, -344, 205, 260, -310, 869, -670, 1056, -519, 850, -276, 108, 666, -299, 684, -559, 953, -508, 617, -293, -130, 555, -629, 800, -668, 906, -659, 391, -38, -288, 136, -933, 695, -777, 396, -942, 163, -169, -439, 260, -881, 567, -1080, 758, -708, 191, -78, -672, 523, -918, 334, -870, 405, -274, -80, -265, -752, 345, -571, 593, -569, 336, -301]
2154c01J90N18r19J450j673J420j214J108n75nN87r80J558j852J724j342R11m59
2172A46k23P56j184J380j350J322q76L95j85l57J018j477J398j349J201p17J99
2189I7K34p74J179j419J285j103J159p62l70R75j372J327j343J634j367Q33l24
2206a11l41O93j256J813j865J585j115N18Q0o47R34j144J296j249J400j041N27
2223G7j6n92J184j715K086j560R41n83J78M66j128J392j262J432j234Q43n55J49
2241A03M78r38J240j354J494j268M45k53N7O23r23R06j086J130r27M49K61o17
2259a80Q78j344J420j203Q53p28O29M0r67J269j283J179j202R06l68j32K76l66
2277c23Q13j628J746j382Q02k17l11Q26j080J144j208J252r98O17K2m68Q32j033
$$ y = [-301, -111, 407, -512, 938, -735, 685, -529, 579, 4, -1, 586, -394, 1164, -688, 1036, -306, 605, 146, -77, 679, -505, 875, -475, 847, -29, 366, 181, -176, 842, -635, 763, -586, 615, -102, 97, 331, -443, 736, -683, 602, -501, 658, -104, -474, 501, -871, 456, -887, 747, -620, 213, -111, -452, 241, -1015, 798, -1067, 518, -597, -79, 1, -646, 288, -856, 440, -809, 591, -450, 77, 61, -531, 653, -1062, 1024, -536, 405, -178, 0, 466, -662, 730, -532, 900, -334, 509, -46, 103, 581, -357, 883, -471, 1023, -245, 200, -53, 4, 627, -296, 610, -476, 654, -273, 176, 437, -180, 698, -646, 774, -429, 424, -304, 325, 365, -602, 667, -616, 563, -639, 267, -101, -233, 43, -323, 490, -1138, 608, -774, 28, -189, -500, 326, -754, 390, -818, 434, -564, 53, 75, -393, 439, -594]
2295e94J095j451J479p83N60k88j82R13j364J454j421J337p95J41J99o13J124
2312H11j172J228j122Q57o91L42L23r42J208j199R90j019R91n91J95J95p10J209
2330I03j656J326p20P06n89k79P83j169J500j414J423r76K07Q0l50M52j026J163
2348C64r62J122o88M4J93o23Q71j002J266j150P25m83m7M09n53J072j394J112
2366B76r07R73n57L3M60r49J141j191J231j082Q18k37r8L55p43J166j238R75p09
2385b83L71J74n26Q49j099J157j113J167o90L13K84r31J304j324J068j090P57
2402C88k62j60O19r14Q73j149J243r39O16P5o57R55j334J324j284R61o01M69k56
2421c3k65O53j266J424j137Q89p08k8O80o63R70j252J047q81J012q52K08J99o33
$$ y = [-594, 501, -950, 529, -254, 306, 18, -164, 749, -615, 839, -582, 755, -40, 101, 300, -313, 811, -361, 867, -255, 602, -89, 253, 576, -366, 842, -357, 633, -386, 605, 14, 209, 404, -306, 903, -753, 573, -147, 559, -30, -309, 474, -695, 805, -609, 814, -162, 45, 125, -225, 227, -799, 364, -598, 524, -164, -120, 73, -550, 321, -681, 585, -565, 160, -323, -370, 39, -514, 558, -836, 276, -631, 342, -215, -182, 278, -671, 470, -721, 510, -572, 246, 9, -89, 266, -477, 689, -549, 426, -283, 88, 262, -264, 585, -514, 643, -470, 697, 7, 320, 604, -327, 977, -347, 721, -369, 388, 126, -34, 585, -329, 544, -605, 638, -301, 315, 390, -267, 688, -646, 678, -606, 355, -246, 223, -33, -298, 355, -911, 513, -624, 265, -443, -471, 209, -454, 516, -736, 311, -570, 442, -410, -202, -3, -636]
2440f36J006j129J205r38Q11n61k24O77p04J283j362R62p60N94l17r0N18p41R14
2459E08r08J107p56L31k21n14J237j112J053j056J087q74K23L96o51R88r64Q18
2477F92j004P28o11O1M75n56P63j142J120p28M41l62K14K26q51Q86p65O76q07
2496e44N82J80l31L96j003P91o77J035r92P25k45o08J244j684J733j118R15n88
2514a89k03L72l25L78q06J455j267L64M91l77L96r04J042n90O86p60O84j20j07
2533B20J62p92R52r35J093o00L3M0m00J008j056J002r30Q59r51O82l6n60Q83j064
2553c90J032q81O86o32J44J21l20P99j228J069j040O70j25M9L40n59N34r76Q30
2572A23o33N67j43l57O24o81Q29j087R21q02M91J60l67M56m49Q53j050R22r71
$$ y = [-636, 370, -759, 446, -492, 319, -242, -466, 211, -493, 790, -572, 390, -370, 224, -93, -183, 335, -406, 508, -400, 707, -49, 282, 61, -453, 784, -328, 725, -331, 756, -118, 105, 501, -150, 838, -126, 692, -312, 416, -195, -134, 341, -215, 548, -594, 526, -202, 239, -123, 91, 317, -534, 352, -413, 263, -544, 38, 218, -113, 283, -720, 71, -606, 429, -563, 162, -83, -691, 553, -1131, 602, -516, 399, -189, -392, -20, -345, 33, -773, 682, -585, -221, 270, -107, 289, -615, 427, -163, 523, -237, 447, 327, 220, 382, -410, 542, -393, 700, 100, 133, 173, -227, 781, -275, 727, -203, 656, -295, 387, 351, -209, 674, -390, 642, -239, 447, -185, -41, 80, -240, 559, -669, 400, -640, 30, -95, -46, 294, -265, 269, -707, 123, -510, 57, -86, -443, 181, -500, 329, -758, 163, -639, -148, 12, -355, 101, -348, 505, -545, 377, -594]
2591e94O27n3k49P79j144J042p89O27m75L0L52o73R91j145J092p26M91j60jJ35
2611A57l98R34j180J020p69N62k90m9K82p09J117j110Q27m08M17k81j81L48r69
2630f80J176q56R04o79J33M4m83Q75j018J216j096P36l29k23M82q59R81o78P03
2649C49r81M87j35P8K35o92R70o45O79p00L50j6l57O75q93Q69q08R17p67M07K0
2670D2n46Q33q34Q87q86Q67l66p4L21o38O91o54J031j053O77m41L05K05o75P60
2690D52p59Q00n74N43l72l32P43q61R00q04P09o27L54m2k98N84r67Q77p13P37
2710C50n78K22J44l30N37p90J133j122N65o00K58N03o83O58q62O81n26M63k76
2729b53K6J82m96P40q48J039r48L39M9j34P00r53R04r42R29o37M31J26l31K91
$$ y = [-594, 33, -20, -269, 510, -634, 408, -381, 246, -229, -199, 153, -520, 471, -674, 418, -308, 183, 23, 22, 157, -241, 693, -487, 533, -236, 326, 36, -13, 269, -440, 677, -433, 394, -14, 403, 122, -59, 289, -680, 496, -360, 544, -135, -2, 42, -441, 434, -584, 632, -464, 272, -57, -280, 202, -657, 324, -354, 349, -632, -145, -280, -202, 33, -659, 311, -334, 345, -355, -5, -21, -378, 297, -596, 273, -535, 382, -385, 22, 42, -504, 329, -505, 382, -504, 363, -3, -77, 244, -394, 297, -357, 674, -379, 298, -143, 162, 367, -308, 452, -307, 493, -81, 462, 90, -242, 501, -360, 540, -264, 445, -182, 172, 130, -168, 416, -551, 326, -387, 350, -228, -6, 138, -192, 345, -445, 688, -434, 131, -469, -211, 292, -391, 267, -595, 86, -440, 23, -253, -227, -45, -541, 199, -649, 390, -558, -219, -170, -304, 396, -557, 347, -595, 334, -303, 128, 254, -77, 214]
2749B14m97P41q27N21l38K50Q8j21N53j253J263p86M13k51O9J18l52Q69j073J059
2769F60r08O89n05J39L00m35M56p09Q29q00N64j66l07N90r41J209j111R66o77
2788a57P3M56m49K90p33J128j228R38n71J90O2l83O59p25O71n93N58n54N5N63
2808B50o34P61p86P11p04O55k90j23K80q05J007p90R28p23L83j81jK05m98R90
2828F35j120O85m58L95J52n45P32j135J388j015P19m47k7K55m86P51q64J044j072
2847d13Q76l26j86N19p69Q36q79Q28p69M60n1l71P03q77P55q41P87n65L26J01
2867A44k96N64j374J307p05O27o58L46j25k89Q31o95P06p72O48l90M8r1r6M40
2887A70p97J029n83L26k29k15L93n85Q98p06Q38q53L78l5l97O47m26M86o67N47
$$ y = [214, -283, 458, -369, 152, -186, 64, 152, 31, 584, -669, 594, -192, 221, -30, 39, 157, -195, 674, -399, 660, -248, 441, -64, 75, 375, -60, 396, -313, 516, -284, 280, 114, -193, 397, -544, 665, -446, 520, -157, -84, 372, -77, 213, -520, 608, -620, 318, -253, -63, -1, -384, 275, -450, 221, -372, 186, -368, -313, 250, -384, 377, -409, 302, -402, 253, -37, -160, 120, -685, 322, -468, 460, -263, 120, -61, -62, 143, -355, 635, -485, 200, -258, 137, 289, -256, 476, -659, 729, -286, 433, -14, -41, 214, -272, 479, -385, 659, -413, 463, 137, -49, 470, -299, 537, -342, 486, -283, 177, 126, -245, 458, -419, 336, -505, 282, -283, 43, 144, -152, 412, -962, 345, -360, 267, -391, -45, -170, -459, 372, -323, 383, -389, 259, -131, -83, -174, -270, 170, -627, 402, -181, 145, -84, -299, 94, -491, 407, -299, 539, -314, 64, 29, -368, 279, -147, 339, -328, 219]
2907B19m65L74L11o61N70n52O44n47K42J41q9j99m0M90r82J022q11O57o12N46
2927B58M2o21O28m58N40p16K88j59P2K65n97Q36j104J212p32M76m63R8L72j073
2947h36J231p40N14n15J56J20k42P10r71O15m55P11n68L50Q0p67R59o89L94m72
2967d15N00j53j15L48l59O58r13Q56p96O13j20j84K30m60Q01p66Q42r40M85o0
2987E2q9N79q74J010r33M12J39n2l03j90J032r55P42r17N42k83k04L74o00O28
3007A10l28O66q42L50k46J40j8p8P98r90P54o47L54r0k44K93k72P58r98O80m95
3028c45L30j82k19P14p09R06q29M82l34K45l7l16O38q67Q63q16R07n06J8J45j18
3049c0O07o00K27k01L60j29k67M74r60R85j104J315n16m15M95j26O1j002J485
$$ y = [219, -246, 128, 439, -222, 348, -204, 440, -107, 135, 276, 187, -12, -52, 438, -544, 478, -333, 324, -288, 258, 300, -321, 307, -151, 389, -327, -39, -198, -126, 139, -458, 378, -726, 486, -246, 230, -233, -135, 237, -836, 395, -345, 169, -346, -190, -70, -312, 398, -573, 42, -413, 298, -270, 80, 160, -607, 352, -337, 57, -415, 85, -68, -183, 165, -194, 464, -449, 407, -389, 224, 104, -80, 150, -310, 491, -275, 567, -373, 112, 52, -37, 542, -332, 678, -255, 157, 296, 244, -59, -249, 783, -172, 570, -347, 195, -88, -292, 82, -518, 110, -218, 448, -394, -44, -290, -150, -168, -246, 552, -438, 316, -331, 23, -67, -311, -18, -290, 468, -530, 150, -345, -15, -197, -416, 298, -411, 495, -334, 148, -186, 59, 22, -294, 344, -523, 340, -476, 431, -75, -57, 88, -30, 577, -23, 204, 3, 363, 234, -33, 441, -519, 466, -638, 677, 161, -254, 241, 115, 176, -826, 659]
3068F59r41O64o70N76K3m37J97o0P65j450O21n5l1L95n07O24j041J255j366M25
3088c54j29L93M99j218J301r30N75q99N31O20o06K83q17J379j113N47n1k73K73
3107A1k86N8M8L13q00J167r20L9O77m33K58n29M51n25Q87p15k47N74p36Q63j55
3128@L30m84O23p72L94R9m49R28q65P43j002Q17j61Q7O45j182N30l82N47p46M29
3149A29L06n93N55n66M26n60O29m79J41K00m94O70p67R23q80O61k69O1k0o37R93
3170D29o64O61o51M18k80j21K98n39P60o70N04o04M51j77j10K53k80Q22r58O44
3190A86m02L74l2k81N88q69R11q13N13m00L08k0m30Q61p39P15r25J060m79k19
3210i3N18n80O76m30J71m52K18R4j65K94o88P71p43P66m79J72J16k85K13m94Q50
$$ y = [659, -282, 382, -288, 288, 311, -126, 71, 11, 776, -674, -53, -108, -139, 256, -251, 373, -668, 587, -779, -354, -483, -90, 409, -809, 492, -438, 137, -762, -231, 389, -217, 66, -751, 628, -485, 62, 11, -262, 11, -275, -217, -169, 144, -656, 511, -409, -370, 307, -126, 132, -397, 54, -471, 416, -299, -546, 28, -708, 155, 0, 330, -154, 469, -303, 91, 190, -259, 669, -196, 547, -455, 362, 201, 288, 933, -249, 281, -101, 446, -300, 129, 435, -158, 397, -169, 257, -303, 326, -153, -12, 188, -306, 364, -403, 520, -360, 301, 32, 93, 73, -564, 429, -235, 426, -225, 193, -87, -208, 90, -449, 311, -359, 145, -459, -8, -185, -295, -42, -322, 500, -458, 186, -216, 158, 126, -155, 433, -436, 475, -338, 175, -225, 83, 63, -367, 494, -245, 470, -455, 605, 126, -93, 425, -155, 521, 91, 262, -190, 28, 122, -43, 251, -437, 334, -409, 357, -122, 50, 166, -119, 94, -400, 450]
3231D50p33M94m93M12k79k1N19p42O92n78O77m94J16j78j37L25o8O46o63Q5l43
3252c13O56k10n12L75Q8J36l94M56k25o67L69K60L24n04K59m70J279l62j260J682
3272I67j154L74J3j73K24J3L14o33M19p57Q55o51N46n31J84L44n28P90q29O71
3292D58p59O27o59N17j3k26L69n96P12o29K87K5J0K33o64O10o08O20n71L08R2
3313A43l58L54m03M68m12M65p00K76K77l79M07q11Q53k92K37k85LK40n97P17o61
3334d58O02m63M10j04l9J80o94Q98n12L62l95M60j73k14M02n13M05m36Q43p82
3354b21L38m4k74M97m42M55j59J98m17K47J77m95O26q51N16k32J26j44Q8K80l19
3375e0N63q37O04m64M02k57K01M0n04O68m90L78m79M07k23J07K35m77M08o87N76
$$ y = [450, -283, 211, -282, 130, -149, -170, 349, -393, 299, -279, 398, -96, 20, -158, -295, 30, -38, 608, -55, 30, -313, 343, 133, -379, -4, 84, 220, -174, 282, 57, -610, -241, 19, 343, -161, 98, -372, 907, 545, -715, 967, -187, 187, 200, 27, 251, 264, 578, -55, 364, -393, 462, -189, 357, -174, 10, 354, -174, 616, -213, 458, -301, 326, -333, 184, 171, -55, 314, -282, 430, -199, 88, 113, 123, 356, -308, 302, -306, 314, -257, 51, 143, -215, 139, -264, 204, -208, 257, -443, -167, 110, -269, 138, -673, 180, -112, 125, -160, -157, 83, -514, 203, -458, 144, -319, 91, -13, -52, 128, -566, 332, -180, 182, -213, 247, 74, -140, 262, -251, 154, -282, 561, -221, 117, 73, -201, 296, -146, 309, 150, 348, -69, 178, 355, -140, 486, -365, 151, -81, 45, -99, -11, 269, -50, 513, -324, 280, -184, 218, -39, 162, 202, -302, 366, -124, 254, -225, 182, -41, 66, 301, -176, 232, -455, 121]
3396A21l67K88O9j98Q5l63O59o09M86n41M48k90k47P70p38P08n61L44k12O0L71
3417B83m02L22n72N82m59M78k21p9J76l79O20p17N91l68L6Q7O0K11p93J044n78
3438g8O59p48R04m58k87K30o36P91m09Q2O4j32K75n61O30n79P54q32N25k85j1
3459a02J20q2M59o63N02n60N06j39J35k6j28K54m47L04k61K35jk96L86o81Q49
3480C64n47K70k20J12J15m41K97j45K89m36L60O9k6J02j63O7l29O03n55J98j81
3501a97J30K37l43M59p71Q85l40J74p9l93M16n56M75K6K7l67m5L93n8L02m40K99
3523B34k87M45l04m4J25l67O76p44L10k05L41k39J84k3k76L29l76N33n01J63j00
3544a26m2J56k10M17n63L47k35J90o3l3J63o70R88p12M53j59k4K03k80L02n02
$$ y = [121, -246, 42, 111, -87, -2, -365, 294, -315, 171, -370, 78, -212, -459, 311, -427, 281, -280, 64, -148, -88, 283, -119, 203, -369, 213, -246, 232, 11, -68, 108, -271, 349, -368, 223, -145, -109, -22, 38, 249, -544, 500, -78, 581, -167, 737, 279, -8, 222, -414, 377, -32, 50, 114, -18, 257, -304, 326, -253, 501, -331, 194, -91, -102, 18, -64, 395, -268, 234, -326, 180, 41, 176, 150, 22, 276, -171, 133, -128, 107, 106, -190, 196, -485, 364, -183, 87, -133, -21, 94, -347, -50, -195, 94, -342, 18, 87, 61, 163, 0, 67, -262, 341, -214, -16, -197, -67, 170, -173, 286, -485, 400, 60, 234, 155, -238, 178, -378, 97, 123, 150, -217, -262, 131, 73, 375, -65, 234, -53, 392, 88, 44, 169, -198, 478, -266, 44, -161, 180, -59, 125, 102, -174, 155, -221, 312, -189, -26, -126, -168, -12, -222, 195, -368, -21, -256, -66, -129, -162, 1, -669, 319, -393, 60, -99, -123, 80, -200, 102, -400]
3565d00M68l35K69l14K83Lm25P18n43M26j48O9k09L36K3n72P89q45O26j52L3J97
3587B97m8J69o10J14J09P67j628J107j361R57O87p57K22j85m4L13O9j15j58K28
3607A33l66L07k06K03j83K89k60j44N10o55M62l40K56k47L83J9k39q1j90M28l79
3628c00J36J18J34m9p00O77j33Q7O6k40O4m22R97l08n49M26n22O34l69O94q63
3649d22M43N6L41o15N33k20o4K63k99K97o26N21k96n6k03M76K99m98QK95L83j452
3671h36J340M94o90j033O15M62o80O97k7j346Q82K4K21j90J66j027J278j35q28
3690f13O61j263J355k39j560J359J204k743R36Q83p13Q30m28R05m27r30J3J370
3708F00n86j69N09j73Q5r92J81l24N51J047j673R05J56M28j91j23rn2m54Q48l95
$$ y = [-400, 68, -267, 2, -312, -29, -26, -451, 267, -276, 150, 2, 71, -138, 198, 221, -351, 438, -407, 219, 67, 100, 297, 249, 418, -192, -78, 31, 798, -830, 277, -1084, -127, 560, -197, 25, -160, -204, 109, 178, 63, -95, 133, -233, 74, -132, 71, -112, 177, -83, -227, 283, -372, 90, -250, 6, -241, 142, 161, -78, -159, -349, 79, -300, -164, -46, 88, 39, -661, 16, -117, -30, 36, -204, -140, -562, 435, 127, -422, 4, -518, 116, -253, 441, -422, 21, 77, 418, -197, 336, 116, 52, 315, 16, 313, -313, 208, -88, -144, -347, 129, 428, -70, -62, 233, 616, -836, 504, 998, 308, -725, -110, 352, -328, 369, 342, -1004, -122, -98, 123, -67, 99, -928, 350, 215, -613, 48, -1215, 140, -99, -1659, -300, 904, -1839, -903, -20, -733, 97, -331, 574, 147, -783, -770, 600, 14, -155, 354, 181, 266, -726, -545, -869, -318, 729, -944, -39, 117, 545, 354, 231, 222, 170, -284, 564, 169]
3729A69O96n60m46K64LR1m03P75j342P35j65K50q58J170j502N62l80J178l20K96
3749B13L98l92k47N50Q12j865O92o11J233o87p2J85q19M33O26p39j569O76J864
3768F81j224J181k35M93j541J275o40J436n87j463N83K1Q0l00q99L07K29K103
3786A500j023m04K30j01m23P85q87J38M46K39m23l05L19k90j37l69J53Q31n04
3805b25R38l42o39N60k31j1m90K66J84N80n14K52k99P3r77P7J350p36Q7m94o3
3826f54N25J12j67K3K28n8N31j005J78j1K11o37M45O99q31R86r18L19j87j2P07
3847D84r72L2M91q57P88J13k34J13k17M02K56j062M82P40j245J129n21K12o89
3866e55Q55l98R4Q9k60OR8M28m87j67j2M62J02N7k42j24M2p4m0K45k31L32n2K06
$$ y = [169, 865, 305, -141, 123, 126, 217, -186, 589, -753, -18, -183, 67, -791, 379, -1123, -561, -941, 237, -83, 213, 611, 219, -28, 522, 1334, -531, 161, -450, 783, 96, 24, 209, -610, -177, 449, -290, -1859, -1183, 681, -543, 638, 403, 896, -645, 630, -10, 1426, 839, -624, -41, -20, 60, -240, -1139, -832, -603, 1500, 477, 73, 303, 202, -221, 564, -323, -185, 261, 500, 77, -228, 91, -199, -336, -705, -552, 279, -225, 713, 371, -268, 292, 61, 50, -440, -174, 10, 590, 76, 328, 29, 102, -875, -798, 552, -184, -97, -591, -654, -129, -17, -184, -161, 67, 9, 540, -465, -287, -298, -87, -724, -279, 420, -411, 575, -343, -24, -211, -223, 484, -488, -456, 35, -822, -34, 79, -155, -42, -259, 143, 399, -663, -181, 559, -686, 443, -78, 134, -555, 300, -98, -4, 85, -175, -169, -71, 357, -130, -297, -309, 153, 255, 312, 70, -54, -12, -86, -126, 119, -112, 220, 168, 374]
3890C74O5j70m17K33n54N41l94K59l5k63Q13N3m27j34J18m00j55R34l42k6k5k44
3912a96l22O99n05l08J190o24J37j63k67N37o7j31m03L22j10N3n6J93M5q3M41
3933C82p26O17o60M81N0l75Mq6L05qQ6j87J92j81J23n2l3M75o64N58l72J98j42
3956a5k2M52n41L36o25N14n5j0r1l31P89n22N23n26j7O6J52J69l18L21n14M20
3978A55l29K47k31K14j76k43N06r3j31m4K66p2k35L39m97O02k80K33n27M32J7
3999A53j05k88J50J93l39L45l99K96j0l12M24k95K34j62M1K31o6J15j99L11m61
4020a43K93k22K41j84J00J34l1r1k53K50l24K46K32j17L8l78M87l85K87l16K19
4041H3j23P3J96l74L33m17L85k63J77P7j64J79m76M59k09pj60J64m4L8O6r0M28
$$ y = [374, 439, 269, -148, 85, -469, 72, -322, -63, -98, -361, 452, 505, 78, -56, 62, -338, -493, 441, 99, 73, 48, -196, -518, 181, -324, -632, 558, -66, 71, -92, -359, 178, 111, -20, -423, -101, -211, -158, -214, -21, 24, -59, 382, -344, 273, -387, 94, 144, -231, -227, -313, -8, -16, 70, -117, 75, -106, 17, -35, -68, 407, -257, 301, -71, 127, -15, -37, 415, -126, 210, -415, 99, 44, 34, -57, -388, 401, -121, 402, -124, -141, -75, 77, 246, -72, 249, -265, 155, -174, 73, -158, 56, -120, -363, 143, 50, -81, -125, 141, 69, -166, 173, -324, 278, -2, 231, -296, 136, 153, 48, -240, -90, 103, -236, 109, -290, 6, -4, -316, 108, -187, 47, -115, -74, 157, 91, 206, 7, 318, -143, 150, -72, 169, -15, 85, 219, 188, 97, -156, 94, -230, 16, 248, 131, 169, -209, 278, -107, 180, -136, 83, -40, 33, 229, -145, 188, -229, 156, -107, 70, 147, -17, 162, -314, 145, -64, -71, -231, -67, -111, -73, -7, -97, 331]
4064C31m65J57k0j38J64J9L52m64rk35K53qk8J27j73K01j36rL6J56k79O2J21k42
4088b27L77j28n6r6Q4L5j23L40k62J54j22jj09J0M66l90J84k61J92K14r6l66K03
4111B2K3m21L62j58K80j52J45P4j11j77J59R2l50L49l54J14L33k53K09m71L18
4132C3m78N79k53J30J3k80J63J8J02l37M28J3j45j16j11N3m7L24j88j03l0L54
4154A22p4jP0o72Q45l54JRj62K23J10K35o83K61j88L14q7J28K88q07N31m20O8
4177b43M7K69k0opr5K74j86K64j48o2j47j10J75k27Q2MJ63q8J98r4j69K45j76
4201e7J72j98pMk27J12k8L05k39J24k7J06Nl42L50k15L08p0J1k48J66j90m3L25
4225I7l26K76l42L43l11K94j39j42N13l84K63l42K65K2k83J50j21O5J4O1J8KK00
$$ y = [331, -134, 23, 3, -135, 29, 48, 400, -64, -73, -308, -55, -63, -91, 36, -137, 64, -72, -81, -45, 111, -168, -106, 15, -227, 150, 22, -34, -130, -46, -11, -134, 206, -56, 98, -24, -25, -134, -124, 342, -48, 136, -125, 67, 281, 185, -181, 22, 45, -376, -14, -172, 108, -44, 101, 175, 64, -113, 46, 138, -212, 137, -217, -103, 230, -23, 186, -285, 33, -445, 134, -119, 11, 24, -256, -93, -75, 27, -310, 118, 131, -14, -130, -241, -188, -235, 89, -99, -202, -232, 122, 48, 47, 117, -555, 290, -64, -63, -54, -216, 7, 117, 352, -331, -70, -258, 56, -31, 97, 385, -422, 109, -311, -243, -196, 73, 53, 47, 40, -55, 219, 33, 297, 149, 87, -60, -170, 5, -222, -140, -136, 27, -61, 137, 43, -126, 119, -57, 115, -83, -90, -86, -313, -201, -229, 76, -163, -39, -66, 40, 45, -297, 53, -162, 146, 76, 87, -161, 5, -185, -228, 97, -229, 47, -295, 48, -263, 31, -108, -250, 263, -121, 142, -200, 65, 87, -196, -46, -167, -102, -88, -27, -9, -7, 193]
4248A93n64O28l65K11J30J18l04l57N72m55M24oMn16N83m05M53J86q36L85j05
4269b6M49k77J64m58J33K32m40O94p2o58L11j35J79k78N17p32O84n24L51k76M91
4290C29J68o65J47m13P24p40K28O9J51Lk02K54n1J74m61N48k74k4k04k06O40j98
4312cJ8j8j04K7K29j32k72L24j55L63l02O1m65N19j9R3o7j64J78j2%j88j06L73
4336A78k41k13K48J35J1o5j87j13L11j28o0K49q8l04K51j24K50k15N48q1j41K06
4358D27l93K32p21L6q9O12L18p74J225j024K89K47j237J647o77r7n21M17L41n04
4378b46M16J3j21N30n95k6M10m83O57l29n16k76N62P66j353Q13m0p52M60j57M14
4399A47l7j06k09N28k75J97l9k7N06k79m36k8j0J91J51j30M15n54J43o78P03k40
$$ y = [193, -371, 257, -108, 103, 233, 351, 47, -310, 262, -193, 231, 225, 229, -287, 296, -109, 344, 530, -306, 79, -26, 423, 146, 310, -148, -15, 217, -223, 471, 399, -259, 52, -83, 96, -182, 335, -397, 287, -237, 114, -162, 329, 497, -168, -21, -434, 290, -450, -222, -153, -2, 1, -201, 53, 2, 176, -285, 263, -11, -35, -239, -445, 195, -3, 15, -3, -107, -80, 149, 17, -255, 69, -86, 277, -25, 36, -429, 90, 71, 164, 97, -67, 111, 99, 99, -89, -195, 178, -63, -276, -28, 107, 118, 53, -134, -247, 64, -64, -124, 125, 37, -267, -16, -140, 110, -105, 443, 362, 221, 427, 34, 266, -455, -419, -508, 104, 422, -352, 873, -151, 138, 385, -852, 795, 118, 21, -500, -83, 258, -246, 170, 183, 62, 592, -3, -29, 381, -102, 555, 226, -290, -566, -4, 762, -591, 222, 182, -570, -110, -267, 147, 110, 4, -205, 323, 48, 245, 206, 179, 685, 406, -30, -58, -68, 123, 274, 144, 559, 5, 148, -530, 173, -67]
4421f7J45l47m0O34J6m91N17l02J24M67j190N25P9J15m02K21r8k0K15l50M42l67
4443a74j81M52l32M59n91K2j69N57m07K53j3K27j63J72p1L00qm09M95m08P3j05
4465b1q59J148l57K52J9o81L50j65N56m38j17Q05M2m85o96M62K43m92J30J047
4485G43r98K28m49O9O26j50K23k14l80PL39m06J71r7M09J51k11L79o74K00J84
4506A50J22n40P5j48N15j83j32K94k4m44O63o40K35o33J051m30k37N77q71N04
4526i6M22P0n59N03j9j33n93M43K4l15N71n08k41P01p50M33l15O33k39L28n60
4547b00j44N05l89M7K2K86N7m34L43j36n5j1J80j77o6N33l78m67K94J47j28M21
4569B50m41k81J57M62R4r92M22K41k69M94n00J90N1J3l9m84Q00l06K37k4n35k16
$$ y = [-67, 78, -269, -309, 325, 341, -150, 367, 65, 189, 656, -534, -9, 70, 185, -217, 4, -94, -114, 101, -249, 193, -174, -355, 97, -235, 224, -367, -345, -514, 43, -364, -111, -124, 103, -60, 112, 41, 341, 333, -76, 419, 11, 84, -21, -880, 268, -89, 163, 182, -499, -149, -314, 242, -196, -313, 492, 534, 49, -647, -185, 58, -434, -304, 743, -255, -27, -476, -407, 219, 69, 292, 78, -302, -295, 44, -362, -191, -288, 121, 272, 61, 440, -234, -34, 150, 272, -268, -193, -341, 174, -9, -141, 153, 129, -315, 348, -292, -57, -690, 361, -69, -306, 271, -600, -96, 326, 396, -163, 340, 321, 188, -405, 38, 62, -253, 318, -190, -431, 270, -480, -47, -362, 271, 32, 360, -200, -344, 161, -228, -181, -159, 127, 184, -250, 93, -43, -98, -109, 71, -106, -172, 361, -17, -484, -190, -43, -171, 250, -191, -472, -315, 147, 241, -751, -329, -88, -357, 137, -363, -173, -122, -109, -148, -632, 168, -138, 99, 75, -460, -676]
4591f76P32j31L03k25J77p4K98k79J47l38n27Q42r25P18j35j9l04N96m48L06K33
4612B71l04o46J68M67l76k84N24P1j12j76N69j08J17j16J38J47n97P3l14L32k28
4633c84L3N94l20J71o8R0j45O30q81P6K49j5l7j64M77l98j7K43j86L01m19J30
4655d0o6N0j57L07J28l16K17l01L53l24Q5P8J58k17k19N04j01k7j40O0P3K35l12
4678B8l7P4k46L44k47J45k35J67r0j02N25n48L97j96L6M0J17j84rJ67l81L46j58
4701d7K8Q8j28K65l61J58N5j03Om4Rj33M84l75K54k07K1J02l9J28j97J17M1J19
4725B41k18Q3n9l35M12k02P2j89R0K33p3nj20N0l74P15m80K63j12qk1j54L48j36
4749B1J25l04J96j43L2J99J0o3j36L8n5L87l52J9N0j97L65k45K86k75K79k84J80
$$ y = [-676, 56, -75, 228, 3, 180, 106, 404, 125, 272, -66, -593, 249, -676, 42, -93, -112, -416, 180, -268, 38, 271, -33, -679, -511, -44, -420, -704, -180, -109, -221, -397, 172, 64, 181, 65, 203, 350, -247, -174, -488, -156, -384, -351, 243, -77, 94, 26, 116, -29, 601, -280, -204, 45, 30, -7, -171, 306, -92, -109, 134, -52, 249, -170, -40, -106, -56, -213, 94, 222, -94, 123, -178, 175, -149, -64, 14, 172, -45, -264, 240, 139, 112, -28, 32, 105, 340, 28, -9, 65, -181, 163, -84, 61, -174, -7, -97, -199, 326, -222, 175, -21, 15, 55, 172, -12, -21, 146, -235, 111, -47, -19, 69, -59, 206, -155, 3, 58, -45, -39, -83, -74, -207, 277, -98, 156, -51, -30, 72, 33, 161, -36, 81, 122, 241, 23, 106, 47, -288, 124, -78, -6, -195, -105, 128, 55, 50, -70, -20, -394, 321, -159, 104, -8, -16, -37, -191, 157, 21, 146, -158, 38, -105, -73, 126, 136, 73, -63, -25, -80, 307, -45, -26, 24, -173, 192, -53, 233, -42, 237, -47, 133]
4772A33j46R8j35j72K53k34K51P1j29m0j5M7PLO2j85J21K50j32k88J60j76K29
4795C3r8j21K61k8K23k73K56j28j87k0O6j1k14J51r4L01k01K38L3j20j93p0K00
4818Dj34J98M1J51k82p2o5K75kl98L74j55j05J42k0J83l71L19k06L35l41n8K60
4841G3L2L7k73J04p9K76k63K82k15n5j07Q2N8Ro7K36k5J6r2J32m7j34k65K86O2
4866F3J3L6k88L86j75K23l63Q7K04k10n3j53L89l3L8k74K32q3j11K29m42K97J16
4889A28j27j38K00m8m7J89o3K6p6J93k09mK5k24K54p0J52l39Q1j8K06o6p0J64
4913A19j48J72j33n2j55K78n3L2M07n92K86l02J65j46O7K24q8j63N5L83k53O5
4935A68j10k37R4L0k2p4M26j90J20k33R0p4p1P1j96K58K4o1K7n0M6r9K09r8J72
$$ y = [133, -13, 85, -50, -222, 31, -203, 48, 119, -10, -50, -65, -18, -11, -8, 54, -131, -10, 240, 108, -180, -20, -196, 33, -65, -186, 75, 47, 270, -3, 253, 125, -62, -82, -16, -27, -241, -90, -184, 117, -84, 154, 187, 67, -126, -196, 4, -130, 68, 109, 260, -22, -94, -159, 116, 114, -284, 90, -65, -170, -28, -48, 135, -236, 83, -123, 212, -129, -187, 73, 105, 142, -131, -27, -106, 170, -93, 189, -26, -81, -188, -106, -48, -39, -106, 130, 105, 121, 29, 161, 114, -20, -285, 1, 63, 76, 112, -176, 210, 35, 258, -105, -18, 186, -24, -77, -230, 159, 126, 164, -110, 122, 39, -72, 157, -285, 12, 128, 1, -137, 63, 15, -32, 157, 94, 120, 44, 237, 28, 24, 49, -175, 79, 9, 161, -178, -97, -115, 91, 25, -45, 119, -29, 143, 10, -42, -197, 81, 28, 60, 467, -125, 161, -141, 24, -122, -55, 169, 81, -82, -27, 356, 103, 168, 58, -179, -85, -55, -77, -151, 275, 85, 205, -28, 62, -12, -83, -12, -208, 50, 74, 13, 40, -10, 36, -63, 146, 48, 220]
4960B20l45L34O5k20%k39K9J45k99L23k7J0Kk54R5L09k96Q2J04j37J74k34L17
4983A58n23M60j71j1J8j26NK21P0j00J62n1j75q4l5L06l2m9l26J16j38J34L55
5006A84m77J66K30k89L75m9K4k78J02j6j06L82j11j06j15l4J21L50n00M1r1L07
5028A10l08J33M47n46rm9L36k65l9N3l4n4N41j17m67J26l8L40K48m48l9J47k10
5051a42J39LJ93k45N27n48J39k85N32m06K04j42j58M88j08k48P8pj59M49k97J26
5073A33L82m05L10m26j40J50l74P99j86J61l02J87m13O67k81p56N97K85o34J92
5093e4O72o91L31k38k13M92m00j74j24lL18Q55q00l32L60n70N00j24L01J5n9J27
5115A89M7l50N76r60L86R12q48J18K84K34j144M81P44j300R45Q0m37n58P40q07
$$ y = [220, -125, 209, 274, 54, 54, -185, -156, -11, -310, 13, -14, -4, -2, -256, -161, 148, -148, -66, 38, -99, 75, -159, 158, -365, 95, -76, -87, -69, -195, -190, 31, 101, 1, 163, 112, -63, -147, -182, 124, 92, 43, -283, -167, -305, -171, 184, -293, -127, 103, -186, 189, 140, 164, -114, -12, -28, -134, 248, 137, 31, -84, -118, 3, 353, -147, -106, -197, 110, -198, -65, 382, -164, -173, -222, 114, -151, -190, -137, -171, -225, 316, 199, -268, -142, -180, 160, 408, -40, -79, 68, -142, -3, 0, 193, -52, 475, -73, 66, -219, 313, -93, 111, -31, -189, 299, 191, -57, 21, 14, -145, 304, 7, 133, 515, 110, 420, -6, -146, 4, -370, 429, 243, 404, 102, 289, -124, 543, 262, -494, 103, 388, -246, -54, 618, -73, 258, 20, -193, 299, -101, -275, -399, -402, -84, 771, -29, -361, -1, -571, -71, -195, 106, 121, 62, 189, 236, -114, 462, -498, -112, 800, -48, 70, 354, 588, -556, -75, 669, -631, 314, 394, -43, -601, 139, -668]
5135f68M24k19K93R74j071L1Q41o79l98K01M3J35k25K17k35K18m62q8P87M60n25
5156E4L51n62K18m83M96j40o5m19L51L67j01K1L17p56N25n44N41o51m1R92p62
5177b91L68l03qP1N70j54o3j58K42J9j07m9l75N84m39k70r8L82J2J38k5j6p5L00
5201B55j33l58L75L5k94K67j36L34L6n86Q48o83J58k29J0oP28l32k74J02p9m49
5223d11N52j28L13p34M47N91j160L97k27Q48k30m67j48O47K76O5j010J24p4Q68
5243E39q2n24m4p1N36m61K46l83k00N20K55l99J5k07L36k25M2J66m3q1k75M16
5265G6j08k93K96j53J12J01r0n8R0n8M4p0P9J04j91L81k62j68M10m65J20N97o24
5288a30K75k03L7J8q6j07O6k52L3O4L6J70k6L38j12J04m55K34L51m99l03K54M06
$$ y = [-668, -244, -463, -170, 804, -267, -236, 605, -74, -472, -271, -228, -93, -318, -101, -336, -118, -580, -668, 119, 579, 54, 405, -157, 61, -422, 74, -66, -131, -550, -199, 168, 67, 88, 405, -351, 174, -370, 171, -480, -521, 471, -291, 77, -226, -234, -163, 407, 253, 190, 32, 274, 293, 186, 137, -238, 346, -93, -363, -461, -79, -67, 71, 46, 30, -45, 255, 122, -236, 139, 174, -120, 147, 11, 345, 381, -205, 643, -40, 118, -111, -101, -107, 621, 289, 15, 117, 38, -411, 141, 13, 326, -408, 39, 630, -530, -133, -360, 488, 258, -209, -357, 290, 566, 631, -379, -255, -329, 539, 457, -67, -111, -182, 354, -107, 139, -244, -444, 76, 331, -68, -53, -260, 76, -149, -107, 59, 16, -65, -340, 76, -32, -325, -29, -182, -70, 31, -59, -117, -27, -85, -41, -111, -32, 72, -119, 262, 0, -168, 242, -223, -103, 494, -130, 145, -58, -21, -3, -89, -196, -130, -382, -349, -285, -249, -79, -105, 233, 121, 225, -230, 4, 355, -144, -447, -193, 213]
5311B13m66q3K95j36l36M82M32l85M7m69K91K39n12L12j44P6M7p7P9j16O5Lq7
5334b30K75k46M34k78J56k42L75l88K43j18j75J47k87K01Q0qN4M4l02L17K3kj24
5357e1q0J68rJ26k48K23n0J16l2j9o6k4j79J30M5o6J07M7k2l9j69L7K14j12k09
5382a62L16k1P6l31m3K40l03J79J57l99L57J9K7P3p7Q7j03j30j61K29M2j63K69
5405A78q8Kj47J42P2j09p8l7K63j53k55N3J40k6K91j81j33l1K83k43k03N64k61
5428D3J00l16J01M4P0j69J99J50l77J31k17L60l76N35l35J52j65K25l05j45N99
5449C04l45j5N09J69n61R2N28n36n84K23O8K97k53N2j46K97m7n6rR4j19n0J29
5472D1k06J10K46l07J14P6J17m11M02k09o4J47n6J88j31K41l28P7j00j24K19n1
$$ y = [213, -253, -336, -41, -177, -513, -31, 401, 16, 63, -406, -115, 124, -388, -76, -220, -144, -97, -174, -95, -211, -146, -143, -230, 45, -201, 233, -45, 111, -131, 244, -144, 99, -19, -194, -47, -334, -133, -53, -61, -7, 37, -265, 52, 75, 73, -51, -131, 37, 28, 154, -94, 129, 79, 195, 163, 144, 78, 54, -125, 5, 50, -16, 91, 138, 116, 77, -92, -55, 159, 47, -162, 154, 133, 209, -122, -165, 75, -228, -49, 108, -291, 66, 85, 112, 185, 108, 195, 92, -38, -199, 30, 72, -91, 178, 90, 92, -55, 87, 159, 50, -28, -65, 198, 45, -210, -157, -17, -43, 248, 67, -66, -97, 186, -57, -260, 304, 43, 143, -173, -72, -28, 42, -127, 72, 222, -155, -24, -241, 119, -257, 278, -57, 95, -70, 155, -150, -295, 304, -41, -56, 453, 622, 61, 153, 681, 145, -439, -216, -148, 149, -104, -52, -198, 99, 52, -4, -13, 81, -38, -88, 41, -165, -55, 191, -116, -2, 74, 191, -220, 182, -27, -91, 56, 0, 188, 57, 298, -30, 47, -53, -177, 42, -9]
5494ij40J07K43l48M95k61r8J17k92R2LL12n53N03l75J31J82L7M1k18L5lJ34k08
5518g3r6J58r4J55j03K4o3J77k77j83P35l94L11j67k7k05N1J71k28K22Qj35pk17
5542b57p1M63j04j85L20p2k9J95o15M98m27L4M52N1k83N45q62N09m1k38o1K39
5564F1p5J40j80j86p6N18l29j39J41R4k91L24J14r4P25j521J033o01J628j732
5584d46L14j4K00K70K86M5j093P04j03o72M36J93k1J59j36L35p8j54q8l38m2M79
5606B36r6K87m35j79M10k74M48o39M72o5l6l57K90N2k78K32j57J1qK17j55J86
5628A62j17M2l19L94j17j67K9K08j23k74L28P8k94L17j94m7r7K07k60L49l78r8
5650c71M55k3J15j05Nj37N2K08l45PJ30PJ78l23K00m2J85k39M3m8J33k39L3J31
$$ y = [-9, -149, -42, 201, -147, 348, 87, -11, 106, -186, -94, -91, 221, -332, 171, -204, -73, 109, 146, 187, -31, 4, 1, 135, -73, -169, -11, -105, 50, -53, -29, -92, 85, -192, -375, 360, -34, 277, 110, 83, -122, -71, 100, -128, 94, 102, -33, -40, -257, -328, 135, 31, -154, 166, 94, 65, 260, -355, 143, -284, -250, 202, 253, -30, 515, -347, 162, 121, -117, -178, 61, -14, 126, -54, -240, -316, 202, -127, -266, -125, -31, -322, 2, 116, 22, 747, -774, 259, -342, 1286, -446, -132, -146, 54, 324, 610, 655, -438, 266, 163, -509, -73, 120, 99, 258, 122, 457, 379, 225, 137, -201, -243, 236, 140, 427, -8, -187, 223, -51, 397, -242, 230, 165, 129, -228, 62, 114, -164, 68, -89, -78, -86, 131, -24, 162, 45, 87, -232, 162, 45, -122, -93, 115, -8, -282, 46, 124, -170, 147, -47, -94, -191, 16, -244, 105, -273, -371, 84, 61, 176, 71, 76, -61, -9, 199, -146, -139, -9, -2, 176, -147, 53, 11, 196, -43, 0, -48, 85, -154, -121, 10]
5674A0j15L01k21j49J45K88j38l29K12M28m88k25N00j89J58k58J20l45M97L86
5694E88J7j72l29J80n61K23o56R85n46K63q8K54k14M2l9J50k49j95M56j50j06
5715a47J51J73l6k03q6K83j19R4k03J32J18j60L32m63J83j90M9J01k11K39k55
5736b18L16p9j3Nn7l96M31J72j84j37J03Or5J29J99k22M1k89M06k11J55o1P5j92
5760a16K14R77j515O04J69l22J45j74J53l76M04k8l42J00N47m01l04M95l42J74
5780F2j1M0K1m2j40n4L4M7l2oL7l7J10j99N7J61o6J37j0j83m9j16N44n84L31L9
5806I1j31J41K5j44k53K95N4R4k46K62j96J98k70o9L22l18J91J11j98j05K99j69
5828a6N6Q1N2m11K44j19P0N5j55J32J60k90j30M39k2m26K98J10J17o8ql58K71
$$ y = [10, -105, 196, -25, -174, -29, 259, 121, -208, 4, 432, -56, -281, 219, 30, 188, -70, 50, -295, 202, 588, 605, 433, 104, 284, -277, -54, -710, 275, -271, -8, -96, 158, -56, -14, -53, 97, -152, -347, 109, -41, -147, 4, 177, 141, -62, -148, 135, 16, 110, -93, 39, 157, -3, 329, -134, 49, -141, -92, 9, -202, 37, -218, 98, 19, 6, 11, -46, -442, -11, 161, -23, -160, -57, -51, -146, -17, 182, -40, 1, -288, 118, -93, 62, 1, 76, -116, 98, 1075, -440, 164, 333, 11, 156, -18, 135, -241, 163, 135, -207, -107, 440, 39, -265, 230, -112, 62, 51, 91, 112, 70, -70, -124, -90, -43, -75, -81, -44, -81, 29, -170, -113, 48, -18, 119, 109, -74, -123, -239, 305, -279, 52, 91, -40, 101, 126, -18, -271, 24, 78, 172, -74, 188, -8, 190, -80, -149, 173, -145, 46, 157, -41, -146, 153, -16, 40, 121, 173, -238, 6, -113, -43, 12, -143, -11, 149, -141, -271, 168, 146, -280, 18, 128, 245, 177, 169, -189, 82]
5851H2j67J75l92L81J57l46P%L28l83O35m92j53M1L96j53J91l24k68j7K38L9J02
5874G7j08Q2k47J05N2l64r6R39M73j089Q33n70R1j5l92nL6J41o9R16n01k74n3
5897c8n7J62l35M22m45L37Q1k36r7M49n09L66j21K21l60N1q0Q4J34p5l9L39q11
5920e57R43N96j089L33m31M8O60l62j23lp3R4K4N5j92M7K6m2j5j20L33k71K72
5943A53K84l55L91o38M44p91O13l35K06J36j12J8J63l30J69J31k65J32L39n24
5963a71K10lj64L78j97k60J56K61k31p4J35k37J41K5J69k69k8L51J07l72J57P4
5985A58k28J71k81J98O1j59j37M18j28Q7q3K1r3p7K40k43R1K6J08j23J63j44p0
6008b4q8J09j18j5r6J13J1K07k96J07K45l26J56p6J63r2P2j61K85j87o0P0k0K72
$$ y = [82, -85, 90, -302, 79, 236, -110, -103, -103, 225, -158, 477, -15, -168, -127, 269, 116, 307, -17, -285, -302, -64, -25, 77, -31, 51, -196, -91, -39, -403, -499, 440, 913, -176, 657, 87, 178, 163, -229, -234, -198, -57, -126, 790, 289, 15, -38, -95, 67, -268, 154, -291, 46, 127, -109, -206, 243, -266, 100, -21, 200, -160, -109, -189, -105, 29, -46, -85, 254, -557, 386, 982, -107, 226, -205, -157, 503, 141, 18, 15, -58, 36, 60, 115, -77, -30, -4, -46, -61, -181, 152, -119, 153, 437, 82, 473, -165, 279, -512, 101, -234, -28, 108, -4, 14, 177, -153, 16, 147, -118, 14, 353, -171, 39, 36, -128, 250, 53, -207, -51, 210, -21, -95, 40, -197, -56, -31, 138, -131, -159, 192, 299, -73, 84, 158, -70, 101, -180, 18, 79, -80, -217, 201, 73, 160, 77, 98, 5, -72, 168, -75, 16, 42, 150, 27, 190, 46, -24, -112, -3, -121, -136, -232, -119, -108, 99, -197, -90, 155, -171, -15, -91, 72, -20, 52, -109, 176, -11, -71, -1, -21, 251]
6032B51k79j54J96J98j11m3n4l3l5J13j33J16m3N9o7J66o0j91J0O1m5J26l3P1
6056H6J1r9l24L02Q9K7J32j19n9k06O0N4J06k69M6K74j88J83j20j11P6K52k30
6079b7j70M36j25n5J40j90L12j30l04J08J6j92L06Q0k88P6lJ26n1j7l18L66l0
6102F6k2j35N9p7J79j26r7J45m3k53M61j88L3j49O1J92k66K25r8j38J0J26J2J32
6126A09j04j01j24J95J50r9p1K2j13L07j31Nm7J83l40K11M9J85k83l40L01Q6J58
6149B08j29%n3M1J55m00K11j89L62n14L71k3k86J87J34o6j08L15k18N0k66K55
6171C7k02L28m40R7R1N6l6L3j94L70k69n6L64l38J36L1K23n76L94k12L0L02n3
6194A16j88J61k5J9rk5O7j13J2O5j22K14J67k17j19l0j50K47m00N07k2j5J24m38
$$ y = [251, -28, -182, 14, 212, 101, 58, 4, -29, -64, 49, -84, 32, -11, 48, -19, 147, 87, -104, -94, -33, -78, 48, 15, 86, 97, -2, -326, -24, 65, 92, 224, 105, 46, -160, -100, -46, 60, -209, -163, 111, -77, 106, -14, -125, -49, 203, -27, -197, 239, 114, 59, 199, 9, 321, 191, -113, -5, 11, -181, 125, 205, -83, -7, -10, 116, 65, 48, -270, 96, 66, 44, -91, -32, -109, 70, -56, -153, -8, -51, -304, 157, -31, 2, -147, -86, 106, -160, 65, -33, -171, -161, -35, -23, 109, 5, -96, -220, -25, 125, 26, -45, -23, -136, 171, 40, 45, -2, 181, -159, 52, 101, 286, 3, -337, -36, 50, 208, 79, 79, 26, 67, 222, -178, 33, -156, 206, -308, 63, 40, -246, -59, 75, 9, -99, 216, -2, 48, -218, 37, -165, 163, -277, -180, -89, -33, -69, -36, -230, 140, -129, -185, 179, -159, -23, 8, 231, -345, 49, -163, -133, 169, 116, -72, 89, 64, 83, 74, 49, 116, 3, 15, 80, -42, 172, 339, 122, 3, -27, -177, 70, -330, 177, 155, 140, 264, -174]
6218a74O3J17k10L35l17Q7q2M51k37o7K68k11J50k31j33K2K40j29%O8m5J69j32
6241BP3j75N8j69L1K70k16K35j27J43q8k8N0N2j67pR5j9j59K05J38j48J11k37
6265g7j31J15o5J10J08j73QK29j05k39L86l71L53j26j7%Qp4P0n3m3M2r8K01m6
6290A2j82J22n0J89J00j97j33N3J8k19L21j26J1j28J29j2J27J47k09M0j35K59
6312A37l0k62J61k52K26p8K32j74m0K45j58J5M5k1j10K36r9j18M7p5J04p7l3L52
6336B73j85J55k05p4R2r0K78o53K17K55j75j21J92j17P6n1j56M51n30K44q0K34
6358C0j66l3J1K5J29J80l4q5N5j77P8k16K08r1RK16j58j32K91Lk28L2p7L39k15
6383fk8J26j52q1J41r8l3m5J05J75J52k80J57k1k5P5j66J61j40l0m6MM1P3k91
$$ y = [-174, -111, 6, -204, 131, -186, -99, -181, 270, 33, -34, 234, 23, 173, -58, -191, -169, 71, -58, -58, 10, -35, 134, 2, 75, -100, -42, -211, -180, 90, -126, 109, -18, 125, 37, 9, 59, 111, -56, -63, 32, 13, -146, 59, 197, 49, 160, -77, -208, -93, -158, -48, 60, -113, -105, 124, 19, -220, 166, -205, 148, 22, 5, 5, 13, -61, 9, -44, -87, -45, -143, 58, 12, -170, -48, -98, 91, 191, -6, -139, -86, -68, -287, 34, -92, -81, -209, -80, -92, 35, 182, -27, 13, -122, 137, 107, -155, 6, -246, -20, -98, 134, -40, -80, 165, 7, 22, 67, 46, -64, 172, 73, -45, 2, -73, 31, -46, -79, 273, 88, 243, 38, -36, 56, -34, 244, -409, -192, 63, -112, -233, -41, -158, -82, -133, -289, 162, -368, -124, -204, 30, -136, -169, -158, -133, -4, 176, 142, 57, 112, -65, 13, -203, 5, -86, -77, 139, -19, -151, 140, 143, -85, -53, -130, 209, -6, -34, 92, -60, -141, 0, -98, -131, -176, -71, 104, 256, -24, 133, 112, 87, 162, -4, 157, 17, -13, -59, -55, -14, 59, -232]
6408b32J23K70m01K14k75O1L22jL9q9L8k41M8P5j98L25k05K16K4l0j66j28Q9J32
6432A0j07j14J75j39r9L28q9j0J01l4k7R6O2j60mJ45k29P9o5L06j95mj85J33K65
6457B39q7O0l33R1k3or1J74J89J85n62J38J66k13J37q2j19J45j5L07k01pj38N9
6481A3j5k42J19L68r8lm64n6O81J69k02n87M76m73O83o88j07Q92m76K48j90q3
6503c5J15q1j11J81j08k%P4N2N2J0k30J83j58P3N4l7k0N9o2j4rJ91j64J36K3k14
6530d2j39j17N53o5j07K29m92Q1J37m3J22j46J03J19j36K04n23K61L3n1J82o1
6552A02j8M3j84K57j01k72K16r5m1K10j97r6Q2M8R5j27L23n74L19j30K44q0n2
6575b8Q7k14M8L54l65O2J18Q1j71j09k21M29N2l65M96o26o2N61j73j43K97J30
$$ y = [-232, -109, 161, -240, -26, -301, -240, 82, 81, 120, 31, 69, -172, -124, -49, -247, 78, -127, 89, 113, 83, -83, -211, -122, 10, -97, -211, -36, -175, -274, 54, -35, -45, 56, 22, -5, 91, 153, -7, -11, 134, -95, -16, -81, 225, 30, 26, -159, -26, 239, 152, 212, -121, -30, -53, -59, -150, 24, 213, 398, -164, -26, 140, -73, 64, -18, -137, 8, -7, 300, 99, 92, -46, 13, -2, -244, -125, 243, 145, 142, -322, -378, 303, 472, 270, -317, 159, -314, 369, -319, -426, 466, -10, 238, 48, -35, 80, -1, -112, 69, -39, -41, -41, 33, 85, 137, 147, -83, 100, -58, 15, 69, 32, 12, 71, 9, -5, -14, 177, 13, 149, 172, -42, -181, -298, 255, 190, 83, 312, -180, -99, 38, -5, 117, -29, 74, 193, 57, 261, -262, -1, 32, -19, 163, 102, 84, 127, -57, 200, 99, -173, 43, -52, -93, 117, -80, -176, -94, -46, 49, -78, 245, -329, -10, -140, 104, 24, -28, 59, -155, -107, 247, -118, -56, 62, 143, -28, -137, -358, 71, 123, -242, 254, -372, -434, 127, -46, -189, 108, 238]
6597B38k72j69M52n70j11J111n02o53J98M67m50P53m40l46M24n3M47k46p19nJ215
6618G69j103J009o96J51l73n44J204l56K23l89M97J46k36m65J49J70k11k10N83
6637C18l87J09j53O5q3J70k43L92l19r4K01K20j75Rnj38J74j19J00K2P8l14K45
6660G3N9j8j34J28j36O9j22m8L97j96k27K28K02l20q2K3%n8K83j19Q3J31j3k65
6684f2M6m3J22M7l01J62O0K1L1k8j43K75k65M1L2j52J34R2J80m27Q0l1J44O5r0
6709a0J2K0l17K44n4j73K38K31j4l76K58L4Q8r4K11l37R8r6M2j49K13L0J17r8
6733A18J13j89m8k32J86o6m8J07n1L20k24k10K21n5N3O8j30Mj16L10k77J44J33
6756A31m0k60J81k1O5L2k08q4L35j71p9L1K27j58L7lj32J56L7j45O3j54Q4r8N5
$$ y = [238, -34, -203, 249, -321, -432, 679, 177, -476, -278, 189, -261, 492, 52, -294, 130, 77, 524, 278, -441, -446, 769, -334, 675, -21, 130, -243, -787, 417, 61, 284, -105, 392, 538, 302, -163, -14, 156, -55, -265, 318, -69, 40, -113, -48, -131, 39, -204, 188, -131, -225, -24, 196, 21, 30, 25, -113, 61, -58, 42, 64, 142, -172, 73, 132, 114, -20, 108, -28, 41, -81, -129, 268, 72, -155, 73, 275, -45, -127, -104, -104, -162, 121, 2, 85, 216, 203, -62, -16, -59, 63, 110, -191, -29, 31, 52, 83, 55, -88, 187, -78, -37, -5, -157, -23, 69, 249, -178, -98, -129, 15, 80, -10, 2, 22, -295, -51, -105, -278, -40, 191, 177, -199, 59, 93, 181, 87, 298, -39, 59, -37, 5, -144, 69, 99, 216, 118, 231, 42, -6, -238, -52, -118, -166, -59, -110, 210, -14, -224, -3, -58, -5, 63, -67, -63, -179, 131, -146, -2, 131, 91, -169, 12, -9, 56, 88, -120, -204, 131, -40, -119, -88, 139, -19, 18, 15, -117, 39, 76, -69, -6, -160, -76, -174, -119]
6781a19J56j6k29J75j51M44o2q8o7N1O0k59O9j10M4j5K37k50K27k46N4J43j01
6804e3m2J41j25p2J18p1K11J8n0p2J03o6M2J5j99L14j88r0RJ35r4R5j58J65m0
6829D6mk22J74J96j17j82J33L40m22R6l8k23K82o7j04Q6K24l51M43k09r9q6J30
6852B6J8j47l31P33k65r1J5J73j45J36r9m3J22P9j3L5k00j38J26J21J72j22J07
6875B69j77j74o8J75J4j61J50o6L5N8j01L98m94J53m0r2J82j62k2K39L4n6k26
6898a32N9K34j50k08K41R6j04K2o7k8J08k38J45j72J37K53j44J8j19J8M16p34
6920c49L57jO6J15m84O01o93Q24m30j26M99n54J05K29J56k5l7r56N24J80j61k8
6942a88M47m05K09R0j03j66N8R2k3j75J25j89K44J09J19m87L26l3MJ78j72j65
$$ y = [-119, 37, 21, -208, -33, -184, 260, 198, 110, 43, 94, 154, -105, -36, -146, -102, -117, 120, -130, 97, -149, -95, 48, -53, -95, 46, -79, -151, -33, -104, 107, 125, 75, 3, 106, 40, 82, 97, -102, 212, 24, -66, -57, 78, -16, 79, -79, 86, 46, 42, -180, -6, 190, 73, -109, 24, 364, -58, 38, 0, -223, 59, -8, -112, -26, 198, -153, 290, 81, -18, -104, 26, 44, -103, -434, 299, 34, -57, -42, 131, -14, 122, 23, -20, 102, 181, 168, 203, 3, -135, -9, 112, 284, 162, 269, 92, -82, -150, 25, 39, -122, 28, -38, -3, 55, -46, 352, -142, 11, -29, -121, 61, -101, -123, 116, 150, 94, -132, -73, 161, 11, -197, 44, 140, 36, 58, -9, -37, 71, -167, -22, -194, -57, 196, 52, 70, -49, -31, 385, -349, 8, 7, 73, 188, -296, 305, -388, 436, 6, -120, 379, -175, -70, 159, 315, 290, 253, -703, -179, 1, -160, -188, 259, -146, 63, 153, 50, -116, -58, 34, 11, -164, -39, -228, 16, 125, 244, -243, 83, 50, 54, 232, 60, -105]
6964a05P8kj02J70k5m8o0p2J54o7J37l8mP3l32L19qn0JKj27j34K44k2L3j05J86
6991I6L1k94K81l96K23l8j14J42j4o0L58l09L04j78K34j92K2j91n3J17p6q1J91
7014Cj20J65k78J63J43j1l9l33L52k33K29j69J01j2n7K56j84M6Q1j72K62l18J94
7037F9l03K15k1M2j55J44j87J52P4P6pl7m6P5M5k42M7j28Q5K27r8O2M0k02j1J44
7063F0p4N7L3O9l11j0L05l12J42q0J20P0j94j44L54j72K6K91l04K68k92K56j9
7086A39R4l40J66k39N8K29p3j17K5L0K1PN9k7rj04j1J34k09J17J46k9n8k27J38
7111h0J91k92K54k63L19k65J25j11J95j85k28K05M45j78j33p3J66P0m10L38l9
7132E1j0j23L88l55p8L98m88J85O4JL4K30m35J3K37j19M1q0J20J0k6N9K9l10K69
$$ y = [-105, -27, -29, -131, 39, 14, -34, -94, -166, -12, -79, 58, 20, 16, 89, -243, 76, 68, 18, 19, 21, -106, -240, 4, -18, 15, -90, 96, 127, -167, 114, -282, -59, -97, -211, -69, -83, -143, 215, -94, 210, 32, 266, 74, 96, -95, -148, -31, -107, -188, 3, -117, 48, -230, -67, 76, 65, 26, -307, 45, -188, 41, -128, -27, -39, -96, 160, -24, 22, 103, -69, 193, -125, 69, -234, -19, -40, 2, -153, -9, -196, -44, 30, 106, 99, 62, 16, 91, 136, -106, -59, -187, -102, 125, 27, 89, 129, -73, -84, 60, -14, 43, 76, 145, -166, -176, 129, -183, -41, -121, -1, 69, -125, -269, 85, -87, -61, 230, -74, 194, -98, 158, 139, 233, -107, 59, -180, -122, 107, 34, -83, -58, -28, -7, 0, 59, 32, 23, -81, -92, 42, -167, -50, 96, 67, 9, -218, -80, 111, -181, 73, -190, 129, -136, -11, -122, 73, -112, -340, -135, 310, 132, -1, -74, 92, 162, -248, 90, 51, 41, -82, 306, -49, -127, 271, -217, -32, 32, 33, 67, 297, -138, -125, 112, -7, 34, -46, 74, 84, 58, 117, 146, -164, 105]
7157A05l7k36J95j52p6J87J97k09J7Q5k98J13K1Q9L7J16k76J99n6j25j21J69l1
7180h7R6P0R2nj72m5j57K16J49k51l8NR9K74l47M4J47j63L1Q8pL03m26l4k4J35
7206gL46j36m36P7L60j44k32L93k43J14j70L9J00l1R6j17k56K07r3k2K96p5J07
7229A73j25j31M0M5P6j71JJ88m2k15L7m6j38K41J89K2k02L09n5k19L36k44j00
7252c1J04q6j47j0L27k07K24j0k19P1k30K29m2j51J82j7Pj38K69K3p0r4J5R1j44
7277e4K16l16L6O9o2M1j57K87p0R6k62K54Q5L5l90J76J32k82N2K26k12j73M85
7300B12j63j89P2K26k55K46l13J49o6L97m10p3J13K1q7J14J48n9j07k37M39k28
7322e0L4K20k01P5j92K2l8J70k47K52m1N6m0q6K46j83p5K32j48K57l15Q1Q5l05
$$ y = [105, 68, -168, 27, -125, -201, -14, 183, -26, -9, 76, -222, -109, -88, 1, 38, 154, -122, 77, 21, -104, -225, -56, -87, 9, 79, 171, 166, -6, -51, -208, 8, 157, -94, -132, -127, -28, 246, -101, -57, 90, -73, -42, 46, 39, 342, -84, -118, -142, -7, 339, 203, -233, -156, 204, 60, -172, 221, -22, 92, -78, -39, 61, 30, 126, 9, -247, -40, -133, -155, 141, 66, 173, 48, -83, -43, 2, 78, -93, -92, 96, 54, -161, -124, -170, -308, -67, 122, 144, -58, 251, 196, -23, 313, 69, -31, 73, -13, -160, -170, 157, -50, 174, 164, -55, 16, -214, 15, -27, -178, 4, -13, -6, -144, 125, 148, 78, -16, -1, 90, -54, 162, -154, -118, -49, -111, -70, -227, 60, -10, 86, -176, 78, 163, 198, -192, -16, 116, -166, -114, 112, -100, -273, 212, 49, -140, -68, 158, -97, 149, -164, -15, -81, 316, -94, -167, -54, -33, -120, -6, 142, 83, -24, -261, 178, -50, -16, 204, 3, 78, -114, -92, -130, 40, -207, 45, 4, 60, 20, -66, 180, -3, -78, 154, 6, 263, -52, 29, 114, -191]
7346a91M7J06q3P7K77q1k20oK11k74k20L40l5R4k52JJ67K23k33m0J62P9k06j64
7370b21K11j19J4K19r5j56o9L50j48n9J53j69l2K93O4n48M05j24K8P8o6j78l3
7393b02L87j74N2o5L63j97k02J63J8p0k49L88l42K43k06K55n3j75m4N8rJ11q1
7416c1n4j00L15k38J35P1k13J44j9jJ34k83K52lj51Qj71m4J81J33J5m3M3j74J14
7441B0j65J40m1R0J18k38J8K94n9k70N9M7o7m0k8J43Q3j00o1N0L8L11l46L7n6
7466b3k16K12K49l45L72k96L0R8J6K45m69K50j14J19j67j00K42k21J31p6m6O3
7488d6K29M2l71j6M12n05L37Q0k79K6M6jJ57J33l35L99j23k37J31j25j12k3NQ5
7512i1j9J51j01R2m6P7p0J5Q8j95J71j12J75j55J70Q0k07R0o8r1j86K82l2mP5
$$ y = [-191, -144, -38, -121, -44, 233, 152, -68, -74, 137, -137, -357, -17, -52, 42, -210, -209, -42, 181, -52, -92, 70, 149, -57, -221, -10, -129, -115, 104, 9, -147, -216, 134, -14, -73, 80, -89, -121, 172, 236, -312, 93, -31, -3, 75, 9, -169, -202, 185, 11, 63, -2, 361, 164, -38, 125, 143, 73, -176, 212, -130, 113, -93, 162, 109, -66, -110, -52, -61, 50, -31, -85, -185, 130, -108, 27, 98, -115, 29, 10, 9, 143, -140, 112, 109, -42, -34, -205, -249, -68, 65, 80, 37, 80, -94, 20, -145, -5, -46, 44, 162, -76, -58, 236, 177, -93, -34, 13, -54, -94, -122, 21, 104, 4, -57, -7, 31, 342, -4, 33, -23, -239, -27, 222, -123, 249, -47, -17, 81, 97, 342, -127, 123, 9, 128, -39, -139, 103, -118, 13, -63, -109, -46, 183, 225, -146, -162, 250, -255, 82, 162, -117, -91, -45, -46, 111, 244, -91, 308, 185, -52, 79, -46, -158, -181, -176, -91, -110, 41, -60, 32, -14, 63, -7, 8, 96, -99, 72, -40, 135, -20, 150, 230, 23, 113, 45, -46, -232, 50, 18, 14, 89]
7537H9k12J76J01o8J08k39J05K9J2k88J77k68K20J35q2j31K33k71j57J59J72K6
7559B6J08j80j14J88L9o4k66q8L16j51J71q2J92j56L3j32K27l91K42k9J43p0J42
7582A04l7k15K69j9l1O5n0j10Lj12L72j89j00m9j9K33l64nL25K04j51j75K02j39
7606A2J19l75M50j20n4j51R0K06l57L12k14Ml5K57k53m2J41J5p9qJ2L9j24J70
7630A5Pj58J98Ok81K85kl24K82Q9k16M2L5j01K02k07J89j00R5L0m3o4k6k3M1n3
7656h2K08O2l73L09j99j50J24P4J97o0k36J66o3K10j57L4j50Rn0L60k63J76n8
7679H8k19l8o4J71p5j0k11J53L5j51N16l18J43K14q5j20l79M17Q2j69j97L06J5
7702A04l09K61j00r0J24p1Q0K22j81L9k9M0p1J47K3l45L62j72L6J82j29k5J06
$$ y = [89, -123, 53, 154, 86, 194, -45, 60, 89, 101, -187, -10, -278, -58, 77, -5, -136, 97, -174, -331, -172, 0, 26, 134, -46, -160, 28, 67, 3, -263, -351, -35, -186, -15, -97, 95, -61, -28, -160, 67, -324, -82, -111, 32, -38, 104, 67, -148, 121, 102, 71, 136, 86, -24, -21, -133, 239, 50, -50, -99, -118, 115, -249, -254, 71, 275, 124, -51, 151, 12, 131, -244, 206, 86, 32, -119, -29, 177, -180, 132, -82, -78, -113, 144, -109, -151, -10, 5, -74, -82, -70, -31, -155, 15, 22, -136, 62, 68, -213, 72, 70, -254, 28, 117, -99, -57, -22, -123, 79, -128, 61, -39, 56, 86, 43, -21, -47, -70, -29, -82, 126, 188, -185, 124, -75, -225, -101, -27, 170, 110, -126, 40, -23, 187, 30, 64, -86, -77, -127, 233, -30, 146, 88, -131, -169, -233, -62, -137, -147, -358, -205, -170, -321, 195, -123, 20, 234, 149, 29, -350, 67, 149, -20, -217, 89, 104, -205, 56, -44, -134, -10, -81, -1, 221, 40, 79, 50, 90, 19, 166, 189, -156, 206, 34, 70, 252, 123, 98, 204]
7725B04mj86O3j03j9pqP7p5q0Q0O0j33r1L24p2j10J38%MR4r8r3L6O3p8m7O8j11
7754a04J97j64J91j10k46J95r5Q9j36J05PK10j6j75l6K9j20l0J05J81j42l4N5
7777d4J11j03J33j10k3P7j61K30R9k89Qj43J59j8L9Rq2P9p3J48n8O3j97J54M3
7802E1L45o29K19P0o0j54o3K93j97L4n4M08k4j91k16p8K70m16K85R3Q1o7J2kM
7827A4m0j18m9K03O4l06O3L89j28j65m7j0J73j04R2M4j98K36p6J28l05N3k84K62
7851a09O7rN2JJ14j42O2m2nl2o7Q7J58m09L36j12P1N0j6j46J80N5j15r2J33Qj84
7878a06P7Q2j75L65l15J31mj40O1K71l10M1J06r4J12j33k89J64N8L26k76l6j39
7901b23P5J24J18Nj75K27l83L4K65o6j93K08j95P0rJ92p7j39R7R3k81K43J79k52
$$ y = [204, 200, 14, 77, -26, -45, -52, -60, 17, -58, -138, -58, 2, -131, -222, 102, 30, -80, 58, 58, 62, 156, 58, -35, 1, 64, -14, -61, 7, -104, 93, -71, 120, 10, -236, -41, -136, -47, -183, -78, -71, 139, 123, -52, -88, -59, -179, -209, -104, 77, -65, -99, -44, 67, -36, 97, -13, -36, 41, -120, 110, 209, -80, -72, -215, -56, -74, -35, -26, -108, -29, -102, 46, -12, 51, -146, 8, 51, 396, -233, -14, 56, -4, -158, -221, 72, -125, -91, -145, 263, 239, 48, -168, -246, 24, -392, -107, -14, 67, 0, 12, 10, 14, -26, -144, -193, 10, 74, -232, -169, 220, 92, -73, -120, -130, 43, -61, 31, 75, -123, 113, 37, 165, -140, -87, -371, -109, -42, -51, 1, 2, 116, -26, 36, -6, -11, -43, -110, -23, 135, -274, 62, -50, 21, 71, 55, -91, 89, 144, 29, -63, 70, 78, -106, -29, 53, -122, 243, -72, 59, 55, -85, -24, 247, -63, -22, 84, -10, 102, -31, -320, -156, -98, 228, -48, -84, -223, -148, -24, 94, 99, -76, 151, -232, -198, 67, 1, -192, 16, -179, -109, -118, 74, -3, -142, -45, 48, -233, 10, 189, -63]
7925f3R4k6K9j49J41M2K03k76k05K10O2O1m2O8k67J28K6j9k13N07j59k77L12j4
7949A73j88R4J0J00k6k68j29J62K46l21M7J91K9N5l76J53J80j98J55N9j51m7J11
7972F1j74J98Nll5jo5l6l40O05m35M1J44n8J28j26J76P6j30j34O8k58J11J09p1
7997a44K46l3P8l39K58j33L1J64k71J70N4l14L47P6l57M05l42J84j76J68j19J57
8019A10k01R5O3j42j88J98M6o2k37L80o9Lj02K37P5j99M02l62Q2l91N45j16m18
8042b51J090o61p64R64O2q07O64n44M44l35k4L86n75M73n46m9M19l10M34k88K54
8063C6k25J38J31j62j6K21j82J69n6l11J71J91R4m5J29k87o2j6Q2o5J20P2j58
8086c1L67k85j95L09l50K32j08J17j02j22P9m9P6P2L53k74j86k7J47j17m2J47
$$ y = [-63, 31, 5, 34, -115, 26, 68, 271, -5, -210, 0, 62, 123, 81, 149, -118, 10, 36, 17, -196, 311, 152, -125, 187, 173, -15, 79, 89, 189, 163, -105, -234, -72, 174, -147, -100, 91, 120, 175, -201, -48, 132, -66, 89, 148, -3, -50, 61, -113, 85, 90, 87, 52, 51, -14, -50, -390, 215, -220, -179, -35, -93, 35, -91, 85, 161, 31, -103, -35, -293, -182, -73, -144, 102, 69, 147, -192, 66, -67, -36, 128, -143, 27, 81, -233, 114, 190, -167, 238, -104, 80, -96, 72, -47, 110, -91, 4, 67, -75, -263, -65, -19, -81, -318, 62, -7, -4, -106, 131, 206, 7, 409, 47, 129, -262, 283, 167, -251, 839, 178, -586, 378, 440, -367, 297, -247, 197, -138, -162, 224, -351, 122, -424, -473, -54, -364, 70, -218, 36, -189, -51, 80, -82, -98, 123, -59, 110, 54, -257, -86, 105, 199, 154, 283, -4, -66, -82, 0, -65, 55, 127, -31, 336, 51, -144, 165, -185, 47, -61, 56, -46, -168, -89, -138, -62, 10, 363, 89, -97, -124, 23, -94, -136, 11]
8108A1Q5J6k74K97N3l8j34o8K45l35L3J12j09n9J66o5n5J46o4p3K35o4J86j15
8132A32o8Jl0o4K81j14o0m8k4l14J22K47P4j5j26k53K33P1K6J12k02K21k99Q3
8156a4k10L80k92l3L63k46K44l14K74l47L09n4J51j05Q5j99N3rk76K72k16J51
8178c3q8J30M4J54k94J91j32j16L83j50K7k32Q3
$$ y = [11, 96, 112, -162, 135, 188, 150, 16, -52, 193, -142, -109, 3, -106, -165, 1, -64, -119, 27, -37, -110, 125, 61, 247, 132, 64, 65, 35, -29, 252, 138, 78, 30, 6, -308, -186, 61, 135, 120, -6, -259, -26, 45, 71, 183, -19, 202, -97, -14, -224, 156, -136, -169, 194, -52, 192, -122, 152, -195, 114, 60, 211, 106, 191, -8, 45, 36, -240, 32, -184, -33, -121, 9, 53, 207, -87, 104, -28, -144, 239, 89, 116, -116, -33]
8191c3
$$ Imaginary data points
##PAGE= N=2
##DATA TABLE= (X++(I..I)), XYDATA
0@%%%%%%%%%%%%%Pj5J6j6J6k3L1l9M6n4O3p1Q5j00J17j39J61j85K14k43K76l13
35a66L53l97M46n02N63o28O99p76Q61r54J057j168J287j419J565j726J901k092
53a096K304k541K805l102L438l823M267m788N409o160P097q303R921j2231J5849
68I046k2650O0491j62072R3386J39405j60706J6744M3665j7308R428k5165j5315
80c1051J01678j08566J5028O2907m5539k1686K7665K7289n6994J2785M2884j1244
92A5156o0917N4113K2680o6675M1183k7105L2690M32m2703L1160K7440l9412p257
105a9215L5117l3002L6808m4447N529N7248n4049J575K8310j986l4271L4869j4841
118b355n612J1537q643J4221k1258K9044k2789J1100k337j6774L5030k1100k2119
$$ y = [0, 0, 0, 0, 0, 0, 0, 0, 0, 0, 0, 0, 0, 0, 7, -8, 8, -8, 8, -15, 16, -23, 23, -31, 32, -39, 46, -54, 63, -76, 85, -100, 114, -129, 147, -166, 187, -210, 236, -266, 297, -331, 368, -408, 453, -501, 556, -612, 675, -744, 821, -905, 996, -1096, 1208, -1333, 1472, -1630, 1808, -2015, 2252, -2536, 2873, -3287, 3810, -4493, 5428, -6803, 9046, -13604, 46887, -115185, -21799, 117606, -43100, -26356, 17309, 1, 9429, -15736, -31051, 70627, -37939, -22911, 39996, -5543, -27229, 436, 27725, -29269, -16484, 26400, 15156, -45761, 8352, 31032, -35643, 5540, -21565, 11125, 11557, -31146, 14, 27454, -11958, -19215, 15902, -17100, 19708, -24739, -19210, 38038, -16011, -14436, 13874, 11888, -22383, 12486, -2355, -7967, 3570, -5073, 9148, -12110, 16934, -5855, 5245, 2908, -13866, 21164, 64, -22055]
131b2055L2098K7701p4707M9224J5126n0437M0729k0717n153K0007m429k9476
143b2089M3131j1446k2011K6585k3188K3664j9988O80N246L172r06q589J0728
156D989p823J1316k3435K3608j4439k652K1107l0017K2127K409r718j1142K5357
169A1687j5439k480O215j5092L1896k8447R248N931o824O59N246p031r086K8671
183A5154k9831J1788N373J688o675q978K4402j6032J864q327J7749q038k318L136
197I55p69J1676k4383K4068j4189j81R225p152j919O034J1000k6068K1411r342
211C66M087k068r082J4202r361P467j0745J3194r267N670l631n840J4326j4656
225e338J0185j4033J9192n732j2021R005K733J95j6254J8771j2574R096o831j54
$$ y = [-22055, 10043, 37744, -36963, 12261, 27387, -23050, 17679, -3038, -8191, 11816, 7387, -22089, 21042, 9596, -12415, 14170, -9018, 14646, -5342, -4662, 584, 3756, 2850, -5739, 4989, -2834, 8482, -14953, 8655, -5784, -8436, 12671, -17346, 4781, 7190, -2528, -13670, 11687, -3752, -6232, -17, -15109, 16787, -11660, -2412, 3519, -3305, -2646, 2600, -4431, -13517, 15154, -14677, -2889, 2484, 4172, -2503, -11481, 12921, -3111, -1247, -9574, 8175, 137, -2181, 955, 186, 11862, -12521, 11547, -2642, -2823, 6402, -750, -2669, 3365, 14365, -11703, 9708, 366, 4453, 2385, -6697, 7505, -1856, 5611, -5134, 8060, -1207, 4463, 832, -5008, 9318, -5338, 4847, -9186, 10006, 4274, -7747, 1258, 3991, 4186, -12068, 6703, -5871, 3225, -3606, -3760]
239c760J1002j5008J1276p120M317r076J4251j1421l052J6297j3123P532j1766
252i651J6111q245l105J342K237M173j2043J4185q841Q694j0184M265N701j0951
266f312R417r080J1358p853O701p269O876J261j1063J4910j5259J0576n768L990
280B485k696J220L974q248R551j0579J4257j5057M634N196l870K575r394J5228
294I276j0539M590n860P418l697o031J1132j1713J3430j2321O611j248o45Q16
308A219n106O590q758J3582j5639Q698L35k513K864p832R974q229O923j0513J0988
323B583k410m209L789n481J3874j5808P247k947M543j822m743P702n115P927j2989
338g859J2596o220K79K383o269R887p448O939r110J0169n051l76Q19m973J2703
$$ y = [-3760, 7242, -7766, 3510, -3610, 707, -8369, 5882, -5539, -8591, 7706, -5417, 2115, -9651, 6460, -1785, -4890, -3548, -1311, 2862, -9181, 5004, -3837, 4857, -5327, -1062, 4639, -6312, 3105, -5975, 5383, -2470, 4231, -3038, 3838, 5099, -5964, 8946, -6313, 4263, -1505, 2485, -211, 1009, 4983, -3265, 6286, -4293, 9964, -5093, -459, 4737, 867, 3442, -5952, 9276, -1263, 3327, -2533, 4885, 1188, -4843, 6289, -5424, 8006, -4315, 2296, 1048, 403, 1219, -3887, 2703, -6055, 7527, -8112, 586, 921, -1592, 1272, -6560, 3414, -4815, 2108, -8405, 2583, 173, -4036, -247, -5728, 8146, -7662, -415, -3362, 1181, -641, -5384, 2318, -2797, 5130, -7859, 4737, -1483, -1204, 1179, -5090, 4797, -2651, 4288, -4822, 5347, 296, -80, 739, -4234, 8469]
353H469j2934P886n587P164l428k524M533m491O651j1870J2471p130M561k763
367A008k909Q728q131N604q548R505o231L720l601j147Q416j0936P839o719P240
382C838o204J55L033k617M773j0317J1185o865M433m427R15M166p046P381q164
397e761Q830p218N124k939l96M384o869P218r419J1363o437o3M93J958L025j0282
413f989J0086o169O808q413L880M107m610K911o243J2220j0191L850k407L068
427A908J029o064P777p232Q311p424M964l285R44K819o899Q263p845Q474p705
442a965L362P59m14ko782J1187p367L889o819O887n6n724N548o015Q223q420M512
459H03l294M383j604n157Q429p456P860r320N233p47J292j436m787R806p283M577
$$ y = [8469, -4465, 3421, -2166, 4998, 1570, -954, 3579, -912, 5739, -6131, 6340, -790, 3771, 1008, -1901, 6827, -1304, 4300, -4248, 5257, -974, 2746, -855, -2002, 6414, -4522, 3317, -3402, 3838, -2366, -2211, 822, -1795, 2978, -7339, 3846, -3019, 1414, -3013, -2098, 2068, -4978, 2403, -5761, 3069, -4149, 975, -1964, -2360, 2024, -4845, 2373, -7046, 4317, -2120, -2183, -1690, 268, 3293, -6989, 3097, -3072, 3736, -4677, -797, 3310, -1300, 1611, -4632, 7588, -2603, 1247, -1160, 1908, 2937, -3127, 4650, -2582, 5729, -1695, 3269, -16, 928, 3747, -3152, 5111, -2734, 5740, -1965, 1397, 2156, 1742, 1740, -5042, 6145, -1222, 2667, -4152, 2735, 2679, -3045, 2503, -3512, 4711, -3709, 803, -2491, 1892, 288, -4869, 3560, -3896, 3964, -5356, -123, -870, 422, -1014, -5801, 4005, -3278, 1299]
475A299o947Q689m285k847N952o093O492o477O053n925N769j255l017L104m201
490c689R995j1230N138p58M167l308n419R906m290Q37o734J2625p495j328M769
505C186m143N733p438O236n635O326m094l15K977m040O693q544P361o066N054
520C291k459l494N563l392L177o994Q676n765L545k766k605P729o830L728o556
535e152R470n319j892K875m1J547q105J0182o736M017l623J131K375l385M718
550B062p446P876n808M866l395l84L311l425M556q182J0162n629l61R88J876O40
566A707n989Q281p491P304m911Q30J032n47K825p552Q983o024M856m823K266K581
582C328l878K600n347R978q731K978o67K314k60n163P367o528N828o000M471j880
$$ y = [1299, -5648, 3041, -1244, -4091, 1861, -4232, 2260, -4217, 1836, -4089, 1680, 425, -2592, 512, -3689, 6306, -4924, 214, -544, 3623, 315, -5104, 4802, 512, 1349, -5385, 7240, -255, -1583, 3186, -957, 4776, -2662, 3574, -2061, 4265, 171, -144, 2833, -1207, 5486, -3058, 4303, -1763, 3291, 832, -2662, 2901, -491, 2686, -4308, 4368, -1397, 2148, -618, -3223, 4506, -2324, 1404, -5152, 4318, -1001, -2893, -18, -59, 1488, -6617, 3565, -3171, 846, -2777, -1646, 729, -2656, 2062, -5384, 2492, -3316, 1550, -1845, -2229, 1082, -2343, 2213, -5969, 4193, -1436, -1797, -809, 1067, 1707, -4282, 3999, -3492, 3812, -1099, -269, 763, 216, 3041, -4511, 4472, -1552, 3304, -1519, 747, 3328, -550, 2050, -3297, 6681, -2050, 928, 261, 2575, 2315, -2848, 4519, -2009, 3819, -2181, 2290, 410]
598D10o56K676m825N580o085O908o736K701R08j585J575n861R115n934K187m546
614d168O421j640o004P094l943M164p339O833k632M68L47k913N603o270N908n444
630c515M129k160J427J046n699Q066n380L326m298N208k541j327L912m409O053
645C838p267O193m046L136j017k077L370l812N864p306N844k657J204q28j497
660a058O170p512M935l702M885l667J54J575k675M973p531O900n219L754j368
675F14j618K281k801M760o933O439m114K026j311q27L422m796M633o067O961m375
691a706L49N65r90L739o225N398n043O368n667J470L139l223K150m767Q527o618
707b534L221k357K49L047m235M619m865N777n357L135k046N58L577n095M916m596
$$ y = [410, -246, 2430, -2395, 3185, -2900, 4008, -2728, -27, 881, -704, 871, -4990, 4125, -1809, 378, -4168, 2253, 613, -5391, 1703, -2240, 1924, -5415, 1418, -1214, -746, -399, -3312, 2291, -3979, 1929, -3515, 614, -1546, -119, 927, -4772, 3294, -2086, 1240, -3058, 2150, -391, -1718, 2194, -2215, 3838, -3429, 2764, -1282, 1854, 837, -1240, 2130, -1682, 4182, -3124, 2720, 63, 1267, 439, -1058, 5112, -2400, 2535, -1167, 3718, 51, 205, 1780, -895, 4078, -3453, 3447, -1772, 1982, 614, -1004, 1277, -1524, 3236, -3697, 2742, -1372, 654, -657, -1484, 1938, -2858, 1775, -4292, 2669, -1706, -1357, -792, -1782, 1957, -4268, 1130, -3913, 2455, -3212, -1742, 1397, -1826, 324, -4443, 4084, -2534, 687, -1670, -1421, 1626, -2609, 2010, -2855, 2922, -2435, 700, -1346, -788, 2789, -2306, 2610, -1986]
723a986O377o643L082Q41j641K284n202O453m570M143m261J943J325l131L594
738B608m614O152n369L589k502J559L63l374M404m893N638n098L201k803J335
753A96K042n493N325m506N213n327L189l65j062J338l716N689n711L921l845L631
769E19j385j847M135m160N375o767M823l091K095j014m30L648n347N547n452M521
785A170k200J430lk711M519m168M065m819L865p74n71J473k816N341n940M414
801B275l180K955j648j563L783l934M453n204N043l064J181j36j553L713m835
816a714N015n148M894l561Q19P50k250M087n373N053m077L708k629m76K217k830
832a515M078n740M980l596K569j977l06K849l800L726m848N836m528J659l09m67
$$ y = [-1986, 4391, -2252, 830, 1671, 30, 2314, -2888, 3565, -1005, 3138, -1123, 820, 2145, -986, 2608, -2006, 4146, -1223, 2366, -136, 1423, 1786, -1588, 2816, -2077, 3561, -1537, 1664, -1139, 196, 2238, -3255, 2070, -2436, 2777, -2550, 639, 274, -788, 550, -3166, 2523, -3188, 733, -3112, 519, -866, -2713, 1422, -2738, 2637, -4130, 693, -2398, -303, -1317, -1747, 1901, -3446, 2101, -3351, 1170, -1030, 400, 397, -2314, 2205, -1963, 2102, -2717, 1148, 374, -197, 1276, -1540, 3801, -2139, 2275, -905, 2050, 402, -1161, 2622, -1312, 3141, -2063, 2980, -84, 1097, 961, -592, 3121, -1714, 3301, -1847, 3047, -514, 305, 1055, -1195, 2892, -2481, 2572, -1505, 2203, -426, -902, 1315, -1515, 2563, -3177, 1803, -1793, 776, -1201, -1507, 1342, -2458, 1268, -3580, 2256, -2272, -613, -922, -1389]
848a389K909m917M440l765M380l999J795J069k449L298m638N803n026L673k388
863a204R53J157k401L488m679N617m439K988k290N97K252l490L274l685N572n210
879a500K619k61l75J476m374O028m667L558l706K265O24j981K103l291M702n157
895a937M252l014J520L45k170L325m633M880m224K748k111Q23J351l464L999m224
911b534M910m754J996L86n76O56k549M934n381M124l666L025n03k247K545k667
927b301M088n234M353k501J866j000m55K124m247O130m991L721k436R09R13k468
943a529L946m693M414m075L507j878M64k09j382N126o013M146k168L195k434k85
959A32K233l202L767m721M070k504J847j321m1K244m215M328m136L221l309K395
$$ y = [-1389, 1520, -3397, 1043, -2722, 1658, -2341, -546, 523, -1926, 1372, -3266, 2537, -2489, 1184, -1204, -251, 906, -1495, 1993, -2686, 2931, -1508, 1480, -810, -213, 2039, -1451, 1823, -1862, 3710, -1500, 1119, 858, 483, 1959, -2415, 3613, -1054, 2504, -1202, 1063, 1687, -294, 1809, -1482, 3220, -1937, 2315, -699, 821, 1166, -1004, 2321, -2312, 2568, -1656, 1092, -1019, -196, 1155, -2309, 1690, -2534, 2376, -2378, -382, 4, -572, 84, -2465, 2469, -2912, 1212, -2454, 571, 68, -2179, 366, -2301, 1787, -3447, 906, -1595, 271, -729, -1184, 940, -3307, 2823, -2168, 1553, -883, 26, 939, -1529, 2417, -2276, 2138, -1937, 1570, -308, 156, -53, -1435, 3691, -2322, 1824, -344, 2851, 417, 132, 2365, -837, 2930, -1791, 2279, -225, 1622, 301, 260, 2504, -1711, 2617, -1519, 1702, -1607, 788]
975G88k23j588L611m659L296l220L652k676K27M15m44K974n678M805k328K532
991A484l480R79K350l790L632l698L678l631K907q77r95K634l401L245l081L576
1007A532l080J634m47r62L085m412M230k991L031l068J463R49k242K932l353M529
1023B830m109L201k527P33J778k917K971l501M295m279K821j168K45J737l765
1038a655L869l361L534l177K052k86q88J110k567L600l952L717l165J502O73k122
1054a116K093k543K949l211K967k901K060J20k304K674k266L053l485K006r39
1069h43P4Q33k324L232l353L903l198K103m64j510K519l029M145n172L329j849
1085a604J731j24r73K278k874L489l753L618k746J301J70j663K892k778L345l920
$$ y = [788, 565, -1023, 2588, -2071, 1225, -1995, 1657, -1019, -792, -377, -821, 2153, -3525, 1280, -1048, 1484, -1996, -1017, 1333, -2457, 1175, -2523, 1155, -2476, 431, -446, -1441, 1193, -2208, 1037, -2044, 1532, -1548, 86, -361, -1323, 1762, -2650, 1580, -1411, 1620, -1448, 15, 964, -1278, 1654, -1699, 2830, -1279, 1922, -605, 128, 1906, -1011, 1960, -1541, 2754, -1525, 1296, 128, 373, 2110, -1655, 2214, -1147, 2387, -790, 1262, 976, 88, 1198, -1369, 2231, -1721, 1996, -1169, 333, 1006, -1116, 977, -1566, 1383, -1828, 1139, -1762, 298, 418, -1886, 788, -1478, 1575, -1910, 96, -843, -769, 64, -2260, 972, -2381, 1522, -1676, 427, -37, -1547, 972, -2057, 2088, -3084, 245, -1604, 127, 3, -970, 1308, -1566, 1923, -1830, 1788, -958, 343, 513, -1150, 1742, -1036, 2309, -1611]
1101a611L378j722N0M88j207L392m482L925l031K678j946j53J919k475K827l453
1117a423L623l115J978r04k61J688k988L674m288L615j997J140j061o64K788l688
1133a883L197l664L913k891O92P21j220J783l169L960k929J989k183J120Q62j965
1149a667K863l608L950l657K439j296L84J026j875L038l814L860k839J497p41
1164d40k47K370l617L576l037L330l169J430N73j023J655k689L962l762K370j764
1180d82J476L66k118K209k543L655l681K305j351N83P43j807K421k812L734l609
1196i11J568l25l06J229l620M078k956K587k981K184k26j280J608k330L542l938
1212b077K934k333J521k38j375K807l247L194l066K729k057J069L00j691K404
$$ y = [-1611, 1767, 45, 95, 583, -624, 2768, -1714, 2211, -820, 1858, -88, -241, 1678, -797, 2030, -1423, 2200, -915, 1063, 159, -102, 1586, -1402, 2272, -2016, 1599, -398, 742, -319, -983, 1805, -1883, 1314, -2350, 1563, -1328, -636, 85, -1135, 648, -2521, 1439, -1490, 499, -1684, -564, 298, -1667, 1196, -2412, 1538, -2119, 320, -976, -592, 434, -1441, 1597, -2217, 1643, -1196, 301, -440, -687, 1683, -1934, 1642, -1395, 1935, -1234, 196, 769, -254, 1401, -1288, 2674, -1088, 1282, -482, 994, 1360, -758, 1451, -1092, 2563, -1118, 1187, -164, 419, 1162, -645, 1776, -1036, 2698, -911, 657, 332, 26, 1255, -2365, 1713, -1243, 1344, -1637, 547, 321, -959, 649, -1681, 1861, -2077, 857, -1476, 45, -193, -1568, 1239, -2008, 1186, -1880, 849, -1208, -139, 161, -1530, 874]
1227H74k765L111l107K367r16J29O92k000L351l468K797k455K307j152m14J924
1243A275k164K913l715L225k084J348l65q70K153k736L190l396K634j579R08J43
1259H80j248K533l325L142l196K699j360R9M96j048K547l881L645k983K113j344
1275b31l4J175j780K794l986L148k308J342o00j45J281k504K848k971L100k399
1291a270J059k0q92J777k492K854k789K262j699R53M94j547K540k954K807l060
1307a977K297q12K79Q46j766K098k683K928j961J384k49p0N61j743K442k093K424
1324A905k809K043r7j591J988k488K874k919K429j636J155l36q77J364j933K695
1340A767k531J874j835J075P02j578J581j950K142k529J673j155N43P72j178J614
$$ y = [874, -1891, 1220, -1887, 480, -436, -307, 385, -1615, 1736, -1732, 1065, -1390, 917, -235, -649, 1275, -889, 2024, -1691, 1534, -550, 798, 433, -437, 1716, -1020, 2170, -1226, 1408, -171, 737, 880, -368, 2165, -1160, 1982, -1214, 1485, 125, 224, 720, -328, 2219, -1662, 1983, -1000, 1113, -231, -265, 910, -870, 1924, -2062, 1086, -1222, 120, -480, -625, 656, -1848, 1000, -1971, 1129, -1270, -211, -231, -1123, 654, -1838, 1016, -1773, 489, -1210, -257, 237, -1310, 1230, -1724, 1083, -1977, 320, -492, -213, 633, -1133, 965, -1718, 1210, -751, 633, 384, 314, 875, -868, 1574, -519, 1905, -904, 1139, 1042, -549, 1439, -1049, 1825, -1094, 1335, -301, 854, 518, -359, 1005, -928, 1767, -764, 1110, -725, 350, 1052, -526, 1055, -895, 1247, -1282, 391, -764, -221, 551, -627, 987]
1356I87k233K344k701K314n22r19Q53j359K602l223L064k304J926j080o30J295
1372D14k015J450k217L227k337J985J48j855J695j791J620k452K488k93o9K13
1388B11j060J922k449K301j947K633j598l96J515j286J855l007L491k524J062
1403G23m17k91J507k251K287k425K052j689J715o64j127J568j253J486k206K570
1419A585j657K03k52J41J274k072K009l235K718j492N39k1o97J574k309K747k866
1436a811R08L47m81P50q56J259k426L091k124J267o66m00J883j870J027q11K070
1453A157k384Q57k6j83J458k707L349k047J028r50O10O20j521J750j374J531k771
1470a603J999p64J047L70j642K221k080J879j876P36o68L62R91j642K072k134
$$ y = [987, -1246, 1098, -1603, 711, 189, -730, 123, -1236, 1366, -1857, 1207, -1097, 829, -251, -881, 414, -1601, -151, -2368, 859, -1478, 507, 655, -1200, 495, -1296, 324, -2128, 360, 67, -2, 211, -849, 1073, -1376, 925, -1022, 1611, 13, -383, 1132, -154, 1701, -1306, 2185, -339, 723, 306, 15, 1522, -729, 1558, -867, 1185, -504, 1211, 547, -580, 988, -265, 1221, -985, 1585, -72, 131, -121, 20, 1294, -778, 1231, -2004, 714, -778, -239, -260, -957, 617, -1692, 1055, -1811, -903, -556, -1037, -287, -1143, 116, -2310, 781, -1343, -76, -742, -1142, 741, -1129, -102, -913, 1157, -1227, -370, -396, -579, 879, -1828, 1521, -526, 502, -448, 162, 782, -739, 1011, -363, 1168, -1603, 396, -368, 679, 1049, -593, 1628, -452, 1427, -449, 287, -381, -19, 972, -670, 1402, -732]
1486g32K076j828R54J24p38J324j842K267k386J828j805J176m13n55J595k128
1502a083K014j951J558r16L88j06p09J747k239J981k003J875j055J13P78j662
1518a270K059k302K125k044J557n90M4Q29j773K388k449K136j369Q55O6q49J292
1535G05j661K175k413J887j282Q53q8m95J432k021K194j851J545j124K96N68q94
1552a74J357k108K319k162J605n28j20J121j789K081k529K011j460J323q65j90
1568a08P42j217J440j861K104j375M20k44k11J402k569K167j559J681j905Q59
1584b34M69j265J297j476J917j997J604r75N08K15p15J173j815K150k078J392
1600A70p15j35J078j336J432j421K112k096J087j98j32Q31j757K348k083J636
$$ y = [-732, 1344, -484, 470, 594, -144, 1180, -662, 1605, -781, 1047, -758, 418, 5, -550, 1045, -1083, 931, -1020, 538, -378, 10, -96, -805, 942, -1297, 684, -1319, 556, -499, -386, 392, -1270, 789, -1513, 612, -1432, 125, -465, -421, 408, -1365, 1023, -1426, 710, -659, 196, 262, -587, 705, -956, 1219, -1194, 693, -589, 264, 176, -319, 1113, -908, 1286, -565, 980, -144, 152, 720, -174, 1183, -925, 1394, -768, 837, 309, 189, 1310, -479, 1602, -927, 1084, -376, 947, 82, -108, 634, -583, 857, -1004, 1100, -275, 145, -99, -310, 1092, -1477, 690, -869, 812, -1093, -234, 235, -1030, 267, -1209, 708, -1289, 315, -660, -152, 63, -652, 521, -1294, 856, -1222, 170, -545, -680, 398, -938, 494, -927, 1185, -911, 176, -22, -154, 677, -1080, 1268, -815, 821]
1616H21j558J327k88p87J347j510K092k588K254j295N28M26r81J389j995K229
1632A411j679P46n49L65P22j541J629j768K025j948R04n6j8J88j266J926k004
1649i13J818j651J311q94j05Q99j382J610k065J875r63K02M3n96J234j416J675
1666F82j873J460p64Q8K00n25J238j638J600j536J592j040L39L47q91J535k058
1683a244J858j394J430o99J4N54j196J682j990K147j609J025l53l42J025j782
1699h74K002j825J522r36Q51n67o14J881k323K211j906J660j145n7O84r68J647
1716A243k138J972j688J534j019J11Q35j443J366j775J998j621R37n45P3P15j518
1733i63J762j858J602j533R36k61k02Q40j662K032j593J223j214O28K60n78J113
$$ y = [821, -737, 590, 302, -485, 862, -648, 1444, -1144, 1110, -185, 343, 769, -212, 1177, -818, 1411, -268, 478, -71, 294, 1016, -525, 1104, -664, 1361, -587, 317, 261, 243, 431, -835, 1091, -913, 905, -746, 565, -329, -434, 465, -917, 693, -1372, 503, -460, -258, -215, -811, 423, -993, 682, -1191, 269, -495, -407, -207, -732, 506, -1132, 468, -1068, 524, -516, -177, 170, -721, 814, -1244, 614, -780, 650, -49, -35, 519, -677, 1005, -985, 1162, -447, 578, 225, -117, 908, -874, 1128, -697, 825, -111, 740, 173, -441, 1440, -883, 1328, -578, 1082, -63, -120, 564, -404, 1243, -895, 1077, -611, 923, -96, 15, 850, -593, 773, -1002, 996, -625, 312, -233, -160, 555, -963, 799, -1059, 543, -990, -54, -315, -517, 323, -1339, 693, -900, 323, -891, -263, -3, -581, 532]
1750E32j910J928j296Q96q69O11L45r85J344j715K255k086J107j65L9M49j413
1767i33J738j578J615j443J027k07l64R20j278J845j906J500j114O37O3n35R37
1784I24j568J809j729J526j061M3P15r77J224j331J531j806J319p25R1J87q28
1801f56J622j931J707j447J096o75L9P69j439J645j944J884j541J054o14j64P22
1818A27j175J727j815J306j160J102l38m12J337j536J377j688J566o65M0L56q69
1835g20J609j836J835j527J340r04K69O09j052J554j975J805j453J228m89k68
1851B5P84j329J655j648J779j333O06l36n94J405j832J901j786J521j117N48L56
1868F05r65J267j790J915j642J305j210N03L50j026J622k017J687j533J172o03
$$ y = [532, -1378, 550, -746, 150, -719, -108, 237, -748, 596, -1119, 1136, -950, 157, -8, 31, 480, -933, 805, -773, 842, -601, 426, 219, -145, 775, -503, 1342, -564, 936, -178, 459, 522, -13, 924, -644, 1165, -564, 962, -99, -56, 659, -318, 906, -425, 1106, -700, 619, -106, -15, 172, -656, 966, -965, 742, -705, 391, -284, -245, 524, -915, 730, -1214, 670, -871, 183, -431, -595, 127, -1048, 679, -1136, 170, -990, 112, -226, -638, 699, -837, 540, -1148, 418, -247, -207, 149, -720, 889, -947, 888, -639, 701, -203, 66, 675, -377, 1177, -798, 1007, -446, 782, 293, 25, 809, -520, 1135, -513, 1266, -67, 539, 203, -391, 1014, -818, 1083, -703, 818, -299, 249, 605, -360, 907, -883, 1032, -610, 695, -515, -12, 338, -688, 934, -1083, 604, -929, 243, -360]
1884c60k00R58j075J159j647J495j234R74l71j51N82j079J582j564J488j437Q48
1901c2k58k31R18j356J750j672J361j307R25M1n37J114j438J476j493J463j021
1918b97L32M59r92J706j922K000j694Q14k29N0L50j079J793j835J409j411J200
1935F54m83k49Q23j371J761k126J778r32L10j5m25R05j462J574j721J353o39J75
1953i0L0l61J065j655J773j805J456q35J42M09r91J420j577J560j353J023o41
1970d30o3O06r44J382j516J578j179P46k30n40J170j221J262j685J563r35N56
1987A20J14l66R86j813J969j561J225o56L6M93j073J536j437J722j812J241q33
2004a09K16L38n23J123j632J564j173P06q11M34Q45j416J180j224J698j918P26
$$ y = [-360, -560, 398, -677, 482, -1165, 330, -904, 70, -301, -452, 130, -949, 633, -931, 557, -880, -32, -290, -521, 397, -959, 791, -881, 480, -827, 98, 139, -398, 716, -722, 754, -739, 724, -297, 35, 494, -498, 1208, -714, 1286, -408, 406, 177, 227, 577, -502, 1291, -544, 865, -546, 654, 171, -78, 745, -626, 1135, -991, 787, -145, 165, 150, -275, 630, -832, 742, -979, 374, -265, -90, -60, -421, 644, -1011, 762, -1043, 413, -422, -280, 129, -862, 558, -1019, 541, -812, 211, -430, -493, 113, -831, 551, -965, 613, -566, 180, -50, -590, 580, -641, 621, -1064, 499, -436, 120, 234, -132, 854, -959, 1010, -551, 674, 18, 54, 547, -526, 1010, -427, 1295, -517, 724, -109, 107, 445, -78, 1045, -587, 977, -196, 510, -301, 133, 978, -438, 742, -482, 1216, -702, 24]
2021B4J71p24R28j533J795j552J347l66J387j655m67J015j545K249j660N05l68
2038d49K61pp2P33j756J835j263Q56o70K48P26j416J653j423J411j094N09k38
2056a56K7M28j109J715j916J606j010P10r2l95P87j033J285j356J152q10L87L58
2074E78q84J238j625J675j374J111p07M24j33p79J522j560J560j721J361q68n5
2091b37O37r07J262j397J447j211N59l69j12P39j145J338j602J462j013L99K14
2108F4n95J019j377J463j723J314n16Q9N7m59J288j583J516j414J099o39Q0O87
2126C70j307J268j155J495j254O58j43p4L27o37J283j649J454j185O94J01o66
2143d20J265j106J028j571J525o97K92K36q44J601j965J587j453J451j168N46
$$ y = [24, 195, -529, 399, -1134, 661, -891, 456, 90, 1477, -178, -645, 370, -1175, 1074, -586, -81, -449, -188, -195, -267, 466, -1290, 545, -718, 138, -532, -284, 442, -974, 679, -744, 667, -427, 82, -156, -129, 299, -810, 905, -1011, 595, -415, 295, 203, -192, 595, -438, 847, -509, 643, -167, 220, 578, -306, 932, -693, 982, -392, 719, 12, 436, 303, -476, 1046, -514, 1046, -675, 686, -182, -237, 400, -507, 755, -642, 805, -406, 153, -216, -328, 411, -734, 604, -998, 464, -549, -150, 64, -531, 488, -889, 574, -1149, 165, -351, -262, -205, -664, 624, -959, 557, -857, 242, -397, -317, 370, -937, 331, -824, 671, -583, 75, -68, -142, 185, -452, 831, -818, 636, -549, 145, 246, -420, 845, -261, 767, -804, 721, 24, 316, 552, -292, 1309, -656, 931, -522, 929, -239, 307]
2159C07K63q16J136j453J380j216P95m25j03O21j157J472j368J064j007R33l97
2176B9j84M89r79J550j953J669j202O05M1l93O28j399J600j263J007q24M12K47
2194H0o24R55j154J386j268R35o63L8N31j013J626j628J187j257J244m37k21P46
2212D63q90J275j581J818j473O95k61K6P36j280J364j034J023j196P00q6n53J137
2230H83j013Q56j145J126q52N27n4n03J055j608J552j404J256q37J86K83o69R68
2248F07j299J508j402Q42l21l3J81o86J049j171R23j004J023k02m52P96j026J018
2266C51j389J318q13M65k04l03J125j218J400j594J267r10K66M20m75P46j142
2283f90J573j539J318q90J2Q12r42J048j140J123j027J021o27N5O88j181J187
$$ y = [307, 570, -246, 890, -563, 817, -399, 396, -29, -132, 489, -668, 804, -564, 500, -507, 426, 29, -155, 334, -645, 905, -1048, 621, -581, 24, 65, -328, 300, -1099, 501, -762, 245, -579, -167, 80, -544, 411, -743, 643, -625, 310, -353, -315, 216, -797, 829, -799, 388, -869, 375, -62, -283, 463, -427, 848, -733, 1085, -388, 307, 46, 72, 808, -472, 892, -142, 881, -315, 385, 299, -254, 883, -130, 726, -419, 707, -145, 382, 328, -175, 880, -728, 824, -580, 676, -161, 25, 308, -361, 607, -692, 816, -586, 256, -65, -98, 83, -603, 446, -725, 198, -806, 217, 15, -437, 359, -667, 351, -1038, 280, -533, -68, -272, -575, 550, -668, 732, -862, 405, -505, -239, 181, -294, 452, -690, 883, -656, 662, -228, -216, 596, -346, 702, -438, 685, -342, 679, 52, 107, 795, -386, 801]
2300H01j424J670j086N48k15l98J148j497J094j145J171q38M66J3n81Q46j508
2317i35J820j417J019p68L84L4n93J144j682J685j450R64j68l30O36j012J171
2334E02j388J378j228Q53k33k98M11p73J382j249Q72o59M43J60n21P74j214J239
2352D51j212R99o06L64L23m97N81j274J573j095O58k81K91J5m96Q00j349J599
2370H44j243Q13n13J49M90q03J029j131J312j378P45q1k09M79o06J010j412J081
2388E76o45K32j70m31R48r40J094j106P00o11L50r4m91Q38q43Q59r04O67l31J13
2408a89K27o10J148j285R31p34M00k98j25P07n34Q75j472J435r21O73j51p44J047
2427C80q74R59j018R84p15J90l6l10R90j311J381j308J134o68M86Ll33P13j202
$$ y = [801, -623, 1047, -39, 509, 294, -104, 1044, -453, 641, -504, 667, -171, 295, 308, -273, 573, -935, 885, -532, 487, -281, 103, 137, -456, 688, -994, 691, -759, 205, 37, -293, 343, -669, 502, -886, 492, -736, 117, -116, -414, -3, -776, 606, -643, 229, -430, 13, 173, -348, 426, -788, 451, -761, 238, -368, -4, 319, -178, 403, -871, 702, -393, 265, -16, 275, 290, -206, 594, -755, 844, -399, 414, -99, 50, 540, -263, 766, -365, 947, -431, 314, 233, 24, 503, -103, 907, -505, 576, -69, 163, -7, -438, 510, -430, 664, -442, 258, -353, -3, -97, -588, 250, -593, 266, -638, 29, -302, -189, 38, -572, 576, -709, 222, -512, -112, -410, -535, 172, -362, 513, -959, 476, -445, 228, 77, -667, 380, -494, 465, -553, 431, -284, -94, -130, -440, 550, -761, 620, -688, 446, -222, 264, 267, -66, 647, -555]
2446e55J144j200J066n73q6O16r02J129j049J165r66L49K2j93N97r54J273j368
2464d85R02o52M82j59j58M61q68J026j286R48p13M46K9l98Q86j176J192r71P78
2483B84o66J48M49q29P65q46J294j333R66m82R3L30q68J149j080Q32n84M19j38
2502i7k41P23q12J387j333P37o48M61O4o22J051j259R52p68Q24m38Q6J46o08J140
2522G45j173J182j258Q56m81K63M80q56Q31j268J167r65J155p37M9L76p72J016
2540F10q40R83j030K61N5j86M10p22J011r92Q38q20N07j77m61J054j315J240j058
2559f32R90n48J5J2m28O87p70J061r61O71k38j33L06m26N55q10J042q13O71m46
2579a95p1N79p90J238j246Q57m72N70o80j4Q72q66P65r91Q57m11J01K28m40O13
$$ y = [-555, 589, -611, 455, -118, -204, 412, -490, 639, -410, 755, -211, 138, 160, -33, 564, -390, 883, -485, 417, -235, 247, 88, -70, 391, -477, 549, -737, 211, -502, -56, -27, -425, 461, -715, 477, -494, 284, -382, -234, 215, -614, 151, -695, 599, -734, 232, -250, -157, 173, -695, 454, -626, 206, -378, 41, -97, -338, 385, -427, 960, -373, 364, -284, 177, 241, -381, 670, -589, 363, -405, 419, -19, 67, 213, -395, 745, -428, 754, -504, 352, -129, 134, 614, -242, 589, -679, 488, -477, 678, -59, -10, 366, -406, 610, -230, 753, -277, -16, 39, -147, 263, -459, 552, -440, 398, -422, 85, -92, -553, 501, -814, 426, -632, 358, -190, -175, -163, -591, 96, -674, 387, -574, 97, -141, -274, 32, -394, 161, -649, 393, -420, 251, -195, -266, 313, -477, 761, -485, 372, -100, 470, -210, -224, 648, -218, 547, -444, 413, 2, 103, 331, -109, 504]
2599E04q29P76m91O60o58N0N14n78L96q39J126q62O12m20N0J43m47O43p58R25
2619E17q80P66l46l26O38r72J098j111Q62n54L99k33J26L28j003R72q93J017q38
2638d33M45O2n54O84p71P27r57Q94l59K58L02p80Q60r05P26n74O95l08j5J85o71
2659d89Q01o77J055j014M18N9k99N06p80J029q91P98m97K58r5l51P87p50P68j092
2679d56Q38n99L02Q6k70Q94j264J009j067R20l43J59J07o22N92r31J198p25J94
2698B2j01O0M79r95Q01j000J026o11M10j31k07N41r61R96j004Q72p61N30J52l34
2718b16Q57j299Q68q69R07o58L23K83n91R44j287J127p51N02j74j68L71m41R98
2737G26j481J270o33M67l10j66N79r02J070r51J022p77K87J08m51M54n71R57r92
$$ y = [504, -325, 451, -40, 620, -38, 12, 526, -52, 344, -495, 631, -231, 381, -39, 11, 154, -293, 350, -408, 517, -363, 403, 57, -269, 369, -603, 495, -616, 246, -308, 91, -142, -16, 312, -691, 281, -612, 405, -433, 12, 74, -480, 204, -567, 160, -797, 97, -262, -4, 298, -482, 378, -527, 199, -375, 320, 12, -3, 182, -489, 312, -365, 690, -324, 94, 153, -146, 360, -420, 609, -282, 516, 19, 277, 182, -169, 618, -132, 636, -456, 382, -217, 85, 171, -99, 795, -469, 540, -527, 393, 50, 209, 316, -306, 286, -645, 553, -172, 22, -79, -19, 460, -535, 266, -734, 292, -319, 91, -40, -247, 294, -667, 329, -675, 197, -564, -34, 118, -216, 641, -658, 210, -659, 248, -410, -87, 196, -395, 549, -738, 389, -362, 140, -34, -202, 169, -272, 726, -755, 515, -118, 349, 39, -127, 452, -450, 620, -331, 691, -86, 201, 309, -142, 312, -259, 698, -294]
2756b94O92n15K61km10R20j059R63r98Q06j36j78J39n44P53r36R90j113R94m35
$$ y = [-294, 398, -117, 144, 142, -268, 652, -407, 556, -442, 364, 228, 50, 189, -355, 398, -538, 452, -661, 333, -102]
$$ [...]
8191E2
##END NTUPLES=NMR FID
##END=
