##TITLE=1H_Pr 5016-dT
 CDCl3, 40 sc, 
 25.12.2020
##JCAMPDX= 6.0         $$ Bruker NMR JCAMP-DX V2.0
##DATA TYPE= NMR FID
##DATA CLASS= NTUPLES
##ORIGIN= UXNMR, Bruker Analytische Messtechnik GmbH
##OWNER= root
$$ XWIN-NMR		Version 3.5
$$ Fri Dec 25 11:14:13 2020 Russian Standard Time (UT+4h)  she@DPX200
##.OBSERVE FREQUENCY= 200.1315066352
##.OBSERVE NUCLEUS= ^1H
##.DELAY= (6, 6)
##.ACQUISITION MODE= SIMULTANEOUS
##.ACQUISITION SCHEME= undefined
##.AVERAGES= 40
##.DIGITISER RES= 18
##SPECTROMETER/DATA SYSTEM= spect
##.PULSE SEQUENCE= zg30
##.SOLVENT NAME= CDCl3
##.SHIFT REFERENCE= (INTERNAL, CDCl3, 0, 15.7039)
##AUDIT TRAIL= $$ (NUMBER, WHEN, WHO, WHERE, WHAT)
$$ ##TITLE= Audit trail, XWIN-NMR		Version 3.5
$$ ##JCAMPDX= 5.01
$$ ##ORIGIN= Bruker BioSpin GmbH
$$ ##OWNER= she
$$ F:/spectra/data/she/nmr/H-F/1/audita.txt
$$ ##AUDIT TRAIL=  $$ (NUMBER, WHEN, WHO, WHERE, WHAT)
(   1,<2020-12-25 11:12:57.85 +0400>,<she>,<DPX200>,
      <continue with go, POWCHK disabled, PULCHK disabled
       configuration hash MD5:
       00 E9 B6 7A A2 85 ED C7 34 08 36 98 17 FE 4E 26
       data hash MD5: 16K
       F8 B2 09 27 87 E7 2E 9D 6D BC 77 9A 85 11 20 28>)
$$ ##END=
$$ 
$$ hash MD5
$$ C9 36 62 2D FD C3 DA EA 96 5B 2D 86 9C 04 9A AD
##$RELAX= 
##$RELAX= 
##$RELAX= 
##$RELAX= 
##$RELAX= 
##$RELAX= 
$$ Bruker specific parameters
$$ --------------------------
##$DU= <F:/spectra>
##$EXPNO= 1
##$NAME= <H-F>
##$PROCNO= 1
##$TYPE= <nmr>
##$USER= <she>
##$AMP= (0..31)
100 100 100 100 100 100 100 100 100 100 100 100 100 100 100 100 100 100 
100 100 100 100 100 100 100 100 100 100 100 100 100 100 
##$AQSEQ= 0
##$AQ_mod= 1
##$AUNM= <au_zg>
##$AUTOPOS= <>
##$BF1= 200.13
##$BF2= 200.13
##$BF3= 200.13
##$BF4= 200.13
##$BF5= 200.13
##$BF6= 200.13
##$BF7= 200.13
##$BF8= 200.13
##$BYTORDA= 1
##$CFDGTYP= 0
##$CFRGTYP= 5
##$CHEMSTR= <none>
##$CNST= (0..31)
1 1 145 1 1 1 1 1 1 1 1 1 1 1 1 1 1 1 1 1 1 1 1 1 1 1 1 1 1 1 1 1 
##$CPDPRG= <>
##$CPDPRG1= <>
##$CPDPRG2= <>
##$CPDPRG3= <>
##$CPDPRG4= <mlev>
##$CPDPRG5= <mlev>
##$CPDPRG6= <mlev>
##$CPDPRG7= <mlev>
##$CPDPRG8= <mlev>
##$CPDPRGB= <>
##$CPDPRGT= <>
##$D= (0..31)
0 1.2 0 0 0 0 0 0 0 0.06 0 0.03 0 0 0 0 0.0002 0 0 0 0 0 0 0 0 0 0 0 0 
0 0 0 
##$DATE= 1608880228
##$DBL= (0..7)
120 120 120 120 120 120 120 120 
##$DBP= (0..7)
150 150 150 150 150 150 150 150 
##$DBP07= 0
##$DBPNAM0= <>
##$DBPNAM1= <>
##$DBPNAM2= <>
##$DBPNAM3= <>
##$DBPNAM4= <>
##$DBPNAM5= <>
##$DBPNAM6= <>
##$DBPNAM7= <>
##$DBPOAL= (0..7)
0.5 0.5 0.5 0.5 0.5 0.5 0.5 0.5 
##$DBPOFFS= (0..7)
0 0 0 0 0 0 0 0 
##$DE= 6
##$DECBNUC= <off>
##$DECIM= 32
##$DECNUC= <off>
##$DECSTAT= 4
##$DIGMOD= 1
##$DIGTYP= 9
##$DL= (0..7)
0 120 120 120 120 120 120 120 
##$DP= (0..7)
150 150 150 150 150 150 150 150 
##$DP07= 0
##$DPNAME0= <>
##$DPNAME1= <>
##$DPNAME2= <>
##$DPNAME3= <>
##$DPNAME4= <>
##$DPNAME5= <>
##$DPNAME6= <>
##$DPNAME7= <>
##$DPOAL= (0..7)
0.5 0.5 0.5 0.5 0.5 0.5 0.5 0.5 
##$DPOFFS= (0..7)
0 0 0 0 0 0 0 0 
##$DQDMODE= 0
##$DR= 18
##$DS= 0
$$ [...]
##$SUBNAM2= <"">
##$SUBNAM3= <"">
##$SUBNAM4= <"">
##$SUBNAM5= <"">
##$SUBNAM6= <"">
##$SUBNAM7= <"">
##$SUBNAM8= <"">
##$SUBNAM9= <"">
##$SW= 16.9725356469052
##$SWIBOX= (0..15)
0 0 2 0 0 0 0 0 0 0 0 0 0 0 0 0 
##$SW_h= 3396.73913043478
##$TD= 16384
##$TD0= 1
##$TE= 0
##$TE2= 300
##$TE3= 300
##$TEG= 300
##$TL= (0..7)
0 120 120 120 120 120 120 120 
##$TP= (0..7)
150 150 150 150 150 150 150 150 
##$TP07= 0
##$TPNAME0= <>
##$TPNAME1= <>
##$TPNAME2= <>
##$TPNAME3= <>
##$TPNAME4= <>
##$TPNAME5= <>
##$TPNAME6= <>
##$TPNAME7= <>
##$TPOAL= (0..7)
0.5 0.5 0.5 0.5 0.5 0.5 0.5 0.5 
##$TPOFFS= (0..7)
0 0 0 0 0 0 0 0 
##$TUNHIN= 0
##$TUNHOUT= 0
##$TUNXOUT= 0
##$USERA1= <user>
##$USERA2= <user>
##$USERA3= <user>
##$USERA4= <user>
##$USERA5= <user>
##$V9= 5
##$VALIST= <valist>
##$VCLIST= <CCCCCCCCCCCCCCC>
##$VD= 0
##$VDLIST= <DDDDDDDDDDDDDDD>
##$VPLIST= <PPPPPPPPPPPPPPP>
##$VTLIST= <TTTTTTTTTTTTTTT>
##$WBST= 1024
##$WBSW= 4
##$XGAIN= (0..3)
0 0 0 0 
##$XL= 0
##$YL= 0
##$YMAX_a= 138392
##$YMIN_a= -125915
##$ZGOPTNS= <>
##$ZL1= 120
##$ZL2= 120
##$ZL3= 120
##$ZL4= 120
##$ABSF1= 10
##$ABSF2= 0
##$ABSG= 5
##$ABSL= 3
##$ALPHA= 0
##$AQORDER= 0
##$ASSFAC= 0
##$ASSFACI= 0
##$ASSFACX= 0
##$ASSWID= 0
##$AUNMP= <proc_1d>
##$AZFE= 0.1
##$AZFW= 0.1
##$BCFW= 1
##$BC_mod= 2
##$BYTORDP= 1
##$COROFFS= 0
##$CY= 11.3945322036743
##$DATMOD= 1
##$DC= 2
##$DFILT= <>
##$DTYPP= 0
##$F1P= 15.9154993809931
##$F2P= -4.1035820241983
##$FCOR= 0.5
##$FTSIZE= 0
##$FT_mod= 4
##$GAMMA= 1
##$GB= 0.15
##$INTBC= 1
##$INTSCL= 1
##$ISEN= 128
##$LB= 0.24
##$LEV0= 0
##$LPBIN= 0
##$MAXI= 10000
##$MC2= 0
##$MEAN= 0
##$ME_mod= 0
##$MI= 1.114404
##$NCOEF= 0
##$NC_proc= 0
##$NLEV= 6
##$NOISF1= 3.799351
##$NOISF2= 2.8
##$NSP= 1
##$NTH_PI= 0
##$NZP= 0
##$OFFSET= 15.70392
##$PC= 1
##$PHC0= -10760.26
##$PHC1= 8.800954
##$PH_mod= 1
##$PKNL= yes
##$PPARMOD= 0
##$PSCAL= 0
##$PSIGN= 0
##$REVERSE= no
##$SF= 200.130013532006
##$SI= 16384
##$SIGF1= 3
##$SIGF2= 2
##$SINO= 400
##$SIOLD= 16384
##$SREGLST= <1H.CDCl3>
##$SSB= 0
##$STSI= 0
##$STSR= 0
##$SW_p= 3612.71676300578
##$SYMM= 0
##$S_DEV= 0
##$TDeff= 0
##$TDoff= 0
##$TI= <>
##$TILT= no
##$TM1= 0
##$TM2= 0
##$TOPLEV= 0
##$USERP1= <user>
##$USERP2= <user>
##$USERP3= <user>
##$USERP4= <user>
##$USERP5= <user>
##$WDW= 1
##$XDIM= 8192
##$YMAX_p= 0
##$YMIN_p= 0
$$ End of Bruker specific parameters
$$ ---------------------------------
##NTUPLES= NMR FID
##VAR_NAME=  TIME,          FID/REAL,        FID/IMAG
##SYMBOL=    X,             R,               I
##VAR_TYPE=  INDEPENDENT,   DEPENDENT,       DEPENDENT
##VAR_FORM=  AFFN,          ASDF,            ASDF
##VAR_DIM=   8192,          8192,            8192
##UNITS=     SECONDS,       ARBITRARY UNITS, ARBITRARY UNITS
##FACTOR=    0.0002944,     1,               1
##FIRST=     0,             0,               0
##LAST=      2.4114304,     0,               0
##MIN=       0,             -125915,         0
##MAX=       2.4114304,     138392,          0
$$ Real data points
##PAGE= N=1
##DATA TABLE= (X++(R..R)), XYDATA
0 0 0 0 0 0 0 0 0 0 0 0 0 0 0 0 0 0 -3 40 -40 40 -40 40 -43 80 -80 80 -120 120 -153 160 -199 204 -240 280 -313
35 -313 344 -386 434 -481 535 -594 657 -727 805 -891 982 -1080 1188 -1308 1440 -1584 1748
52 1748 -1923 2119 -2344 2597 -2880 3207 -3593 4048 -4596 5271 -6116 7227 -8734 10913
66 10913 -14327 20485 -35005 138392 90884 -122327 80064 12212 35441 -36818 73908
77 73908 -31841 76280 -19310 3474 86461 -59492 67725 -17714 58112 -32154 36375
88 36375 40462 -37784 47070 -15320 56205 -66303 62506 -21762 4013 22925 -52656 65388
100 65388 -48572 22633 -34958 29177 -33629 -10498 8392 -51837 54009 -84833 36839
111 36839 -34522 -7141 -15040 -28270 15551 -60814 35811 -61641 26543 -41707 1783 -6895
123 -6895 -39685 31585 -63907 45618 -58789 15328 -5847 -10213 -4618 -17113 41550 -65910
135 -65910 56882 -38303 18129 3451 -13099 26909 -21516 45767 -40835 51468 -20892 26200
147 26200 5308 -7616 47259 -31432 53473 -29754 45885 -7518 13880 21155 -9395 40045
159 40045 -27021 54284 -33908 43425 -1464 -32 26199 -17581 41040 -38258 42502 -26701
171 -26701 24776 -8425 -5464 24978 -35453 38309 -42292 30614 -28865 9878 -6142 -21683
183 -21683 23824 -42047 27485 -45435 24588 -30763 -5650 -2514 -30509 22750 -50320 27218
195 27218 -38849 12280 -23830 -7329 4185 -35139 26150 -45306 26651 -33181 13907 -13413
207 -13413 -12282 18747 -32675 29952 -34789 30735 -22797 13309 2477 -9500 27243 -27206
219 -27206 40195 -28280 33209 -9269 9074 14236 -6244 34544 -26364 45035 -18751 29737
231 29737 -3842 10887 22044 -16090 39332 -23086 39288 -17026 23544 1218 701 23433
243 23433 -20869 35381 -29721 34439 -18793 11723 2945 -12089 21562 -29348 28064 -31495
255 -31495 22847 -22398 1707 2229 -23107 18413 -36522 24281 -34338 9555 -17922 -9323 2364
268 2364 -28132 16823 -38302 21892 -33232 7348 -11166 -15049 9239 -30612 22823 -33556
280 -33556 19893 -23644 6244 -4080 -12490 19080 -30196 29493 -26524 21659 -13001 7348
292 7348 9242 -12771 27020 -21976 32572 -21097 26272 -4194 6295 19228 -13227 33211
304 33211 -19319 32936 -13774 21421 3502 2370 21190 -14368 34946 -21989 30500 -10806
316 -10806 13163 6353 -5598 20470 -20135 29718 -22712 22129 -12635 5751 4924 -15757 20674
329 20674 -27841 21750 -24518 12799 -12682 -4669 2895 -22979 17335 -31969 17437 -27200
341 -27200 6402 -11035 -13528 7509 -27321 16012 -30727 15334 -23702 2933 -6021 -15692 12638
354 12638 -26760 20760 -28023 14909 -13631 724 2612 -12608 18053 -22916 25768 -20792
366 -20792 18166 -5405 1961 12506 -12907 25279 -18258 25721 -11889 17520 1243 2028 18700
379 18700 -12215 28946 -16587 26225 -7962 13817 6317 -1898 22150 -14113 26458 -15576
391 -15576 23116 -8092 7634 8842 -9206 20167 -18775 22660 -18459 14739 -7565 -1004
403 -1004 6545 -16096 17802 -24975 18193 -20200 7035 -7953 -8139 6665 -21486 14779 -26705
416 -26705 13075 -19965 1837 -6566 -12933 9188 -25991 15163 -24946 10269 -15674 -479
428 -479 -1328 -14660 12216 -23293 16734 -20501 12101 -9876 -2118 7747 -13941 17614 -18283
441 -18283 20010 -13665 12438 -1272 -192 12595 -12348 22284 -14853 22766 -7905 11006
453 11006 6314 -850 16843 -11231 23946 -12304 21649 -4623 9540 9981 -4461 19926 -13930
466 -13930 23546 -11927 14772 -3316 4851 8869 -11648 19508 -16202 19867 -14724 10174
478 10174 -3557 -4232 9046 -16108 14769 -20664 13539 -16579 3680 -4200 -10344 7328 -22151
491 -22151 13161 -22066 8671 -14860 -2155 -3014 -14877 7274 -21606 13669 -22882 7866
503 7866 -8487 -4868 1830 -14673 13192 -20345 13713 -15818 7455 -5747 -1901 8074 -13596
516 -13596 18366 -17018 16280 -9599 9683 3456 -2970 13325 -10425 21336 -12424 18287
528 18287 -4147 8277 8118 -4373 18687 -10197 22109 -10428 16821 -1349 5254 10075 -7040
541 -7040 20193 -12688 20160 -9857 12131 5 -1307 9955 -10665 16529 -16167 14418
553 14418 -11895 4984 -1584 -7592 8331 -16980 13491 -18818 8264 -11504 -653 -2940 -11841
566 -11841 8192 -20941 11337 -19047 5737 -10295 -4278 420 -15757 9337 -19569 10271
578 10271 -17114 5733 -6196 -5268 6081 -13562 13286 -17718 12634 -10839 4720 18 -4119
591 -4119 11144 -12386 16880 -13759 15148 -6476 5807 5784 -4892 16383 -9643 19833 -8798
604 -8798 14597 -1414 5680 8849 -5290 18511 -10392 17619 -7099 12152 198 355 11546
617 11546 -7763 16030 -11880 15183 -7834 7624 838 -4458 10823 -13415 13741 -13961
629 -13961 10589 -9177 1671 -23 -9300 8753 -16337 10697 -15868 7423 -9346 -3058 524
642 524 -12953 8582 -18188 9690 -16477 3936 -7526 -5914 2671 -14777 10045 -17775 9584
655 9584 -11579 2169 -3936 -6088 7821 -14284 12642 -13353 11155 -8284 4583 2877 -6124
668 -6124 12156 -10814 15025 -9598 11768 -3333 3391 8063 -5090 14243 -9753 17407 -6376
681 -6376 11095 924 2051 10615 -6692 16542 -9412 16017 -5719 9178 2075 -1269 11330
694 11330 -9433 15367 -11305 12355 -6493 4348 2132 -5500 10208 -13721 12313 -11886
706 -11886 7897 -6388 -1073 2289 -10605 9027 -14561 9756 -13943 4537 -7232 -4294 2434
719 2434 -13759 8588 -16070 8482 -13101 1240 -3615 -7946 3756 -13019 9259 -15317 8438
732 8438 -8550 396 465 -7729 8240 -12352 11737 -12066 8009 -4710 1265 4447 -6790 12478
746 12478 -10185 13917 -7403 9406 57 1142 9138 -6156 14665 -7915 14034 -5263 8856
759 8856 2755 -1050 11336 -6871 15731 -8068 12955 -3265 5366 3884 -4355 11232 -9052
772 -9052 13633 -9209 9702 -3721 1046 4417 -7096 9800 -11605 10584 -10501 4555 -3328
785 -3328 -3643 3254 -10253 8674 -14337 8128 -10927 1482 -3907 -7021 3991 -13372 7999
798 7999 -14354 6447 -10302 576 -2121 -8372 5984 -13291 8835 -12420 6160 -6730 -714
811 -714 2506 -8238 9401 -11976 10631 -9493 7275 -1797 -1184 6669 -6896 12333 -9119
824 -9119 12509 -5984 7424 1510 -445 10244 -6727 14422 -7304 12195 -2463 6092 3696
837 3696 -2072 10876 -7745 14453 -6614 10156 -2221 2534 4532 -5114 11484 -9520 10779
850 10779 -7239 6586 -3495 -1749 4330 -9611 9270 -12435 7882 -9242 1983 -1955 -5440
863 -5440 2880 -11878 7864 -13454 5618 -9303 -72 -2276 -7948 4744 -12962 6650 -12456
876 -12456 5189 -7200 -2271 668 -8818 6785 -12492 9208 -10737 4016 -3418 -992 4593
889 4593 -8355 9016 -10292 9663 -6919 5163 378 -2185 8299 -7807 11689 -7619 10680
902 10680 -3864 5306 4152 -1770 10056 -7404 13347 -6838 10385 -1881 3395 5734 -3865
915 -3865 10838 -7037 12092 -6277 7621 -343 1134 5810 -6839 9964 -8643 9831 -7418
928 -7418 4110 -828 -2841 4753 -9454 8907 -11355 6966 -7365 681 -979 -6719 4885
941 4885 -11566 7263 -11322 4315 -7224 -2004 47 -9290 5915 -12080 7118 -10751 3025
954 3025 -4707 -2611 2074 -9186 6946 -11177 7445 -8896 2813 -1365 -3174 4773 -7585
967 -7585 9690 -8784 8537 -4819 3524 1437 -1882 7996 -6777 10430 -6573 8725 -1732
980 -1732 3602 4911 -3037 10497 -6564 12206 -4681 7372 -297 2470 6392 -4505 10661
993 10661 -7038 9660 -4872 4963 385 -1059 6659 -7580 8958 -8115 8281 -5855 1399
1006 1399 588 -3992 5866 -9479 7398 -9751 5368 -5519 -1184 175 -7124 5446 -10900
1019 -10900 7213 -9422 2521 -4767 -2917 1100 -8468 6277 -11086 6300 -8442 1982 -3016
1032 -3016 -3935 3111 -9199 7288 -9608 6461 -5576 1737 -95 -3679 6458 -7487 8710
1045 8710 -7122 7531 -2915 2236 3897 -3468 8688 -6290 10444 -5150 7942 -618 1296
1058 1296 5356 -4062 10202 -5760 9971 -3643 6119 1212 -288 6501 -4755 9202 -6266
1071 -6266 8169 -3823 3621 1735 -2677 6344 -7393 8585 -7382 6075 -3822 -35 909 -5103
1085 -5103 5302 -8691 6426 -8239 3247 -4438 -1708 1091 -7814 5305 -9934 5419 -8354
1098 -8354 1200 -3329 -3890 2466 -8585 5567 -9876 4872 -6321 834 -1084 -4068 4689 -7488
1112 -7488 6849 -7759 5602 -4046 913 2069 -3689 6482 -7174 7722 -4914 5553 -1272
1125 -1272 1621 4914 -3650 8535 -5568 8829 -3279 5899 725 455 5992 -3833 9368 -5276
1139 -5276 8455 -2534 4249 1810 -647 6329 -4648 8886 -5798 7155 -3364 1811 1716 -3767
1153 -3767 5628 -7090 7084 -6821 4106 -2832 -797 1388 -5922 5794 -8285 5253 -7900
1166 -7900 1957 -2841 -2798 2290 -7555 5182 -8861 3616 -6695 426 -1931 -4146 3529 -7482
1180 -7482 5190 -8088 4371 -5128 12 749 -4792 4940 -7259 6431 -6515 4634 -2525
1193 -2525 341 2912 -3952 7253 -6310 7774 -4066 4630 438 486 5070 -3566 8639 -5029
1207 -5029 7819 -2220 4573 1987 107 6587 -3986 7888 -5252 7099 -2757 3266 2227
1220 2227 -2424 6149 -5838 7506 -4614 5589 -2191 1120 2273 -4212 6035 -6616 5905
1233 5905 -6289 2630 -2229 -2210 1780 -5762 4520 -7789 4649 -6461 1107 -1271 -3874 2199
1247 2199 -7123 4313 -7503 2998 -5327 -4 -728 -4660 2654 -8336 4706 -7412 3815
1260 3815 -2260 -880 1738 -4698 5429 -6066 6423 -4791 3627 -1318 -145 4824 -3768 6881
1274 6881 -5097 6810 -3304 4412 1261 -1113 5370 -3065 7650 -5306 6892 -1278 3613
1287 3613 2777 -926 6796 -3838 7062 -4075 6127 -388 1989 3063 -2164 6145 -5086 6488
1301 6488 -4490 3687 -1415 -901 2321 -4672 5322 -6267 4695 -4698 1215 -1676 -3201 2628
1315 2628 -6332 4206 -6800 2852 -4635 -115 -1164 -4017 2889 -7497 4389 -6982 2516 -3645
1329 -3645 -903 21 -5671 3647 -6498 4630 -4844 2617 -2140 -1678 1922 -4850 4849 -5829 5158
1344 5158 -3541 2421 766 -1081 4320 -4186 6241 -4987 5922 -2496 2901 1824 -579 5379
1358 5379 -4421 7431 -4181 5841 -467 2101 2630 -2182 6342 -5079 6873 -2640 4994 -280
1372 -280 537 3784 -3734 4751 -4962 6034 -3850 2484 -469 -1355 3166 -5307 5433 -5246 4351
1387 4351 -4068 286 -208 -3330 3333 -7302 4288 -6322 2570 -3993 -679 279 -4019 2673 -6859
1402 -6859 3277 -6068 1957 -2752 -1148 1035 -5701 4446 -5853 4314 -5427 1470 -842 -2352
1416 -2352 2079 -4475 5496 -5373 4017 -2506 1976 -60 -1433 3415 -3819 6008 -3200 5127 -689
1431 -689 3823 2470 -1514 5430 -2652 7716 -2762 4358 22 731 3295 -1826 6324 -4315 5563
1446 5563 -3154 3166 311 -995 3875 -3181 4840 -4370 4152 -3305 1933 -280 -2833 2989 -5666
1461 -5666 4284 -5446 2881 -3968 -270 369 -3412 2289 -5539 3302 -6098 1723 -3504 -1709 957
1476 957 -4646 3285 -6301 2708 -5115 942 -1386 -2284 1089 -4281 3963 -4884 3615 -4138 1392
1491 1392 122 -2297 3562 -4086 5992 -4151 3831 -1340 995 2156 -1021 4856 -3090 5020
1505 5020 -2959 4794 374 1114 2814 -1265 5817 -3302 5773 -2581 3762 331 96 3700 -2877
1520 -2877 4892 -3304 4491 -2925 2172 875 -722 3242 -3806 4046 -4315 2906 -2595 -37 366
1535 366 -3387 2605 -4686 3398 -4473 1975 -2682 -1325 731 -4093 2684 -5528 2975 -4883 952
1550 952 -1477 -2099 1305 -5215 2840 -4990 2547 -4127 494 -72 -2882 2439 -4662 3890 -4270 3184
1566 3184 -2549 928 785 -1708 3536 -3945 4897 -3339 3481 -504 661 2877 -2024 5011 -3497
1581 -3497 5807 -2362 3486 667 1039 3401 -2044 5216 -3146 4839 -1632 2967 1535 -538 4220
1596 4220 -3506 4834 -3017 3875 -1900 1136 1468 -1999 3139 -3857 3846 -3615 1991 -1790 -624
1611 -624 427 -3833 3096 -5285 4079 -4888 851 -2065 -1937 584 -4122 2997 -4960 2818 -4252
1626 -4252 363 -1960 -1922 1321 -4359 3229 -4627 2225 -2720 272 214 -2487 2440 -4308 3776 -4195
1642 -4195 2877 -1865 381 1924 -2455 4011 -2860 4592 -2233 2980 -56 395 3186 -2587 5184
1657 5184 -3041 4687 -1009 3239 1148 -198 3548 -1998 5188 -2969 4670 -1062 2021 1163 -1102
1672 -1102 3889 -2557 4981 -3252 3056 -1346 467 1091 -2782 3632 -4164 3556 -3570 1771 -2062
1687 -2062 -1813 900 -3311 2831 -4503 2107 -3580 798 -1637 -2195 598 -5182 2515 -4931 2566
1702 2566 -3569 147 -448 -2913 2332 -4406 3279 -4418 2424 -2577 -312 469 -2238 3205 -3475
1717 -3475 3646 -3058 2799 -477 -200 1810 -2264 4237 -3127 4212 -2256 1929 561 -247 3342
1732 3342 -2311 5120 -2625 4558 -950 2583 1342 -380 4512 -2969 3705 -2403 3918 -1248 1159
1747 1159 1440 -1069 3402 -3351 4284 -3220 2949 -928 -425 1384 -2864 2967 -4537 2755 -3381
1762 -3381 787 -1301 -1434 807 -4519 2410 -5364 1864 -4027 -1 -1397 -3239 2280 -4701 2843
1777 2843 -4498 2267 -2791 -912 402 -3609 2842 -4118 3337 -3249 2482 -1654 -286 1352 -3070
1792 -3070 3307 -3908 3398 -2887 1475 95 -191 2992 -2527 4564 -3248 4457 -937 1830 1930
1807 1930 -166 3294 -2067 4983 -2352 4555 -802 1631 1876 -1079 3593 -2443 4834 -2746 3260
1822 3260 -306 567 2177 -2027 3712 -3721 3883 -2762 1669 -1113 -1228 1895 -3295 3594 -4340
1837 -4340 2708 -2788 535 -744 -2409 1398 -4161 2616 -4704 1721 -3285 -716 -211 -3363 1862
1852 1862 -4536 2818 -4519 1693 -1824 -870 967 -3325 3254 -3807 2761 -3027 1661 -718 -1537
1867 -1537 1583 -3092 3519 -3649 3308 -1682 1779 681 -347 3380 -2989 4171 -2011 3017 -1014
1882 -1014 1282 2020 -235 4053 -2235 4332 -2187 3793 -355 1484 2007 -2355 4317 -3144 4192
1897 4192 -1746 2181 -559 -270 2459 -2645 2817 -3973 3030 -2677 226 -57 -1729 2028 -3806
1912 -3806 2708 -3443 1742 -2620 224 -264 -2169 2019 -3914 2740 -4986 1532 -2142 -637 297
1927 297 -3572 2926 -3878 2808 -3755 1307 -1236 -1079 1283 -3245 2312 -4313 2878 -2645 1556
1942 1556 151 -814 2548 -2634 3818 -3281 3833 -1391 1286 855 -1221 3562 -2806 4570 -1745
1957 -1745 3333 -264 823 1450 -1256 3968 -2204 4972 -1808 3378 434 -364 2285 -1595 4318
1972 4318 -2203 4135 -2146 1938 296 -410 2713 -2534 3288 -2600 3049 -2326 -194 -13 -2340
1987 -2340 1259 -3789 3024 -4224 1610 -1959 -649 163 -3044 1954 -4426 2344 -3152 962 -1817
2002 -1817 -1715 398 -3372 1961 -3514 2689 -3097 927 -754 -1542 1451 -3518 3378 -3368 3173
2017 3173 -1574 661 328 -1651 2623 -2802 4450 -2208 3334 -759 800 2090 -758 4287 -2229
2032 -2229 3929 -1906 2783 773 92 2633 -1456 3254 -2139 4210 -1959 2076 -190 -319 2621
2047 2621 -2211 3558 -3127 3002 -1900 929 -218 -1073 2138 -3283 4206 -3096 1993 -1566 422
2062 422 1382 -1922 2110 -3543 2176 -3669 1058 -1896 -1958 399 -3642 2453 -3603 1704 -3720 22
2078 22 -1007 -2651 1965 -3464 1970 -4825 2241 -2335 -199 -196 -1670 1596 -2746 3410 -2927 2522
2094 2522 -1893 244 1152 -1446 3554 -2643 3889 -2155 2789 -39 132 2814 -1796 3964 -1884
2109 -1884 3457 -1406 2182 893 87 2765 -1767 3965 -2293 3578 -759 2089 686 -878 2823
2124 2823 -2120 3471 -2776 2373 -1200 527 921 -1446 2248 -3052 2381 -2894 1363 -1145 -1412
2139 -1412 1299 -3307 2527 -4134 2048 -3294 331 -1582 -2291 722 -3631 2072 -3559 1762 -3336
2154 -3336 354 -624 -1844 1616 -3538 2988 -3392 2225 -1195 -561 738 -2240 2297 -2781 2734
2169 2734 -2510 1701 -585 -405 1650 -2172 3684 -2295 3511 -1359 2014 516 -218 2827 -1816
2184 -1816 3899 -2146 3019 -1062 1073 1234 -317 3134 -1999 4132 -2486 2510 -546 643 1339
2199 1339 -1516 2967 -2535 3944 -2026 1882 -714 -5 1054 -2733 2875 -3270 1990 -2504 903
2214 903 -836 -1764 1417 -3133 1795 -3816 1253 -2558 202 -268 -2417 1486 -3469 2475 -3520 929
2230 929 -2044 -786 357 -2154 1600 -3269 2305 -2811 1212 -865 -144 801 -2234 2285 -3127 3130
2246 3130 -2299 1812 175 -197 2405 -1706 3351 -2835 3271 -1040 1666 1045 -133 3678 -2030
2261 -2030 3245 -1562 3122 -394 1039 1279 -465 2419 -2191 3608 -1783 2447 -180 423 968 -2160
2277 -2160 3465 -2424 2198 -1751 1244 -532 -329 2127 -2929 1838 -3006 2877 -2585 847 -107
2292 -107 -1796 555 -2957 2345 -3414 1651 -2166 -874 -718 -2398 806 -2878 1802 -2979 906
2307 906 -1036 -758 -114 -2622 1757 -3287 1987 -2203 1345 364 -897 1792 -1915 2867 -2282 2795
2323 2795 -2029 1216 391 -843 2619 -1931 3386 -1973 3113 -778 990 1415 -792 3131 -1721
2338 -1721 3927 -1590 2775 -460 768 1681 -1301 2574 -1611 2460 -1872 1718 -91 -376 1808
2353 1808 -2208 2638 -2882 2130 -1665 402 335 -1035 1441 -2164 1722 -3187 1267 -1808 221
2368 221 -242 -1806 1278 -2982 1607 -3238 621 -1742 -174 382 -2550 1494 -3409 1474 -2330 571
2384 571 -783 -1263 830 -1984 2091 -2475 1869 -1957 740 559 -457 1521 -1921 2593 -1889 2349
2400 2349 -1053 872 423 -824 1837 -1437 2366 -1404 2485 -560 752 1840 -910 3422 -2385
2415 -2385 2549 -1539 2280 218 159 1708 -1176 2583 -1704 2904 -1540 1338 432 -810 1411 -2340
2431 -2340 1987 -1920 1864 -1632 -55 35 -1986 1137 -2185 1327 -2722 1183 -1379 -384 160 -2145
2447 -2145 1535 -2971 1623 -2523 731 -1576 -1285 418 -2422 1501 -2977 1541 -1739 -77 73
2462 73 -1827 424 -2165 1937 -2107 1290 -1224 -448 -259 -1536 2872 -1817 2786 -1922 1468 61
2478 61 582 1395 -1499 2184 -1729 2944 -1208 1520 471 -52 1743 -1138 2680 -1354 2659 -741
2494 -741 1104 376 -334 1919 -1694 2746 -1476 1870 -718 479 -48 -744 1135 -2307 1909 -1646
2510 -1646 1271 -644 -27 507 -1348 1891 -2363 1843 -1783 1101 -890 -1063 782 -1514 1243 -2899
2526 -2899 231 -1987 366 -500 -650 6 -2839 1932 -2786 1378 -1039 921 629 -260 2342 -2749
2542 -2749 1881 -2607 1799 -748 -254 1357 -1100 2248 -1553 1957 -1554 1632 -327 -613 2341
2557 2341 -1230 2084 -1299 2866 -488 2135 799 218 1346 -1227 2194 -1445 1889 -1083 927
2572 927 512 -1347 1426 -1994 2028 -1261 1818 -733 320 1322 -972 1127 -1750 1198 -1464
2587 -1464 1036 -1219 52 -395 -1519 1167 -2719 465 -1588 770 -340 -1276 741 -3072 1416
2602 1416 -2733 423 -1540 124 -104 -2016 1040 -2017 1301 -2236 1408 -1063 -309 917 -503
2617 -503 1470 -1449 957 -2003 818 -93 158 1664 -1237 2687 -947 2422 339 2527 857 -652
2633 -652 1364 -1477 2550 -1276 2059 -494 805 639 -571 1903 -1179 2227 -1152 1806 -479
2648 -479 822 1368 -898 1245 -902 1957 -1128 1007 -56 4 644 -1801 1824 -1776 1116 -1865
2664 -1865 190 -198 -711 569 -1980 1083 -1740 1081 -1885 -27 -782 -757 926 -2165 1194 -2059
2680 -2059 779 -1368 205 309 -1528 673 -2712 1389 -2094 528 -1004 -273 39 -1832 1734 -1858
2696 -1858 1888 -1019 1330 -344 -194 1271 -723 2246 -1418 1660 -414 1141 60 -277 1803
2711 1803 -877 2519 -977 1635 49 915 464 -387 2164 -1383 2659 -1386 1196 -177 -331 760
2727 760 -1048 1832 -1886 1696 -805 320 391 -383 1049 -1739 1393 -2101 1358 -1056 -55 -183
2743 -183 -1234 708 -1929 1395 -1999 712 -1229 -248 -234 -1383 1229 -1587 1078 -1722 797 -980
2759 -980 -521 722 -1516 996 -2142 1475 -1217 669 -314 -740 1209 -1581 1167 -1792 1889 -777
2775 -777 785 26 -448 1488 -1027 1831 -1233 1480 -862 881 327 -408 1840 -1205 2241 -1126
2791 -1126 1384 -268 271 856 -852 1615 -1457 1652 -904 866 -94 -108 1487 -1496 1340 -1243
2807 -1243 1351 -1276 39 406 -737 757 -1594 1271 -1835 580 -88 -503 454 -936 1098 -1271
2823 -1271 1577 -2024 566 -721 -1023 467 -1646 850 -2643 1176 -1434 711 -634 -1036 28
2838 28 -1907 974 -2025 726 -1033 694 522 -64 950 -1145 1549 -1735 1559 -455 89 433
2854 433 -642 935 -693 2130 -1401 1690 -845 216 1235 -722 1154 -1328 2282 -77 1444
2869 1444 270 385 1114 -811 1703 -1670 1623 -904 642 183 -76 773 -1132 1375 -1491 847
2885 847 -1131 -235 42 -1126 207 -1784 870 -1923 552 -657 -332 -103 -1050 962 -1765 1349
2901 1349 -939 530 -735 -770 957 -1679 969 -1641 1201 -1280 493 -280 -869 871 -1555 1286
2917 1286 -1597 1163 -414 80 365 -642 1144 -1084 1574 -832 1173 -11 -140 593 -390 1539
2933 1539 -1201 2096 -1023 1176 180 414 752 -1058 1564 -1205 1841 -657 1155 626 -49 1145
2949 1145 -1316 1806 -1108 1306 -524 228 92 -496 1169 -1436 1393 -1480 258 -1040 -535 -110
2965 -110 -1001 1278 -1731 889 -1593 64 -645 -290 618 -1936 749 -1260 1101 -1831 249 -259
2981 -259 -1389 900 -1192 1065 -1378 1004 -597 303 290 -674 1176 -1426 1458 -1520 704 -207
2997 -207 -210 584 -686 1717 -1351 1516 -1112 1054 -36 190 429 -887 1701 -1060 2068 -716 684
3014 684 712 -176 1094 -510 1790 -1148 1565 -582 867 -90 -903 1084 -829 1675 -1172 1631
3030 1631 110 -560 241 -947 1085 -1123 737 -1414 361 -1078 -275 179 -766 961 -1189 1416
3046 1416 -984 617 -321 -814 82 -1403 1059 -1735 877 -1074 -351 -501 -981 682 -1833 669
3062 669 -1796 874 -275 -92 385 -718 993 -1035 1072 -1145 735 -425 -46 690 -886 1436
3078 1436 -1008 1014 -1139 1362 165 132 514 -1085 1867 -649 1570 -436 1359 495 -110 1680
3094 1680 -951 990 -1151 1587 -512 589 475 -643 1369 -683 1054 -1762 1108 -387 -189
3109 -189 1103 -1223 968 -1661 1080 -990 177 -575 -471 1051 -826 571 -1290 310 -989 87
3125 87 -428 -524 272 -1982 903 -1736 612 -1279 -33 312 -464 613 -1232 1329 -1173 283 -186
3142 -186 77 533 -1011 1390 -1266 990 -349 1268 741 139 210 -1162 1788 -961 1389 -677 1001
3159 1001 163 332 1043 -1151 1589 -932 1919 -34 602 -179 -96 1341 -110 1637 -1726 587 -955
3176 -955 205 -79 -624 1250 -1145 1460 -1013 474 -347 -584 352 -724 983 -1310 692 -1208
3192 -1208 -31 154 -867 385 -1451 195 -986 1034 -358 -220 -339 -956 762 -1462 567 -1475
3208 -1475 465 -731 -728 -226 -1038 1127 -978 803 -940 308 -502 -268 383 -1054 974 -1119 1169
3225 1169 -23 802 -44 -288 1188 -1248 1602 -740 1591 247 484 703 -91 1346 -1149 1340
3241 1340 -678 815 423 369 476 -921 594 -1037 1270 -1212 776 -195 82 883 -959 1081 -1210
3258 -1210 1045 -710 372 -184 -833 445 -1244 791 -1494 553 -510 34 -18 -723 682 -1079
3274 -1079 369 -1374 571 -863 636 176 -1569 373 -1192 578 -1681 488 -391 -813 369 -1233
3290 -1233 578 -875 1283 -964 402 1393 -531 517 -1412 254 -648 1654 -136 -20 304 -714
3306 -714 1815 -921 1675 -1164 1062 385 276 459 -436 1700 -751 1414 -793 1306 -653 240
3322 240 913 -1165 1396 -717 998 -998 638 627 122 593 -913 848 -848 524 -693 309
3338 309 -33 -753 209 -1141 993 -1300 767 -333 -852 -417 -1050 517 -769 781 -740 229 -215
3355 -215 -751 118 -503 929 -1048 319 -821 -28 1 -305 838 -978 1094 -1118 428 -482 81
3372 81 391 -483 997 -818 1089 -1083 1193 -465 816 484 -558 1107 -448 1290 -522 522
3388 522 -298 -507 665 -207 1199 -282 1206 -261 556 -438 -181 33 -1227 1860 -873 697 -1286
3405 -1286 181 -30 69 -219 -1506 290 -486 79 -478 23 -424 -772 349 -1102 795 -1564 579
3422 579 -1030 -484 183 -711 963 -1256 801 -1169 865 -443 -470 253 -877 940 -634 621 -696
3439 -696 -18 -547 -539 345 -1205 376 -1550 407 -277 634 223 -444 1195 -953 647 -307 352 -496
3457 -496 64 600 -365 1412 -863 1471 -326 985 399 -333 603 -112 1007 -726 1357 -52 1014
3474 1014 35 -123 1214 -806 569 -350 200 -120 -26 87 -744 870 -712 600 -1488 147 -717
3491 -717 176 -359 -1105 525 -1025 900 -582 698 -142 -241 51 -1308 962 -1245 491 -858 -452
3508 -452 -511 -344 252 -593 1267 -1024 662 -505 309 -144 -852 750 -1126 1162 -370 1200 -122
3525 -122 193 720 -439 945 -649 619 -546 395 -224 111 1085 -481 649 -1020 1428 -632 345
3542 345 401 -627 906 -71 1545 -1071 934 -358 1017 176 -260 610 -974 674 -1400 597 -324
3559 -324 -330 475 -815 516 -871 396 -1021 -12 -434 -276 201 -977 846 -1202 587 -844 -40
3576 -40 -261 -345 156 -1142 129 -1146 439 -975 274 142 -526 289 -722 697 -721 498 -98
3593 -98 -145 187 -434 623 -557 1095 -1140 946 -437 -161 829 -570 1190 -124 1223 12 398
3610 398 197 453 426 -852 718 -702 870 -49 761 194 -170 944 -921 968 -530 738 -264
3627 -264 -67 577 -887 680 -928 886 -483 387 849 -147 -137 -886 191 -1168 1131 -1001 55
3644 55 -228 -291 295 -661 686 -843 325 -621 -118 -14 -577 751 -974 214 -838 545 -270 177
3662 177 -190 -727 394 -651 -2 -851 473 -712 29 162 -832 1281 -460 1031 -638 400 275
3679 275 -10 774 -437 1203 -601 720 -189 346 346 -349 -61 -112 1250 -964 601 414 644 491 97
3698 97 908 -317 583 -934 861 -324 -405 243 -598 567 -870 296 -180 -102 -30 -171 471 -757 651
3717 651 -939 159 -801 -153 -2 233 568 -1035 510 -1133 308 -731 262 -268 -678 948 -1389
3734 -1389 503 -685 1258 -265 -765 -166 -721 487 -238 1402 -757 367 108 207 873 -314 646
3751 646 -769 455 -330 681 622 383 830 -920 677 -617 732 -453 230 -185 -656 542 63
3768 63 723 -1225 1059 128 -445 326 -90 964 -685 426 -903 441 -215 -211 587 -1340 2087 -409
3786 -409 868 -253 104 -184 -489 -36 -356 982 -715 845 -566 227 -49 -31 491 -951 1008 -938
3804 -938 633 -599 -362 4 -884 120 -1128 74 -816 -100 -231 127 658 -644 1117 -742 246
3821 246 -766 812 -252 23 551 -1533 1184 -133 373 -395 -44 464 -615 905 -208 738 -33
3838 -33 363 64 31 391 25 765 -223 1174 131 176 11 149 865 121 498 -285 136 246 335 -181 349
3859 349 692 -526 953 -643 574 -265 -113 431 -831 -163 -877 1334 -235 114 -1026 -242 200
3876 200 -871 342 -740 532 -836 301 122 -1059 377 -175 -50 -1421 488 -335 166 -139 -460
3893 -460 423 -377 759 -869 27 -201 962 733 -207 821 -493 593 -728 748 -750 70 282
3910 282 -357 1001 175 1065 -840 181 163 110 1256 -232 1025 -264 825 -925 223 289 93 724
3928 724 -582 459 -676 694 -516 -141 172 -237 1242 -1013 966 -674 600 106 75 -65 -758
3945 -758 232 -827 99 -1040 487 -224 -247 540 -614 594 -1010 336 -149 -51 -94 -401 563 -29 471
3964 471 -1176 83 -312 47 526 -353 932 -507 549 -789 429 -311 185 601 -795 821 -538
3981 -538 1020 150 375 -38 -80 747 -241 711 -527 1209 -199 444 222 58 360 -238 837 -407
3999 -407 564 -220 349 309 -37 243 -555 856 -812 109 405 -91 119 150 55 -1382 458 -818 425
4018 425 -460 -379 -89 -652 273 -704 318 -525 8 -447 132 763 -838 361 -1203 -370 -317 151 195 -673
4038 -673 154 -835 686 -769 913 -115 41 144 -713 759 -1176 585 -703 269 -193 267 564
4055 564 -452 1114 -811 51 -473 251 238 -363 701 -228 1574 -861 822 -339 -101 159 -663 423
4073 423 -340 575 -304 547 122 702 655 -257 118 -567 683 -453 32 -176 -354 -32 -353 133 -469 652
4093 652 -1190 142 -211 -818 -269 -620 596 -462 88 -325 128 382 -206 518 -764 875 -273 933
4111 933 -289 349 381 -277 443 -580 150 -634 213 -332 56 530 -720 293 -315 908 -167 232
4129 232 40 147 533 198 1038 -263 573 -349 412 132 31 335 -744 991 -483 647 -556 78
4147 78 75 -423 549 -250 502 -258 609 -732 -389 520 -526 627 -290 694 -973 -84 -219 -615 383 -1365
4167 -1365 804 -362 1026 -106 -544 -1125 -259 556 -514 13 -1086 274 -225 21 -181 -124 371 -386
4185 -386 365 -825 266 -611 2 -268 -1363 753 -719 500 -241 550 45 -455 327 -1003 518
4202 518 -1048 159 212 417 -221 -400 40 -138 813 -504 230 -162 129 801 -423 617 -287 164 -318
4221 -318 442 -222 -132 236 -563 282 -727 765 -457 191 -75 -65 803 -257 551 -726 660 83 -81
4240 -81 -743 -72 261 -769 563 -929 673 -660 -319 -41 -468 580 -648 244 -377 623 -430
4257 -430 89 537 -383 431 -625 548 -649 373 -173 -537 -182 -102 112 -615 551 -384 7 493 54
4276 54 49 -491 602 -477 449 -622 28 744 -429 557 -191 424 -325 560 -504 220 178 287 393 -655
4296 -655 857 -687 279 -131 -297 974 133 753 -58 844 -504 -6 189 -214 450 -390 1085 -695
4314 -695 908 -14 -134 -255 340 488 -517 -325 -469 10 -293 -111 -1 -520 199 -487 615 -841 -52
4333 -52 -232 -505 397 -465 497 170 916 -415 516 -140 -241 310 -204 1314 -487 -256 -447 129 18
4352 18 -369 974 -933 664 -277 518 8 97 -188 -402 63 -382 900 -627 57 226 -499 559 -80
4371 -80 177 -329 1172 -320 17 -257 -294 814 -621 510 -458 232 -309 644 461 -357 197 -784 865
4390 865 -412 -294 182 -263 -450 -572 -15 -758 346 -917 602 -358 500 -116 -946 210 -660 744
4408 744 -671 -292 -300 -510 -23 -385 585 -581 735 -417 -120 371 -350 230 -285 -97 -531 99 321
4427 321 644 238 -461 382 29 299 -522 418 75 107 640 -144 705 -334 551 -808 -85 413 -492 933
4447 933 -668 401 115 406 -235 -340 45 302 747 -689 227 -730 783 -301 -665 363 -26 445
4465 445 -594 -2 -393 416 -429 -311 485 191 -13 -495 34 -239 -464 33 60 273 -1019 443 -338
4484 -338 272 16 145 -495 -798 335 -662 1020 -953 120 52 77 176 -223 426 -102 -19 37 196 495
4504 495 -595 428 -30 258 -91 331 276 -286 -509 -42 218 -404 653 -73 639 -117 384 187 -157
4523 -157 239 -325 522 -277 556 156 246 309 -111 475 -43 907 78 474 -349 -85 -14 -266 875 -496
4543 -496 198 -142 -80 -298 -640 473 -686 399 -665 632 -566 -586 -339 -474 275 -252 261 -613 355
4562 355 -202 -240 68 -398 -373 -444 92 -160 432 -333 -186 216 -378 563 171 -145 528 188 269 143 334
4583 334 -322 283 -341 543 341 -86 258 74 847 337 780 -218 368 -157 -273 589 -661 371 -168
4602 -168 713 -386 297 -219 -51 293 3 170 -760 391 -1043 255 -150 -636 -215 -799 534 -593
4620 -593 294 87 -71 -184 -213 58 -203 250 -747 -228 -163 24 -43 -186 378 -487 -16 -801 583 230 -261
4641 -261 -56 -466 219 185 467 -78 269 -150 -21 105 -249 75 -315 432 243 217 426 -62 633 -116 1009
4662 1009 150 328 -114 165 116 131 316 -740 314 -140 886 -490 195 208 -868 563 -189 33 -321
4681 -321 -155 522 -80 487 224 35 -939 62 -363 290 651 -429 420 -202 1064 -29 -325 -840 -324
4700 -324 36 -358 146 375 4 -78 -452 30 -284 -102 -363 661 -664 23 35 -202 -152 -131 611 -438
4720 -438 418 -259 412 139 19 309 -324 384 -28 169 -457 449 113 357 354 -504 556 -92 3 -382 293
4741 293 -69 394 74 -840 3 -278 360 -474 41 -186 -291 -14 262 221 -662 52 -576 -247 -7 -220
4761 -220 -74 356 285 -966 612 -564 277 -592 -580 364 -45 486 -217 875 179 -267 158 -563 -9
4780 -9 -665 272 47 374 218 -169 477 -216 948 -229 487 528 -252 -235 -284 442 -40 249 -108 -84 -526
4801 -526 464 565 112 284 -9 459 238 367 -403 -30 962 960 615 170 128 38 -33 202 425 234 -388 523
4823 523 -687 501 -511 216 124 -181 326 -956 328 -333 127 -69 74 225 -616 618 -154 702
4841 702 65 640 293 -30 511 153 241 -301 553 -127 325 -128 111 11 -316 616 -315 508 100 109 -58
4862 -58 -430 510 -313 340 92 175 -10 -164 358 335 -16 -686 233 84 26 155 -342 -126 253 41 -264
4883 -264 15 110 -172 206 -171 -356 -259 726 105 -334 238 150 20 -5 -94 -188 636 -480 611 279 240 230
4905 230 -74 -37 -531 247 -111 -384 -273 -87 165 -16 -171 -38 -237 -464 541 -995 -629 64 -214 204
4925 204 -724 273 -114 -323 -241 -434 312 -732 232 -423 334 581 -434 184 -690 74 -523 299 20 217
4945 217 -437 -174 348 84 44 52 101 -270 31 73 18 225 -456 716 -612 746 282 245 171 2 -382 -305
4967 -305 208 8 797 410 37 234 -596 74 111 351 -46 153 -453 127 -172 -453 126 -676 662 -1
4987 -1 566 -242 -539 41 -380 -132 -387 119 -102 478 386 -442 -298 -406 355 -516 389 82 283 209 -395
5008 -395 -164 -235 82 -27 602 459 138 -34 -591 163 102 -83 -1009 956 207 132 216 -163 339 -246 -351
5029 -351 -1016 478 -105 738 -91 -457 253 -176 990 -60 51 -34 -192 -414 840 419 743 -491 -294
5048 -294 120 159 72 824 -282 -25 -117 -65 72 -597 -916 -120 492 -814 -3 88 339 222 131 322 -368
5069 -368 329 -210 -5 -837 194 408 -546 -90 -535 1065 -868 -15 71 -124 -43 -26 -233 -430 855 -745
5089 -745 -206 197 452 -721 4 99 -195 806 40 446 -159 -429 315 162 1378 -296 826 36 544
5108 544 -796 51 1157 424 747 570 312 -151 617 282 -21 -381 -394 589 847 723 600 479 620 -307
5128 -307 1317 -21 42 -337 -294 -27 71 -92 8 79 -85 157 -115 203 -183 -9 428 -336 15 -240 396
5149 396 71 -366 -469 531 490 -577 -208 -260 48 -608 707 -45 79 -221 -242 1073 -599 386 -309
5168 -309 495 -160 -113 233 28 -127 393 19 160 156 -122 -225 359 -109 401 105 -83 66 -552 532 -240
5189 -240 149 -108 142 -447 631 164 -350 579 -729 649 -274 25 -67 217 -290 76 269 -316 -19
5208 -19 -194 196 729 -229 427 10 769 -378 -92 -18 166 -186 -354 -57 -921 129 -278 249 -458 -15
5228 -15 39 -681 300 -103 183 -550 20 -224 -167 57 -596 227 103 307 133 136 -361 114 -248 97 -165 -128
5250 -128 155 -172 310 -90 -216 177 -56 316 182 105 110 120 -160 293 429 -580 339 -42 -325 -672 589
5271 589 -308 -422 460 -219 345 -181 -355 -29 269 -130 -305 342 -471 137 -351 112 218 -253 79 32
5291 32 293 -634 -243 -338 28 -205 -184 326 -196 -257 -293 0 -446 -80 -255 145 145 -272 398 -202 -20 -205
5313 -205 468 348 57 -285 429 67 -42 10 213 918 90 -78 371 -484 -89 -298 -351 15 -109 268 -10
5334 -10 357 -117 -315 6 -409 425 -395 519 -31 231 -41 439 224 -541 306 -471 -171 -305 -155 357
5354 357 -242 52 -272 250 -156 141 -351 -308 -140 -249 2 6 836 -480 -33 -152 161 158 137 -24 -219 -34
5376 -34 -219 -206 -135 332 -245 -88 155 -320 -4 -669 10 -256 50 -101 -366 818 -341 522 -251 -418
5396 -418 -106 -514 172 313 333 -585 113 -131 328 -185 -416 441 -482 723 -174 242 -78 135 -66 -581
5416 -581 -302 -105 275 93 309 184 -50 378 121 214 -184 -6 -201 -452 -116 -455 240 105 -136 -77 87
5437 87 -458 -331 296 -514 -192 -9 540 -78 321 -240 -382 -534 212 140 260 211 -180 -62 -40 42 -476 -96
5459 -96 85 -435 355 94 462 -553 -55 80 -434 -178 -341 137 -138 3 -185 35 33 431 389 -309 16
5480 16 -397 686 377 -498 65 528 205 -935 -339 -465 492 21 771 -248 -779 521 -107 166 -627
5499 -627 264 336 635 -568 326 364 83 -671 59 289 221 -204 -555 -706 610 632 -328 -393 -296 438 605
5520 605 85 195 652 -1049 250 -388 -59 -67 377 163 289 357 -299 -603 94 -37 -537 -528 149 -174 40
5541 40 -212 224 -98 233 19 556 -985 246 -123 70 638 -200 49 151 -269 399 715 49 437 -18
5561 -18 595 -577 -164 421 -65 -231 387 -40 -664 -308 -518 297 -61 1071 477 44 -152 567 241 221
5581 221 -255 234 -717 -266 1134 213 124 -147 594 830 17 378 -407 -200 -257 -1097 -674 477 636 -609
5601 -609 -105 82 -149 254 -310 470 -89 -775 -413 -328 -614 -45 -545 -106 -147 -168 110 -759 -562 538 -652
5622 -652 75 385 -560 -722 144 -438 250 4 -404 63 -121 -348 -126 -250 229 190 -231 -469 362 14
5642 14 253 739 -422 48 550 231 362 521 88 12 3 99 153 -365 432 -413 8 -103 264 123 237 344
5664 344 -585 660 -578 69 337 129 228 72 -380 -93 -51 21 152 -259 -110 218 -479 -168 107 155 835
5685 835 285 -191 -114 31 96 76 -378 371 -697 -59 654 -510 648 -147 29 -709 -128 -273 168 -144
5705 -144 -331 341 217 528 -461 54 -701 323 234 -410 -258 314 29 503 274 -697 307 -270 -1083 632
5725 632 26 240 -186 -49 592 -1127 487 -546 30 101 -311 601 -324 1074 156 231 349 834 -153
5744 -153 665 287 -75 -1274 -298 -393 79 -47 -425 811 -349 -45 -391 -395 296 -323 559 -203 30 -44
5764 -44 -219 -323 311 756 -635 797 -226 -222 470 -278 102 -444 63 510 956 306 -101 99 -179 631
5784 631 -414 -65 447 576 -22 -484 -424 95 77 253 202 11 6 9 405 192 -284 162 116 -282 424 -82
5806 -82 -67 -366 -66 -14 314 -597 61 99 -211 151 21 534 -962 -51 -125 237 60 144 309 -785 499
5827 499 230 -705 -749 141 106 111 -402 -46 -132 200 -385 474 -715 696 58 -154 240 -186 298 -536 1171
5848 1171 631 54 273 1503 431 -111 362 2277 205 -902 327 128 548 595 891 31 513 603
5866 603 -483 1523 200 -556 -139 678 173 962 241 -483 4 28 433 219 393 869 398 -431 3
5885 3 -331 -58 710 -249 -361 251 357 -83 -122 445 177 153 -180 -361 519 438 -709 -301 131 468 -13
5906 -13 328 556 467 19 -74 441 71 55 872 286 192 261 -375 -294 -124 -263 805 64 313 -358 -544 218
5928 218 426 -287 183 -77 182 -32 -239 219 232 98 -132 95 -95 973 -214 -603 -575 204 391 -267
5948 -267 -971 491 -150 294 252 -95 362 -359 -642 -1296 -178 -925 -1133 -633 326 -369 268 777 373 -213
5968 -213 -5 -67 -38 556 -29 -142 450 -154 922 -232 -356 72 654 -83 156 272 -147 -180 154 26
5988 26 -263 -236 279 196 -290 724 101 439 521 -109 66 230 -1020 236 238 -458 663 570 414 828 295
6009 295 -124 245 94 -205 192 -10 0 303 -507 606 -497 625 -132 771 549 -236 489 458 -125 -39
6029 -39 -198 -91 -778 71 357 -347 -111 -358 467 455 -161 133 -214 -77 98 3 349 161 458 -179 366
6050 366 680 -121 186 540 53 -429 -400 981 -503 -184 -26 356 -5 -8 -56 -304 -71 -271 -392 -447 -386
6071 -386 -151 -560 -68 -77 -489 -90 -92 106 -111 70 -619 154 28 -556 -266 434 72 112 290 -5 -299 -95
6093 -95 79 -64 -170 123 -222 -168 560 301 412 -19 -92 -233 331 460 15 -117 275 -156 558 83 417
6114 417 -235 102 -256 -186 -232 239 -128 398 -107 422 -151 -278 171 -311 -51 -354 -330 -386 316 -143 340
6135 340 -302 -305 38 365 99 -389 -81 322 -228 -428 235 -188 69 -118 -615 -630 33 292 411 -48 -234
6156 -234 -447 298 -226 -156 -93 -400 -164 75 -19 -359 -442 -181 -126 112 143 209 221 -98 279 -343 -823 3 -123
6179 -123 20 -554 432 -149 173 4 -255 -201 -803 106 -35 -197 -17 547 290 -460 -384 -546 -120 -195 -370
6200 -370 82 -568 698 118 -427 -300 425 -273 -372 -41 223 -1 287 -27 -523 -187 114 235 -46 163
6220 163 -412 -50 -21 -188 194 242 477 23 -494 -46 -158 -431 -57 76 311 -342 53 132 310 229 -224
6241 -224 324 -411 104 -8 -253 -36 -187 -522 -58 -154 -339 67 -239 95 42 -57 490 -134 146 262 -123
6262 -123 -263 -503 212 11 -53 -634 204 164 -296 -89 235 141 -313 334 -79 385 133 -87 107 -61 426
6283 426 61 -38 162 671 -201 -345 42 4 542 -304 6 -302 395 -87 569 835 -434 6 -720 -163
6303 -163 -41 217 154 -433 -74 -253 414 -537 -185 -310 -54 -154 -87 -32 -206 269 -465 -150 327 -435 -249
6324 -249 -28 -357 -147 235 -344 -379 162 35 -469 -18 -179 261 -287 -117 -76 74 9 -34 156 -36 254
6345 254 -126 169 -1 -75 -32 -25 80 69 170 20 328 -456 -437 -24 -75 -176 195 -16 -399 253 58 353
6367 353 468 377 -167 -280 -104 -117 -1106 99 174 -75 520 -25 541 37 213 -70 279 564 3 -148 -368
6388 -368 -252 -478 -577 -59 135 672 -183 51 418 -557 -204 -271 66 -76 104 40 -286 -147 417 29 -646
6409 -646 243 -67 -160 -169 -298 14 -4 -51 -24 385 -212 176 -337 462 480 206 79 -289 -310 -130 306 393 -39
6432 -39 -128 159 -6 -403 -65 -411 86 -306 454 54 139 203 16 -324 -565 340 237 -109 -166 50 -162 -221
6454 -221 150 -124 716 508 -181 -134 -159 845 -90 -568 92 -270 -67 549 -513 -147 -91 -441 73 -463
6474 -463 970 -319 372 -3 49 -423 421 -160 41 293 -278 279 226 106 77 -184 199 555 -19 -136
6494 -136 13 -249 -338 72 -255 383 -177 -568 123 -632 -414 529 86 138 95 162 83 -199 -554 198 -180 249
6516 249 -661 -366 258 608 900 -184 423 -16 416 187 -219 -196 -244 205 -154 -28 772 -367 -291 -112
6536 -112 349 585 -58 106 -244 644 137 1026 238 -112 569 255 -367 493 664 206 427 -301 78 442
6556 442 -117 38 -10 -180 165 -34 228 -409 -706 -483 -342 538 33 459 412 484 895 -949 399 -351
6576 -351 126 807 733 -318 -146 -436 -165 454 339 -401 -258 438 261 -194 -515 -21 343 355 177 -260
6596 -260 -288 -78 234 91 6 -215 383 -361 222 -1141 246 88 -204 -160 444 -435 -583 -396 -417 227 408
6617 408 93 390 -62 -61 -174 -57 -6 -476 -175 -103 325 9 117 136 -31 -302 280 53 -103 387 -559 202
6639 202 296 -457 336 594 -221 -78 50 -380 93 483 460 107 534 -198 299 182 24 2 283 152 -342
6660 -342 -155 -397 -24 -318 -207 -64 88 -58 438 520 212 -202 -435 51 106 130 753 -5 -771 -82 423
6681 423 -866 -524 490 687 325 -363 -135 281 430 667 -265 -104 -189 -266 -106 50 174 -487 -42 -365
6701 -365 -27 461 -131 379 0 -19 129 -18 -329 177 194 65 -253 -312 237 -402 -4 48 -105 359 -412
6722 -412 -254 -8 232 -492 -341 -467 8 -402 139 254 142 59 -235 -236 461 449 -158 -93 -152 162 191 -72
6744 -72 206 -62 -312 320 -253 160 -157 236 52 -7 -261 -195 640 -26 315 -104 0 -557 309 -307 244
6765 244 -48 -352 355 54 99 -31 -67 308 -486 336 70 110 92 -277 -259 -81 -97 -7 123 176 -252 -162 -25
6788 -25 -64 -23 -85 100 516 219 275 133 55 30 -223 -211 -258 -375 -116 147 286 -335 -60 -89 128 -201 292
6811 292 500 -181 290 -292 -272 -304 -147 126 285 -105 -100 -473 46 -174 -642 91 174 -63 -217 -435 501 34
6833 34 -87 -341 531 69 104 342 121 -89 -335 262 -251 -783 -75 -85 -344 -276 96 71 -195 384 -331 -254
6855 -254 41 20 238 -6 184 653 -248 302 -122 369 -42 102 -227 213 -328 -237 166 357 -116 -479 -235
6876 -235 345 -243 550 -608 -55 358 2 -232 -854 36 -268 126 344 -636 -192 393 31 -184 200 -460
6896 -460 -205 -62 -628 269 -962 -2 -539 395 -470 -124 -438 -362 270 103 -136 -206 -172 379 700 386 378
6917 378 -537 -474 -543 618 -355 144 273 896 203 646 -255 -627 212 87 -467 6 -306 -192 84 -229
6937 -229 -429 207 10 -84 -681 -492 -214 524 -87 196 -497 4 2 99 -82 59 401 -212 306 128 1
6958 1 -6 -70 -205 -24 105 -331 171 -467 -473 613 291 29 -130 128 -234 463 -93 -127 -541 229 -203 -233 337
6981 337 149 30 255 -1070 -211 110 74 43 -167 -391 -113 -391 -90 296 -152 -78 122 318 -244 69 157
7002 157 45 9 377 212 296 17 -62 -98 -31 -709 172 436 452 224 109 511 311 364 22 468 183 468
7024 468 118 -76 198 -168 -327 -196 -52 165 42 80 153 -543 -220 338 303 151 -206 -408 213 118 -31
7045 -31 -173 -69 461 219 -83 -458 64 -44 338 -493 -175 326 -202 -39 -279 90 78 -133 -42 -568 327
7066 327 106 408 -145 18 -226 191 63 302 -25 591 100 -675 114 329 -175 383 -251 -151 174 319
7086 319 -33 213 305 -43 -140 -61 319 385 -294 -32 101 -276 -242 -88 -177 -99 -17 -209 164 714 134 107 228
7109 228 -489 -28 -88 32 168 403 143 -234 -460 177 105 -119 122 264 184 -512 575 259 164 24 -164
7130 -164 55 56 -247 -326 -123 -75 -150 418 237 -53 197 -323 -203 -416 -170 282 53 -125 -147 -147 259 -131 68
7153 68 -121 -99 -71 -165 16 -483 571 46 -67 -790 -280 60 -501 399 -478 33 -53 -446 190 389 -182
7174 -182 -642 -588 -11 276 452 548 157 -197 -245 936 720 -218 -410 369 -299 -64 59 29 -30 102 -364
7195 -364 -35 -33 99 -165 -368 -152 -251 71 312 -65 -93 329 185 231 219 233 348 -76 160 59 -728 -367
7217 -367 58 -17 -178 110 298 -42 27 -869 -170 -318 527 -385 -25 -534 -42 -87 223 -144 141 436 16
7238 16 130 84 328 228 154 -5 220 144 330 141 21 -410 277 1 -449 113 325 107 -173 270 -237
7259 -237 -59 171 140 -319 -181 -166 -179 -19 14 418 -117 179 -216 688 629 -750 -1429 -878 209 -517 -386
7280 -386 15 -293 -27 -11 -384 -390 2 -186 -73 295 -193 -557 -242 -44 -492 -203 -132 -136 177 -29 715 163
7302 163 27 162 -165 -132 -278 219 173 -16 -251 -208 -243 -101 120 -135 515 59 -19 -68 -42 -261 215 145 -190
7325 -190 183 211 527 -276 401 287 -213 413 -186 147 468 1057 18 116 -155 -108 221 129 411 269 -141
7346 -141 -160 -825 47 313 -60 158 163 -534 -27 -25 -641 297 -32 -238 -429 116 -516 659 391 182 -313
7367 -313 353 237 17 -359 -32 139 -289 -321 99 -140 -611 3 84 191 38 -414 194 -65 -592 -376 -793
7388 -793 49 -151 242 174 -175 -140 -93 8 -203 275 -5 -199 -135 66 191 -278 464 -25 56 450 152 237
7410 237 -66 133 -36 36 -333 -126 446 69 432 422 52 -438 62 458 -607 -96 -14 -102 127 -242 43
7431 43 564 759 -299 535 -80 -762 -30 -314 -58 -664 -123 -287 147 239 787 -320 -2 274 -331 -875
7451 -875 -357 101 -61 3 -704 -593 257 -95 -270 -155 89 181 284 253 -149 -288 -288 330 113 329 -285 336
7473 336 22 65 476 -87 -83 -324 -17 246 -160 219 -137 487 -276 314 -149 353 -155 14 540 24 449
7494 449 22 698 -168 395 140 101 -270 144 146 -67 -551 -255 1 -410 -642 -12 97 424 62 -137 189
7515 189 359 -298 -25 502 321 -87 203 -107 -77 258 -357 18 -124 -149 420 73 -406 -59 -71 -174 -123
7536 -123 168 135 -124 -325 -151 201 331 69 -246 680 -514 139 413 361 44 428 -38 -71 -41 43 831
7557 831 -182 -241 -111 -244 279 197 498 9 50 -573 470 351 33 -19 -107 179 270 433 -364 -276 142 -189
7579 -189 91 -197 -80 390 -167 139 212 -5 109 -79 259 -57 95 586 -283 -231 339 -129 -550 -225 552
7600 552 -675 -597 -156 385 99 -766 235 272 12 11 58 -368 -427 -109 -127 210 -231 -160 -120 332 29 138
7622 138 366 297 479 844 89 987 600 169 176 69 101 -163 49 -411 201 -288 666 -43 129 -824 -63
7643 -63 87 147 -168 637 -23 428 -203 -153 272 -119 -224 341 309 163 -185 -126 -49 -3 -532 -444 214 -288 326
7666 326 -323 -25 8 -63 -128 -50 212 -425 -139 38 -220 -56 -308 595 16 472 616 438 -307 622 106
7687 106 -150 -8 -116 455 -191 -111 291 -292 138 386 -328 161 353 -330 621 333 -24 -4 -405 -295 -25
7708 -25 401 -159 -115 435 361 -45 112 256 -187 216 128 205 436 -257 -512 -137 -245 -52 502 2 307 -140
7730 -140 149 314 239 -50 -34 329 182 133 263 302 -261 -179 -22 -16 387 -341 507 -391 -353 240 337 53 99
7753 99 136 -532 -321 -411 272 -589 383 219 -109 312 -464 301 201 -280 53 274 27 -70 -473 -419 394 157
7775 157 -330 741 -267 371 199 -115 317 -315 -372 -647 -232 -647 -72 -296 172 888 -105 -571 -390 467
7795 467 75 -647 58 120 -110 -291 357 -258 491 -300 -436 203 140 -9 -5 181 -143 7 80 405 57 259
7817 259 15 -164 160 -42 -85 137 526 532 -324 -170 -315 -141 -121 -687 -138 -347 91 -54 -191 -278 -473 -301
7839 -301 219 192 -366 53 -331 -17 295 338 544 -250 285 -82 29 -210 412 -479 144 8 -157 -153 -224 182
7861 182 -78 126 356 37 883 133 -33 64 84 -81 -75 142 48 171 43 -364 -201 -287 -228 -44 405 128
7883 128 146 189 82 -300 317 -82 435 -38 751 217 108 652 85 229 -318 547 -388 54 32 -302 -590
7904 -590 110 398 -229 295 63 686 143 -66 368 170 115 255 -121 -256 197 -166 94 270 65 281
7924 281 -163 -47 -424 -439 278 -52 284 397 288 -117 -233 226 -173 670 442 228 569 406 -192 -80
7944 -80 9 97 -143 -83 60 123 31 116 -35 67 344 -100 -171 364 6 -39 553 -484 226 -70 -2 457 -223
7967 -223 222 480 469 176 -204 350 -178 -269 97 -258 192 210 -353 143 -305 837 75 91 660 123 66
7988 66 -238 576 -89 -367 -830 -116 -82 29 -164 -180 -204 -329 127 231 470 684 -139 620 -418 159 106
8009 106 -225 69 -120 195 744 272 -671 347 -134 646 -69 -77 -101 63 84 12 146 518 255 258 -129 297
8031 297 -279 58 -84 -74 -189 -1055 849 362 -73 -559 -175 68 -68 -235 -708 251 -175 276 224 12
8051 12 174 672 364 -345 825 -11 111 -309 -103 -663 53 45 -199 -375 -62 449 445 160 -474 -645 168
8072 168 489 -107 -512 43 40 -617 580 210 -2 -843 -211 93 401 312 1224 257 -286 239 -200 247 353
8093 353 518 365 186 -164 -334 95 16 -350 106 258 -158 -620 122 -136 348 -22 463 -109 -79 -20 -59
8114 -59 680 296 280 -7 169 62 -208 -423 155 -702 -142 217 -346 63 56 -160 -422 -23 170 106 587 -195
8136 -195 -150 208 -116 631 -160 747 116 684 156 194 -42 -416 543 -166 413 -403 -169 13 274 -63 -139
8157 -139 132 54 438 8 26 -146 68 -22 -25 -87 -60 245 -302 17 -223 -172 -19 -28 401 -444 -71 -89 264 -116
8181 -116 -32 245 -307 -219 284 -460 231 -292 -85 -110
8191a10
$$ Imaginary data points
##PAGE= N=2
##DATA TABLE= (X++(I..I)), XYDATA
0 0 0 0 0 0 0 0 0 0 0 0 0 0 0 0 0 0 0 0 -39 40 -40 40 -40 40 -80 80 -80 119 -120 150 -160 199 -205 241 -279 319
36 319 -359 401 -444 502 -561 626 -696 775 -859 946 -1052 1156 -1275 1408 -1550 1709 -1879
53 -1879 2072 -2282 2516 -2781 3080 -3421 3809 -4265 4808 -5463 6273 -7309 8699 -10684
67 -10684 13863 -20373 86378 -125915 37972 66948 -10799 -14111 16236 18836 -23954 46507
79 46507 -83278 99016 -71285 8986 8799 -20539 3720 -50163 58674 -82795 21476
90 21476 -21505 3936 -38432 -24078 32725 -81560 45899 -82218 31013 -27462 -33912 3046
102 3046 -26051 12925 -62817 42773 -65513 35558 -38916 -21963 35805 -55320 36460 -45956
114 -45956 42360 -42895 23259 -5398 -12356 30252 -34987 53599 -46862 56173 -24459 24098
126 24098 16210 -22864 59443 -31153 40213 -19548 59684 -27388 24761 35973 -28087 60914
138 60914 -34779 49587 -16923 35846 -7832 10921 31683 -24734 48124 -40375 53864 -28151
150 -28151 19571 3164 -10161 30853 -37873 41562 -37985 29682 -28237 11230 -5676 -23347
162 -23347 31068 -54067 34839 -39840 18840 -29053 -5589 3482 -35210 21209 -51308 32180
174 32180 -46694 12116 -19441 -16290 9343 -38871 26396 -50041 30749 -35322 5983 -9314
186 -9314 -12680 18532 -40450 35909 -40929 30940 -25965 6970 8529 -17419 26670 -28806 40635
199 40635 -31187 33511 -10753 7595 19085 -14111 37193 -27965 46574 -20413 27650 1876
211 1876 5946 25377 -17289 42233 -24768 41222 -16718 24433 5936 -2520 30595 -24486 38681
224 38681 -24073 31879 -18838 13996 8854 -15193 25039 -29220 34072 -34482 22042 -16526
236 -16526 -1998 5679 -24684 22641 -37968 25777 -34469 12050 -17497 -9823 6905 -35061
248 -35061 22751 -40280 19666 -30940 4562 -10691 -16006 8755 -34942 24679 -38404 18711
260 18711 -24244 3186 -1154 -19022 19160 -31204 26580 -29000 20316 -14525 4343 9765
272 9765 -17593 30558 -26652 32517 -19372 21717 -1470 2039 19681 -13780 34010 -21468
284 -21468 35905 -15035 20238 7636 -2779 25340 -15527 35655 -20659 31574 -8163 14584
296 14584 8059 -6367 27389 -23202 33509 -23348 22435 -8028 3002 9017 -15956 23102
308 23102 -28234 24875 -25558 14681 -11375 -7163 10257 -26627 20253 -31538 17433 -25661
320 -25661 4805 -10105 -14781 8718 -29507 18357 -33833 15610 -21771 -2125 -2605 -18281 11751
333 11751 -29131 19541 -29067 14937 -15123 -2127 4792 -17405 19389 -27490 24312 -20044
345 -20044 13399 -5096 -935 12592 -15657 26839 -22461 27652 -13342 15795 3478 -1364
357 -1364 22653 -15012 29608 -15888 27143 -7748 13571 9344 -5160 25429 -16610 29447
369 29447 -15732 22936 -4088 5997 11561 -9672 22770 -18759 24630 -17012 15629 -4297
381 -4297 -2620 10749 -17115 19717 -23551 18297 -18266 5604 -5513 -9725 8025 -24307 17847
394 17847 -27215 12156 -17770 -1172 -3984 -15683 10202 -26365 14675 -25993 9794 -16140
406 -16140 -3002 827 -19098 14127 -26212 17174 -20859 8543 -8322 -4296 7304 -17393
418 -17393 18557 -20359 20138 -15317 10970 1681 -5157 14789 -13204 23327 -16421 21704
430 21704 -7669 10035 7225 -3195 19772 -13936 26529 -13476 19508 -2290 7599 10375 -5809
443 -5809 21962 -14369 23914 -11689 16671 -1199 1568 12012 -12727 21120 -16417 18216
455 18216 -12442 9317 -1434 -5796 10832 -17267 17656 -20902 13780 -13742 2042 -967
467 -967 -13382 9374 -20507 13916 -22685 9675 -13535 -4266 102 -15666 10942 -23882 12815
480 12815 -21067 5262 -10109 -6001 2233 -17498 13338 -22425 14039 -16710 5876 -3088 -7219
493 -7219 8697 -16310 16542 -17123 14964 -9915 7657 1938 -5538 16986 -13545 19326 -11833
506 -11833 17007 -3438 7345 8275 -5133 19768 -12193 23150 -10767 17431 123 3091 13252
519 13252 -7283 20455 -12180 20917 -9093 12107 1363 -1411 11533 -11951 20008 -16427
531 -16427 14811 -9593 4885 195 -7755 11384 -16812 14397 -18476 10037 -11058 -1962 1045
544 1045 -14201 9279 -21147 11291 -18500 5214 -10194 -6943 1904 -17204 10043 -20830 10659
557 10659 -17168 3159 -5560 -8521 6088 -16035 11543 -17527 12871 -12610 3073 295 -7456
570 -7456 11049 -14123 16391 -13891 14374 -4447 2905 5639 -5329 16821 -12500 20115 -9000
583 -9000 14966 -267 3609 12175 -6507 19058 -10311 19635 -6185 11726 2864 924 13758
596 13758 -9270 18439 -10725 15061 -6950 6567 2755 -5000 12364 -12703 14345 -14276
608 -14276 11798 -7499 70 2898 -10514 10078 -17308 12664 -14629 4897 -7730 -4545 2077
621 2077 -14346 9276 -19133 9534 -15795 1620 -6387 -7174 3899 -16296 10023 -18402 9215
634 9215 -11957 1196 -2101 -8189 8208 -15219 13078 -14210 8993 -8221 1337 4019 -8346
647 -8346 12240 -13140 15095 -10860 10702 -2224 2049 9108 -6922 15446 -9925 16695 -7319
660 -7319 10051 2604 956 11963 -6888 17202 -8987 15249 -4285 6976 4548 -2114 12202
673 12202 -8641 16461 -9780 12163 -4356 3780 4388 -6235 11936 -11680 12948 -11741 7422
686 7422 -5026 -1060 3581 -11409 10162 -14918 10469 -13339 4123 -4296 -6779 4499 -14089
699 -14089 9441 -16876 7463 -12829 899 -3168 -9823 5353 -15348 9393 -16292 6741
711 6741 -9174 -656 895 -9069 8392 -14124 11329 -12205 6940 -3828 -1049 4901 -7258
724 -7258 12757 -10903 12606 -7856 8213 89 -677 10335 -7452 14751 -9279 13631 -5191
737 -5191 7919 3700 -1585 11777 -7607 15599 -8739 13436 -2643 5193 5785 -4002 12712
750 12712 -8877 13733 -9116 9597 -2326 -23 5637 -8352 11529 -12088 11079 -10279
762 -10279 4456 -3419 -4112 4985 -11674 9274 -14284 8408 -10662 1312 -2919 -7827 4155
775 4155 -15140 8586 -14694 5723 -8510 -2234 -1027 -9503 6328 -14017 8718 -12787 5006
788 5006 -6177 -3338 3151 -10061 8232 -12409 10156 -9478 6203 -1414 -2801 6560 -8614
801 -8614 11893 -10593 11965 -5083 5396 3201 -2426 10285 -7899 14690 -7829 12241 -2204
814 -2204 5110 5492 -3005 12285 -8039 14175 -6999 10183 -910 2424 6617 -5889 12430
827 12430 -9585 12513 -6998 6768 -1005 -1861 7000 -8752 10111 -10852 9037 -7758 1120
840 1120 -1335 -6015 5851 -11965 8156 -12999 5820 -7963 -1424 -841 -9222 5244 -13479
853 -13479 7918 -12521 3382 -6537 -3698 952 -10261 7436 -12753 8155 -10142 3345 -3822
866 -3822 -3344 4558 -10568 10013 -11263 8932 -6394 3507 718 -3413 8254 -8212 11981
879 11981 -8065 10246 -3764 3989 4967 -3088 10281 -7358 12273 -5669 9479 -596 3019
892 3019 6686 -4284 11772 -7692 12366 -5282 7078 1478 -234 7030 -6526 11409 -8567
905 -8567 10132 -5166 3996 653 -3648 6203 -9820 9699 -10522 6365 -6683 394 74 -6962
919 -6962 6274 -11698 7647 -11385 4269 -6646 -2185 1098 -9971 5953 -12197 6419 -10774
932 -10774 2602 -4430 -4244 3161 -10409 6952 -11819 7203 -7815 2167 -1140 -5125 5705
945 5705 -9410 8847 -9511 7491 -4457 2460 2976 -4246 9015 -7832 10552 -6321 7874
958 7874 -1416 2381 5398 -3718 11411 -7175 10784 -4487 7333 884 866 7806 -5320 11104
972 11104 -7285 10903 -4455 5054 1284 -1894 7607 -6858 10897 -8544 8426 -4426 2546
985 2546 1500 -4614 6454 -8492 9037 -8699 3936 -4727 -2339 2293 -7925 5864 -11446
998 -11446 6477 -8958 1999 -3907 -3331 2783 -10163 6346 -11377 5325 -8410 1092 -2364
1011 -2364 -5280 3833 -9360 7165 -9657 6331 -5394 675 756 -5404 6382 -8466 8671
1024 8671 -7205 6467 -2203 1130 4221 -4071 9152 -6880 9735 -5514 6875 780 623
1037 623 6842 -4558 10310 -6322 10233 -3184 5788 2008 -474 7942 -5903 10402 -6000
1050 -6000 8624 -2623 2676 2430 -3332 7547 -7683 9552 -6381 5664 -3514 -355 2158
1063 2158 -6009 6561 -8801 6815 -8206 3425 -3213 -2303 2296 -8524 5784 -10268 5170
1076 5170 -8054 869 -1824 -4529 2541 -9579 5624 -9994 4605 -6139 -398 -728 -5053 4563
1090 4563 -8929 6804 -8378 5203 -3863 -111 2135 -4989 7355 -8018 8423 -5379 5063
1103 5063 -873 -5 5182 -4331 8627 -6080 8843 -3784 4657 1580 -683 7378 -4436 9511
1117 9511 -5594 8476 -2486 3928 3110 -1683 7698 -5371 8913 -4918 6268 -1031 1706
1130 1706 3232 -3641 6270 -6952 7654 -6145 4497 -1895 -1298 3080 -6789 6386 -8553 5774
1144 5774 -6449 1634 -1986 -4251 1986 -7980 5038 -9297 3852 -6401 -204 -1396 -5477 3677
1158 3677 -8400 5038 -8506 3347 -5056 -1296 285 -5421 5481 -8074 6025 -6511 3752
1171 3752 -2466 -731 3263 -4960 6664 -6440 7689 -4309 4426 521 -627 5345 -4559 8436
1185 8436 -5190 7194 -2005 3706 2434 -1293 7098 -4826 8941 -4150 6780 -1194 3007
1198 3007 3146 -2307 7103 -5104 8204 -4584 5259 -1113 486 3369 -4989 6688 -6401 6317
1212 6317 -5189 2998 -1540 -2434 2723 -6448 5621 -7569 4734 -5599 241 -1071 -4165 2881
1226 2881 -8099 4646 -7910 3271 -4725 -883 -711 -5129 4051 -7545 5070 -7211 2663
1239 2663 -3581 -1791 1074 -5906 4689 -7298 5535 -5273 2359 -1230 -1599 4018 -5078 6431
1253 6431 -5610 6201 -3671 2897 1784 -925 5938 -4047 7597 -4489 7550 -1416 3694 2886
1267 2886 -1625 7113 -4340 7868 -3849 6149 -366 1564 3819 -3340 6769 -6276 7316
1280 7316 -3786 2813 -712 -1483 3338 -5086 5699 -5829 4691 -4722 1353 -613 -3781 4114
1294 4114 -6796 3997 -7337 3504 -4547 -1610 -695 -4693 3366 -7672 4398 -6977 1772
1307 1772 -3764 -1574 1002 -5516 3990 -7620 4086 -6021 1848 -1756 -2770 2071 -5441 5471
1321 5471 -6425 4920 -3783 2308 116 -1662 4857 -5139 7153 -4348 5532 -1889 2176 2040
1335 2040 -1576 5999 -3837 7617 -3196 5352 91 1846 4000 -2113 7737 -3530 7178 -2770
1349 -2770 3983 600 416 4336 -3186 5694 -4196 5735 -2568 2621 -139 -2409 3494 -4617 4606
1364 4606 -6729 3556 -3902 -174 -10 -4752 2141 -6511 4013 -6526 1241 -4100 -1712 511
1378 511 -4892 3348 -6656 3703 -5203 1832 -2716 -2542 1377 -5347 5050 -6808 4037 -4852
1392 -4852 1312 -1030 -2455 2553 -5367 5014 -5324 4440 -2559 1503 1376 -2048 4288 -4843 6667
1407 6667 -3875 5110 -1204 1622 2863 -1337 6855 -4278 6837 -3248 4162 1168 952 3635
1421 3635 -2719 6620 -4040 5559 -1129 2727 943 -1544 3151 -4415 6245 -4087 4451 -2460
1435 -2460 1705 1543 -2744 3762 -5597 4538 -6211 2593 -3347 -1106 648 -4053 3305 -6218 3241
1450 3241 -5334 1019 -2297 -2110 735 -4949 3037 -6848 3467 -4401 1165 -1746 -1931 2247 -5381
1465 -5381 4548 -5528 2444 -3487 555 956 -3251 2784 -4599 4326 -4408 4127 -1796 775 2254
1480 2254 -1532 4911 -3102 5666 -3287 3234 258 312 3188 -2149 5542 -3049 5586 -2512 3384
1495 3384 2447 380 5249 -2178 5280 -3619 4297 -1655 934 1405 -195 4236 -4178 5344 -4035
1510 -4035 3940 -2044 420 950 -3590 3226 -5778 3702 -4953 1573 -2161 -2085 1657 -4738 2720 -6103
1526 -6103 2885 -4603 467 -1273 -2895 1166 -5231 3445 -5467 2872 -3772 -71 -119 -3486 2691
1541 2691 -4758 3685 -4809 2612 -2149 -57 952 -2912 4190 -4192 4275 -3087 3218 -424 327
1556 327 2816 -1738 5840 -3517 5198 -2467 3276 947 -139 3901 -2005 5755 -2685 5223 -1083
1571 -1083 2394 2065 -593 4127 -2656 5385 -3007 3824 -932 884 1407 -2644 3999 -3790 4745
1586 4745 -3498 2140 -1385 -814 1419 -3369 3426 -4678 3330 -3931 843 -1297 -2768 1293 -4684
1601 -4684 3207 -5575 2135 -3826 -46 -1422 -2965 1750 -5022 3249 -4989 2336 -2984 -472 249
1616 249 -3679 3196 -4299 3614 -3729 2364 -1099 -324 1743 -2682 4643 -3901 4886 -2785 2761
1631 2761 753 -501 3556 -2361 4799 -2643 4928 -1445 2258 1282 -414 4389 -2296 5166 -2727
1646 -2727 3914 -1114 1492 2121 -1296 3923 -3095 4396 -3105 3512 -618 -94 2081 -2183 3659
1661 3659 -4164 4095 -3497 1473 -1584 -1829 1664 -3826 2539 -4504 2629 -3363 818 -1093 -2627
1676 -2627 1464 -5117 2539 -5490 1645 -3344 -363 -640 -3598 1934 -4601 3037 -4755 2078 -2052
1691 -2052 -598 1114 -2445 2806 -3729 4067 -3253 2460 -641 -299 2494 -2968 4519 -3332 4806
1706 4806 -1900 2556 874 43 3743 -2206 5260 -2425 4469 -1070 1760 1567 -488 3862 -2386
1721 -2386 5296 -2427 3915 -345 525 2435 -2030 3955 -3436 4394 -2917 2346 -137 -587 2191
1736 2191 -3056 3266 -3750 3062 -2915 744 -720 -2010 1658 -4682 2572 -4731 2026 -2989 -555
1751 -555 -480 -2671 2275 -5217 2629 -4496 1237 -2785 -758 694 -3532 2672 -4701 2668 -3870 1358
1767 1358 -1301 -1116 1824 -3389 3192 -4312 3352 -2585 1568 263 -930 2887 -2572 4629 -3020
1782 -3020 3244 -892 1630 1833 -814 3931 -2773 5091 -2296 3947 -41 1384 2272 -1824 4074
1797 4074 -3009 4418 -1910 3226 389 551 3218 -2095 4367 -3232 3349 -2918 2130 -707 -1288
1812 -1288 2176 -3150 3934 -4026 2709 -2705 501 -407 -2526 2253 -4500 2830 -4127 1419 -2060
1827 -2060 -502 280 -3222 2264 -5496 2553 -4380 1058 -2243 -1167 688 -3648 2947 -4408 2688
1842 2688 -3475 469 -162 -1682 2184 -3044 3427 -2817 3328 -1403 1000 1018 -1133 3338 -2587 4579
1858 4579 -2218 4003 -878 766 2152 -885 4336 -2361 4126 -1780 3051 99 867 2330 -1778
1873 -1778 4142 -2866 4082 -1295 1940 567 -226 2657 -2444 3714 -3269 2846 -2054 772 389
1888 389 -1838 1989 -4072 2822 -4170 2272 -2677 -403 671 -2918 1787 -4539 2806 -3871 1098
1903 1098 -2279 -1092 632 -3221 2947 -3875 2479 -3644 152 -1271 -2180 1516 -2756 2359 -3479
1918 -3479 2576 -2055 1071 -264 -1869 2107 -3201 3844 -3237 2264 -1167 655 1566 -1305 3357
1933 3357 -2496 4405 -2343 3135 -382 911 2782 -1549 3993 -2160 4455 -1571 3045 911 540
1948 540 3185 -2073 4224 -2601 3888 -1797 1883 1180 -1158 2239 -2943 4509 -3452 2247 -1529
1963 -1529 78 843 -2479 2335 -3495 2566 -3788 1577 -1554 -832 723 -3666 2104 -4012 1930
1978 1930 -3481 687 -1878 -1358 1483 -3786 2522 -4888 2050 -2903 1061 -205 -2411 2197 -3536
1993 -3536 2911 -3583 2589 -2336 102 1193 -2023 2695 -3048 3891 -2493 2073 -501 722 2254
2008 2254 -2168 3964 -2750 4138 -1978 3392 473 -231 3356 -1672 4201 -2562 4095 -1051 1995
2023 1995 1084 -269 3445 -2544 3635 -2426 2857 -1399 1104 1534 -768 3119 -3496 3644 -3175
2038 -3175 2327 -1693 -311 1244 -2751 2096 -4043 3056 -3703 1049 -787 -1200 785 -3676 2582
2053 2582 -4555 1158 -3666 -131 -1100 -3058 1313 -3789 2237 -4234 1994 -2330 314 507 -2747
2068 -2747 2311 -3292 2768 -3038 1191 -1728 -200 1752 -2398 4089 -2705 3121 -2432 2035 399
2083 399 -558 2815 -1964 4094 -2955 3606 -968 1927 750 -127 2734 -2318 3986 -2175 3282 -159
2099 -159 1558 1241 -1117 3079 -2287 4042 -1991 2726 -745 215 1192 -2134 2950 -3508 3049 -2613
2115 -2613 1339 -705 -1501 967 -3312 2297 -4126 1713 -2849 316 -824 -1792 1811 -3046 2480
2130 2480 -4095 1228 -2112 -393 -643 -2543 1933 -3398 2952 -3107 1313 -1878 -154 757 -2314
2145 -2314 2212 -3305 3037 -2172 1540 -449 -331 1806 -1936 3478 -1086 3589 -2067 1506 207
2160 207 -74 3663 -1746 4199 -2788 3068 10 1828 629 -141 3006 -2138 3906 -1559 2562 22
2176 22 461 1925 -1205 3511 -2434 3531 -2362 1896 -15 -333 1436 -1732 3079 -3064 2175 -2713
2192 -2713 625 -381 -1754 877 -3260 1571 -3193 1553 -2189 589 98 -2493 1467 -3529 2362
2207 2362 -3240 1088 -1362 -301 22 -2967 1496 -3610 2068 -2355 1540 -1015 -1219 1072 -2458
2222 -2458 2583 -3167 2747 -1742 1072 235 -811 1921 -2234 3359 -2569 3148 -1653 598 1386
2237 1386 -339 3165 -1920 3374 -2006 2539 -199 745 1393 -1172 3362 -1197 4031 -2278 2078
2252 2078 -425 419 1588 -1720 3468 -2713 2792 -2010 1326 -669 -729 1896 -2665 3148 -3654 2134
2268 2134 -1049 436 -370 -2672 1212 -3428 1634 -3136 1130 -1405 -404 555 -2655 1670 -3504
2283 -3504 1905 -3024 367 -1691 -2497 649 -2798 2050 -3324 1989 -2337 444 -504 -1543 1507
2298 1507 -2029 2685 -2083 2046 -1750 1093 174 -1162 2333 -1810 3014 -1941 1893 -740 938
2313 938 1442 -1214 3400 -2081 2917 -1047 2017 424 772 2514 -1173 2942 -1819 2178 -863 1919
2329 1919 207 -187 2144 -1963 2783 -2380 2385 -1624 746 731 -1207 2192 -2479 2409 -2882 1618
2345 1618 -637 -865 197 -1738 1881 -2684 2017 -3527 600 -1075 -681 693 -3008 1460 -3037
2360 -3037 1376 -2743 426 -1399 -1102 642 -2943 2192 -2916 953 -1266 492 -199 -1517 1619
2375 1619 -1815 1789 -1571 2090 -633 -25 1435 -1152 2377 -1616 2434 -1290 1341 -247 -155 2416
2391 2416 -1106 2230 -1987 2726 -1399 1647 645 264 2191 -1870 2873 -1734 1984 -770 1042
2406 1042 780 -539 1919 -2164 2509 -2096 1815 -1195 291 291 -1754 1296 -2903 1857 -2162 985
2422 985 -1664 -715 183 -2086 1894 -3164 1586 -2175 594 -1108 -870 742 -2579 1641 -3155 1171
2438 1171 -2533 245 -66 -1567 1004 -2118 1755 -2734 1400 -1828 48 645 -1552 2320 -2032
2453 -2032 2279 -1581 1852 -156 286 1459 -1628 2744 -1256 2758 -848 2154 276 18 2401
2468 2401 -915 2508 -2112 2781 -1110 1245 927 -265 2331 -1642 2372 -2019 2150 -532 122
2483 122 1166 -1722 1915 -1925 2376 -2127 1476 -597 -1071 721 -1942 1783 -2076 1808 -1859
2498 -1859 1083 -1158 -425 1163 -2713 1395 -2911 1052 -1995 874 -399 -1469 662 -2583 937
2513 937 -2821 757 -1381 -286 895 -1259 1809 -2080 2130 -2148 959 -617 -244 247 -946 365
2529 365 -2557 1945 -1834 1184 -74 -368 2080 -1713 2580 -1605 1895 -613 1422 778 374 2208
2545 2208 -1850 3376 -2198 2701 -1225 7 524 -983 2100 -1391 2402 -1646 1940 -383 -963
2560 -963 1252 -1082 1494 -2282 1671 -1323 1051 -544 -751 947 -1949 1873 -2384 862 -1974
2575 -1974 12 -228 -1542 1227 -2076 1473 -2293 99 -2070 -698 290 -2510 298 -3135 1099
2590 1099 -2294 2007 -1493 -185 44 -1017 915 -2714 1475 -2261 -211 328 206 1597 -1205 1764
2606 1764 -1513 1581 -1094 639 250 1128 1767 -1151 2470 -1661 1918 -245 1088 1293 130 2107
2622 2107 -702 2197 -680 1243 -882 1943 1287 -997 2446 -2233 2184 -1464 765 -166 451 1064
2638 1064 -1610 1285 -2231 1659 -2222 184 -524 -1055 724 -2109 1205 -1947 1064 -1404 -235
2653 -235 -411 -1331 896 -2363 1729 -2180 907 -1041 -509 316 -1136 1882 -1804 1448 -1637 1134
2669 1134 -612 -320 771 -1558 1646 -1779 1363 -1015 668 229 -471 1644 -1095 2606 -1626 2009
2685 2009 -705 154 985 -708 2341 -1863 2004 -1200 1994 -15 589 1305 -240 2099 -1571 2216
2701 2216 -901 1208 -23 -623 1492 -1282 1972 -1375 1981 -1138 964 -140 -514 1307 -1430
2716 -1430 1480 -1453 1033 -939 -407 2 -909 807 -1876 1080 -1685 375 -1093 -914 241 -1716
2732 -1716 415 -2234 1560 -1756 300 -738 -658 101 -1719 1008 -2262 1099 -1419 366 -687 -584
2748 -584 610 -1718 1219 -1397 749 -926 238 291 -390 1243 -956 2194 -1231 1981 -147 536
2764 536 1674 -616 1861 -1145 2035 -1009 1227 89 306 1291 -636 1642 -1701 2118 -705 1011
2780 1011 69 -434 1289 -1543 1851 -1419 1340 -894 307 226 -806 1149 -1584 1850 -1751 270
2796 270 -760 -164 -68 -1436 915 -1733 913 -1573 462 -922 -838 247 -1805 1074 -1961 727
2812 727 -1158 884 -210 -961 -68 -1676 2024 -2468 1097 -1625 37 182 -33 835 -1827 1769
2828 1769 -1783 1338 -426 -74 1041 -889 2015 -1091 2122 425 1435 212 -403 694 -649
2843 -649 1925 -1513 1748 -1274 1291 -68 -156 1999 -858 1889 -1286 1641 -274 465 787 -373
2859 -373 1157 -1590 1620 -1262 857 -922 94 517 -1099 1500 -1203 1323 -1612 490 -1131
2874 -1131 -327 207 -1083 761 -2252 890 -1221 130 -520 -733 428 -1341 1420 -2146 1303 -1012
2890 -1012 442 531 -705 1065 -1565 1406 -1566 849 -857 101 144 -778 1450 -1004 1486 -1563
2906 -1563 1182 -470 159 1245 -759 1640 -1006 2058 -1010 1033 689 -86 1636 -1108 1620 -1032
2922 -1032 1528 -310 836 370 -700 1766 -937 1513 -990 861 -259 176 865 -405 1117 -1021
2938 -1021 1413 -1012 1183 -211 27 786 -1074 1361 -1447 880 -742 208 18 -823 531 -1578
2954 -1578 935 -1782 1145 -1706 157 -352 -355 1215 -1495 1091 -1656 870 -748 -81 37 -1117
2970 -1117 1154 -1634 1287 -1496 511 -1007 157 687 -1662 1503 -1339 1422 -1063 1135 263
2985 263 287 1136 -1017 1861 -923 1158 -592 549 538 -750 1155 -680 1820 -1085 1140 -249
3001 -249 720 437 -459 1599 -1063 1847 -777 1273 10 625 349 -1316 1186 -1753 1802 -1266
3017 -1266 264 -365 -280 640 -1279 1252 -1229 837 -994 -166 -221 -797 237 -1415 696 -1515 337
3034 337 -1349 -367 -176 -447 367 -1124 900 -1034 740 -306 -537 335 -817 886 -2014 2107 -1099
3051 -1099 376 -19 -448 411 -795 1448 -1033 1402 -665 803 275 179 816 -632 1613 -411 1495
3068 1495 -459 685 752 -180 2132 -778 1541 -949 1090 -321 672 868 -506 1505 -625 1788
3084 1788 -1290 140 -67 -541 776 -1205 1108 -1350 1238 -1046 246 -4 -440 820 -1621 591
3100 591 -1124 656 -1521 11 -312 -992 951 -1874 382 -1383 1125 -977 -517 -208 -1210 1008
3116 1008 -1272 1053 -1301 496 57 -273 821 -1309 728 -1166 985 -986 563 -82 -470 1264
3132 1264 -923 1416 -428 1788 -427 563 716 -690 1749 -791 1775 -1010 1295 -480 -146 875
3148 875 -385 1041 -647 1586 -783 738 -195 436 158 -1359 1350 -1447 1231 -501 772 -822
3164 -822 -958 352 -1222 459 -1834 1562 -1322 -191 166 -1013 738 -1990 1273 -1261 -306 -692
3180 -692 -1460 340 -1226 650 -2093 1415 -1142 64 -637 -456 585 -959 536 -1879 926 -920
3196 -920 -17 -419 -265 273 -1433 1411 -1239 750 -722 915 768 -522 1476 -1613 1501 -1213
3212 -1213 810 -353 699 393 -370 1676 -758 1423 -162 1272 502 243 442 -455 1535 -1012
3228 -1012 1357 -487 941 144 50 845 -1463 731 -1293 1453 -537 712 221 -902 735 -1113
3244 -1113 1156 -1021 362 -240 -191 127 -1237 686 -1613 633 -1176 569 -821 -748 446 -1459
3260 -1459 864 -1123 1024 -1166 -106 -517 -784 482 -1051 1105 -1184 717 -557 94 29 -328
3276 -328 527 -623 1052 -1138 897 -260 352 562 44 849 -962 1055 -628 706 -926 81
3292 81 1130 -556 1922 -472 1156 19 222 1037 177 525 -241 1552 -39 928 -994 754 234
3309 234 -388 863 -427 980 -1082 1005 -782 94 -107 -551 410 -870 493 -1081 769 -1180
3325 -1180 82 -53 -812 439 -1600 547 -1306 200 -550 -456 401 -844 649 -1872 702 -1250
3341 -1250 -153 -309 -567 645 -1293 923 -1248 894 -280 -101 -406 -1147 646 -1408 546 -843
3357 -843 637 -220 47 -181 19 951 -985 1123 -588 944 410 381 508 -65 1153 -260 1166 -127
3375 -127 593 744 -87 505 -802 1520 -681 639 -305 767 263 492 864 -1415 1579 -1514 448
3392 448 -726 -711 289 -392 229 -801 593 -901 7 -773 -563 875 -611 403 -1574 434 -941
3409 -941 182 -148 -587 -264 -1050 1122 -1330 891 -721 488 100 -731 716 -873 516 -510 656
3426 656 -449 201 295 -303 1041 -729 849 -344 534 0 270 841 -203 1321 -830 818 -417
3443 -417 757 -497 210 828 -514 1253 -608 1187 -365 991 58 4 716 -509 735 -827 422
3460 422 -419 -49 798 -63 673 -728 1164 -1193 382 -619 -1136 -214 -661 1231 -455 423 -844
3477 -844 322 -664 -1290 -191 -805 538 -1176 367 -823 -724 99 -1004 -91 -1529 660 -749 192
3494 192 -380 345 224 -458 522 -1216 1097 -961 295 104 -155 571 -252 834 -856 539 -445 676
3512 676 182 -292 1138 -479 1338 -733 1297 -435 98 108 -215 1340 -646 1041 -870 812 -385
3529 -385 342 183 -395 1333 -1132 465 -372 747 241 265 -241 -820 849 -554 666 40 268 40
3547 40 -135 -379 -1047 536 -1108 948 -795 786 -75 -134 665 -1291 831 -1299 710 -763 -156
3564 -156 65 -884 594 -786 911 -1083 795 -187 291 507 -95 833 -817 695 -63 421 30 409
3582 409 681 -572 1033 -393 999 -304 543 835 -170 114 -732 1023 -1085 759 -219 952 141
3599 141 -217 823 -312 909 -808 631 -297 78 -359 -762 1085 -763 672 -872 436 -528 -312
3616 -312 763 -405 881 -574 732 -15 72 67 -299 648 -827 635 -1027 349 -765 -78 285 -631
3634 -631 1526 -998 1081 -1723 -490 -705 -40 74 197 638 -718 741 -188 119 -293 381 323 -116
3652 -116 610 -800 708 -133 607 37 -213 1125 -203 1086 -639 943 49 663 412 -473 1094
3669 1094 -381 928 -580 274 187 394 135 -483 743 -498 685 -485 273 214 341 662 -812 751
3687 751 -891 399 -844 211 24 -616 1290 -227 1027 -1276 557 -637 32 -252 -537 382 -696
3704 -696 673 -434 22 -420 -444 487 -1097 920 -1198 111 -735 332 -600 -811 275 -1185 381
3721 381 -218 1013 -478 177 -63 -687 2 -609 911 -672 722 -274 -608 51 -57 527 -999 749
3739 749 -635 498 100 453 290 -450 745 -327 224 313 694 52 -292 458 -666 1568 -624 728
3757 728 -550 248 -171 -496 654 -391 472 -657 78 -796 638 702 -74 1231 -779 820 -1361
3774 -1361 -367 -411 -273 -305 177 523 -625 196 -865 179 -374 -551 482 -1018 933 -941 -194 -1342
3792 -1342 -162 -408 -366 420 -1710 790 -330 981 -130 430 882 -867 613 -678 584 -349 1147
3809 1147 104 825 575 302 1252 -168 1493 -1359 728 -206 92 130 -468 1404 -224 779 -576
3826 -576 462 115 193 448 -191 577 -456 752 -505 898 605 -279 842 -871 1406 -652 274
3843 274 -41 21 657 -425 222 -406 1107 -657 485 -317 -290 310 -604 966 -498 462 -1083 -368
3861 -368 -47 -115 718 -907 1083 -1207 434 -74 367 -86 -242 508 -828 473 -784 362 -328 -504
3879 -504 408 -26 971 -574 591 -315 754 -53 48 321 -321 1110 -1080 680 -474 672 -41
3896 -41 143 563 -554 873 -219 2 -211 312 264 9 530 -38 722 -548 652 -230 527 388 -873
3915 -873 472 -847 85 -403 20 -666 -24 326 -665 398 -1363 107 -1407 248 -473 -167 509 -1008
3933 -1008 446 -575 327 -384 -116 -224 -398 158 -457 436 -994 957 -270 569 278 -472 277 -460
3951 -460 -43 -298 468 -119 -280 506 -368 705 -361 763 -368 324 -249 -141 601 224 829 -584
3969 -584 885 -731 58 147 40 628 -454 699 -503 323 -154 -174 361 -115 511 -792 626 -787
3987 -787 512 -489 177 537 -1210 1265 -796 670 -1026 310 -832 -236 162 -592 680 -1255
4003 -1255 393 -990 15 -543 -405 -181 -862 611 -628 196 -77 407 124 -945 620 -537 856
4020 856 -393 693 -587 420 198 -486 252 -816 1240 -695 580 65 -183 226 -176 856 -246
4037 -246 675 -136 44 186 -800 676 -705 326 -113 880 -64 357 383 -342 48 -1040 833 -400
4055 -400 378 313 152 401 41 448 -760 1218 -703 261 -292 -27 245 -473 92 -885 583 -503 -154
4074 -154 -294 -179 -50 -712 310 -985 238 -349 -282 -594 -455 732 -68 382 -771 174 -284 -201 -463
4093 -463 -801 -2 -795 365 -971 607 65 291 397 -278 721 -825 403 -361 318 27 -364 1033
4111 1033 -851 819 -288 747 -76 160 324 -654 771 -543 836 -433 207 -52 87 283 -433
4128 -433 666 -404 495 -735 -31 -641 -62 576 -618 1182 -450 1087 -328 184 128 -490 888
4145 888 -674 656 -990 618 -170 241 571 -621 477 -1085 106 -1054 350 -626 -420 236 -581
4162 -581 932 -303 338 -457 -295 -229 -518 249 -511 534 -424 497 -591 305 428 -243 736 -323 738
4181 738 -732 687 66 548 918 -143 715 -793 718 21 764 242 4 748 -590 302 -597 528
4199 528 196 173 -253 403 195 -298 668 -597 478 -84 134 328 -735 5 -582 -138 -757 237 -480
4218 -480 292 -358 -683 371 -646 503 -448 126 -388 -171 -295 -671 531 -853 534 -892 43 44
4236 44 77 453 -399 425 -211 240 -1199 28 -30 -296 467 -356 425 -389 10 -543 -64 18 19 441 -445
4257 -445 216 -485 572 -113 45 101 194 1160 -85 746 -544 780 -63 179 506 -10 1115 -398 490
4276 490 -365 569 -16 -279 -5 -318 563 -421 89 -241 709 216 383 203 -492 579 -700 -36 -570
4295 -570 81 580 -1018 345 -257 193 -629 -185 132 -198 -180 -620 -192 -105 1163 -860 641 -157 -175
4314 -175 109 -466 552 -652 768 -479 160 -183 -301 335 -745 556 -386 -179 37 215 100 -715
4332 -715 1171 -794 624 -515 -136 148 -25 888 -451 1046 -88 1084 -136 746 162 -405 631
4349 631 -238 558 -435 769 -296 -88 162 -108 412 -593 286 -205 358 -49 -140 408 -575 210 -381
4368 -381 -97 -573 26 -596 127 125 -458 43 -161 414 -718 -341 98 31 217 -551 343 -795 328 -328
4388 -328 383 174 202 -173 206 427 -181 855 -455 156 -127 -705 299 -690 1388 -579 125 -231 -121
4407 -121 890 -1087 935 -742 548 -540 124 -96 -117 315 -245 300 3 524 348 195 220 -404 696
4426 696 -365 506 -703 656 87 595 -176 -47 937 -110 432 -217 369 -51 -152 811 180 319 -278
4445 -278 429 -956 202 -570 -14 1 -1140 593 -871 1068 -532 -340 575 -357 -95 -147 302 -85
4463 -85 436 -57 557 796 -436 121 -642 796 39 162 76 -70 636 -64 104 -348 818 421 195 575
4483 575 83 841 -235 -70 -136 904 -122 -215 -459 634 344 -530 231 -680 488 -39 213 223 218 899
4503 899 -744 678 -82 69 117 72 232 -413 -442 -347 327 -314 -228 289 -504 571 -536 40 -474 408
4523 408 -12 -230 -97 -299 -1 -721 830 -473 22 -622 -560 74 -356 385 -289 -55 -413 283 327 -590
4543 -590 183 -30 356 -428 116 -524 -86 -988 -129 -132 58 421 -288 391 -267 182 239 63 -161 -32 -91
4564 -91 37 695 -111 355 389 6 211 131 170 -379 764 196 296 1156 68 337 -266 520 -276 -453 -211
4585 -211 -933 -192 -271 334 -1087 761 -239 -371 -68 -559 879 -924 504 -434 91 -243 -160 113 66
4604 66 742 -820 332 -403 -108 -491 -285 17 -86 -116 -266 605 221 497 -372 -82 47 -426 -340 -165
4624 -165 321 -441 12 213 -438 617 -533 925 -239 -41 -825 -133 268 -523 767 21 302 -352
4642 -352 1026 -924 336 96 90 404 -422 343 -238 281 287 677 629 -5 69 -96 235 -244 662 -39 -235
4663 -235 496 -18 549 253 717 81 8 -25 -303 31 -401 834 -740 268 -43 116 119 -524 845 -846
4683 -846 89 -820 503 -665 -347 -188 -45 195 -652 -250 -117 -67 292 80 -143 -851 -38 -182 -202 53
4703 53 593 259 425 176 -739 84 -819 642 1056 109 612 -918 1031 -91 114 -449 698 68 136
4722 136 160 48 247 -573 503 -217 696 -40 71 474 85 239 -282 -149 -252 -148 -383 617 529 20
4742 20 144 -899 112 235 745 228 -77 183 -752 147 -363 -46 -282 -817 -168 -559 311 -755 180
4761 180 -585 315 -307 210 34 -772 -143 -370 288 38 40 173 -554 385 -605 251 -458 322 263 -288 852
4782 852 -485 312 -257 202 168 -135 -195 529 -155 -371 368 -28 12 -86 458 192 -60 646 -471 -219 292
4803 292 465 -205 933 -510 -407 -985 -745 708 -350 159 196 365 433 -7 678 -407 311 -406 -186
4822 -186 177 -41 -2 -484 163 -839 435 56 516 -217 -191 547 31 487 -199 -187 -541 -43 186 -50
4842 -50 235 -417 51 -445 96 -494 -10 383 -589 277 24 568 -48 158 -402 -179 -409 -195 41 -479
4862 -479 -37 116 517 -136 -439 560 -444 668 -81 58 281 587 330 -113 199 -450 527 -9 365
4881 365 -619 -240 310 322 104 -10 526 -665 78 -226 355 506 -254 301 -604 -66 -84 13 229 -357 206
4902 206 -226 363 -60 53 443 367 -266 -246 327 -226 259 -127 -43 -117 310 -517 -353 388 -563 160 -636
4923 -636 283 -240 86 40 121 495 -387 147 -689 716 21 162 329 -16 149 97 693 225 162 531 263
4944 263 471 -189 683 -285 188 68 -389 238 -342 280 -264 49 588 348 300 -163 237 -384 139 -376
4964 -376 -87 -85 -135 608 -32 111 -413 179 -551 221 146 -45 -344 -313 154 -380 132 -384 -27 -113 64 -107
4986 -107 -641 24 -373 387 78 638 -758 368 92 -235 246 -316 899 159 -110 -419 -145 -11 221
5005 221 45 -484 288 -10 -175 47 -238 -254 -155 -141 -463 -143 537 -50 768 341 -187 -66 182 288 329
5026 329 530 201 417 -393 412 -482 -220 -456 -177 66 -3 -28 -111 757 -139 451 315 456 104 -168 -245
5047 -245 -603 984 -200 280 -229 -256 -437 318 723 187 427 -1402 -24 -678 144 -779 -323 5 260
5066 260 371 -184 -258 164 9 -169 147 631 317 244 -585 228 142 -12 277 191 -91 -154 -158 -22 -627 -54
5088 -54 -73 353 -129 594 -292 -26 -152 -86 596 -288 -324 -477 779 425 55 -456 333 4 156 90 -193
5109 -193 180 651 -321 -308 -408 -86 -317 336 -329 245 672 -811 497 -642 -99 -552 -235 -1086 -834
5128 -834 -598 326 429 440 142 -204 -349 -418 -492 -232 -10 -362 -204 388 66 -28 -489 -312 344 296 -147 -303
5150 -303 12 -547 -129 213 294 155 -610 381 -592 -501 -496 -205 299 12 408 289 191 -266 -118 80 500 -231
5172 -231 -190 -99 -60 159 -173 391 87 -91 473 329 199 -444 265 -634 185 -451 -206 -148 84 -75 -150 -297
5194 -297 -613 179 -311 86 -150 202 -134 -649 -364 461 499 -509 -370 -722 -189 204 301 -209 -63 -37 -19
5215 -19 -188 142 -180 -80 90 -229 80 209 -391 -158 215 168 322 -1007 -52 0 276 -346 204 142 -547
5236 -547 100 -108 -265 -474 -116 -172 232 250 -453 540 -139 223 60 2 135 -437 436 310 -438 -196 54
5257 54 71 -60 -78 -366 62 2 3 165 238 567 -185 -88 -412 -548 -148 597 -190 128 791 169 -99 -629 789
5280 789 -307 65 161 -12 96 199 -190 24 48 -290 -122 442 -322 665 361 -521 -151 -92 -77 -122 -99 96
5302 96 251 -281 378 -288 18 127 147 174 -192 662 -442 186 -219 379 33 -101 496 -682 -30 -175
5322 -175 237 -60 164 127 -675 129 88 892 -169 -39 -185 -31 183 116 28 -176 436 -59 -182 143 98
5343 98 487 -1034 74 -410 591 -470 306 -165 -447 355 -262 376 87 633 -583 -138 -331 -404 -93
5362 -93 -550 -266 -925 -208 -440 -113 -6 -502 401 2 72 -256 219 131 -201 436 103 -189 -564 -66 2
5383 2 116 33 -145 -39 -164 157 32 236 -642 113 -180 405 132 -90 161 -172 850 -58 -20 23 -175
5404 -175 96 -23 125 51 420 -584 -91 587 -306 202 -292 136 -149 436 -71 190 217 -586 -183 -31
5424 -31 431 562 325 122 -195 232 -550 -60 26 308 -574 -51 -22 -272 306 -504 -56 -150 -321 228 -141
5445 -141 2 -907 363 -4 306 -244 116 67 -103 -456 178 123 -351 234 -242 73 1086 -340 174 -108
5465 -108 67 289 641 -593 -171 61 -453 19 685 470 -298 503 -53 443 -459 389 -89 -646 -222 308
5485 308 -457 184 847 1049 -14 71 84 846 378 768 300 -953 -161 -445 237 -103 924 -587 -116
5504 -116 -107 -424 -391 -741 1614 -93 93 -118 2 588 -325 -510 -25 219 713 267 460 -191 565 -313
5524 -313 557 -494 126 74 224 330 -160 -95 -359 678 64 77 -349 -114 98 311 541 -91 -153 558 398
5545 398 312 537 341 11 -468 -186 590 -5 126 -530 -297 -427 98 587 -410 290 331 -644 -436 698
5565 698 893 -372 118 -89 852 -88 -324 137 531 1280 -227 -659 -170 685 -1766 1081 -351 -1207
5583 -1207 383 384 54 295 -98 70 -163 -356 -623 -266 -486 488 -263 -286 428 -835 -51 -682 303 514
5603 514 -564 -41 -116 -424 -483 175 -121 90 430 985 -51 524 767 -484 -88 -136 718 176 507 -92
5623 -92 331 -165 218 -20 -687 185 91 -190 19 95 -136 -277 -365 -379 160 418 -255 719 -147 -94 356 125
5645 125 484 176 -295 -354 -15 -153 -211 -300 -251 -332 188 108 483 -289 -530 512 -567 1060 -1062 -313 50
5666 50 -242 -125 227 334 -166 -947 -335 -88 -199 515 -101 311 148 -84 -798 -52 -389 -472 -499 244 -140
5687 -140 20 -584 130 353 -287 -92 67 281 167 -33 98 -960 265 569 350 527 335 -436 590
5706 590 144 -439 -152 -519 -504 -396 96 -32 -136 -139 -21 508 -564 97 -163 621 294 -285 119 -349 -611
5727 -611 -395 679 -165 670 1048 456 251 44 17 339 -423 -537 270 401 -634 -411 33 70 -421 29
5747 29 -247 46 -398 -137 -43 -302 -403 -2 74 -67 -209 89 308 19 -568 334 -921 55 -638 629
5767 629 -207 -393 640 -34 -81 575 -83 276 287 -496 319 -222 -32 250 -473 -303 379 162 -296 160
5787 160 14 -46 -176 102 70 399 157 13 -580 -144 386 -33 -229 -221 294 -77 81 -429 193 -250 -68
5808 -68 202 -230 -308 -583 141 147 -10 -302 -380 49 195 169 134 -325 107 -1088 -278 109 1231 -115 -211 -107
5830 -107 452 -704 -7 453 173 -127 -80 148 -442 -108 -141 1057 -554 110 76 -673 -431 -312 393 25
5850 25 -1 555 -212 -175 559 1097 524 -594 387 547 -31 90 -696 -444 -14 23 482 -589 -791 206 -646
5871 -646 -834 366 -57 793 310 83 -127 -462 -208 264 172 406 43 -174 -317 -389 -245 -297 281 -408 -306
5892 -306 -539 -29 369 -322 374 -809 471 -674 -26 849 331 393 -593 320 88 -253 73 504 -28
5911 -28 382 168 -546 -683 -81 -512 -1 589 194 550 184 -143 -279 -243 -302 774 -452 117 -222 570
5931 570 308 318 270 109 -379 245 392 -352 11 678 -390 -833 -377 861 -339 144 -60 63 -68 52
5951 52 511 -1185 -151 -889 191 -764 -509 -245 408 -543 573 -120 120 1023 -451 17 -409 -498 -355
5970 -355 -588 -791 -751 -109 -302 -397 50 435 -790 -118 530 77 -137 -323 21 1644 -51 324 -401 611
5990 611 419 -235 -187 -327 93 162 -69 83 135 -622 147 713 338 -143 422 372 -316 -90 -557 88 -491
6011 -491 525 -492 -141 -526 -269 869 23 -373 30 101 -332 303 390 78 142 -43 -241 -118 -137 640
6031 640 -638 435 -12 598 89 106 -93 487 -178 -126 -232 -108 111 -28 -234 93 -94 -25 -345 -302 -98
6052 -98 -253 -431 665 185 -206 -18 -182 -347 -610 238 -549 -192 6 149 123 -482 246 -320 505 -24
6072 -24 33 -135 -384 159 -437 98 132 33 154 155 298 -450 225 -23 300 -183 191 16 -296 -33 359 -88
6094 -88 -148 141 329 274 -328 -98 162 -654 -15 634 39 -325 -319 -6 -302 96 34 -316 8 -6 -227 -13
6116 -13 -277 -76 -495 173 42 94 -554 -153 539 -30 -154 396 -61 -73 -59 99 -234 -297 67 -175 -102 -44
6138 -44 -758 -254 -132 59 -359 353 -65 -221 -55 47 -3 38 533 513 102 384 328 -50 -398 160 467 365
6160 365 -45 413 -472 73 81 27 -37 -186 86 -264 321 -219 138 57 209 12 -219 621 119 -130 -136 47
6182 47 -160 -722 752 336 98 -138 147 -325 287 -302 335 720 -242 382 -48 -343 -299 16 -257 -150
6202 -150 44 -121 165 -538 -174 -11 -16 144 -306 43 249 -285 47 -1042 343 -2 412 -416 -73 -194
6222 -194 120 340 -78 123 -352 170 -399 -228 -223 -327 80 -270 -302 -648 5 -426 -285 -516 -244 190 -267
6243 -267 532 -12 -361 74 -646 -412 -52 -165 191 -342 -332 489 243 -108 94 301 -89 38 -17 -49 473
6264 473 -525 -160 281 603 -475 393 121 -212 -331 203 425 -129 23 -206 300 443 -336 139 160 74
6284 74 -134 -262 -148 507 117 -390 6 -298 -116 -293 -44 -17 -101 181 188 204 -185 -156 -300 -448 -69 -19 23
6307 23 -79 -360 -186 -437 -38 -628 69 -728 170 424 -332 -25 -557 403 277 -128 -246 149 -168 -46
6327 -46 -123 -85 125 -134 467 -43 104 -139 -192 -20 141 32 248 143 -196 -237 584 -262 103 318 -342 277
6349 277 76 -472 -503 -56 -269 -244 -305 51 -134 -316 -49 -61 261 -101 105 -53 159 -17 218 124 229 -273
6371 -273 114 114 205 -236 80 261 -170 -215 84 342 222 -96 156 72 330 -88 -619 315 61 -402 344 812
6393 812 -116 110 -63 -335 796 264 38 377 -180 100 111 94 61 -261 -398 -1 -21 394 47 -85 -55
6414 -55 -500 -539 259 154 -168 440 306 621 160 -53 -132 -260 122 -67 -87 -38 -590 535 -357 47 195
6435 195 45 -82 173 522 76 -215 -540 139 -54 -216 163 -435 34 -411 42 114 512 512 -217 -118 295
6456 295 -23 193 -364 -538 438 -430 561 -456 415 -70 361 195 -413 378 97 -62 -682 -1040 31
6475 31 202 -119 -193 -476 -144 -383 227 357 -245 -9 -289 489 615 156 -451 62 447 206 -248 198 610
6496 610 246 -554 215 265 380 -3 100 -192 63 -370 8 77 528 -72 81 -170 76 196 -96 117 -137
6517 -137 900 -32 71 174 -113 458 15 -386 376 112 -581 109 -152 -1167 390 641 469 141 -140
6536 -140 -425 -28 1124 306 682 175 320 -256 -18 -120 -678 39 74 -435 -78 284 -565 44 481 26
6556 26 -428 -1066 -335 -281 -228 1066 528 420 -492 224 238 193 -159 -140 273 253 -571 -173 -762 681 102 135
6578 135 42 760 -952 5 -229 393 -613 315 172 46 -59 -911 240 -91 271 479 -8 -187 -172 -501
6598 -501 -372 -293 -733 144 115 67 -65 177 -986 566 490 -399 1030 -139 -12 617 -103 -135 122 14
6618 14 -247 -213 330 -495 387 239 251 396 432 194 181 -76 465 -165 -353 -156 42 -330 -160 -107 -7 -363
6640 -363 -85 636 475 -385 146 -252 -48 -134 357 251 348 -596 251 114 -103 230 -34 174 -193 368 -596
6661 -596 129 315 108 267 -49 95 68 115 -27 69 97 -56 147 -341 -54 -86 -334 -305 -639 -400 -231 386
6683 386 -282 -600 727 -11 280 92 -306 -396 513 -840 -657 271 -114 322 -423 -416 -129 -371 -125 -369
6703 -369 -208 -45 165 5 201 367 174 -305 -106 569 417 -340 -290 179 -57 539 576 96 -164 413 -5
6724 -5 256 86 264 -75 -201 -365 419 502 338 49 -259 441 -127 100 32 62 136 554 419 544 139 271
6746 271 8 463 16 -505 -87 -518 519 367 -33 147 65 41 49 112 72 169 147 -172 320 279 -495 -209 -125
6769 -125 -202 305 217 30 504 272 -440 128 -253 -112 -170 -7 -134 229 -165 287 -306 -270 -169 -74 -139 -394
6791 -394 376 -12 -500 142 -175 93 -529 368 300 -488 -162 -271 -410 -501 -276 345 148 152 -160 37 -514
6812 -514 -35 266 70 353 270 -180 216 250 -310 638 -346 68 389 -301 -82 306 308 228 -42 355 -166 77
6834 77 -86 38 44 -237 244 497 -506 124 -21 -289 570 250 -12 -415 -242 208 361 -56 126 -203 202
6855 202 189 -196 -269 282 34 -154 -222 257 -562 -212 99 14 30 729 185 63 300 -219 -223 -132 -367 35 -754
6878 -754 183 119 337 8 569 358 -1259 743 13 -25 251 -415 142 264 -1104 -263 440 -320 94 -479
6898 -479 380 -5 -443 134 163 -196 -422 235 -561 -198 -559 -249 122 -393 430 -461 -1365 -64 -904 804
6918 804 199 -556 131 644 -913 -850 -91 -215 -46 -384 -282 421 509 -24 349 661 90 -363 -164 -46
6938 -46 -240 10 -428 -356 -315 244 -345 -123 -96 523 580 -555 93 -153 215 102 -175 -153 -138 -160 140 342
6960 342 344 71 -62 131 -6 21 -245 -176 -364 -222 -483 -307 -89 -112 -199 412 181 68 416 -100 546 160
6982 160 -454 -767 95 599 -789 -513 328 -131 264 124 70 427 -380 -94 13 80 58 76 261 -414 351
7003 351 -93 482 -346 -169 -148 423 -412 -271 89 -13 2 418 158 329 163 381 -118 243 263 268 304 -573
7025 -573 -145 -186 243 192 267 -422 -97 -802 -70 514 -266 -221 -241 -288 -486 -27 77 36 -196 -221 -605 -84 -243
7048 -243 -74 -76 22 29 -332 -41 -317 -141 -328 -84 -59 -189 -331 186 -55 -72 16 166 530 316 332 148 390
7071 390 89 90 -34 679 -108 -98 -157 411 26 -178 52 86 -670 254 362 296 302 435 233 -284 299 -361 -1
7094 -1 -380 36 198 -227 -639 252 247 242 -167 -162 -74 -181 -241 -157 110 -153 -385 -60 72 -77 168 -189 -98 -68
7118 -68 171 -243 186 -98 -148 143 77 -183 -468 485 328 -291 -291 -66 -125 -385 -36 239 45 279 -191 -379
7140 -379 35 -68 21 500 -300 -540 -96 -455 135 -77 -4 -385 193 24 -123 137 -130 111 306 14 205
7161 205 394 -94 195 648 -560 88 607 517 149 657 473 90 874 -564 -855 -63 -426 139 215 -427
7181 -427 -451 -38 602 -615 -154 -238 206 584 202 400 88 -22 241 -158 31 -434 -333 -308 104 -175 -144
7202 -144 322 -82 -202 -156 -216 -210 -149 -228 -134 394 -376 110 -629 204 317 -389 220 142 176 -142 -14 -135 374
7225 374 54 -300 131 -268 -21 51 -387 194 -49 612 17 -393 -198 21 -313 225 466 220 -456 -552 -292
7246 -292 -27 217 -290 -76 -22 -207 36 -308 40 170 -23 61 -285 89 -55 -116 -39 628 -474 -96 -44
7267 -44 185 -98 520 50 -914 571 -834 479 -295 -381 -401 -321 -372 512 282 -26 211 51 -92 -147 115
7288 115 -481 -429 295 471 255 155 -573 193 464 173 -197 192 358 240 30 -87 383 379 350 -185 383
7309 383 48 175 1 -83 41 -282 -161 358 84 -281 -471 -89 175 177 -201 -70 -150 -195 -34 -163 -52 2
7331 2 223 -123 -277 -290 -196 308 -5 -53 -431 -20 -242 -85 -8 80 229 -830 122 -495 188 439 209 -273
7353 -273 -327 468 -554 552 122 176 -706 -1 -618 -74 108 -257 442 -423 71 -263 -267 -256 258 165 -147
7374 -147 260 163 4 143 -35 315 266 -244 449 71 -166 87 -226 -202 456 202 -331 -28 59 238 -366
7395 -366 148 -149 76 437 -95 118 -360 -18 -372 804 -49 -51 111 220 -80 -77 -606 -547 -97 261 214 191
7417 191 117 -231 -360 459 177 -364 -17 330 180 222 651 -428 193 171 482 126 55 -377 -214 -77 80
7438 80 -564 763 57 -641 -44 -353 274 -231 397 -145 -134 1048 -33 6 97 390 -355 85 397 -63
7458 -63 448 378 -62 -49 136 -166 -53 236 -295 215 50 245 -117 -183 354 -334 -25 239 184 -319 200 -283
7480 -283 -400 -209 -339 573 -491 2 -465 715 638 -244 717 220 156 -53 -274 95 -172 180 -544 311
7500 311 -367 -404 117 516 -370 19 -293 -226 128 5 -167 -475 -25 -416 -511 84 81 269 51 258 230 -357
7522 -357 154 -410 514 -540 -34 164 536 626 130 159 -645 283 -361 465 36 -481 -140 256 289 -65 75
7543 75 -186 -114 -126 25 -351 -524 428 271 -218 400 266 -114 -404 -640 -194 44 170 490 -62 131 -74
7564 -74 -248 -114 -504 146 113 709 -77 -420 284 -86 -216 -332 411 -404 197 -331 -89 32 -1 108 -67
7585 -67 194 -187 -241 402 199 76 -233 -58 -153 246 -149 -96 527 -153 229 4 310 -312 457 -239 384
7606 384 304 48 384 -181 -68 -220 -58 -44 133 399 -363 -118 -111 -472 419 267 -250 356 339 -63 756 1047
7628 1047 270 1 183 585 -14 457 -112 529 16 -360 -161 -125 43 348 639 -114 115 75 -63 -361
7648 -361 673 -492 174 -17 -128 438 -89 24 -9 -178 -550 38 -419 9 -362 251 277 -419 521 -61
7668 -61 322 -66 43 376 -313 -475 321 -47 -1 -369 -54 149 54 -210 -151 -602 272 4 452 256 -540
7689 -540 357 -44 674 158 242 659 -84 143 453 762 -184 -766 460 392 98 -367 192 128 -46 -403 78
7710 78 -249 203 -58 26 -380 -118 -37 236 -303 -486 -334 490 -224 317 -312 -183 317 -154 80 -139 -151
7731 -151 -35 91 34 -149 295 -573 63 -442 -228 -153 509 222 -671 -5 -258 548 -165 -470 -436 223 -128
7752 -128 731 87 -564 -422 -165 -452 107 -112 490 719 -1000 -372 194 8 760 -234 -9 196 -102 145
7772 145 24 63 69 37 176 305 46 115 702 -199 87 -324 141 102 403 -19 79 263 -41 750 -119 -178 -633
7795 -633 -198 -708 498 387 -137 -426 -270 222 -218 -136 -139 -317 -136 -680 41 -404 -143 120 51 525 41
7816 41 300 250 255 -174 -5 828 -55 268 287 498 -66 -170 -135 168 245 -129 31 346 -106 -8 140 -193 -61
7839 -61 104 -90 -175 -618 37 -394 530 -519 -377 353 348 159 26 -56 -148 -325 225 -198 111 -89 273 -361
7861 -361 91 194 -233 207 40 349 -283 286 153 -494 -207 -79 -351 135 -263 -80 -34 291 42 -229
7881 -229 19 -116 -18 623 -243 624 -289 -309 127 185 -279 181 600 341 223 -5 288 279 910 -292 -49
7902 -49 778 -226 861 366 143 313 -281 93 671 -499 -290 -247 -82 -24 400 226 663 -236 177 219
7922 219 -443 -333 -208 -106 -172 -416 44 -254 264 510 305 122 -47 -150 532 -261 -323 -32 166 195 -118
7943 -118 187 -941 -72 -41 72 -73 18 170 -664 15 97 -246 -579 -289 384 -10 -335 -539 -444 41 221
7964 221 -315 12 218 -284 612 537 99 8 -36 6 11 582 -12 234 -226 260 -137 -176 192 -69 86 -102
7986 -102 396 94 -178 124 232 383 -765 595 182 408 -57 -247 30 -207 410 -174 263 -120 61
8005 61 -100 274 369 -700 -249 197 34 -37 -156 -145 -296 26 -102 -296 -668 332 -247 -312 535 -92 -291
8026 -291 -126 25 -448 -102 -138 -327 302 316 45 -118 325 49 278 -582 -243 571 -140 103 -87 187 -469
8047 -469 162 -192 584 -387 -498 301 423 -66 -312 -759 707 -131 572 -1068 -425 -760 403 750 601
8066 601 -348 603 129 -291 306 487 533 -98 329 434 333 729 -779 -93 -148 241 185 -40 -737 470
8086 470 -520 350 -87 -239 315 118 152 -320 -483 227 99 -128 -187 -27 -52 -89 -210 530 -237 214 209 -369
8108 -369 -224 -221 669 445 -322 -172 -136 -195 -34 -22 -395 11 -52 160 -20 -234 -184 -51 376 -177 -334 527
8130 527 -850 114 -37 320 -303 -46 -337 63 -292 -164 643 -333 -424 173 398 305 -10 319 -449 92
8150 92 263 -250 -7 -320 363 -137 -199 -210 36 15 -163 176 -412 319 1 389 -517 -292 444 326 8
8171 8 3 -158 -213 -118 140 98 -249 -195 421 660 -373 -392 -182 -44 -248 -295 184 461 -95 353
8191C53
##END NTUPLES=NMR FID
##END=
