##TITLE=1H_Pr 5009
 CDCl3
 8 sc, 
 21.10.2022
##JCAMPDX= 6.0         $$ Bruker NMR JCAMP-DX V2.0
##DATA TYPE= NMR FID
##DATA CLASS= NTUPLES
##ORIGIN= UXNMR, Bruker Analytische Messtechnik GmbH
##OWNER= root
$$ XWIN-NMR		Version 3.5
$$ Fri Oct 21 14:36:45 2022 Russian Standard Time (UT+4h)  she@DPX200
##.OBSERVE FREQUENCY= 200.1313499994
##.OBSERVE NUCLEUS= ^1H
##.DELAY= (6, 6)
##.ACQUISITION MODE= SIMULTANEOUS
##.ACQUISITION SCHEME= undefined
##.AVERAGES= 8
##.DIGITISER RES= 18
##SPECTROMETER/DATA SYSTEM= spect
##.PULSE SEQUENCE= zg30
##.SOLVENT NAME= CDCl3
##.SHIFT REFERENCE= (INTERNAL, CDCl3, 0, 15.7039)
##AUDIT TRAIL= $$ (NUMBER, WHEN, WHO, WHERE, WHAT)
$$ ##TITLE= Audit trail, XWIN-NMR		Version 3.5
$$ ##JCAMPDX= 5.01
$$ ##ORIGIN= Bruker BioSpin GmbH
$$ ##OWNER= she
$$ F:/spectra/data/she/nmr/H-F/1/audita.txt
$$ ##AUDIT TRAIL=  $$ (NUMBER, WHEN, WHO, WHERE, WHAT)
(   1,<2022-10-21 14:35:40.17 +0400>,<she>,<DPX200>,
      <created by zg, POWCHK disabled, PULCHK disabled
       configuration hash MD5:
       00 E9 B6 7A A2 85 ED C7 34 08 36 98 17 FE 4E 26
       data hash MD5: 16K
       AD A5 19 EB 85 13 FC A4 9F 99 FC FE 46 BF E7 45>)
$$ ##END=
$$ 
$$ hash MD5
$$ 97 46 B2 E2 3B D7 6E 12 62 D9 D5 93 1C 0D EF AB
##$RELAX= 
##$RELAX= 
##$RELAX= 
##$RELAX= 
##$RELAX= 
##$RELAX= 
$$ Bruker specific parameters
$$ --------------------------
##$DU= <F:/spectra>
##$EXPNO= 1
##$NAME= <H-F>
##$PROCNO= 1
##$TYPE= <nmr>
##$USER= <she>
##$AMP= (0..31)
100 100 100 100 100 100 100 100 100 100 100 100 100 100 100 100 100 100 
100 100 100 100 100 100 100 100 100 100 100 100 100 100 
##$AQSEQ= 0
##$AQ_mod= 1
##$AUNM= <au_zg>
##$AUTOPOS= <>
##$BF1= 200.13
##$BF2= 200.13
##$BF3= 200.13
##$BF4= 200.13
##$BF5= 200.13
##$BF6= 200.13
##$BF7= 200.13
##$BF8= 200.13
##$BYTORDA= 1
##$CFDGTYP= 0
##$CFRGTYP= 5
##$CHEMSTR= <none>
##$CNST= (0..31)
1 1 145 1 1 1 1 1 1 1 1 1 1 1 1 1 1 1 1 1 1 1 1 1 1 1 1 1 1 1 1 1 
##$CPDPRG= <>
##$CPDPRG1= <>
##$CPDPRG2= <>
##$CPDPRG3= <>
##$CPDPRG4= <mlev>
##$CPDPRG5= <mlev>
##$CPDPRG6= <mlev>
##$CPDPRG7= <mlev>
##$CPDPRG8= <mlev>
##$CPDPRGB= <>
##$CPDPRGT= <>
##$D= (0..31)
0 1.2 0 0 0 0 0 0 0 0.06 0 0.03 0 0 0 0 0.0002 0 0 0 0 0 0 0 0 0 0 0 0 
0 0 0 
##$DATE= 1666348539
##$DBL= (0..7)
120 120 120 120 120 120 120 120 
##$DBP= (0..7)
150 150 150 150 150 150 150 150 
##$DBP07= 0
##$DBPNAM0= <>
##$DBPNAM1= <>
##$DBPNAM2= <>
##$DBPNAM3= <>
##$DBPNAM4= <>
##$DBPNAM5= <>
##$DBPNAM6= <>
##$DBPNAM7= <>
##$DBPOAL= (0..7)
0.5 0.5 0.5 0.5 0.5 0.5 0.5 0.5 
##$DBPOFFS= (0..7)
0 0 0 0 0 0 0 0 
##$DE= 6
##$DECBNUC= <off>
##$DECIM= 32
##$DECNUC= <off>
##$DECSTAT= 4
##$DIGMOD= 1
##$DIGTYP= 9
##$DL= (0..7)
0 120 120 120 120 120 120 120 
##$DP= (0..7)
150 150 150 150 150 150 150 150 
##$DP07= 0
##$DPNAME0= <>
##$DPNAME1= <>
##$DPNAME2= <>
##$DPNAME3= <>
##$DPNAME4= <>
##$DPNAME5= <>
##$DPNAME6= <>
##$DPNAME7= <>
##$DPOAL= (0..7)
0.5 0.5 0.5 0.5 0.5 0.5 0.5 0.5 
##$DPOFFS= (0..7)
0 0 0 0 0 0 0 0 
##$DQDMODE= 0
##$DR= 18
##$DS= 0
##$DSLIST= <SSSSSSSSSSSSSSS>
$$ [...]
##$SUBNAM2= <"">
##$SUBNAM3= <"">
##$SUBNAM4= <"">
##$SUBNAM5= <"">
##$SUBNAM6= <"">
##$SUBNAM7= <"">
##$SUBNAM8= <"">
##$SUBNAM9= <"">
##$SW= 18.0517283424941
##$SWIBOX= (0..15)
0 0 2 0 0 0 0 0 0 0 0 0 0 0 0 0 
##$SW_h= 3612.71676300578
##$TD= 16384
##$TD0= 1
##$TE= 0
##$TE2= 300
##$TE3= 300
##$TEG= 300
##$TL= (0..7)
0 120 120 120 120 120 120 120 
##$TP= (0..7)
150 150 150 150 150 150 150 150 
##$TP07= 0
##$TPNAME0= <>
##$TPNAME1= <>
##$TPNAME2= <>
##$TPNAME3= <>
##$TPNAME4= <>
##$TPNAME5= <>
##$TPNAME6= <>
##$TPNAME7= <>
##$TPOAL= (0..7)
0.5 0.5 0.5 0.5 0.5 0.5 0.5 0.5 
##$TPOFFS= (0..7)
0 0 0 0 0 0 0 0 
##$TUNHIN= 0
##$TUNHOUT= 0
##$TUNXOUT= 0
##$USERA1= <user>
##$USERA2= <user>
##$USERA3= <user>
##$USERA4= <user>
##$USERA5= <user>
##$V9= 5
##$VALIST= <valist>
##$VCLIST= <CCCCCCCCCCCCCCC>
##$VD= 0
##$VDLIST= <DDDDDDDDDDDDDDD>
##$VPLIST= <PPPPPPPPPPPPPPP>
##$VTLIST= <TTTTTTTTTTTTTTT>
##$WBST= 1024
##$WBSW= 4
##$XGAIN= (0..3)
0 0 0 0 
##$XL= 0
##$YL= 0
##$YMAX_a= 409333
##$YMIN_a= -481223
##$ZGOPTNS= <>
##$ZL1= 120
##$ZL2= 120
##$ZL3= 120
##$ZL4= 120
##$ABSF1= 10
##$ABSF2= 0
##$ABSG= 5
##$ABSL= 3
##$ALPHA= 0
##$AQORDER= 0
##$ASSFAC= 0
##$ASSFACI= 0
##$ASSFACX= 0
##$ASSWID= 0
##$AUNMP= <proc_1d>
##$AZFE= 0.1
##$AZFW= 0.1
##$BCFW= 1
##$BC_mod= 2
##$BYTORDP= 1
##$COROFFS= 0
##$CY= 11.3945322036743
##$DATMOD= 1
##$DC= 2
##$DFILT= <>
##$DTYPP= 0
##$F1P= 2.36226072786647
##$F2P= -0.459571619588291
##$FCOR= 0.5
##$FTSIZE= 0
##$FT_mod= 4
##$GAMMA= 1
##$GB= 0.15
##$INTBC= 1
##$INTSCL= 1
##$ISEN= 128
##$LB= 0.24
##$LEV0= 0
##$LPBIN= 0
##$MAXI= 10000
##$MC2= 0
##$MEAN= 0
##$ME_mod= 0
##$MI= 1.114404
##$NCOEF= 0
##$NC_proc= 0
##$NLEV= 6
##$NOISF1= 3.799351
##$NOISF2= 2.8
##$NSP= 1
##$NTH_PI= 0
##$NZP= 0
##$OFFSET= 15.70392
##$PC= 1
##$PHC0= -18034.29
##$PHC1= 11.6007
##$PH_mod= 1
##$PKNL= yes
##$PPARMOD= 0
##$PSCAL= 0
##$PSIGN= 0
##$REVERSE= no
##$SF= 200.130013532006
##$SI= 16384
##$SIGF1= 3
##$SIGF2= 2
##$SINO= 400
##$SIOLD= 16384
##$SREGLST= <1H.CDCl3>
##$SSB= 0
##$STSI= 0
##$STSR= 0
##$SW_p= 3612.71676300578
##$SYMM= 0
##$S_DEV= 0
##$TDeff= 0
##$TDoff= 0
##$TI= <>
##$TILT= no
##$TM1= 0
##$TM2= 0
##$TOPLEV= 0
##$USERP1= <user>
##$USERP2= <user>
##$USERP3= <user>
##$USERP4= <user>
##$USERP5= <user>
##$WDW= 1
##$XDIM= 8192
##$YMAX_p= 0
##$YMIN_p= 0
$$ End of Bruker specific parameters
$$ ---------------------------------
##NTUPLES= NMR FID
##VAR_NAME=  TIME,          FID/REAL,        FID/IMAG
##SYMBOL=    X,             R,               I
##VAR_TYPE=  INDEPENDENT,   DEPENDENT,       DEPENDENT
##VAR_FORM=  AFFN,          ASDF,            ASDF
##VAR_DIM=   8192,          8192,            8192
##UNITS=     SECONDS,       ARBITRARY UNITS, ARBITRARY UNITS
##FACTOR=    0.0002768,     1,               1
##FIRST=     0,             0,               0
##LAST=      2.2672688,     0,               0
##MIN=       0,             -481223,         0
##MAX=       2.2672688,     409333,          0
$$ Real data points
##PAGE= N=1
##DATA TABLE= (X++(R..R)), XYDATA
0@%%%%%%%%qJ6j6J6k4L2l2M0n6P2q8J04j20J44j76K08k40K78l25L76m34M98n70
31c05O54p48Q48r55J076j211J361j527J704j898K114k347K602k881L184l517L880
48B034m276M712n191N720o304O948p668Q480r396J0438j1640J3043j4706J6715
62H909j9198K2357k6531L2336m1016N5550q5769K53921m15451j84948Q09173l37307
74G2026m08355M90516M9142n38630M01947L09485o36987m4684O83450k83190m75124
85c80404M65783J97877m94069J06477L30080l03288j13463L79797j23495l01306
95b36011L07468J64406m07010j279L80247j19678k83239J88950J52339j80183
105c3990r468J29221j41731n2988K52845m1265l07143J41478K94166k12589k23102
$$ y = [0, 0, 0, 0, 0, 0, 0, 0, 0, -8, 8, -8, 8, -16, 16, -16, 24, -32, 40, -48, 56, -64, 80, -96, 112, -128, 150, -175, 201, -233, 265, -305, 349, -399, 449, -506, 570, -641, 720, -807, 897, -1001, 1113, -1234, 1368, -1513, 1671, -1846, 2034, -2242, 2470, -2721, 2999, -3305, 3643, -4025, 4455, -4941, 5497, -6143, 6900, -7806, 8909, -10289, 12068, -14463, 17873, -23143, 32407, -53362, 200559, -214892, -399840, 409333, 72026, -336329, 154187, 203329, -335301, 66646, 376131, -260856, -305540, 377910, 94720, -380404, 85379, 283256, -210813, -104336, 225744, -77544, -191007, 188790, 65295, -236011, 71457, 235863, -171147, -172426, 207821, 88143, -195096, -6146, 146193, -33990, -43458, 85763, -55968, -108956, 143889, 102624, -204519, -63041, 231125, 18536, -204566]
116b04566K32070Q9003k02239O8670J15896j97263K8470K53863j87069k19858
126b23023K97113J06790l18907M4470K61487j67105j31122K17149l6462j76992
136a26602J79702O1709k41775Q4441K16963j97657j38463K30852L7092j88844
146h2582M6345R4632q4754J8176O8013j14065k5715J56512j1015j44797K4732
157e4518J11886j2164p8229r869M9809K5353k2998j8559K688k626K5438K5937
169D2148p0908l1506J20811L037j45557N3583J23725j09876o3996J28588k1375
180B8674r8911J01546K1779j45576Q1897J29381j77358n6854K17669l8107j79946
191a15806J16093Q5588j42044L1754J09772j32124k9933J87323o5633j73181J40168
$$ y = [-204566, 27504, 116507, -85732, -17062, 98834, -98429, -69959, 183904, -3165, -223023, 74090, 180880, -138027, -93557, 167930, 825, -130297, 86852, 50390, -126602, 53100, 114809, -126966, -42525, 174438, -23219, -161682, 69170, 106262, -82582, -36237, 58395, -26359, -8183, 59830, -54235, -79950, 76562, 65547, -79250, -54518, 57368, 45204, -33025, -42894, 6915, 32268, 9270, -9289, -6601, -9227, 16211, 42148, -28760, -60266, 60545, 63582, -81975, -28392, 95333, -14543, -78539, 50049, 28674, -70237, 31309, 53088, -92488, -10591, 118790, -58568, -115422, 102247, 64140, -115806, 287, 85875, -56169, -24415, 85357, -46767, -76700, 110623, 44990, -128191, 11977]
202A1977J01648j63286j0800J27856o4011n6396J01231k3836j01059Q6611O6415
213G6350j22509j6647J22337k9442r2792N6318N1843o4070j2631N9887k2308m3891
225c7555N8348J7975q3931J9353R3812n8699q1657R1936M9288j07612J723R6459
237E9440o2244n1632J06436k3609j12484R9349P3768j50197n385J52723p1047
248A5118j07218J26231K4433j38169P1475R5135j40647j1245J57075p6836j14926
259i9574J37694L8831j48930M5066J12089j07533l8617J27836m4130r9152J04430
270B8010L6538j22869K7492R9741p3461n4566Q9440J528p9312M2853M6355o8073
282b6324o329P0308k7147n5324M7835L6504n7535j3893O1227j0860n4421L9204
$$ y = [11977, 113625, -49661, -60461, 67395, 3384, -53012, 48219, 24383, -76676, 9935, 76350, -46159, -62806, 59531, 30089, -62703, -6385, 45458, -18612, -31243, 28644, 6336, -37555, 20793, 38768, -45163, -25810, 68002, 9303, -72354, 19582, 68870, -38742, -37019, 59440, -2804, -54436, 52000, 28391, -84093, 15256, 89024, -61173, -66558, 86165, 15118, -92100, 34131, 58564, -79605, -8130, 87005, -53642, -64887, 92188, 15352, -99574, 38120, 76951, -71979, -26913, 85176, -22357, -60974, 66862, 22732, -76420, 28010, 64548, -58321, -30829, 68912, -4549, -59115, 30325, 31853, -47459, -4606, 41749, -26324, -32653, 37655, 10508, -44816, 3019, 39523, -18012, -31905, 29322, 18462, -35959, 3245]
294C245L5603n9850m589O7815l0740n9593O4324L2248q7084J0716Q4928o0377
306c354n2861R2395k754r3789N8841O1526r7962p593J05625n2205p7504R7344
318B7709K1064j07697M5035P8961r1798k0581J03396l8729p8454Q1557L1992r5509
330d3054K1857P8094o5073l5772Q1051j5072o7446N1056L4780o6718r13O1725
342C4515k7718m4794M5371J9320n0283O588M2517k6000k7280L8386J1523m4839
354b2694P790M6619k7745l7957M8384J7134n7860J2878N1427m0816l0243O0092
366B7009l543o4138M1355M5429p2873p183P9413l8257n8768O9907J6990p8049
378d2708K9204N9750o5988k0044Q1065k7542o6941O7942K9591q2075J7073O8389
$$ y = [3245, 38848, -21002, -25591, 42224, 11484, -48109, 16215, 48463, -38621, -27905, 57023, -3354, -56215, 36180, 33426, -60363, -1522, 60004, -37958, -45551, 60074, 7869, -69635, 27709, 48773, -58924, -13889, 65072, -26726, -47307, 56089, 17360, -61094, 20463, 52455, -43054, -21197, 56897, -8176, -43948, 37103, 22031, -45415, 5641, 40421, -26297, -27210, 34515, 6797, -37997, 7374, 26694, -23589, -17001, 25516, -484, -27764, 10622, 22145, -22694, -14904, 31715, 3970, -33987, 14397, 31531, -26329, -13451, 37976, -2840, -33083, 27009, 23466, -40672, 683, 46112, -26761, -33944, 45469, 7212, -51556, 18351, 35341, -42708, -13504, 46246, -19742, -39786, 41279, 13737, -53204, 14738, 44329, -37746, -20673, 47716]
390D7716n1727l3794O6190o061n8657M0639L3865o1238J46O0162l1157m2341M7321
403A1064J6233m8825N605L9190k3434k4161L4470N033l8796J5718L3779l2704
415f828k0971M3667O200m8328J3984M5100l4635k7200M9808j674m8826L3993L0058
428C4348n7235Q32O4017l5876n2277O3423K1611p4986J8591N9146n3554k2056
440c4016O7390k4767n6269O2477K5172q0073J4487P4431n0264m4107O9503K235
452B6199o2637L7699L4693n9111L492O0071l7192m3694N9754J6707o5763J1886
464a7896N3051l4064k7815M0758j748l4997K5105K0801m2969l067N1809j6460
476A2508n1107L4749L7378m3508j5754M2840q034l0751L1680J0143m7088J8253
$$ y = [47716, -4011, -37805, 28385, 22324, -36333, 4306, 38171, -23067, -22921, 37241, 6084, -36257, 11064, 27297, -21528, -15923, 23267, -167, -24328, 10142, 15175, -23621, -7903, 25876, -6828, -27799, 15868, 22068, -26260, -12276, 32824, -1811, -29011, 20797, 19123, -29703, 4290, 34348, -22887, -22055, 41962, 6086, -46191, 17232, 38843, -36143, -17552, 41594, -11960, -34016, 33374, 8607, -47662, 14815, 39987, -40086, -25599, 48832, -1432, -45539, 23964, 26199, -36438, 1261, 35954, -23157, -19665, 40406, 3214, -40480, 19274, 35981, -29782, -17896, 35155, 1091, -26724, 14034, 12286, -22711, 2394, 23195, -19774, -22841, 28968, 12508, -38599, -3850, 33528, -9980, -25734, 17106, 9072, -21679, 10001, 20144, -26944, -8691]
488h691N0944m7686l6095O7436P913o7768K2356M8590m5560j6263N2941k2788
500E329m2506N6262J1847p3495K6584O5703n8251l8911P0498L834n9944K8279
512d771L1634m8146Q905N0347m6849l3281P1494O340p3013J9988N6011l5227k8404
525b4972L8408l206k9918L0900J1008m9642J2027N2449l2590m3258M2896K6515
537C0617m5380p049L9248j3656k3568K9630L01l5112K6410K9478m7816j3566O1019
550C0556o276o0841K7165M6169m0577j6681L9550j7669k2175M5229o284n8903
562d0737L5154N4747n7801l5659O4249N626n2458K3283K2237m0234J5230L8375
574C2012m5979k2305O3520m24o3809K3760M8913l8594k1487M0311p028k6541K8492
$$ y = [-8691, 42253, -5433, -41528, 25908, 33821, -33947, -11591, 36999, -8561, -24824, 28117, 5329, -37177, 19085, 30932, -42563, -15979, 49724, -8527, -47438, 23060, 26894, -33050, -4771, 26863, -21283, -12378, 37969, -8880, -42161, 29333, 35673, -37340, -17352, 38659, 3432, -24972, 13436, 10230, -19688, 11212, 22220, -27422, -15395, 37054, 4464, -38794, 4102, 30617, -14763, -21812, 17436, 3780, -19788, 9842, 10143, -24969, 1441, 30919, -16897, -30463, 30556, 24280, -36561, -9396, 36773, -3804, -20485, 19065, 1396, -20779, 24450, 18166, -40737, -5583, 49164, -8637, -44296, 19953, 25579, -26879, -3596, 18641, -21593, -6363, 32012, -13967, -36272, 27248, 26824, -36985, -13225, 35688, -2906, -24393, 15918, 8890, -17651, 10841]
587A0841M904l7701J7849L6702l6750k8052M7102J4145m8426J35L7137j1636j7800
600a1550J5219m122j5390K4944J1711m3246k869N3559r967n0142K2391L5086k7767
613b143j1854K5529j2264j3924L3719m669m4739K7532M1357m6417k3840N2407
625B0694j83m3679J9785K3003l1882L730L0193l0855j6785M9320n965n3625K8175
638h074M1973l8805k2411L7776P68k4250J8457M579k9999J8985L1785l7078k3618
651b9912M5849J0291m1940J803K9949j1488j4161J7536n606j7593K2831J0334
663A7893l5588J018L8755j3459l4856K3733K3925k9673p092K7880j1550j5587
675a4601K7070l881l2326K5606K7533m1140j3735M8133l965m2147K1016K3640
$$ y = [10841, 15745, -21956, -4107, 32595, -4155, -32207, 14895, 29040, -19386, -19251, 17886, 6250, -11550, 3669, -453, -15843, 9101, 20812, -22434, -25303, 28256, 18289, -31853, -9462, 25624, -2143, -13997, 11532, -732, -14656, 19063, 14394, -30345, -2813, 38544, -7873, -31713, 20694, 20511, -23168, -3383, 19620, -12262, -8532, 21661, -9194, -25979, 23341, 17376, -36249, -8074, 33899, -4906, -27317, 10459, 11227, -13023, 5434, 10013, -19986, -1001, 30784, -6294, -29912, 15937, 26228, -15712, -13909, 16040, 4552, -9609, 7927, 2321, -15272, 7559, 17893, -17695, -16677, 22078, 8619, -26237, -2504, 21421, -8252, -15344, 12536, 986, -14601, 12469, 8588, -23738, 1868, 29401, -11739, -25474, 22659, 18694, -23453, -2437, 21203]
687B1203l0654K994K6989k9300j1903M3906p613m7113K5299L6367l7231j6651
699b3707L7827p320k5754K6156M811l3333J7450K8722l2483j6097M0195Q01l8023
712b0755J5384K6558k5356p853K5697j0360j7228K3787M292l0887R187L0707k2166
725A007k4522L0639J0198l1275N388K1770j8153p466K5001r228k5293K5885J7991
738B1942l7074k883L8752j4035k7554K6537R752k8975J0358K3173k6738r633L6249
751A9871r579l4340K7198K0618l6542j506L3094j6831k0334K7111J998k9367J6457
764b152K1844l0651o957L5237j0182k8468K2598J4830k6036J097K3267j4474j3661
777a3708K4195N87k6272J3417K0805k2813r446K4443j926k1865J1764J4044j9241
$$ y = [21203, -9451, -6457, 20532, -8768, -20671, 23235, 15622, -31491, -6192, 30175, -7056, -23707, 14120, 6800, -18954, 7202, 12013, -21320, -3870, 24852, -7631, -23728, 16467, 17268, -20755, -5371, 21187, -4169, -12022, 13675, 3315, -13913, 9874, 14166, -16721, -7534, 23173, 1007, -23515, 7124, 17322, -13953, -8565, 13205, -4948, -12414, 12587, 3359, -21934, 3951, 21942, -15132, -18015, 20737, 6702, -20852, 5685, 15437, -13538, -3180, 19993, -6745, -16378, 19871, 10292, -24048, 3150, 23768, -12774, -14280, 18814, 1983, -18351, 8760, 10758, -18609, -2152, 19692, -10959, -17916, 17321, 7139, -21329, 1269, 16099, -9937, -8840, 14427, -47, -13708, 10487, 11074, -15198, -1781, 19024, -3789, -13235, 11208, 9282, -12583, -819, 13225, -6016]
790f016l288K1280r867j8098K0562P947k5441M133K3244j4901j5608K2395M000
803A0342k4250J0567J8887k2028n936K7322r175k2426K0915J2173k6457J629K5523
816A7086j5905j6460K5197J093k6337J3534J7932k3952m902K5975q727k1373J8919
829B080J1063k4870K872K3008j5881j3049K2565J324k1797J0463J5976j7943o676
842a0865K1924m095j9563J4829J1140k0423j04J9921r864j5310J7155O485k1224
855i994M295J8575j5355j0999K2104j600k1962J3084J5115k0317n039K3396o921
868D382j9696J8669R421k4061N147K2067j7747j1974K4604q48k3561J2729J6940
881A6072k1609n221K4128r523j8327J9734O273k3524O591J9057j6609j0803K1418
$$ y = [-6016, -9304, 11976, 2109, -15989, 4573, 12520, -12921, -8788, 14456, -445, -16053, 6342, 10342, -13908, -3341, 15546, -6482, -12418, 14904, 5729, -16697, 4218, 16391, -10066, -8437, 17086, 1181, -15279, 9918, 11011, -15326, -1792, 16140, -7812, -12714, 13261, 4534, -16839, 2080, 13143, -11727, -8855, 14153, -1728, -14777, 7788, 9112, -12685, -2222, 13754, -4189, -10865, 11059, 6964, -12599, 2230, 13370, -7053, -7157, 12764, 2900, -12410, 4745, 11230, -9994, -5699, 12876, -2479, -13478, 8626, 7026, -14936, -1852, 13263, -7054, -12093, 11303, 4382, -15314, 3355, 12776, -11285, -6138, 15929, -1818, -13792, 10812, 9964, -13597, -868, 16072, -5537, -10758, 13370, 3847, -14480, 5254, 11527, -11997, -5406, 13651, -2958, -13761, 7657]
894G657k18k1126J1616J4334j8855l116K0177p926j4602J6161O596j9203K941
907e564J8633j1889j2748J8305K531j8622P637J3556j4843n952J8031l880j7437
920a2242J2927J1306j9811j634K0381r475j5176J7501N125j9508N579J6618j4818
933c227q476K1035k366k0436J4329J3290k1026j337K0772r217j4940J6991N003
946A0395j9680N793J6828j6455p852K0762l650j9405J2997J1364j7847j941J7689
959H998p408j3056J5127M398j8279O132J5780j4392p816J8184n76j7050Q613J2869
973A1524j4446m745J7133n528j3869J4077N994j8380K949J7268j1566j2384J6867
986D894L735j8856O276J4439j4996n190J8343o307j5044J5062Q324j9635J491
$$ y = [7657, 7439, -13687, -2071, 12263, -6592, -9708, 10469, 2543, -12059, 4102, 10698, -8505, -5564, 13069, 1180, -11568, 6737, 9268, -9354, -1717, 11839, -3004, -8956, 9075, 5195, -12242, 685, 11991, -7820, -9454, 10927, 1452, -13724, 3777, 8902, -10606, -5027, 11591, -3227, -11703, 9332, 6966, -13470, 859, 14149, -6877, -8214, 12558, 3341, -11599, 5392, 10395, -9285, -3492, 13336, -3119, -10971, 9791, 6141, -13264, -267, 11097, -6750, -8691, 8998, 1590, -11466, 3661, 8059, -10220, -4088, 11692, -2700, -10516, 7668, 7092, -9958, -1345, 11524, -2922, -7667, 9466, 3938, -9931, 4146, 10140, -8240, -5291, 11977, 411, -11973, 4894, 8629, -10227, -3951, 10488, -4508, -9698, 8645, 2338, -12706, 2356, 10680, -8955, -7464]
999g464J9535j0838j2977J7313L386j8199Q571J1953j5980k675J8392o982j6085
1012a2050J4392R579j9621O49J7423r811j0534J4585M31j4829Q489J0796j4986
1025e487m205J7999l752j6160J1230R880j4530p91J3579o654q319J1968J751j4176
1039g667N861J3328j2962q284J6880L73j5996O743J0321j1702k917J2777n791
1052I64j1123J3736M885j8539L867J7156j1643j0434J5404K327j4272O180R761
1065H269j2582j891J6729q050j3927J5627O952j8177J743J5108q420r225J2611
1078D767O86j3474Q079R001j5147j407J6719o791j4203J2454P849j4268o71J2656
1092F250o124p328J1977r18j3028R370J0424j4533m528J6307j460j4182P114R114
$$ y = [-7464, 12071, 1233, -11744, 5569, 8955, -9244, -673, 11280, -4700, -7375, 11017, 4035, -12050, 2342, 11921, -7700, -7051, 10372, 561, -9973, 4612, 5043, -9786, -1297, 9499, -5487, -9692, 8307, 4555, -11605, -375, 9505, -5025, -5816, 7763, 1109, -7210, 4758, 6509, -7667, -1806, 11522, -1440, -9724, 7156, 7529, -8467, -1724, 8597, -3105, -6022, 6755, 964, -10159, 3577, 8462, -10077, -6210, 10946, -697, -11131, 4273, 6600, -7672, -1492, 8269, -4313, -6204, 10525, 2475, -11452, 4175, 11127, -7050, -5307, 9801, 1381, -7844, 4767, 5453, -8021, 58, 9059, -6088, -7495, 9224, 2433, -11770, 684, 8533, -5735, -6406, 6250, 126, -7202, 4775, 3857, -9171, 199, 10623, -3910, -8438, 7869, 6409, -7773, -659, 8455]
1106H455j1101j059J1347p935p636J4061O05j6020N561J3997j1000r447J4171
1119C999J217j3386P509P232j2517Q62J3654q847r788J4363M398j6448K865J4935
1133A0048r712p920J2825r55j0492Q834N260j3975J392J4917q177j2334J2394
1146B105O265j4166J030J1318q136m494J0916l098j0417R220P818j3508k500J4980
1160G333l584j2212R232N990j0715J636R313p769n091J2044q77j3099P161J0628
1174I990j2599n137J3506j660j1002P063N137j0421J765J0514r029p446J4177
1187D858J564j5111N403J1221r454m894J0986k015q597Q421M384j2603K368J3479
1201A0010r252r210J2751K738j2514K951R367q079m103J0679l215j0184R381N765
$$ y = [8455, -2646, -3705, 7642, -293, -7929, 6132, 6737, -9283, -3722, 10275, -725, -10172, 3999, 5216, -8170, -661, 6571, -5946, -5084, 8570, -277, -10065, 4298, 8696, -7752, -4887, 10048, 336, -7584, 5241, 4286, -6206, 2628, 7888, -6087, -4695, 10222, 2045, -10289, 2105, 8370, -5796, -4766, 6552, -1584, -6078, 4838, 1740, -8677, 543, 8361, -5147, -7647, 7333, 3749, -8463, 769, 6759, -3956, -2320, 6993, -776, -5867, 6177, 5300, -7799, -638, 9990, -2609, -7746, 5760, 4100, -6902, 161, 5298, -5123, -3358, 7156, -1873, -9319, 4858, 6422, -8689, -3286, 7935, -1519, -6413, 4573, 2558, -6039, 2382, 6766, -5837, -3469, 10010, 758, -8452, 4299, 7037, -5477, -2526, 6841, -1238, -5341, 5338, 2123, -8061, 1320, 7085]
1215G085j3491O94J2682n907r129R432L978j0317K102Q994p963l840J1955k858
1229C417j1027Q168Q083j1291k791J1811k939r676Q215L588j0584L227R287r703
1243b215n014J2198m83j2150N718R029r874l369J1007l607q534R481L005j1603
1257f411L923J0170q439o289J1547Q26j1129M952Q220r345k012J0091m597p654
1271f147Q966L360j1214J197J0516o355p422R650J658j0048M091O969q517j819
1285e115R721k809q616P415N712j0293j67J0520n331o936Q791J796r058L550P738
1300F918q307m044J0635j499j0261O862O369j0444o74R901n189o588Q233K248
1314D160j0022K941R040q343m219J0481q76r390O229O142r145m38R009m127o609
$$ y = [7085, -6406, -5712, 6970, 1063, -8066, 1366, 5344, -4973, -2871, 6123, -1840, -5680, 6275, 3417, -7610, 558, 8641, -2650, -5441, 6370, 3431, -6245, 1970, 5558, -5026, -1799, 7488, -2215, -7229, 4969, 4486, -7664, -1946, 7083, -2791, -6160, 4847, 1240, -7294, 2187, 5192, -6411, -2488, 7682, -757, -7046, 4501, 5327, -5802, -850, 7370, -1975, -3987, 6104, 1507, -6147, 2819, 6179, -5035, -3838, 6678, 323, -7099, 2551, 4209, -5839, -1748, 5221, -3296, -5115, 4606, 1797, -6819, 596, 6308, -3985, -4152, 6368, 1037, -5899, 2892, 4688, -4370, -820, 6918, -1389, -5433, 5202, 3703, -6558, 304, 6673, -3771, -4445, 5456, 267, -6321, 1912, 4160, -5862, -2921, 6119, -2224, -6443, 4038, 3162, -6228, 1, 6143, -3002, -3440, 5569, 1442, -5167]
1329e167Q127K492j0091L045Q021p114m464R293q87q540M812N481p968j573Q948
1344D415l472p489P668L301r011J393Q066n566m701Q268Q27q728L881P134p591
1359a605k423Q965k622p354O426M094q553M00Q929n479o370Q516J521r638L747
1374a446O664p532k652Q937k491p709O656M441r033L92R025n121n729Q309J219
1389C930q067L154O603o896k721Q754j919q024O081M616q601K46P937m108n889
1404d904O837J360p644K320P089o701l579Q382r19p853N101M806o947j101P595
1419C842k907n715O561K447p969K385P142o279l693P951m09p541L959N348o993
1434a871j523P389l065o131O681K391q324J884P102n563m145P344O61p519L794
$$ y = [-5167, 2960, 5452, -4639, -1594, 6427, -687, -5151, 4142, 3255, -5285, -473, 5008, -2960, -4533, 4415, 943, -6546, 1122, 4423, -4588, -3195, 4871, -695, -5396, 2872, 3699, -5029, -1148, 5986, -1605, -4028, 4937, 2315, -5039, 1387, 5481, -3072, -2672, 6257, 778, -5592, 2924, 4445, -5193, -1446, 5218, -2314, -4966, 3971, 1480, -6229, 427, 4868, -4165, -3773, 5252, 131, -5598, 2711, 3930, -4137, -983, 5620, -1276, -3997, 4757, 2838, -5186, 895, 5511, -3090, -2844, 5093, 985, -4904, 1933, 3293, -4351, -2031, 5058, -1643, -5222, 3160, 2241, -5612, -511, 4295, -2652, -3753, 3842, 935, -4780, 1781, 4228, -3741, -1356, 5786, -493, -4186, 3765, 3356, -4185, -226, 5122, -1871, -3394, 3995, 930, -5201, 1480, 3871, -4453, -2569, 4533, -1030, -5175, 2169, 2830, -4689, -895]
1449h95N299o700j118P713k858n867O156K655p309R92O863m081m925O808O08o922
1465c581L113M691n826j853O901j935o347M955L696p167L1P028l737m469N952
1480A452J220o285K342N077n052k196P006r88o487M508M353o974m35O630k970
1495A201m705N398J160o450K125N872n694l219P188r85o612L969M246n836n63
1510b905N575k043m869N495J665o591K169N842m854l120O378L20n820K479M099
1525C820m467j553O036k726m773N322J970o648J054N616l835m045N113J468n684
1540c332K225L908m924j161O599k565n311N260L385o432o3N968k283m514N215
1555A975R19n490K710L927n692r59O442j882o115M118M174o002j069N574k646
$$ y = [-895, 4404, -2296, -3414, 4299, 1441, -4426, 1730, 4385, -2924, -1932, 4931, 850, -4075, 2733, 3341, -3581, -468, 4223, -1603, -3456, 3445, 1510, -4837, 118, 3814, -3353, -3322, 3706, -31, -4500, 1452, 2672, -3613, -1271, 3806, -1246, -3442, 3564, 2576, -3911, 597, 4950, -2024, -2459, 4171, 1201, -3504, 1894, 3054, -3396, -1271, 4601, -1093, -4312, 2876, 1891, -4721, -752, 3494, -2342, -2905, 2670, 627, -4242, 1253, 2918, -3673, -1504, 4338, -516, -3636, 2742, 3062, -2758, -279, 3820, -647, -2200, 3836, 1110, -3663, 1659, 3629, -3019, -1965, 3651, -184, -4229, 884, 2352, -3332, -1107, 2801, -2123, -3284, 3315, 750, -4561, 699, 4084, -2348, -2411, 3557, 1274, -3240, 1975, 2894, -2596, 114, 4041, -1651, -2610, 3832, 1950, -4165, -47, 4127, -1875, -2944, 2630, -16]
1570a6l369M831J31n194K720M480n201k646O883m73n743K838M249m669l33M435
1586B923k896k812N220R42o676K179N808m476l946N681M75m886J902L151m639
1601b050K9M897k943m575N721K226o772M93O287k955l657M596L60l979K885K583
1617C146n242k30O381k477n650N265L074n851j52M263k061k771M207q13m809L910
1633A90L592o501j003O498j611m948K972L195l838j32L498k498j823M797l56n534
1649c502L149M944m934k606N122J30l974J745K069l201J27L906l660k814N395
1664A896Q17n836J010M905k512l807L951Q58l742K463K247m585N77N261k794m318
1680c609M557K873n412l62M772k186k427L749o27l833L476K455n477q88O176j818
$$ y = [-16, -3385, 1446, 1577, -3617, -897, 3583, -1618, -4264, 2619, 2146, -3597, -759, 3490, -1179, -1512, 2923, 27, -2785, 2435, 3377, -3299, -1120, 4688, 212, -3734, 1947, 2422, -2464, -562, 2589, -2050, -2021, 2876, -67, -4642, 1079, 3305, -3467, -2974, 3313, 358, -3299, 1297, 1657, -2322, 563, 3146, -2096, -2326, 4055, 1578, -4072, 1193, 4267, -1584, -1736, 2527, 466, -2305, 1902, 1089, -3720, 190, 3782, -2719, -3722, 2776, 1165, -3783, -811, 2384, -1454, -1586, 1912, -586, -2409, 2388, 2032, -3502, -353, 4591, -343, -2949, 2173, 2303, -1671, 74, 2143, -1058, -931, 2975, -685, -3499, 1896, 2713, -3123, -2113, 2792, 280, -3527, 424, 1282, -2460, 3, 2250, -2335, -1758, 3503, 709, -3609, 948, 3821, -1591, -1953, 2819, 633, -1794, 1955, 1328, -2505, 971, 3426, -2051, -2939, 3237, 1419]
1696A419n140L178L122m257q0L609k935j334M479j062m669L373L946m654k090
1711c095N533l79m601K783J898l515R49L440l530k021M991j05n317J902M773l877
1727a71k570M042o63k870K600R74l733J093M180l444k989M863J245n115R53M105
1743B500k674j540L555j002k807L293J579m883O63M803k452l818L529J704l761
1758a311M06K604k326j154L282r60l854L432K689m973l16M243j196l184K840J373
1774A595l127J123K745k874j250M455q78m159K657K850l605j289L632r12k898
1789a935K403J286l776J233L241l193j960L993Q3m123J461L223k760j479L854
1804A551r89k924K757J459l690Q09L687k461k288L420J009l856J119K938l150
$$ y = [1419, -3721, -543, 2579, -1678, -1758, 1851, -1084, -2418, 2061, 999, -3670, -297, 3649, -1005, -3095, 2438, 2059, -2542, 241, 2139, -1376, -427, 3013, -517, -2538, 2453, 2348, -2969, -1067, 3706, -171, -2741, 1301, 638, -2232, 368, 1342, -2391, -1298, 2882, -562, -3551, 1312, 2557, -2558, -1605, 2500, -174, -1714, 1841, 839, -1968, 1325, 2904, -1979, -1316, 3487, 1035, -2783, 746, 2450, -1311, -905, 1699, -627, -1781, 1501, 541, -3313, 119, 2808, -2165, -2481, 1762, 566, -2618, 222, 1595, -1532, -409, 2336, -538, -1788, 2667, 1789, -2370, 287, 3137, -468, -1757, 1875, 963, -1935, 468, 1754, -2022, -789, 2452, -741, -2701, 1292, 1375, -2748, -1287, 1936, -824, -2303, 1551, 562, -2362, 395, 1854, -1836, -1027, 2660, 199, -2089, 1331, 2340, -1516, -397, 2541, -609]
1819f09j125L839j206l227K718J490l499j4L446j771k815L193J038l587J163K837
1835A871k760r02L415n71l343K600K044l472k87L695j731k467K990Q10l127P87
1851d48K671k491j536L459m80l788K433K146l410m31L392j366k545K720J148l140
1867a666J83L412k254j782L619o9l238K064K196k996n56L013p93k665K258J143
1883A869l112M91L019k535j658L293r4l448J519K375k459j237L074q46k318K695
1899F28N76k854Q57K721k161j536K967L63l018J132K524k245r67K879j028k449
1915a611K421J083k884l16L246j661k660K699P95k537M18K171k013o62K604n91
1931E02k576K019J560k684n27L093p25k038K099O86k410P16K232k247j147L100
$$ y = [-609, -1734, 2105, 899, -2328, 390, 1880, -1619, -1633, 1813, 42, -2773, 420, 1458, -2129, -966, 1871, -889, -1791, 1624, 1053, -2290, 310, 2354, -1118, -1405, 2290, 559, -1908, 1082, 1892, -1235, -448, 2223, -268, -1804, 1655, 1175, -2613, -180, 1966, -1444, -1875, 1517, 151, -2394, 326, 1474, -1666, -1483, 1929, -325, -2107, 1512, 1443, -1795, 269, 2465, -531, -1087, 1926, 1133, -1532, 726, 1869, -1243, -752, 2267, -268, -1926, 1367, 1273, -2175, -656, 1719, -740, -1977, 1097, 251, -2067, 628, 1204, -1650, -793, 1928, -233, -1769, 1198, 1561, -1457, -325, 2199, -46, -1013, 1866, 838, -1611, 810, 1893, -991, -1307, 1939, 278, -2382, 317, 1112, -1425, -1007, 1164, -849, -1511, 1093, 502, -2074, -55, 1505, -1179, -1706, 1387, 662, -1376, 723, 1409, -1001, -285, 1947, -300, -1447, 1653]
1947A653m09k875J842K040k938o27K465p99k152K102O47k422N26K239j758j496
1963a962K825J08l059J764J757j780p45K180n44j764J815J118k540K03K712k014
1979G4j480K584K78k781R76J715j510j049K273r94j737J817J070k671J57K523
1995A245j261j738K073R12k318N79K000k031n95K845r15k076J771J284k439r7
2011g61K392q09k194J876N70k170P71J728k173o58K542n97k322J566J334k195
2027a100m52K741r05k026K165O90k125Q82J477j316j211K387p0k253J212J557
2043A653j959p06K309q40j449J406N34j823L21K035j917j616K487L21k571J109
2059g06J837j771o08J824j66j486J589O35k439P21K501j840j284K142O69k218
$$ y = [1653, 1244, -1631, 211, 2251, -687, -1314, 1151, 352, -1800, 302, 949, -1473, -947, 1292, -466, -1962, 863, 971, -2088, -324, 1433, -347, -1092, 1088, 544, -1220, 595, 1713, -827, -624, 2088, 74, -1406, 1178, 1456, -1325, -349, 1366, -144, -1193, 1080, 86, -1651, 166, 1236, -1435, -1278, 1245, -16, -1754, 319, 1231, -1087, -508, 1492, -539, -1134, 1711, 796, -1280, 491, 1775, -664, -761, 1631, 822, -1372, 504, 1074, -1096, -325, 1403, -770, -1428, 1114, 517, -1805, -239, 1095, -1100, -1552, 1189, 284, -1742, 423, 1113, -1012, -130, 1347, 31, -1180, 1207, 1137, -1116, 96, 1653, -306, -1012, 1297, 457, -992, 414, 948, -875, -554, 1481, -436, -2052, 435, 756, -1815, -706, 1131, -640, -1248, 576, 410, -1076, 513, 1148, -1291, -570, 1931, 91, -1193, 949, 1618, -600]
2075f00L66J495j256o94J859r07k029K072J089k744J90K386j069j822J652Q28
2091H16j971R07J214k004J86J896p26j932J986J115k119m55K480p60j506J638
2107G65K94j753Q00J322k027l90K152k65k316J121J422j533q30J561l08j030J278
2124B63K13k197J471J284j228j203K183L90k077M58J614j353P4J136j168l38J354
2141H76K14j984L23K014j083k071K104L77j559M64Q49j199m9J303r74j424K037
2158B18J044k112n50K425l76j549J237J70r78Q03P36j557OJ692q22j619J500J134
2176A402j378r09J366l50p40Q47k43j014P12J114j578m34K041j72j760O11J103
2193F18q48l07J120m58n68J248j6j810R24J846j585r01J344M73j615P23K69o88
$$ y = [-600, -234, 1261, 5, -689, 1170, 263, -1766, 306, 1395, -1349, -1159, 1227, 158, -1664, -12, 816, -1155, -248, 966, -1038, -852, 1044, 318, -1614, 372, 1487, -632, -1087, 1393, 633, -873, 765, 1059, -694, 106, 1428, -599, -989, 1163, 898, -1418, -297, 1125, -408, -1238, 323, 15, -1015, 263, 476, -1721, -250, 1034, -194, -1397, 786, 1176, -901, -443, 1171, -182, -108, 1028, -140, -478, 876, 1090, -894, -571, 1443, 360, -1711, 393, 770, -789, -325, 524, -675, -724, 579, -395, -1819, 218, 1262, -850, -1400, 1025, 649, -900, 337, 507, -471, 332, 1068, -489, -483, 1209, 387, -1232, 268, 1402, 24, -885, 481, 131, -609, 238, -5, -1019, -307, 807, -771, -1205, 836, 664, -1096, -485, 618, -230, -537, 583, 125, -443, 805, 789, -1021, -97, 1749, 164, -737, 607, 1080, -535, 188, 457, -231]
2211b31o7J130j137q71J767K9j674K40J463n61j181Q54N89q20L76P23j227J03
2229d95J573n46j459J190J067j633j33J269o68m26Q73k36j077R82O73j540m99
2246a085J829k61j578P82R19j001m81J513r03m50J249j01j299Q80J157j298j027
2263a155K020m9j232N26N94q94PJ241j254l63J262j7j607N50J313p90j158R10
2281i6J83p49N19K60q13l0J402m86j196J207O76j613%J496j88j061J052K2q80
2300b95L95Q24j157j53J335o47j117J027M46j097j47J036n06o33Q01K5j130Q30
2318a63O59r38o19J748m66r62Q48P16j091o6J232o41o60J215k82j118O37Q67r78
2337f2m85J011k47p75L48M69q00j23J324r58p41J274P2j187K25J245q46m67J009
$$ y = [-231, -298, 832, -305, -1176, 591, 620, -1054, -814, 649, 88, -1093, -239, 350, -470, -94, 629, -598, -495, 1078, 532, -927, 263, 1330, -303, -436, 833, 165, -261, 612, 376, -701, 281, 954, -586, -1085, 744, 483, -1095, -313, 606, -395, -876, 637, -266, -716, 533, 432, -867, 13, 1170, -128, -1155, 865, 816, -416, 110, 704, -190, -183, 1058, -196, -559, 703, 686, -921, -371, 942, 152, -1006, -96, 87, -662, -143, 117, -696, -726, 676, 190, -1006, 201, 877, -736, -736, 760, 572, -489, 563, 585, -295, 100, 924, -233, -386, 949, 302, -815, 212, 658, -439, -586, 450, -56, -689, 112, 137, -993, -163, 496, -442, -1061, 687, 221, -741, 107, 823, -268, -334, 898, 257, -403, 812, 530, -588, 49, 916, -62, -547, 464, 217, -558, -210, 259, -541, -664, 660, -298, -1039, 235, 307, -880, -655, 590, -256, -723, 286]
2356B86L44j044L30P44p98rJ027m27p57P99K09j168K80Q35o59m76Q94k26q41N79
2376g8L73p71k20J005l71p30O91P19j345L75R97o68n19R77Lp51K91O05p23o0J271
2397A071o02q97O77O26j238K8P58l51p78R01j00p48M02N82p93m58J205j29q29
2416f73L75P65p09j50Q08k88o15Q35J49j007M95J093q95o48Q09J71o52J59N95
2435F17p69M2M96k67r80J010L68j311L62J006p79o26J067R1j155P90M33p33J23
2454b15Q91n01o64Q24M20q93o7Q37m48l47M22q1o22M44O45j051p6R33l60p52O63
2475BL18q23P5N02m49m4P16j50p55N75P28q73m49J062K14r72N88M99r59K19L71
2496C95k82l85M98J73j055O72O61q10m69P40j16l71M30J71q30K50M92k49p87Q66
$$ y = [286, 630, -414, -84, 660, -138, -147, 880, 453, -304, 495, 704, -464, -184, 651, -8, -484, 410, 184, -657, -78, 295, -476, -696, 309, -62, -792, -101, 618, -727, -352, 645, -23, -542, 435, 438, -313, -22, 583, -140, -200, 1071, 469, -428, 249, 875, -363, -335, 423, 72, -706, 195, 95, -653, -251, 331, -462, -920, 285, 156, -673, -298, 467, -242, -392, 416, 128, -487, 348, 497, -510, -15, 1078, 183, -465, 344, 515, -137, 22, 617, -152, -110, 386, 119, -861, 149, 517, -794, -432, 574, -205, -831, 236, 327, -828, -38, 395, -338, -215, 676, 175, -489, 335, 755, -138, -205, 632, 184, -163, 259, 178, -444, 0, 645, -406, -482, 451, 91, -661, 2, 320, -503, -428, 74, -375, -419, 297, 147, -608, -33, 695, -178, -627, 435, 649, -323, 265, 764, -195, 24, 395, 113, -272, 226, 399, -656, 16, 677, -133, -602, 138, 22, -349, 81, 252, -578, -328, 164, -85, -872, -6]
2516fL78o08J56N59m77q9L34O7n04K99O55q88j08Q37l87m74K90M73q82K16N27
2537C68o26N4O83n06n49L63M96o13k83R17j05o02L30N36p64Q7N73J3l64O13q5
2558E36n42L30L74q58k4P18l29p93O13K58p14J50N40l49m34K87K84p85L58P98
2578D18n52l28O42J01p08L48O29o43J91M95k34m70N52J11o41N5M96l49n31O79
2598B61P7o03K36L46o08o8N39k35m63M60L98n10k31M21L1o04O26M11n98J62K86
2619C34m44j25P29r1q25M29M21o18m3O77l63m12N57o4p20L50N06n07m57J102l13
2640A23n93L37M14m12l52N32L6j54L98L4p96N30P12n97m72O04K57o10m8K62k15
2661a0o3L69l83j94O20j80n87r2Q05n65k33L46K77n10M73J13n22K15M37j67n88
$$ y = [-6, 372, -236, -80, 479, 2, -87, 247, 314, -190, 109, 764, -124, -232, 605, 218, -256, 34, 507, -375, -159, 368, -258, -204, 479, -27, -576, -213, 283, -330, -613, 304, 199, -403, -73, 463, -301, -214, 359, 372, 8, 621, 536, -6, 324, 698, -160, -184, 534, 205, -588, 25, 283, -431, -281, 259, -90, -524, -237, 47, -738, -380, 418, -134, -462, 180, 281, -427, -79, 550, -93, 98, 593, 359, -111, 441, 552, -89, -34, 462, 113, -418, 261, 338, -265, -29, 317, -291, -359, 180, -55, -518, -58, 340, -170, -401, 20, 51, -553, 73, 484, -114, 48, 334, -110, -235, 494, 403, -422, 7, 428, -190, -233, 444, 81, -331, 226, 162, -558, -208, 298, -209, -666, 436, 123, -470, -133, 281, -131, -483, 49, 85, -69, 329, 363, -433, 97, 809, 212, -260, 344, 601, -9, -57, 205, -10, -73, 296, -87, -281, 339, 159, -428, -520, 285, -280, -513, -167, 110, -400, 73, 186, -336, -121, 316, 149, -439]
2682d39M20L46m38O3O03l12k16K32nm06K36K40n90mO23k28m80K99L19l38j82K85
2704B8mn12N80j05m79N80M32o30M1L42r9k90K26J00j73q5K67j64k82L47L61n75
2726i4m3M45m88Q7J34j50j74J18K6p8j08N40n15p3M71J24l28L27N6k40k54N08
2748B91q9R5J06m3m10j95N49j53n16N14K00m99PK16P3k24N2K08n82J43M04n44
2770c97pO34r0l74M98k13r7K10Oon6O1K03m73K03K83m56jM83k07j97R4N2l87N0
2795a84K84k64k8J51j54k01P8K88k42J66J12j92m3L10J31j19j42M30j85m1P9P
2817B41j54j15L06j76k25K53qm38K78k3k63K06N6k89pqK95l34K52J74o6k26J84
2840h7K41m22l0L72j63l0M71j73m44L19L20l37r4K83l85j75O07L2k47j37R7k01
$$ y = [-439, -19, 327, -111, -48, 555, 243, 27, 259, 254, -152, 84, 324, -266, -270, 353, 125, -355, -56, 263, -75, -257, 28, 24, -488, 92, -13, -492, 88, 520, -110, -69, 273, 174, -116, 110, 210, 37, -48, 219, 55, -227, 120, 481, -94, -137, 308, -180, -93, 41, -109, -283, -165, -139, -217, -325, 215, -300, -373, 98, 222, -106, 221, 277, 37, -217, 291, 202, 297, 403, 360, -50, -245, 304, 151, -365, 149, 349, -150, -143, 73, 146, -78, -26, 182, -400, -257, 147, -397, -404, 230, 140, -234, 264, 51, -46, 164, 170, 164, 108, 169, 372, -101, 102, 385, -71, -72, 411, 204, 7, 101, 153, -234, -184, 100, -164, -192, -41, -195, -396, -318, -30, -272, -106, 6, -186, -229, 81, 212, 93, -49, 381, 196, 155, 234, 241, 87, -28, 278, 102, -123, 130, 122, -316, -38, -61, -324, -118, -62, -351, -358, -366, -71, -405, -153, 21, -45, -271, -87, 154, -268, -298, 74, -89, -119, 352, 179, -265, 54, 374, 37, -57, 226, -159, -334, 273, 305, 58, -79, 18, -183]
2862a83l54P76m08l22L09K83l10kJ86j86j40L55J39k86Q7L90k48l74L74J50j87
2883D9K58k76j90R8N1R8k94K20J7k40j38N75m03R7M2j47n4Q5K18o3r0j8K53m74
2907c26N79J31n08K12K84k98mJ66K7l34K46Q7j59m27L18pj8j89J57rl4j20r9K11
2931a14j02J81k50j8L31k30J58Q0J2K13o5q5K7j68K69j89r8K92Q7l24qM77l70
2954A06j76N3P4n07J04L19l34M2K64r2k33K43O5r2k18L60r2l3L55l68M39k51J86
2977B14m12K92Q0K4q7j05J82k54j95J92Q2j60o6Q1k5K48m9k48j2J81Pj74O1K96
3001A53l99K42J36r5K38m8O9m89L85K23l68Q6J62j11l78L52o5r5pJ62k38l7M2
3024h0J50k47j60L34R2m39L38J56k28k3R3j65m5L42k0j72L07j57R4O5pqj45K90
$$ y = [-183, -537, 239, -169, -491, -182, 101, -209, -211, -25, -211, -351, 4, 143, -143, -56, 334, 86, -288, 86, 236, 49, 307, 31, -159, -61, -10, 88, -206, 14, 31, -209, -347, 228, -175, -78, -36, -183, -237, -152, 66, 3, -87, -105, 148, -326, 253, 384, -124, 88, 372, 74, 70, 236, 263, -71, 175, 262, 103, -324, -6, -13, -31, -220, -63, -72, -106, -226, -325, -114, -216, -35, -285, -303, 28, -202, -44, 36, 48, 261, 196, 111, 138, -30, 239, 50, -48, 244, 331, 7, -1, 476, 106, -70, -17, 57, -450, -346, -27, -361, -319, -55, -147, -380, -137, -72, -164, -382, -22, -114, -147, 208, -160, 279, 28, 214, -198, 94, 174, 198, 111, 6, 188, -66, -261, -69, 13, -147, -213, -132, -157, 91, 42, -206, -218, -37, -30, -204, -143, 153, -246, -4, 132, 37, 275, 227, 296, -193, 192, 415, 47, 133, 295, 184, -194, 158, 93, -2, -9, 153, -85, -122, -80, 70, -177, -337, -3, 89, -350, -12, 144, -84, -107, -14, -179, -224, 118, 98, -74, 233, 76, 170, 235, 228, 220, 75, 365]
3048C65k33l30K65J9j21l2K3k0j79L34k44j23n1J45O3j18K09q7q6M06N1q1j60
3071A5J63pk03jK90j34j50K92k83k20L48m9ok13J68j03o1k75N49k25j04L41k73
3094a41j33J92P3j19j82M99j69P8l31Q4K19p1K06j36j46L53j24j78J47p7r7p7
3116a30K23j35j03M2J19k51J74j2k09J29n3J90j45L52P8r0j51Jk9J51Q2k56N1
3139B8N2J56j21N5o5m0j86L57q1k97K9M0J50l27J25J39j22K55j09l38k4L01P1
3162D8j79J09J9L17m77q3J91J49M7J0j81J48J87l04L73Lo80P1K89J62k96l1J43
3185C5k19q3P7K37l34L06K6k44Q8mRn4J55J46r2K12K13l94K06j30M8j01K22J8
3209C43k66j5j88J36j18K66n5r4k38L10j08q1rj03K78r1J27j20J5M1m4k75M2L51
$$ y = [365, 132, -198, 67, 86, -35, -67, -44, -64, -243, 91, -153, -276, -327, -182, -119, -237, -28, -115, -201, 205, 256, 175, 15, 178, 171, -32, -33, 257, 123, -27, 265, -18, -238, 110, 61, 55, -158, 10, -93, -154, -429, 120, -105, -209, 132, -141, -274, -82, -9, -128, -310, 189, 20, 98, -233, -149, 70, -1, 205, 69, -77, 276, 152, -26, 121, 44, -53, -130, 93, -42, -145, -103, 16, -235, -61, -73, -282, -153, -206, -16, -161, 191, 269, 179, 28, 29, 0, 151, 233, -23, 28, 80, 236, 115, 170, 105, 65, -121, 236, 155, -142, -113, -73, 77, -250, -125, 14, -108, 147, 38, -300, -324, -23, 48, -131, -22, -3, 314, -163, -246, -55, 94, 141, 151, -30, 118, 305, 1, 374, 377, -303, -232, 57, 219, -77, -108, 35, -184, -267, -190, 47, -287, 19, 45, -199, -111, -115, -106, -160, -5, 141, 49, 261, 474, 80, 286, 156, 204, 103, 325, 343, 77, 62, -126, 10, -108, 158, 103, 9, -229, 81, -27, -108, -117, -220, 58, -33, 94, -26, -11, 30, -14, -289, -247, 104]
3233A04k07K58O0k57j04M18N8m15L12p7J35k43k01L28m12k8J88j44j04L59j12
3254h4j33K42R5j95j57K48m5k98N92j51J5q6J1r7J52k1rM7j55Q2P9K1L1j44l5
3279EJ21o0k91j08L04J00l13N0l4J21K56J03k95M6l0J68m65J42L93j90L6K14k02
3302G1M6K43j71l73P8L64l31j4J00o8K3m9J96k8o4j64J02j35j61N78n05J88K34
3325A60k34n4p8M27m41J98J1J98k44M04l00k00J71j7j05L61k46j16J03l9j01k23
3347c65K03P0k68K76L6k42PJ53J32k63K23J9L41l81R8j18J12N0J94m08K24k66
3369a73K57r1l1M3R0j60J84l22K6Q0R3j67N6J98m6j50J39P0j58J07K24m10J89
3392D8j9q7J22PNR8M8k06K41k71J16j25Ok8l6M8o6%Pj31P9J36m14M59Mr0j41K68
$$ y = [104, -103, 155, 215, -42, -146, 272, 330, -85, 227, 150, 285, 42, -159, 169, -243, -271, -83, -227, -331, 28, -84, -217, 25, 120, -75, -232, 16, -29, -327, 265, 114, 129, 43, 54, -43, 109, 88, 79, 126, -29, 53, 132, 153, 184, 40, 5, 126, 66, -225, -333, -29, 71, -242, -192, -226, -105, 151, 254, -41, 5, -25, 143, -322, -180, 213, 23, 59, 273, 71, 117, 360, 189, -184, -106, 258, -73, -87, 13, -55, -32, -81, 115, 87, 23, -141, -39, -174, -335, 243, -262, -74, 160, -74, -128, -206, 221, -220, -22, -11, 187, -57, 347, 47, -153, 18, 1, -104, 257, 11, -105, -2, -41, -142, -365, -162, -92, -360, -84, -48, -290, -283, -130, 2, -261, -38, -19, 322, -59, 39, -79, 33, 83, 277, -131, 93, -173, 84, -7, -38, 5, 95, -65, 119, -203, -177, -97, -4, -171, -115, 83, 37, -113, 26, 96, -62, 45, 269, -141, 48, 29, -58, 64, 71, 76, 174, 222, 16, 257, -14, 102, -23, -17, -45, -81, -33, -99, -99, -92, -223, -144, -8, -422, 37, 41, -49, -190, 78]
3420G8J54l38J28J85k99K51j84J95r3M3r9J21k39K96N6m28K05J11k78Q9p3rJ39
3443A1no3k62M27r2j69j25J00j15N6M51j57l1L9J48k11n8J64L7Q3j0k0L4l29L60
3468B63j9k40J40q6j04j90K46J2l9kj90K67k35R1n2J32J16j4j61R9JM2J21j83
3492A5j86OK01j67R2K74J2k78P4o9M2M1k02N9L16p9k76K67j36q3O1j39J8J63n6
3517c0o3J94K2l91K32l2P5K5j44J43R2P6k51kl8K98o7k22j46R0nQ9K15k26NJ43
3543H2o9p3l9L8P2j04R4l7k27L37j31QJ20m9P7j67P3k5J4O3O4j28J55j62K35j73
3569D8J54j39k42N5j14L01j82j72J12k26J80J98R2m0J21k14J30k7K3J21k19l5
3591g5n5P8J51K4j51O0J22r2J2J63k30n3O8L6J46k51n4n2j78RM48k7k77M0n8k7
$$ y = [78, 232, -106, 22, 207, -92, 159, -25, 170, 77, 120, 21, 142, -97, 199, 255, -173, 32, 143, -135, -46, -119, -128, 11, 6, -57, -319, 108, 16, -153, -278, -178, -293, -237, 214, 57, 26, 65, 213, 2, -56, 108, 145, 228, 218, 198, 232, -97, 263, 244, 4, 144, 58, -46, -236, 10, 22, -17, -19, -209, 58, -177, -86, -138, -6, 110, 96, -65, 34, 35, 77, 198, 15, -171, -165, 36, -131, -39, 235, 247, -31, 43, -26, 16, 57, -145, -86, 230, 151, -125, 142, 6, -77, -16, -155, -137, 26, -30, -93, 101, 123, -268, -36, -68, 7, 32, -112, 31, 123, 199, -52, -54, -92, 206, 139, -83, -229, -139, -144, -55, 160, -66, -61, 82, 13, -60, -99, -61, 11, -93, 1, -36, -263, 74, -57, -49, 71, 22, 99, -68, 5, -20, -6, 57, 121, -7, 148, -14, 221, 48, 202, 63, -179, -124, -238, 63, -119, -291, -179, -405, -225, -27, 65, 25, 146, -68, 62, 35, 58, 179, -40, -75, -130, -52, 99, 123, -28, 32, 154, 62, 74, 237, 7, -46, 22, 58, 204, -47, -101, -153, -331, -322, 126, 99, -178, -138, -196, -223]
3617b23K61J58l5j71n8M11k82O2R3k45O8m0J46k70K41k30j03L89j22j15k08K93
3639B0j18J17K8j47l3K45k78j0K15J25j70p8qL53k08j97O43m83K04j28j02n8m
3662g2j0J01j1m4j10n0J18J65j34J7j44J33k2l9J87Q9j61k0j35K10l5Rk18K53
3686G7N8o9N0j91J80k08K01m6m4j11K22j86n5Q7j87Q0K81l7l18j07L71m05J69
3709a88K33k4j55M3J95n4k20M95j97r8q3J78j35O8J56k88J60p9L2O5j27l0K8j82
3733b07L32k44j04J22J35k59J80l9m5j65J37mJ39p4K17R5j33P1J07l70K60j75
3755b4k5J82l8q3N6j92J04j45K00J11k71J61l7O4k76K62P4k45J61j68J02k35M93
3778B31m12J01J13J13p0M2j73J93k25J52J19l27N1K79n7k08K68l30P9j73L13l50
$$ y = [-223, 38, 196, 161, -10, -68, 343, 61, 123, 216, -29, 39, -1, 145, -125, 116, -114, -217, 172, 50, -65, -273, 20, -98, 19, 47, -100, -133, 112, -166, -176, 39, 164, -6, -84, -92, 261, 53, -144, 499, 16, 220, 92, -10, -68, -72, -82, 19, 8, -36, -146, -196, -78, 87, -47, -30, -174, -41, -63, -102, 85, 174, 13, -7, -142, 68, 33, 42, -176, 77, 135, 66, 116, -75, 105, -103, 98, 52, 8, -103, 119, -67, -122, -35, -222, -142, 139, 102, -216, -323, 48, -357, -188, 45, 21, -134, -91, 104, 50, -170, 325, 128, 30, -53, 125, -10, 58, 214, -74, 86, 7, 39, 104, -23, -53, -25, -207, 125, -119, -223, -101, 34, -225, -45, -84, -129, -294, -157, -161, -22, -96, 121, 216, 83, 154, 261, -109, 151, -24, -49, 133, 95, 12, 68, -124, -20, -165, 35, 146, -125, 36, -1, 63, -213, 49, 123, -122, 39, -129, -27, -262, 231, -181, -80, 33, 146, 76, 118, -55, 138, -87, 65, 184, -143, -92, 187, 130, -78, 190, -140, -61, -234, 79, -271]
3800b71R6N7N5J86j96K7PJpJ80j39m5lP4j58Q6J48n8j4K04k00j57K47l34J82L0
3826bj57J05N6j41K1j86L38n9n4J65k02M9K16J4j33qK52j4l89O0K4J51k40N42
3850D08n40M0J78N9m3k00L73k43q0J59r0l25K69O6k32K98k28o7J14K84j2j74j18
3873a04J28r1k19L19J09j37L2M3m75M94k14J91l3K10j68j22N5j82L6n0m1K14Q7
3896H2j52Q0J6l50M76j55O3j20R6q4l3J25N6o3k5J93j63P0Rj12P8j11J26r5J79
3921A86nk69K02j51qj5p7K43n3k74k5L19kM0l65j66M97mn3oPr5R9R9m5l22N72
3948C29k87oj01M8K16q2q0K73k84j83P2p2J95N1l3l55Q6m4L0J39p8L34o2q1k96
3973b71L97n5j86K36k57N87l99J86k90K6K79k80p7K63k93J30J68j53j91M7P5j1
$$ y = [-271, -175, -118, -63, 123, -73, -46, -39, -38, -45, 135, -4, -49, -52, 22, -136, -50, 98, 40, 26, 230, 30, -127, 120, -214, -32, -2, -159, -54, 2, -139, -118, -304, 34, -25, -79, 86, -116, -67, 149, 163, 30, 22, 274, 260, -129, -69, -45, 106, -134, 408, -132, -92, 86, 145, 102, -98, 275, 32, -48, 111, 21, -304, -35, 31, -201, 97, -131, -198, -84, 200, 188, 14, -104, 24, -67, -286, 33, 142, 5, 37, 80, -395, 99, -115, 76, 43, 253, 85, -37, 18, -164, -128, -178, -219, -5, 82, -70, 10, 26, -324, 152, -3, 60, -60, 36, -48, -81, 44, 100, 37, 12, 205, 42, 112, 121, 9, 87, -24, 102, 7, 186, 181, -88, 114, -37, -45, -60, -137, 106, 53, -221, -246, 73, 71, 111, -254, -420, 77, 73, 20, 14, 21, -74, 25, 124, 79, -243, 329, 42, 36, -65, -17, 199, 117, 37, 310, 26, -157, -85, -157, 38, 89, 56, -299, -213, -257, -227, -88, -166, 168, 106, 25, -271, 126, 71, -115, 121, -136, 451, 52, 238, -52, -26, 253, -27, -104, 159, -134, -4, 164, 11, -180, -133, -58, -69]
3995f9O2J70m18J12k2J19K31j45R6l20K61PJ05k28K67n30L14%J72Qk15K97n57
4018b83Q3J73N0l0j57J58j77J89J63l51J60j67M87m30Q3j34J29qK44k5k63OL01
4041B01k30R2J3j60J72O3Mj00j17J27P0j56J34Oj06k92K29J65l49K24j03K5J78
4064I0j40k51M02k44p0LL14Qk42M05j22j85n9J09K24j57j71J35j38K7K8J07k09
4087a36K7L30m05J95J51j37j09J43P4j69k16J34J08k1K59N8l11n1K8J14J04j03
4109F7j8K34k40K69j67k15K38j06m04N14j95M2J8q4r3M6J87j83Q0n3K91m97J83
4132h6J03J79j23P7K7m95L64K54k26k39M14j28j64n8K74j94j18K97j57r1q3L87
4154B14l18k9n0K62j58J11J80j40k83L07O0lm07L53Qj9N1j57K6m2J13k13J44j30
$$ y = [-69, -7, 163, -255, -143, -165, -46, 185, 40, 136, -184, 77, 84, 189, -39, 228, -302, 12, 12, 184, 192, -23, 274, -283, -200, -27, 23, -7, -164, -6, -183, 6, 169, -182, -22, -189, 298, -132, -49, -183, -54, -62, 182, 157, -106, -100, 201, -29, 63, 76, -84, 88, 151, 155, 55, -62, 65, 135, -21, 113, 119, 13, -279, -50, 115, -234, -10, -113, -88, 90, -50, -301, 101, -143, -213, -210, 104, 112, -130, 275, 153, -32, -91, 18, 242, 85, -86, 49, -89, -62, -34, 73, -136, -109, 221, -184, 11, 162, 25, -84, 59, 133, -36, -252, -118, -10, -31, 228, 286, -25, -76, -48, 66, 170, 67, 49, 283, 43, 312, 145, -70, 168, 62, -342, 172, -23, 19, 37, -47, -140, -94, 93, -90, -10, -63, 228, -269, -86, 17, 196, 73, 150, 177, -318, 46, 300, 74, -165, 249, 121, -43, -101, 173, -21, -139, 158, 1, -90, -173, 214, -104, -133, -183, 79, -79, 32, 212, 72, -211, 96, 156, 153, -254, 99, 107, 88, 139, -18, 8, -34, 79, -134, 10, -120]
4178a20J30Ok9n8n8K84j69J80k7m35N1L07J42j01J7j07N7j04j64K49k05n2M01
4201A95j24j66L43j64j40MM9J34n1J46J83k14l18K58k79nJ23N0K03k50J14k80
4223a89K77j20m7lQ6q8J35j17R6J41l43K17J44m22J98L09j11o6j03p1O8P2j5k53
4247b05J43P8n7o4K39rj40J12J34j79j70J14r7l7K30j09j7j00PJ4J54q5m5K66
4271A77j97r6K96j29K2j17j22K47j73m7R2J99k38p8J93j32M4K14j71p0J1o2K0
4294a17j74K85J22Qk42L8K3j2O8Q8j20O9O2k27K24r5p8l1P1J73k27O3L08j56j98
4319g5q4M92l33K4M2j22r9n7Q3L31l82K28j07M8J33k1j91P5J70j65J04q6J55k46
4343h3K17j33j51l8K17Q7k03m3N86m97j81L20Q5j24Ok68K67j28k3J66K9R6k67
$$ y = [-120, 10, 16, -13, -71, -129, 155, -14, 166, 139, -296, -245, 62, 204, 103, 120, 13, 70, -34, -198, 51, -154, -206, 195, 71, -95, 248, 84, -56, -52, -3, 131, 80, 226, 409, 195, -123, 135, -144, -149, -26, 24, 227, -23, 91, -189, 88, -32, -79, -82, 4, -84, 51, -66, 30, 171, -172, 45, 189, -233, -35, 274, 163, 97, -6, -77, -9, 63, 48, -205, -62, 16, -41, -105, 134, 125, -15, 97, 231, 52, -118, -4, -101, -138, 92, -17, -34, -134, -127, -113, 41, -44, -89, 177, -20, -116, 180, 51, 73, -44, -166, 81, -92, -139, -47, 152, -86, -164, 29, -103, -59, 155, -16, -86, -75, -137, -117, -291, -6, 116, 124, -118, -80, -57, -69, -1, 87, -33, 36, 98, -129, 95, 0, -78, -109, -38, 135, -92, -29, 279, 123, -75, -159, 333, 0, 24, 66, -56, -155, -212, -129, 202, -180, 48, -59, -11, 122, 101, -90, -15, 155, -10, 94, 8, 163, -83, 134, 1, -150, -188, 29, 116, -87, -130, 456, -41, -222, 98, 183, 59, 65, -203, 64, -64, -87, 79, 108, 204, -63]
4366f3k01M60q5j62K5j28L19k82K79L2p2k28N4m9j44K33J19k54J05p5j90K45J57
4389I5L5k94M93o48J85J73l0P6j65K80m04K78j70J68P4o4l7k0m4J68l42K82k63
4412a74J26q0J20K23m87K43J87l71J45P7Qp9Q3q4o7L36j90l0l0J51M0J3p5k63
4436a78J66k3Q1j09J77Lj55J92k13o3K44j17j0J74k6j17o6J48k68Q3j63L71j49
4459a8Q7J4r3m4K15N1k49J08k95J31R3K9j56J09P5j4Q1j69j25K21j96K30j12n3
4483h0L03j70Q2%j0k8q0j3j48J72R2MLM6m0j88l4j3J83k36J47K48k41OJ16j08
4509A3k02K61o8q3K73j45K09l46J29J53k46l14M49j8oQ7j19j08J58O9j43R0K75
4532C68m51K72l44K56L3j83K05k76J24j77J81j54L9J15K23k29Q0j27m0l2L20L2
$$ y = [-63, -264, 196, 111, -51, -26, -154, 165, -117, 162, 194, 122, -106, -52, -101, -245, -12, 107, -147, -42, -117, -307, -62, 95, 130, -164, 329, -319, -134, 39, 9, 85, -80, 200, -204, 74, -96, 72, 146, 82, 45, 25, -19, 149, -193, 89, -174, -48, -128, -8, 215, -272, -29, 158, -213, -68, 9, 17, -62, 21, -63, -130, 206, 16, -14, -44, 107, 147, 160, 85, -178, -12, -35, 46, -63, 114, 117, -38, 154, -59, -122, 122, 5, -5, 169, 143, 26, -40, 108, -160, -77, -240, 131, -18, 69, 83, -10, -54, 161, 212, -37, 71, -224, -93, 0, 29, -127, -18, 57, 43, 124, -45, -170, 51, -145, 85, -27, -80, 223, 53, 135, 135, 125, 97, 17, 4, -144, 28, 120, 124, 127, 173, 133, -55, -89, -102, 81, -155, -8, 240, -1, 5, 121, 13, -189, 72, 4, -79, 194, 49, 258, -88, 41, 194, -52, -366, 83, 65, 59, 146, 27, -81, 77, 146, 3, 93, 368, -83, 189, -155, 101, 134, -49, 156, -120, 4, -173, 8, -146, -107, 8, 231, 2, 82, -45, -85, -117, 203, 235]
4554B35k32J89j74j23K17j69q3L88l47J58J43K2j62k81J1M24k23p8O7J25n6j23
4576g2r0J66j58K50M0q2k42P0J96J82n38L53n8j70J44kJ87M7q7k75J24RJ38k66
4600a34O5j5K09j35k23K17P9j40K8j26K16q7M2K15l04J48j58J31O8Q5j36p9j50
4623a84L62j1j32j30R5OJ78m5k04KJ33j65K25L5m6k03J45R2l85J34n7K38k47K21
4647E7n0Pn4J8Q9J14k00J38k04O7n6J57n2K28l02m4J83k41J22j22q2N21l19M0
4671A5l3j72K35K5J18j62J59l52J85q5J96k61n9K46q0r8K20k36j7p6L99M0k77
4694g0R3K9j4J66k38N9k07K13q3K4J50j32o9J05J44k97M47l13P7k20J71N8Q3l35
4718a59K7k6J56j6K5J68j83J33j24j86N3P1J64P3r8L0j8o0q0k0K71o8l37m1K74
$$ y = [235, 3, 192, 18, -105, 112, -57, -140, 248, -99, 59, 202, 224, 62, -219, -208, 216, -7, -85, -18, 107, 51, -72, -162, 4, -154, 96, 136, 54, -188, -118, 78, 260, -278, 75, 17, -153, -9, -11, 176, 223, 136, -139, -15, -6, 132, -134, -69, -84, 125, -10, -233, -16, 63, -77, -49, -175, 41, -46, -4, 211, -93, 55, -103, 28, 96, 181, 45, -34, -184, 178, 167, 35, -95, 0, 6, 184, 139, -65, -63, 70, -95, 130, 165, 119, -84, 61, 153, -232, -98, -155, 83, -164, 57, 7, 14, -40, -22, 67, 181, -19, 119, -85, -18, -74, 83, 31, 259, -43, -87, 96, -145, -23, -145, -227, 294, -25, 15, -18, -190, 45, 70, 188, 26, 185, -167, 18, -67, 129, -132, -191, 55, -25, -123, 97, -139, -156, -232, 167, 207, -70, 23, 52, 38, 204, -34, 25, -182, 31, -52, -28, 122, -10, -79, 26, 170, -127, 320, 7, 84, -136, 35, 93, 176, -159, -132, -158, -2, -18, 7, 175, -8, 125, 1, -185, -132, -61, 103, 176, 78, 108, 90, 30, -50, -70, 201, 133, -204, -245, 29]
4743B9k19k1K13J84j61j08J11j57O2K84kRj80K4Oj77J55P3k59R6J04P6J00j69
4767G3J27j67r4j83K49R4P5l37OL05j72J71k21k0K84o7j46P3j91Q5J36P0k5j90
4791f5J61k08K32j60R8J60j62nj25o1J82p1j18K66k86O0K4J03k78J41K45k22k3
4814a12L8L40j28j02m2p5J51j69M4lO5k03K31k16K7K52j63L7J97k34L5k53L88
4837A05p2j52J04P0k7l51L39J32p0K60m60K95k81p8L37k27P1J17k2R0m34Q8Q8
4860g8K02j49J16k60M72k05k69J09k4J53j09j23K29k46K16n5K34q2j86L11j95
4881F1j08J15K63k91p0P2l6K91l07L4N8k8P4q9Pj37j16K85j89L3J47n1j53j5K39
4906H9k56N4O4M3n2J03K0j0K13l86K71R6l36K83j70K01n7j1l46J17O9j04J83r8
$$ y = [29, -190, -211, 2, 186, 25, -83, 28, -129, -67, 217, 215, 224, 44, 68, 74, -103, 52, 125, -134, -38, 66, 142, 242, 73, 200, 33, -61, -244, 5, 99, 174, -163, -157, 148, -24, 147, -74, -94, 190, 123, -23, 50, -141, -56, 80, 150, 125, -65, 96, -112, 120, -40, 58, 218, 56, 51, -74, -135, 47, -24, -142, 124, -162, -102, -78, 25, -253, -112, 133, -89, -112, -74, 266, 138, 36, -6, -81, 70, -99, -55, -58, 7, -196, 35, -181, -154, 98, -65, -28, 169, -65, -30, -283, 105, 33, -119, -15, 55, 28, -323, 16, 148, 78, 338, -122, 173, -108, -186, 151, -76, -5, 112, 90, 180, -254, -166, -78, 124, -25, 91, -169, 303, 98, -171, -62, -86, 67, -42, -165, 64, -182, 34, -21, 213, 131, -55, 256, 61, -47, 68, 331, 40, -30, 42, 6, 297, -10, 24, 82, 54, 128, 39, 46, -91, -207, 78, -111, -78, 69, 18, -135, -150, 89, -167, -113, -49, -6, -58, 45, 65, 55, 268, -118, 153, 249, -87, 196, 26, 227, 170, 159, -187, -70, -1, -105, 78, -20]
4930b0j80J83P4R9q1j81J44j59J2Q9N7Q4l20K52k08J15q5K92m9l73J86K80k25
4953a4N1j9o4Q3k4j30o2K00J92l41J7j01J65J38j35J58j79M5k6J64m7k76K47J8
4977F0K57k17j22J80j80Q4l2J23K9j90M1j76J77R1j95J51j83j12p1J23N8o6M12
5000B42l40J35j48j30L09j75J77j74L35m38J86j51M14n60L71P8o6q6l9J71j93
5021h2M6r6J65J36j28k0j80m8K04o3K38k52Q1o9P6J16o1k00J19j08J47j5K4P9
5045A09N0l05K89K2q0J21j28j4r0J13J00J7j67r7l4O9J4Mr2j24K42O3K7m2rJ76
5071B34n48J87L75l36k0J41J21k70Q2j75K79p4K45k60J71k0j40j97L35j67O5K62
5093B90l69N3r5j41J88Q7K9k60M04k94J41o6J10j18K3j41J07R2k87M17k12J68
$$ y = [-20, -200, -17, 57, 156, 75, -106, 38, -121, -109, -20, 37, 121, -199, 53, -155, -40, -125, 167, 118, -255, -69, 211, -14, 37, 18, -46, 37, 13, -117, -179, 21, 213, -128, -111, -212, -47, 91, -44, 114, -65, -20, -46, 118, 71, -205, 42, 60, 317, 100, -22, 158, -22, 62, 30, 153, 182, -8, 33, -143, 34, 125, -70, 81, -102, -214, -285, -162, -104, -170, 242, -98, 37, -111, -241, 68, -107, 70, -104, 231, -207, -21, -172, 242, -318, 53, 131, 65, -21, -60, 111, -82, -36, -132, 33, 169, 41, 21, -159, -207, -3, -66, 172, -80, 1, -68, 8, 124, 63, -137, -18, -126, 21, 6, 30, 109, 159, -146, 143, 165, 85, 206, 78, 64, -26, 87, 187, 204, 37, -60, -94, -25, -11, -7, -99, -223, 19, 82, 109, 67, 58, 234, -314, -127, 248, -88, -108, 33, 154, -116, -34, -209, 70, -4, 241, -19, 152, 132, -8, -205, 130, -37, 28, 290, -79, -26, -121, -262, -74, 13, 42, -218, 186, -108, 33, -33, 77, -41, -18, -159, -52, 40, -247, 170, -42, 126]
5115A26q7l03L10O3j05J19j43j35n1K04N3J53o0n8k80M2k1O0J40K6k88K33K31
5138B29l80J14J62k82M10r4j34J40j50Lj07j51K47K5k70L60l3P4k80O6J53j81
5160g9J11j23Q3J19k01J02J2l57L05J47J3j55J42K33l18p9o2M17k09j45n8M78
5182C76k65j89L08K9l18m1K03j74O7j31J12O1J15k00r9M5M8P0j65K30R2J08k88
5205fj29K46j1L0l29K62j42L20k59Q6l4o4o3P6J69k59K59m0j61j40L20k74j8J14
5229d7P4k34L85j38jj8Q2k05M1K68j45j44K61J37j56k23J08j20J21q1J0QL4J59
5253A76j16k8m8J29L5r1j44k0L46l64J2M0J3k19L35N0M2l59K71P2k93N07j65k54
5277g3J28n1k0j57J56J53j81R2K1p3P6R2k05J21j96m6K58j78k8M27j90j78M1n1
$$ y = [126, 39, -264, 46, 109, 4, 123, -20, -155, -206, -2, 51, 204, 144, 86, -194, -152, -173, -113, 27, 53, -235, -2, 229, -151, -37, 125, -157, 253, 159, 25, 165, 15, 18, -89, -240, 7, 32, -238, 122, 89, 163, -117, -51, 102, -79, 32, -91, -8, 111, -90, 12, 24, -333, -28, 119, 132, -23, 119, 352, 34, -45, -107, 310, 101, -44, -102, 376, 111, -78, 230, 259, -59, -100, 103, -71, -4, -135, -23, 38, 153, -47, -146, -101, -53, 17, -148, 82, 174, 282, -6, -135, 111, 100, 130, -199, 63, -79, 241, -18, 68, 34, -30, -93, -17, 152, -107, 152, 112, -49, -189, 131, -143, -161, -47, 27, -207, 178, 40, 39, 21, 103, -102, -61, 207, 62, -82, 179, 316, 160, -63, 45, -75, 46, -35, -25, -17, 17, 176, 60, 32, -16, 113, 148, 57, -87, -107, 239, -125, -113, -73, -60, -279, 56, 106, 148, -211, 60, 132, -161, 346, 181, -73, 55, 4, -16, -173, -17, 136, -45, 47, 68, -5, 71, 163, -42, 79, -117, -163, 95, -83, -111, 316, 126, -52, -11, -62]
5301f2L4j26J69j9K09k09R6k37J09j63M34l30J02j61J38J65l45P3k44J94L73m18
5323b18K14j28q6K06k93L89j88Nl5J7J95k10J86j21K30j54K21l01J01j57N2o2
5345a37K88q5o4J65j22l06L21J24lk65K17l81L55j88J04q6O6Q0k88K67L7M8P9
5368B26l29J00j7Q3K11l13j00Q2J80j08k40K13OO8j45l1j44K30K2j46J54J9M8
5391F9J85k61M2q4p7L27r8K8j86J41j07j09L09K47m20j91K6J74R9p4R3N0J3k33
5415c7k27N28j72j30j1J8j8q9N6R2q1K4J73l8k30L0L6L29j98J00j02j15J18k61
5439b05J57J91j47K12k86J28j11K42m60Q2M16j77P8K8k61N7M2j17k34K72q4J55
5461b2K1P5j57K53k43R3n6K02j33P3j02N1m1l2j49j0K47L3l8j92j0N6J79k63M13
$$ y = [-62, -28, -154, 15, -4, 205, -4, 92, -145, -36, -199, 235, -95, 7, -154, -16, 149, -196, -123, -367, -173, 200, -218, -4, -132, -218, -12, -305, 84, -104, -99, -134, -117, 78, -132, 54, -67, 163, 9, 230, -71, 30, -127, -75, -137, 151, 66, 2, 167, 45, -261, 60, 184, 181, -84, 133, -248, 107, -81, 23, -63, 3, 83, -205, 62, 99, 147, 226, -103, -3, -20, 63, 274, -39, -139, -57, 123, 15, -225, -12, -6, 62, -83, -114, -258, -28, -6, -152, 2, 21, 69, 254, -7, 35, -49, -126, 201, 103, 131, -55, 86, -21, -130, 179, 426, 6, -185, -159, 15, 114, 40, 133, 183, 196, -37, -264, 264, 92, -38, -49, -31, -49, -138, -82, 10, -71, -47, 126, 88, -142, -112, -76, 253, 55, 155, 53, -62, 56, -205, -48, 143, -4, 208, -78, 50, -61, 181, -279, -197, 219, 42, 120, 148, -113, -56, -14, -131, -365, -93, -177, -22, -1, 74, -83, 170, -73, 20, -36, 166, 33, 106, 4, 55, 14, -18, -167, -177, 70, 103, 65, -127, -137, -81, 98, -165, 248]
5486B48k46L83m18J77l28J65J2j02L11l25K36k20l7L28j10j90J02J89j64L8J88
5507B37j03j41j4O2j8j30J1j23L48j01k39K93M9k14j65K90n8m4N8j8R0j3J11J6
5531A84k31N2m8l5j07J21N1J98k56R8N7p8j04J32r9k03K54q6q6J04m0N7J48J23
5555B06k10l6J02k1j49K77k13k02L92j11R7j31R5m5o3j17L94j72j31L15l08J04
5577G3K13l70n1J72J2p6L9P4j10q7K86q8j12j73J87k66M10O0k1Kk42j29J74K0
5601ck2J19q6R0J4k09K77k75j6J69Q4j97J66j90O4J25j03k22L23k24J09j38K30
5624H5k89K77p2j79K57p4N5j5k8m1K67j27r0L8k96L04l66K82j1J42q9j41J22L8
5648D9l6J38j14l4K42l10J14k31K65p2l1l18K88J15J10r6j4k36J27o6k2K10r7
$$ y = [248, 2, 385, -33, 144, -184, -19, -7, -109, 202, -123, 113, -107, -144, 184, 74, -116, -14, 175, 11, 49, 237, 134, -7, -21, 41, 23, -107, -96, -219, 129, 28, -211, 82, 131, -83, -248, 42, -16, -60, -2, -20, 70, 57, 168, 184, -47, 5, -43, -78, -185, -64, -13, 185, -71, 27, 84, 6, -98, 34, -65, -268, -14, -100, -186, -82, -122, -65, 83, 206, -4, -40, 62, 41, -108, 169, -44, -246, 146, 35, 132, 1, 96, 51, -12, -129, 265, 93, -38, 277, -31, 73, 286, -84, -135, 37, 49, -27, 12, 86, -24, -111, 175, 87, -25, -198, -11, -277, 133, 193, 172, 174, -68, -197, -23, -3, -25, 94, 8, 98, 112, -97, 180, -95, -111, 58, 142, -55, 111, -79, -15, 110, 7, -215, 108, -116, -7, -145, 85, -204, 73, 1, -178, 79, 5, 60, 45, 17, -24, 243, 116, 26, 64, -232, 72, -294, -12, -23, 119, 30, -111, 11, 49, 13, 151, 37, 3, 245, -65, 49, -182, 83, 11, -20, -338, -50, 65, 175, 79, 65, -171, -44, -110, -132, 78, -19]
5671a9nm5J27M4j91Q2Oj00L41l25R9j16J68j06k63L56j43M4L6R8j1%jo9J48k31
5697g6P9q9j69L09N2j75o1J23N6k56K25j85J23n5J51k33L0J83K69o94M67m6J0
5720C8p4J14l2R8Rl32M22k32J3r2p4K38j67Q8Q7k10K1MJ09j01p9K32r0K7O3J14
5746A94j78j29J80J71l07K41n0k14J60J7j61k1J93j64p5K20J30j28P4m8j23K52
5768B34j42J41k79O5j29J31j94O3m7J06K49k02J05j57L8l5j74Q6L44l05J57p0
5790a5J29q4N2m7p4J46j15p0j71K43K0k47l8K56o6r3L28Rl42LJ37J22J42J76l73
5815B8M7k85L52j63j70J92K58k97K46k24L9Q7k07J93k26q2J17J07M9k2Q6n6M05
5838D74m73p1j5P1L20j26k30j46J28J58j45J6J49k07K48j19L4j80o4J90J43k63
$$ y = [-19, -24, -69, 58, 102, -89, -7, -1, -101, 240, -85, 14, -102, 66, -40, -303, 53, -90, -46, -10, 88, 77, 77, 76, 7, 155, -76, 3, -86, -255, 54, 106, -69, -130, -7, 49, -207, 18, -167, -44, -99, 52, -181, -151, 32, 301, -393, 74, 28, 38, -36, 78, 46, 144, 153, -179, 243, 11, 24, -68, -142, 96, -71, 17, 104, -106, -85, -81, 28, -73, -152, 80, -10, 17, 80, 194, 16, -113, 67, 238, -69, 172, 122, -92, 68, 85, -76, -97, 96, -68, -143, 77, 207, 79, 153, 105, -18, 234, 92, 233, -46, 19, -110, 21, -173, -110, -157, -51, 198, -4, 101, -56, -18, -53, -227, -141, 203, -102, 55, -15, 114, 30, 82, 35, -39, 107, -8, -78, -249, -6, 14, -233, -271, -15, -81, -174, 154, 163, -179, -176, -39, 83, 225, 401, 28, 75, -210, 142, -21, -191, 1, 259, -38, 208, -16, 23, 110, -97, 96, -130, -212, -95, 12, 61, 39, 125, 69, 474, 1, -70, -85, -14, 306, 180, -50, -196, -68, 90, -55, -39, 110, -97, 151, 32, 66, -114, -178, 12, 155, -108]
5860a08K90l11K04qj47J05p0J6k5O5j37L27j67K00l72J26j65R3n9L2J45J23l24
5883a67L7n9K01pk63L43j58l22L54J24k1l3L6J01j68lL46l14Q6j64N3l17L49j58
5907a24k8O5m08Q04l95J15K32l71l4J16l8J36K1k67K26k5j14J53orm5L8l46K41
5931f3N0j68K02j31K70j54l2P0L27j99k56q7J16j2j47K13R3l7K15k79k06M13m56
5954b58L68K2l50J75K63q8l44J78L29m45M2k14K48J04jq2K06m87K40p4J40J58
5976A30j00j3P5k71K34K8n5P1N1j49m7L36k12j03J35j54j4L61q8k04k03J01J29
5999C8j48L6q4J03J62J0p7q4J53k52L14m46L04J9r8k04K51p3J64M9p0j42q3K96
6023A38k88k2J00p4o8R8P5J33k38J06M1L0L6Q8L8k88J02K8K34l98L50k15K75q9
$$ y = [-108, 182, -129, 75, 67, -80, 25, -45, -29, -54, 11, -126, 201, 34, 234, -138, -12, -177, -84, -143, -111, 34, 157, -167, -130, -189, 12, 5, -258, 85, -73, -395, -41, 83, 62, 29, 65, 166, -2, -5, 341, 27, 113, -51, 2, -315, 34, -124, -152, -87, -495, 309, -86, 29, 261, -110, -144, -28, -66, 70, 91, -176, 50, 25, -89, 64, 58, 49, 4, 42, -304, -63, -13, -181, 21, -110, 160, 6, -26, 44, 371, 172, -84, -171, -55, -67, -214, -1, 92, 55, 270, -9, -215, 198, -258, 110, 132, -218, -43, 220, 132, -212, -34, 295, -150, -108, -322, -74, 30, 29, -53, 153, -334, -94, -168, -28, 130, 30, 17, 92, -179, 55, 83, 28, 99, 150, 1, -46, 290, 78, -25, 110, -44, -58, 303, 215, 11, -192, -91, 38, -110, -74, -158, -55, 107, 117, 40, -44, 109, -143, 171, -275, 29, 48, -50, -254, -3, -76, 88, 137, 67, -75, -158, 138, -150, -172, -72, -146, -214, -116, -41, 92, -146, -40, 1, 31, 67, 155, 193, -95, 7, 35, 269, -129, 221, 6, 281, 192]
6047A92k10o9j0K67J29j97p5j16p4K94j37J03j11k74J38J05NN9Qk05J28r8K62
6070A14l07K54k62K30M1k03K78j92j83K73j81K03n4J25J20j74j15j94L43j8J12
6091B10m10L82k06K16l36K05k20k7k4J70J89j24k97K15Q6j65PL7k41K15J62Q6
6113A30k79l4L53l38M32l5k16l30J13K63j38N3J90j61Q4k56J9m8N1o1L10p6r4
6136f8O1J39k67j16K57J88k08J39k62K31n3j14j55M7o3J84J79J09n02K23n8L53
6158B44j38p2M6r8QkK4M9j4Pj25L8QN3O9m6o5K2q8n0J49k6J50j06L2q7k6n4r4
6187a92J96J01J5k24M75m09oJ63k87J34J32k60K08p4j6J29r9L3j74j12K95q5J94
6210A37p4j32j8J84NP1k47J26k3J50j68no3K7K92m07R2j36J57O7p6J82j05k24
$$ y = [192, -18, -87, -97, 170, 299, 102, 27, -89, -163, 131, -6, 97, -14, -288, -150, -45, -40, 19, 27, -178, -50, -148, 114, -193, 61, -201, 29, 70, -133, 145, -47, -230, 43, -138, 65, 11, 136, 256, 82, -33, -227, 116, 98, 210, -200, 182, -24, 192, -144, 61, -159, -186, -210, -40, 149, 25, -272, -57, 29, -136, -129, -92, -333, -118, 44, 130, -149, -183, 170, -168, 264, 229, 13, -317, -204, 59, -79, -26, 164, 3, 87, -169, -150, -198, -147, -208, 102, 26, -68, -7, 132, -135, -251, 6, 194, -14, 125, -137, 94, 41, -73, -228, -181, -244, -60, 119, 228, -274, -51, -109, 244, 106, 34, 80, -18, -10, -12, 12, 61, 47, 54, -71, -33, -25, 28, 97, 51, -14, 8, -80, -130, 19, -7, 143, 37, 69, -18, -44, -98, -192, 4, 105, 120, -104, 371, -38, -44, 119, -168, -34, 98, -162, 46, -28, -44, 85, -14, 19, -155, -267, 28, -57, 137, 63, -69, -87, 97, 102, 173, -74, 52, 29, 179, 11, 6, -57, -30, 262, -145, -53, -189, -32, 35, -41, 141, 36, -188]
6234a88k7J54K4J26rJ68k45J22r6o0K30l90J83K51k50K48k28j13J96k9M2m1jk57
6258a90J10l1K29j15J78k96q7J86p4j7K37k4j46K09j79K10k94J39m5l7J66j20
6280IP7k4j31j57L40j67j62L9K77m0k7kJ09j62p9j2l7K46J37j09K49m41J35j51
6304h3J46j2o4j27mk5K14p5J01j61J58N4k89J43j4O2j02j04L25k92L61j60n7N
6328@N0l0p2j3K07J04m38P0J20Q8K07j73k53M01k49o5l2R5M2k35Q9j72O6R5L3
6353f5O6j31K38j91K0R3m1j56K60o8j7K23k35J23q0j56L39k43k3P9l4j0p1K24
6377A44pk66n0J83K31k40J24k17Q2J48k50M0m8J91l03J14J98j01J08o4RJ49j07
6400F8K24j85l28J65Q4J0Nk0m37M40P2o9r6K66k19J15j01r6m2j65K36J77o5L2
$$ y = [-188, -215, -61, -37, 89, 80, 248, 3, 125, 29, -31, 199, -191, -8, 243, -7, 241, 13, -100, 96, 67, 109, 68, 67, -190, -80, -111, 118, 3, 181, -115, -202, -16, -90, -107, 130, 106, -40, 169, -10, 200, -94, 45, 0, -37, 129, 9, 86, 62, -69, -226, 114, -53, -215, -176, 101, 61, 34, 32, 141, -21, -100, -112, -149, 97, 234, 125, 374, -67, 68, -83, 63, 51, -13, -140, -144, -169, 45, -30, 71, -90, 68, 122, -167, -24, -38, 24, -78, -182, 143, -149, 212, 52, -5, 0, 50, 20, -52, -65, 142, 246, -192, -122, -2, 86, 293, 120, -133, 268, 19, -46, -78, 17, 59, -176, -87, -259, -193, -98, -65, 1, -130, 108, -83, -63, 30, -11, -167, 93, 25, 8, 231, -4, 119, 39, -117, 222, -21, -44, 35, 1, -9, -80, 144, 137, -129, -179, 4, 235, -5, 119, -98, -16, 132, -118, -78, -126, 65, -238, -124, 74, -27, 81, 17, 26, 175, 68, 292, 107, -221, -56, 28, 38, 43, 23, -414, 26, 98, 29, -67, 199, -20, 95, -6, -102, -144, -309, -73, 104, 39, 71]
6424G1k88L82k09K78l01o4K11o9J36L8j65m7M3p9n2J02J26N6r0QN2j77k79K74
6448d3O7l7J23K18k45Q3l02K23J05l57L16l32M63k65N7J62m08J85n5K86l13j8
6470h7M8L84l31j30K25L4j33m5M8L52j76p3k72j03K77l11J85j10J96l5m7R5j56
6493a65L40j04k3k27K22N6j11J40k88P1O2J4qk9J23m6p2K0j76P5j9P8P9l9O0q2
6519d9l2J05mn3j23K70j12q3o8M6j60J99K6j01K39K14l17m1K68l07J04j0j41R6
6543c4K72j71R2j57q3J25r7%P2n1J39m2j45K04L3j82N3O2J64k57N8K41o34J98
6567a40R5J98l40J19J33Pj55J74k13j38L11M2nk00J11j24j19K62L9q2Q6k78K54
6590C7m88K94K45L8NR8J0j62Ql71L91j99J97o6j00O5j23J83O1k48J81m5k20L08
$$ y = [71, -217, 165, -44, 234, -67, -131, 80, 11, 147, 185, 20, -27, 16, -63, -115, -13, 113, 169, 79, 87, 139, -38, -317, -43, 24, -13, 110, 328, 83, 166, -136, 87, 192, -165, 151, -181, 282, 17, 74, 236, -172, 13, -42, 244, -69, -87, -39, 345, 14, -116, 109, 143, 10, -35, 13, 365, 189, 116, -156, -259, 18, -293, -108, -218, -22, -57, -104, -9, -165, 175, 71, 48, -179, 43, 99, -12, 128, -160, -89, -27, -13, -21, -50, 73, 27, -45, -25, -201, -126, -145, -67, 12, -27, 33, -49, -81, 24, 20, -33, -156, 114, 2, -81, -149, -103, -263, -64, -38, -139, 100, 314, -3, -44, 224, -83, 21, 11, -130, -34, 238, 67, 159, 2, -81, 44, -53, -53, 19, -32, 107, 65, -80, 124, 157, -25, 28, 90, 254, -3, 55, 296, -338, -140, -45, 153, -187, -68, 65, 72, -83, 91, -122, -260, 51, 93, 88, -112, -1, -125, -244, 18, 57, -25, 61, -217, 37, -451, -157, 88, 126, 131, 229, 239, 77, 85, -286, 105, -94, 103, 37, -63, 2, -121, 62, 123, -125, 56, 11, -209, 99]
6614I9l40P6R3K04l92J91J40j37j2n7J27J75M1l29J8J62n8q0M3Q7J50m21L1N40
6638C51j82j63n5J7K16l14J89q4o1O2o3N2M3j35P9O7j8J02Oj05m7J4L7J2P4m0
6664E4j2Qj74K14km0J81l25J14j00M4j00J52jk41N0L14k13K94k93O9p0Q8P5L4
6689A20J42j0l94m4JL25j52j9n9K15j90j36L61k07J50j56k21L57j80JK50l8k60
6712a44K06j99J29l4K2O1j81K31J15j29p6N5j84j2K11m1m2J34R2k22J06j00J48
6735A46j93O9j46m8j2K92k0l40L13qJ15k63J53R7r3Jj12K50j89j33r3Q3J57Q6
6759A12P9l42J48K62N5n16JK13n9j8q7K11j27K74j10J61j62k01J64m45M81q2l9
6782b7J39l70J70J78l56L21r9n8J48J99k86K20j1N2k66J73l4J96l66L29j65k39
$$ y = [99, -241, -165, -72, 132, -260, -69, 71, -66, -78, -135, -8, 167, 208, -121, -103, 59, 1, -79, -36, 51, 201, -220, -189, 351, 169, 6, -49, -32, 184, -130, 59, -25, -86, -24, -87, -35, 8, -127, -48, 19, 1, 103, 109, 4, -43, -29, 8, 20, 94, 54, 42, 50, -124, 90, 88, 48, 229, -96, 18, -82, -38, -138, 14, 13, -228, -178, 136, -77, 217, -76, -7, -77, 11, 86, 120, 262, 252, -142, -186, -185, 140, -12, -31, -90, 125, -65, -201, 160, -47, 103, -53, -274, 83, -97, -96, 154, 116, -144, 62, -137, -8, -42, -20, 41, -140, 91, 206, 77, 1, 56, -128, -140, 71, 30, -12, 122, 214, -8, 98, -2, 146, -47, 22, -124, -172, -184, 108, 88, -252, 61, 53, 168, -95, 58, 155, 62, 63, -49, 201, 12, -121, -214, -131, 26, 112, 191, -151, -3, 259, 314, -202, -201, 12, -47, -65, -152, 59, -68, 206, 96, 257, 95, -106, 58, -387, 94, 12, -27, 112, -258, -88, 90, -266, 55, -44, -102, 46, 245, -41, 179, 168, 220, -46, 127, 93, 289, -77, 252, 87, -152]
6804a52p3K13j05J07n4q8J90R2Q7lk90K74k13j19J68j3J45k07K72l69L29L3k37
6827a3L2PP7P7m09L03k32nK11l6Qn6N8Q0j28j29J2J43L4j69nj81M09j45K85o2
6853A66l24J33J34j66K20l53K99R9j99M3J0k07NL41k66mJ40k09L08l78Q4J12k9
6876d1J12p1Q2j24J19O2J52j14m9QN4j40O1j93K01j19QJ27j92j55K81J29m5K4
6900A77k83O1M7N4l8K8k66J92R3j31Q9j21R7OR5k23N94k05k05j92K90q5k10L3
6924a03p8K75J73j19r2mN4p4k2R9j19m1P2j00O6j07J12Jj16j03K32K9op6J04r6
6950c9j49K40J3r9K70k52r5M4J41k3m0Pn3k5K4J63j07N8j53J87m5J63j69Q4j50
6975eQJ84l81O1J35P8jk6m6P6k75L85k20J63k32J58K9j85K14k34J51O9k83J94
$$ y = [-152, -225, -12, -117, -10, -64, -152, 38, 130, 217, 214, -76, 198, -15, -134, 34, 21, 166, -41, 231, -138, 191, 224, -13, 19, 26, 103, 180, -229, 74, -158, -163, 48, 12, 20, -36, 22, 102, -26, -155, -143, 0, 34, -135, -140, -321, 88, -57, 228, 166, -158, -25, 109, -57, 163, -190, 109, 208, 9, 52, 62, -145, -140, 201, -65, -69, 71, -138, 170, -208, -124, -12, -41, 71, 0, 82, -42, 77, 139, 291, 177, 128, 136, 190, 50, 111, -82, 119, 0, 8, 135, -57, -212, 69, 198, 153, 177, -106, -45, 2, 56, 18, 46, -220, -28, 65, -66, 23, -98, -1, 5, 100, -123, 471, 266, 61, -131, 159, 74, -136, -103, -181, 94, 267, 148, 56, 52, 106, 32, 10, 109, -10, -51, 21, -79, -13, -120, -8, -7, -123, -226, 6, 35, 29, -47, 57, -39, -188, 52, 65, -34, 236, -16, -111, -67, 74, 51, 11, 18, -35, -60, -36, 127, 20, 78, -75, 112, 67, 230, 61, 145, -5, 3, 187, -194, -133, 2, 80, 79, 53, 7, 83, -192, 193, -27, 136, -96, 62, 91, -94, 120, -114, 37, 106, -177, 17]
6999A7Q8p7N6k12K72k09PL4jPk1K47l21j1M1O0J35l81L39R1k65K30j18p2mK41
7025A73k24o5J77j84J37j37m7K47Ro4J47M2m14L47q1P2J07m59L38k16J57j94J11
7048b1P2OL5k74L27k18J05j59K88K09l83m8p3L24j86k5J76m6j86J55oL0j16L3
7072A9k14L13m8j53j3K84r1LR3k31q4K46lK8n3k3j8p0n5P0k52K87J76j78p1K6
7098a2Nj07J68M4K3q1j22J16m1J25r2O9q1k1N5K6KJ68l63J26L48n77J43j5J27
7123C3R0k43LK7j36K19j46J91k15K55k50J03L9j26j86J74M6N3Q2l7N3r0J02J37
7147A78r3J8oK0k43K59J7j31R7j55J02PM0K2k49L5R7J41k93J14m9J97r8j35J23
7172A5j12J4J41j0j58J26j43K7J62Q9k98K48j69J9oQ8K7M8L7k06J42J9k00K28
$$ y = [17, 105, 28, 84, -128, 144, -65, -58, -24, -25, -18, -39, 208, -113, -124, -83, -23, 112, -269, 70, 161, -104, 126, 8, -64, -68, 173, -51, -116, 61, -123, 14, -123, -170, 77, 86, 22, 169, 211, -203, 144, 63, 135, 242, -217, 121, -95, 62, -132, -21, 51, 57, 92, -182, 145, -73, 32, -127, 161, 370, -13, -61, -134, 190, 4, -21, 155, 109, -77, 78, 72, 102, -14, 19, -195, 118, 70, -83, -96, 188, 97, 100, 193, -38, -122, 124, 121, 149, 96, 73, 55, -15, -70, 0, -252, 35, 211, 33, -38, -12, -7, -114, 54, 98, 121, 40, -82, 34, -7, 118, 26, 95, 14, -7, 48, 74, 76, 244, -119, 7, 355, -222, -79, -94, 33, 123, -120, -117, -90, -226, -7, -153, 38, -177, 78, -172, -69, -30, -156, -342, -168, -122, -69, 13, -24, 29, -61, 41, 178, 85, 103, 97, 117, -126, 133, 150, 19, 116, -39, 63, 70, 110, 132, -117, -82, 15, 156, -137, -23, -72, 125, 27, -108, 15, -97, -83, 58, 48, -110, 16, -127, -100, 62, 151, -147, 101, -68, -49, -55, 33, 60, 108, 145, -61, 81, 100, -100, 128]
7196A28n0j54j54J36J78K0j99k39J71L23J5p6l3j05p3K02j16j06L64k07J50j1
7218A64k27m5K12k07L39k55M3P8k12P2K50p3r9M8o2j32J79k33K35j5j38K38j02
7241E8O5j81o3J32q2L12j20k0J91l37P3j19K29%K2j04K7n7j47l1L68j21j98J29
7265B6j61K04N7K9k93L68pq6J06l25K8Oj9O6J12r5k02kK83l0m9m1p4R8L8j96Q2
7292g7O7Q3r6K7J08j08P2lj56q8M9j13K0M13j15ok4k58J73J30n4Q0j13J02j82
7317f9l1J63O2k16J30J54j56p2j01K94k22j60L41j71O1m1K81k18j84L4QP0j02
7340a45J27j91K07O1J4p3n1j38L28k82J88j5j87J19j7M3J16k13K12r8j84J15p0
7363a34J79Qn5J55j58l2p0P1L53n05J86k01K68k6l62K03J99l44L63j57j75J79
$$ y = [128, 78, -76, -230, -94, 84, 104, -95, -334, -163, 160, 175, 99, 66, -39, -112, 90, -26, -132, 232, 25, 175, 164, -63, -108, 104, -103, 236, -19, 24, 102, -110, -38, 212, 139, 40, 88, 26, -106, 73, -160, 75, 60, -78, 160, 58, 123, -58, -121, 11, -71, 241, 121, 101, 292, -45, 28, -91, 138, 138, 160, 56, 83, 26, -121, -152, 216, 95, -103, 26, -135, 69, 126, 155, -138, 230, 223, 137, 243, -82, -54, -48, -67, -1, 111, 16, -186, -188, 95, 65, 16, -25, -99, -1, 37, -159, -77, -10, 73, -23, 4, 112, 4, 76, 73, -83, -171, -122, -235, -215, 198, 83, 77, 53, -205, -32, 98, 44, 124, 11, 113, -69, -100, 63, 125, -91, 39, 193, 37, -35, -136, 158, -64, -224, 117, -54, 7, -34, 247, 29, -155, -121, -113, -43, -145, -18, -209, -2, 59, 73, 0, -51, -189, 139, -143, 45, 30, -157, -38, -55, -12, 104, -109, 103, 5, -179, -64, -134, 45, 53, -2, 153, -5, -37, -107, -36, 317, -188, -2, -203, 65, 39, -323, -120, 79, -265, 98, -59, -234, -55]
7385e5L4k69K99j83J95l4o7oK35k27o5M0R5P4k87K21q7J81j12j46L28kk20m6p8
7410a82J24K3J60m6o2J19l00J38r8L18k41J84j69J35j81r5J99j26O6j4K8o4K43
7433A59k09J78j03k01J3K42q8N3R7j11J6j98j1J91j12J21r0Q8l18L90j19j83j6
7456b11K73K17l31k4J74P9k54l1K9L13r8j07O1j29l3K9j01O8J43n4p3P4j74K15
7480E5k15J0k21J19J07K65l07J98K9K86l83n1n1N9J25j15J02O6J74k45M9p6R8
7503G8J48m50L49n8l2j28J98p0n1J18N8j70n0r8K09L39m44K90k55j42j2K25K64
7526C16l31J00k6J71j09k81J58j51K71L8j61R2l7k3L6J9q0k5p4K01j63P2J5k4
7550Dj61J21p6R5Q0P6%k79M4K9j20L15j95Qk2J78j80N6J07O9j98K68j76k26J02
$$ y = [-55, -21, -290, 9, -174, 21, -13, -80, -86, 149, -78, -143, -103, -8, 66, -221, 0, -87, 94, -18, -164, 164, 162, -58, -104, -182, -58, -35, 125, 79, 17, 136, -164, -26, -124, 194, -47, 137, -32, 103, -78, -173, 26, -100, -34, -48, -20, -84, 159, -50, 128, 25, -176, -163, 79, -9, 44, 141, 30, 46, -152, -163, 28, -84, 37, -53, 35, -283, 107, -12, -195, -211, 62, 279, -52, -76, 98, 177, -77, -108, -79, 234, 136, 29, 90, -39, -72, -43, -144, -76, 67, 13, -60, 14, -160, 55, -160, -150, -371, -252, -145, 120, -187, 11, 40, 326, -57, -108, -159, -100, 25, -90, 12, 78, 252, 7, 56, -20, 78, 226, -224, 125, 67, 35, -93, 105, 35, -16, 102, 160, -10, -60, -158, 51, 390, -54, 236, -19, -161, -173, 52, 316, -15, 85, 59, 230, 121, -160, -2, -153, 118, 156, -5, 87, 50, 27, 63, 82, 2, -23, -97, 104, -59, 13, 28, 4, -157, -36, -112, -17, 63, 139, 139, -140, -96, -67, -187, 128, -67, -59, -81, 97, -83, -27, 80, 149, -49, 219, 43, -183, -81]
7575h1k27M72j15o8o0P8n5J25k7j93J7J42q4K02j38O8J45k44J7j27N1K99n5j78
7599c6K27k39k4P8l8K2O2j26k0J01K5p3L81k11j40M3O5j92Lj9Q1p0O2J39Q5P0
7625B56m19Q7J13K3j41Q1o5nJ53k06j26K12q5P7k4O5Q8mk25J17K61k03k2M5J14
7650A67j53k33Q7J4J33K54l03Jk4K41l25k0J04J2L23m91L70r5k5l4o2R7p7J86
7674A47m7j29K9J37j82k57K30P6K2l3j92K25k7j46Q1J37k69K53j92K04q7K21l87
7697a86L43p7%j28j67J19m8J11M8j04k9J28j01n1J40K64k66j26K88j75qj11n4
7720a90K15j83J45l9N0j7k05K96K9k11j23K19J56k9K8p7J9k65J26J00o2j7Q5j71
7744a21J54q2J88j84P1K01q0J54p5j86q5J7n0j04K81m0Q1j89o2N6k9J00M0J25
$$ y = [-81, -308, 164, 49, -19, -79, -1, -56, 69, 42, -151, -134, 8, -76, 126, -12, 56, 201, -43, -26, -153, -102, 197, 142, -36, 191, -48, -72, 6, -32, -10, 52, -74, -94, 7, 32, -41, 340, 129, -11, 32, 97, -95, -92, -111, -30, -100, -38, 101, 186, 256, -163, -76, 37, 60, -81, 0, -65, -70, 83, -123, -249, -37, -122, -45, -69, -4, 84, 80, -145, -28, 233, 30, 8, 53, 167, 14, -219, -132, -118, 15, 269, -34, -33, -57, 184, -141, -161, -57, -45, 278, -213, 157, 62, 37, 3, -59, 38, -39, 147, 100, -29, 0, 137, -45, -302, -72, 4, 26, -7, -199, 26, -1, -147, -66, 71, -198, 55, -137, 67, -20, 201, -186, 157, 80, 80, -48, -215, -96, -144, -33, 15, -89, -118, 10, -91, -142, -2, 262, -4, -130, 158, -17, -25, -136, -190, 25, -158, -13, -52, -2, -19, -224, 72, 101, -110, -233, -14, 142, 113, 141, 64, 83, -182, -56, 44, -18, -35, 50, -121, 33, -49, 139, -45, 26, 227, 147, 301, 226, 40, -45, -28, -78, -182, 99, 59, 140, -49, -111, -55, -84, 16, 56, 181]
7768A81k97j76L24k7J22j75n2Q9l40J34J74pn5K37j05k42L70j54J51m5j22r6J53
7791D2j37P1P7j57p8K35R5j30k52K88j36J98l67J81j32J1J40J91k88k5p1K90j10
7814f4n5P2m3k9J16K08m6n0k83J69M2L6j74M4Q0Q1J19j06J78m79p3K42K8Q6M8
7839A47l21J68l1l64O27j58n6M8l1LPk97P0L11l4l1K69p5q1k25J29k79K38k52
7863b18M56j29r4j24K5M7k0J36n1Q9p5M0j7n9Kmp9p4k2R0L62m81M09j97j5j84
7889a87J5L51K7k13j35L01k2l01J95j30Q1j32J85m5J02l5K8P4k77K21l82K76k61
7912b64K84j15K84l44LL70P1l95J91L68m83K3R5j42J21Q9j04o8O7L3j59K45n6
7935A14j70r1oJ95q8rK12m1k09J29Q1p6Q6l44L40j27j2j25J7J67kj7MJ90k79J00
$$ y = [181, -116, -292, 32, 5, 127, -48, -100, -11, -351, -217, -43, -50, -105, 132, 27, -215, 155, 1, 152, 107, -15, -111, 42, -95, -24, 53, -104, -182, 53, 148, 18, -234, 54, -82, 116, -251, -70, -202, -191, -51, 140, -148, -173, -244, 46, -64, -119, -47, -90, -119, -3, 205, 159, 109, -174, -5, 37, 73, -101, -57, 23, 104, 223, 117, 295, -184, -257, -15, 13, 99, 147, -174, -6, -37, -401, 226, 68, 12, 60, 29, 32, 39, -258, -188, 123, 89, 58, 327, 252, 171, -54, 75, -204, 34, -218, 238, 109, 15, -109, -84, -37, -57, 79, 28, 117, 42, 82, 65, 6, 8, 4, -75, -149, -171, -81, 281, -200, 209, 12, -3, -187, -172, 179, 206, -7, -142, 159, 137, -164, 31, -99, -18, -150, 35, -10, 92, 57, 85, 159, -118, 103, -279, -3, -264, 20, -95, 189, -155, -152, 218, 289, -106, 85, 453, -30, -7, 88, -54, 67, 156, 52, -16, 51, 84, -75, 170, 114, -56, -147, -153, 42, -46, -55, 157, 116, -93, 36, 117, 41, 127, -217, 123, -4, -16, -141, -124, 43, 41, 24, 28, 218, -61, 39]
7961C9K9J35j95o8J40O4j09j7K32m79J11J68k45K88J0j19j09M4K25j94K22j70
7983BM5J26j93N2J08k00nj02MjQ4K11J7k68o1K18k8l17L70J66j64o5J60J64m25
8008a02K02j72j91J60J64j53j25K76L3j29rj41J93M8l45L09l1J81k44Q1J39j18
8030B6j54L4L24J06m66J7R8pJ31j74j21L80k21l20L31R3mL2j65n1J13J5j29K37
8054A25k08j5n5Q8j48J39N7l35K42K07Q8j82p7ro2K05k0n9j65K75J7k01m7J72
8078C2k75K79P6j24Q7J22k28j22J82p7NJ59q1l5q1N4J21j00j36L18r9q6j27K45
8102A09r8M7j04n8R8Q5L6l24L35j89k00K80J87m39Q4M7Q9oP2j93O3J30K0P1m7
8127I5j88K08k4l53K34M8P9k07P1m0Q8j65K57O5l08K85j26o9J16j70J20M9J26
$$ y = [39, 68, 203, 8, -60, 80, 144, 35, 18, 250, -229, -118, 50, -195, 93, 103, -16, -125, -81, 144, -50, 172, 2, 47, 173, -20, 32, 140, -60, -65, -167, -163, -164, -80, 131, 148, -120, -181, 37, 9, -308, 62, 228, 64, -1, 159, 323, -102, 100, -72, -263, -103, 61, -92, -217, 59, 92, -37, -46, -187, 6, 54, -291, 18, -13, 168, -76, 5, 144, 26, -128, -94, 230, 336, -130, -113, -15, -22, 109, -65, -186, 194, -27, -347, -16, 77, 73, 105, -60, -111, 2, 17, -112, 125, -83, -98, -153, -65, -213, -74, -17, -352, -110, 97, 185, 3, -74, -83, -145, 60, 40, -19, -184, 91, 108, -93, -140, 32, -243, 36, 112, -12, 75, 197, -31, -153, 29, -48, -43, 116, 35, 0, -81, -27, 94, -6, -142, 176, 77, -9, -136, 109, 11, 58, -46, -104, -6, 79, 115, -209, 126, -63, -263, 17, 204, -235, -151, -104, -15, -21, 51, -142, -79, 51, 71, 142, 95, -93, 115, 91, -262, -28, 20, 99, -108, -37, -77, 11, -154, 103, 168, -140, 145, 19, -50, 66, -104, 16, 65, 191]
8150A91k10J09N5j47p1j04K76j94L49l47J88j45P2j58k4J30J13j77K96j86m2M3
8172A7j11J01n7N2o0j31J15K42k7k81K52M7r3J68k70l9QM5q8
$$ y = [191, -19, 90, 145, -2, -73, -177, 99, -95, 254, -93, 95, -50, 22, -136, -160, -30, 83, -94, 202, 16, -26, 17, -94, 7, -50, 2, -58, -189, -74, 168, 141, -140, 112, 159, 66, 234, -36, -75, -67, -22, -110]
8191a10
$$ Imaginary data points
##PAGE= N=2
##DATA TABLE= (X++(I..I)), XYDATA
0@%%%%%%%%%%Mj2J6j6J6k4L2l4M2m8N6p2Q8j03J19j36J58j84K10k39K73l12L55
33A89m00M49n08N71o36P09p89Q78r74J077j192J317j454J604j767J946k146K366
51A240k605K869l166L503l885M320m822N408o106O957q008R346j1121J3587j7236
66i719K3165l4315O1836k41020k81170Q32586j25173o04181M23339K50809n53881
77b57724J95637M34643n39073j90602O96550j29958n95787L89959L44967n08734
87a60122l8286M23962k18455k28706L62156r264l53700K22495K38785l73362p9981
98b14478M06155o3566l37904J65183K19777j91029q2338J59566o7368r2212K04127
109A05913Q766k87960R3172L08155j83312k67338K28787J61526k23991j0495J65967
$$ y = [0, 0, 0, 0, 0, 0, 0, 0, 0, 0, 0, 4, -8, 8, -8, 8, -16, 16, -18, 24, -24, 32, -40, 48, -55, 64, -72, 86, -98, 112, -127, 146, -166, 189, -211, 238, -270, 301, -335, 374, -415, 463, -511, 566, -626, 691, -763, 841, -926, 1020, -1126, 1240, -1365, 1504, -1662, 1841, -2044, 2276, -2546, 2862, -3244, 3713, -4295, 5051, -6070, 7517, -9719, 13446, -20869, 40967, -200053, -481223, 351363, 226190, -377991, 45348, 296157, -257724, -62087, 372556, -166517, -357119, 339431, 209473, -386314, 3645, 348612, -160122, -198408, 225554, 7099, -221607, 140549, 131285, -222415, 80, 238865, -134497, -214478, 191677, 128111, -209793, -44610, 175167, -15862, -98200, 61366, -6002, -98214, 105913, 114679, -173281, -80109, 228046, 44734, -222604, 6183, 167709, -56282, -66777, 99190]
120I9190j40480n0272K35205j10879k48374K51138J70889l18512l2257L00487
130A56135j12943k03482K03511M9420k07211J16214J27484k21841J2079K39338
140A58704j48473j81990K25322Q8490k18210Q572J46040p2976l9386Q1568p1397
151b3736m8707J42404M366j56543K0349J29059k1320r4983J205O3716J9714l5679
163a55k4263J3476R778R978J5892m5450l1673R7860K2291j37394K3278J40653
175I4271q4180r7709J24965K2256j19939O3440O4783j30753K8064J44865j34575
186b4512r9103K05932R375k08373Q1760J37460j36911k6995J33640q6273p3236
197h7236J67892j7998j88047J08378J42870j58676n5379J52625k9937r4544Q7355
$$ y = [99190, -41290, -91562, 143643, 32764, -215610, 35528, 206417, -112095, -144352, 156135, 43192, -160290, 43221, 92641, -114570, 1644, 129128, -92713, -80634, 158704, 10231, -171759, 53563, 142053, -76157, -67585, 78455, 5479, -33907, 47661, -23736, -72443, 69961, 74327, -82216, -61867, 67192, 45872, -49111, -47906, 15810, 35524, -155, -24418, -10942, -1164, 8814, 24706, -20744, -52417, 45443, 67734, -69660, -46382, 94271, 10091, -87618, 37347, 59603, -60336, 3104, 67887, -62866, -34802, 110063, -24512, -123615, 82317, 91692, -116681, -34921, 102539, -34372, -61367, 72273, -14000, -87236, 80656, 62658, -125389, -17011, 125859, -32817, -88196, 64429, 34492, -60052, 27303]
208B7303J5772j05974N7881Q6990j09287m2737J26826q902j11009M5213P2239
219E4315o2970l1999O2580n226n3271M0761L2513p2852j08R1815l8817q9853P7549
232D437O7968j01673k5394J06764l2031p7940Q8593J6448j15433O3550R7775j30065
244c7001m1987J57124l4016j36479J02647O8760j39339K3897J22511j12223n6247
255h2353J56081l4509j41991J12654P9567j49455M625J36434q0049p8184J24526
266D7346l092j18303P9110P0250j19084k794J15705n3701p9292Q4993K7878q8086
278c9070K1731O4745n8878k6995P1660j2450o4800L8744M5818n3390k5797O0123
290B1441K053n9085K5517M6972n0392k0754O5914j2404o4972M8268M8628p7421
$$ y = [27303, 43075, -62899, -5018, 81972, -27315, -70052, 56774, 47872, -63137, -17924, 54315, -8655, -40654, 21926, 16700, -36571, 4190, 36703, -36149, -36257, 55558, 16741, -73112, 4437, 72405, -29268, -54662, 52102, 20071, -57869, 30724, 47172, -68261, -4711, 93064, -37001, -78988, 78136, 44120, -92359, 10288, 79048, -60291, -36394, 86117, -26106, -82353, 73728, 39219, -102772, 9882, 89449, -60006, -55381, 81053, 1004, -77180, 47346, 44254, -74049, 5061, 75311, -43773, -46567, 69138, 15437, -63855, 21138, 49016, -39070, -17339, 47406, -11472, -38467, 33193, 20743, -44057, -5313, 40505, -12885, -38682, 21441, 23494, -35591, -10074, 36898, -13494, -34248, 31666, 19262, -45710, 2558, 51186, -26235]
302b6235j1756Q9640l6088p2475P9544K6809r7801L1928Q0779q2235l6528J05207
314E0789k3026r6552P7685N1749j07606J2106R7240p1971n1397J02284r651r4657
326f3007O3695N7629r2189m709R0998m5168n8614P7095R956p6675L5288N2754
338D7053o2101j7294O5853j4797n4824L7706L2433n0083o330M7125j7907l5530
350b8696L3119J8635m1869k030M6006j7200m3753L9225K8906n4552k131N7470
362C3130k6979m2528N2672J4498o4065K2781N7794n9032k8355P9759j5854p3161
374d9340N6313L9694p7872N930P1181m9499m2230P6225l776p8088M9870N0396
386D8804p8578n856P8543l6226n2530O2003J4361o4575K4809M8770n3073j6823
$$ y = [-26235, -37991, 51649, 15561, -56914, 22630, 49439, -48362, -16434, 64345, -17890, -54418, 50789, 27763, -68789, 8896, 60645, -46961, -34855, 62385, -9586, -60983, 41301, 31650, -63007, 688, 58317, -33872, -38581, 52417, 7249, -51365, 25730, 35686, -40989, -5701, 47053, -15048, -32342, 33511, 18714, -36110, 1596, 34029, -16054, -22384, 24741, 6834, -28696, 4423, 23058, -18811, -20841, 25165, 7965, -35788, 3437, 32343, -22209, -24340, 33130, 6151, -36377, 16295, 30793, -33272, -10491, 47303, -11729, -40084, 39675, 23821, -49340, 6973, 46667, -31205, -25275, 45906, -3593, -45823, 30402, 26626, -51462, -1592, 48804, -29774, -35630, 42913, 6687, -45843, 16160, 30521, -34054, -9245, 39525, -13548, -30371]
398c0371O3154j6332n2865M1561K9340n0065m473M4961j5506l2727K9174J5038
410B0889l8037M899L6644k4763k8611L8775J3970m7023L852M7842k4438l7768
422c3769M3629J4146n1087J8918M1882m7414j5070O3309j8363o0202N1095L9007
434D6081p1814k149P0668l8383m2720O3532j886o4986M5024M1997p4622n758P9607
447D4591l3415o2132O2654K3910o9746J9785N0836n0891j5579O2446k1467n3254
459d2262N0965L1337o4753j504O1535k4289m1523L9648J2947l9489J4277K8477
471B5366l5421j2846M8659p234n3309K5725M5317m0733k7478M4428L647l7792
483b1671K0323K1312m0580L646N1579l3409m5450N9923K3508o9734P936O0619
$$ y = [-30371, 32783, 16451, -36414, 5147, 34487, -15578, -20051, 24910, 9404, -23323, 5851, 20889, -17148, -12249, 24395, -368, -28979, 9796, 23766, -23257, -19405, 28437, 3999, -33769, 9860, 24006, -27081, -8163, 33719, -13695, -28765, 34544, 16181, -44021, 7074, 46081, -25733, -27882, 42786, 4403, -38317, 25215, 23329, -41657, 3367, 45364, -29258, -35016, 44591, 11176, -50956, 11698, 35608, -34138, -14353, 36483, -14408, -29987, 32459, 10992, -42262, 8703, 40040, -24713, -26217, 35318, 11029, -30494, 9154, 22101, -17388, -3111, 25366, -10055, -22901, 25758, 18524, -34785, -9060, 36257, -4476, -31954, 12474, 16121, -21671, -1348, 19964, -20616, -16970, 34609, 1200, -44250, 15673, 39181, -30553, -22617, 38002]
495C8002l5229l3715N1896l122m9875M0322K9313o8057P063P2139m4509n4206
507d9978O6917K0966o8137J3062M7423m0212j2536N1875k8771m4178O1837K0616
519C8884p4863P930O7153k9174m2942L8864J3034l5588J8573K1723m2066Q68N2664
532C5060k3239m8955L8389L5305m5292j7278M2858l818l2881K2420J2412l4310
544a9329J2962L3818l8498k2280N5987L871o2387J7011N5938l5049l2590M2893
556A2347n83l2652L3759Q675n3844K1296N8940m7709m6948O2918K1293o0907R475
569a3940L8738l3915m109M1194l1907l2438N6700J1270o6140J2331N8240l2515
581C509l6541M1955P032l4653J9211J6381l4261P062L8656k7585l2809M3020K1951
$$ y = [38002, 2773, -30942, 20954, 17832, -32043, 8279, 37592, -30465, -23402, 48737, 4228, -49978, 16939, 37905, -30232, -17170, 30253, -9959, -22495, 29380, 609, -43569, 18268, 38884, -35979, -28049, 39104, 9930, -33012, 5852, 18886, -16702, 1871, 23594, -18472, -17604, 35060, 11821, -37134, 1255, 36560, -8732, -26010, 16848, 13030, -19851, 2569, 14981, -19329, -6367, 27451, -11047, -33327, 22660, 26531, -35856, -18845, 37093, 2044, -30546, 12347, 11764, -20888, 12871, 21546, -32298, -11002, 47938, 229, -46719, 16199, 37492, -23415, -13940, 24798, -9117, -13226, 27968, -3939, -36377, 20323, 31593, -34547, -22216, 36024, 3509, -33032, 8923, 15955, -18698, 513, 16894, -17367, -10305, 28351, 766, -32043, 10977, 32928]
594C2928m9314o637M3819o465k8157J3734O950j5943J4438J3649l5114q187M9631
607B5332l526n4048J6529M4013k6416k3883K8037k83k1073K4348N882m0615J6142
620i561M5279l7703l3701N1478J2371m9952J1226L4707k7432j0239L2731j7991
632A213k4944M1129N705n3843J7613M9197l5514l2927L9750J1271l2722R605J5252
645A0785k5640P473L2617k9255k8229M3465J7160m4592m113L6902o463k2100J5126
658C136M433j8340J4976J4823l0678n033L8055p476l8046J8906K9730k7623j6389
671a9526K9740k336k3819K0499O630l1428J5136L1013l4184k0730M5821N601m6659
684b4242J3099L4754k6807j0592L0328j6541k0248L8076K720m7321J6776M3145
$$ y = [32928, -16386, -23023, 20796, 14331, -13826, -92, 6858, -9085, 5353, 19002, -16112, -24299, 25332, 21806, -32242, -15713, 28300, 1884, -21999, 6038, 5755, -15318, 9030, 14912, -25703, -9561, 35718, -1985, -35686, 15792, 28163, -21789, -10563, 24144, -3288, -13527, 19204, 1213, -23731, 17398, 23103, -30740, -13127, 36070, 556, -32371, 7379, 18650, -14072, -4467, 10785, -14855, -7382, 25235, -4020, -32249, 11216, 28376, -16216, -20329, 16573, 10110, -11990, 3136, 7569, -10771, 4205, 19028, -11650, -16683, 21372, 13896, -24150, -5244, 24486, -3137, -19526, 10214, 7878, -15941, 4558, 11188, -20240, -5104, 25909, -8275, -29005, 16816, 22417, -24242, -11143, 23611, -3196, -13788, 16540, -1, -20249, 17827, 20547, -26774, -9998, 33147]
696C3147l2480k7829L8609M624l3731J8050J5448l1497O428L2160k6031k3230
708b6332L7506Q706m0388P673L3774k1035j7721K6956j535k1848J7845J1413k7563
721a2549K326L1980j6075k8260K7007J7984l2094k277K7185j2727j5065K1865
733I300j207k6243J7779K2264l2237j1462L9022n806l4397K1078J9414k8550N49
746a0496K7419j9228j6902L3028N77l6667J8916K9308l2993j1148L6015q408k7234
759a7813K2571J1552k9570P249K6695k4982j5167L4224k091l3530J7069K1963
771A8170k5230p259K5741q283j8855K0256P621k6285O978K4350j8180j5273K4726
784H477L831k3852P654J8215j5617r133K1183l567k0769J5757J3311k3998k162
$$ y = [33147, 667, -27162, 11447, 16071, -17660, 390, 15838, -15659, -9231, 22929, -3102, -26332, 11174, 19880, -20508, -12835, 20939, -96, -17817, 9139, 7604, -14244, 3601, 15014, -12549, -10223, 21757, 5682, -22578, 4429, 22413, -9681, -11958, 15227, 2500, -12565, 9300, 8093, -18150, -371, 21893, -10344, -21806, 17216, 11410, -22987, -1909, 17505, -11045, -10496, 16923, -2305, -19207, 13821, 14398, -22269, -3353, 25955, -7038, -18186, 17829, 9421, -17813, 4758, 16310, -13260, -6011, 20684, -4298, -19465, 14759, 12668, -20862, -3793, 18170, -7060, -14319, 11422, 3139, -15716, 4540, 12161, -14124, -7146, 17204, -976, -16249, 8477, 12308, -11544, -3890, 14325, -1292, -10425, 10758, 7191, -13578, 2179, 15490, -8508, -10670]
797a0670K4748j0236j9735J8734J0211k4490L091K2966j7460j2827K5738j616
809H454k5844J6060J7798k4241n222K7437r009k1993K1804R861k7229O592K3010
822A7478j9564j1847K5960k053k4742J4374J6398k3236m268K4781j0113j8876
834a5708J9735P190k3236N214J9333j4342j1833K0422J733k1455J0146J6207j8301
847d895n502K1326n252j7878J4179J1178j9380j530K0474r651j5995J9367N070
860A1511k3193P211J8862j7472j0557K2621j183k2408J3144J5125k2470k041K4128
873A3278j1959j7610K2053O024k4795P377K0853j7352j0996K3729j886k2270J5287
886A733J2974k2552K05K1841j2144j5551J9598N324k2485N617J8400j5899r031
$$ y = [-10670, 14078, 3842, -15893, 2841, 13052, -11438, -8347, 14619, -2841, -15668, 10070, 8454, -17390, -1330, 16468, -7773, -12995, 14442, 5433, -16560, 5244, 15105, -12124, -5532, 17478, -2086, -13933, 12027, 9974, -14768, -394, 16004, -7232, -11500, 13281, 3168, -15708, 4027, 11217, -12019, -6805, 12528, -1814, -13647, 6775, 8508, -12947, -2801, 13406, -4895, -10397, 10929, 5677, -12201, 1978, 13156, -6224, -7754, 12720, 3069, -12926, 6441, 11511, -11682, -4471, 14391, -3081, -13638, 8983, 7800, -14608, -1464, 13661, -8809, -10850, 13278, 1319, -16291, 5762, 11786, -13009, -5632, 15221, -2131, -13127, 10602, 8716, -13554, 1733, 14707, -7845, -7640, 14201, 2057, -13494, 6104, 11428, -11057, -5440, 12960, -2939, -11970]
899a1970K0120l018j7751J2678J0363j8174j674J9791p585j5905J5620Q189j9041
912h357K837J7095j1435j0022J7125R90j7896Q302J4725j6857p003K1287m638
925F153j8957J4190J0358j9563J91J8800j1068j3248J8099L826k1278Q524J7262
938A3289j8253p459K1975l729j8335J3740J0242j8453P23J8771j1582j2516J9460
951G873K092k1264R250J5740j6680o737J8120l006j6280J1745Q984j7717O63J7946
965A0729j0990j2509J7130L879j8319N230J5051j1329r447J6813j28j6024J0417
978E03J0290j6642j323J8496p360j5241J4488Q289j8493J032J7532j1417j0776
991a0622J7544p15j7671J0841J1908j7816l871K0279n859j7626J4693Q664j8129
$$ y = [-11970, 8150, 5132, -12619, 59, 10422, -7752, -9426, 10365, 2780, -13125, 2495, 10684, -8357, -5520, 11575, 140, -9882, 7243, 8233, -9663, -1361, 13364, -3493, -10496, 10791, 6153, -12804, 1386, 11744, -7819, -7628, 11172, 104, -13144, 4955, 8781, -12497, -3973, 13289, -4964, -12423, 9552, 5823, -12512, 1228, 11470, -6983, -6260, 12511, 929, -11587, 7873, 9965, -11299, -2049, 13691, -2989, -9726, 8394, 5388, -10892, 853, 9837, -7880, -7217, 10729, -261, -12770, 4360, 8239, -10080, -4850, 10201, -1128, -10575, 6238, 6110, -9914, 503, 10793, -5849, -7172, 11324, 3964, -11277, 3211, 11500, -6993, -5961, 11571, 154, -10622, 6922, 6207, -11464, -623, 11285, -6531, -10402, 9877, 4018, -13608, 1085, 9749, -8380]
1004h380K667J6390j3017p521J8249k049j7592J1462J2984j7445m542J9224n688
1017D742j4534J3109N074j5266M022J2885j2537p252J6652N2j7976P942J3387
1030A0300j3739n543J4809l375j1477J0178N635j3536K065J4449r614j1000J6062
1043E214M440j7273L615J3768r629o578J2408j689j2449J0101Q145j6847p31J8231
1057A0726p975j4692J3936O631j5483J833J2561r887o014J5305l136j6126J2664
1070C43J1289j7774k443J7510n058j2473J0955N528j3706L890J1791j2113n555
1083g816J6426l071j5756R629J1001j3855m311J3569k735j0706R215L526j3295
1096h179N464J2067j2224p690J6061J662j5438M596J1992r504m970J2143l349
$$ y = [-8380, -5713, 10677, -2340, -9861, 8388, 6339, -11253, 209, 13193, -4252, -8794, 10430, 4742, -9792, 3317, 8391, -6875, -2853, 10032, -2505, -9757, 6895, 6947, -11029, -3087, 10300, -3439, -8982, 5827, 2452, -9025, 1153, 6788, -6748, -4683, 9766, 152, -10848, 5214, 9654, -7619, -4004, 9764, 135, -6443, 5965, 4276, -8173, 1928, 10073, -6774, -7505, 10726, 2751, -11941, 1995, 8626, -6857, -5024, 7537, -2350, -8364, 6941, 3805, -12321, 343, 11632, -6142, -8585, 8925, 3867, -8606, 2349, 7877, -5829, -1939, 9852, -2261, -7816, 8610, 5539, -10217, -588, 10413, -3442, -7753, 5816, 3081, -7625, 1590, 5116, -8179, -2715, 9352, -2872, -10562, 5499, 7161, -8277, -3681, 8311, -1193, -6163, 5980, 2631]
1109B631j0043J1259M385j5173K489J5318q780j1908J3059N107j4393L052J0664
1122G667j0541l654J3593n151j2262J1942P051j5877n31J6306o403j1897J1706
1135A949M191j2406N379Q745j1840j859J4607m760j3722J0667R588j3948k848
1148f257J3287m954q408R951O09j1552O380R321j1876n536J5061n24j4401O478
1162b421R475j0401k092J0497m551p199R887K743j2685L561J3234j0192q267J3473
1176E062J939j2749M641P959q892j807J0577n719r225J1769M570j5444J669J3816
1190H166p871q481J0649J432j0025N220P108j0771j352J3565n600j1321J0974
1203A693O671j2783K01J0998n537o665R469O48j0754O162Q059j1529k815J3216
$$ y = [2631, -7412, 3847, 8232, -6941, -4452, 10866, 2086, -9822, 3237, 8344, -6049, -2997, 7667, -2874, -6528, 7065, 1914, -10348, 1594, 8645, -7232, -7763, 8543, 2140, -9757, 1949, 6140, -6266, -887, 7858, -3982, -5841, 8766, 4006, -9716, 951, 10539, -3409, -6257, 7030, 2076, -6332, 3619, 4228, -7324, -944, 8377, -3499, -9035, 6026, 5502, -8899, -2421, 7054, -3347, -5439, 5058, 507, -6692, 3195, 5938, -6747, -3186, 10048, -144, -8411, 5062, 7001, -5748, -1107, 6852, -2040, -3847, 6730, 1011, -8214, 3555, 8125, -7319, -5650, 8166, 295, -8186, 2463, 3895, -6130, -910, 6198, -4573, -5925, 7640, 2040, -9281, 1693, 8364, -4419, -4218, 6780, 1243, -5422, 4047, 4695, -6059, 103, 8162, -3367, -6182, 7034]
1217G034l549j1456P684P108j0362j368R949n187o809J0528O27j2227O179R874
1231H025r963n193J1720J33j0757N691O815r404m49J0854p021p441J1558K036
1245F604j2603L198J0630q135o517J1068l90j0712O925O033j1197M87J1152o609
1259f6q077J0061L979j1723J935J0336o748n510J0286j340q994P143N502j0284
1273c500n52J0544l678r269Q313M394j0247J138Q897o855m870R526o10r864N477
1288a156P364r160l131J0655k248r220P574M497r602J277Q872n447o020R378J422
1303E055j0633M589Q575q985l410J0161k244q285O302M656r567L94R275n723p167
1318g007R822J740j0716L996P970q186l257R535j573q410O440N247r312J90R458
$$ y = [7034, 3485, -7971, -287, 6821, -3541, -4909, 5040, -147, -6956, 3572, 4199, -8028, -1849, 8025, -1938, -7131, 4589, 4722, -6035, -344, 6471, -2933, -3382, 7472, 451, -6990, 4568, 6604, -5999, -2801, 7829, -306, -6823, 4245, 3855, -6857, 68, 6101, -5096, -4609, 6543, -66, -8143, 1918, 5897, -5826, -3891, 6445, -303, -5813, 4473, 3133, -5861, 1282, 6784, -3500, -4052, 6492, 2814, -6455, 1858, 6252, -3995, -2857, 6040, -815, -5685, 3841, 3231, -6633, -1156, 6208, -2952, -6083, 4572, 2324, -6896, 678, 5175, -4427, -3150, 5722, 275, -5745, 3633, 5055, -5578, -989, 7586, -1399, -4809, 5352, 3108, -5177, 1125, 5781, -3786, -3392, 5883, 160, -7007, 2815, 4555, -6161, -2165, 5805, -2381, -5638, 3897, 2324, -6086, 354, 5601, -3711, -3521, 5937]
1333E937n146o246Q416J739q804K723P478o708l747Q669j021q718N721N199q797
1348c305m81Q410l754o879P103L043q960J476Q575o086m927Q859%q704N091O273
1364E734p796j859Q957k838p498P012L980r429J610Q193n962m758Q224K03q823
1379e050M084O560q224k348R321k757p910O822L895q957J528P555n015m665P867
1394B706P74q448M290O447p497k327Q882k191p253N957L821p946N08P439m532
1409F30n690P963J068q656L170O357o384l413P699r65p047M838M657p850K65Q093
1425D735m709n292P464J790p792K260O490n176l726P899q57p300M987M267p702
1440b662k30P756l892n908O449K356p702J544O561n574l480P367q69o621M798
$$ y = [5937, 791, -5455, 2961, 4700, -4104, -1381, 6097, -611, -4358, 4311, 3290, -5428, 293, 5492, -3305, -3786, 4624, 870, -6009, 1094, 4137, -4823, -3347, 5228, -858, -5785, 3074, 3074, -5630, -539, 5734, -2062, -3921, 5036, 2198, -5300, 1712, 5692, -3737, -2127, 6066, 104, -4654, 3570, 3773, -5050, -966, 5594, -2630, -4978, 4343, 1586, -6324, 498, 4393, -4564, -3036, 4519, -496, -5161, 2706, 3480, -4968, -678, 5769, -1728, -4055, 4827, 2636, -4617, 1340, 5161, -2785, -2277, 5162, 630, -5060, 2903, 3971, -4685, -1515, 4842, -1542, -4955, 2744, 1779, -5268, -430, 4227, -3623, -3358, 4735, 26, -5266, 2198, 3988, -3804, -1544, 4946, -230, -3956, 3943, 3086, -4214, 773, 5040, -2662, -2892, 4864, 972, -4936, 1513, 3869, -3833, -2289, 4272, -1302, -4782, 2585, 1716, -4905, -107]
1455a07M040o697r99P473k389n805N722K955p043J153O553m761l585O502J24o703
1471c567L409M767o312k052P355j906o216N262K939o779P00N892l938l992O317
1486A879P51o858K812O118o298k287P155j424n521M405L072n888M04O250l952
1501F18m495O436J267p394K479N469n120k613O068j292n408L851L440o605K77
1516c022O770l526n107O053J821o224J212N329l411k799N577p71n389M309L368
1531D190o170m27O659k741n093M475K920n661J43M969l854k953N826n83o133L991
1547d42M427n868k020O561j101n843M446K966n699J133N376m479k849O427p5o494
1563c534K904N079m556l261O182j137m637M059J681n352J493M848m321l875N872
$$ y = [-107, 3933, -2764, -3763, 3710, 1321, -4484, 1238, 4193, -2850, -1697, 4856, 95, -3490, 3012, 3136, -3567, -158, 4609, -1703, -3755, 3600, 1694, -4522, 740, 3679, -3100, -2400, 3492, -446, -4438, 1879, 2630, -4228, -1416, 4702, -1596, -3883, 3272, 1848, -3673, 732, 3804, -2084, -1680, 4570, 618, -3877, 2559, 3826, -3568, -1089, 4380, -740, -3353, 2715, 1423, -3985, -134, 3306, -3299, -3022, 3748, 222, -4885, 1168, 2989, -3235, -2023, 3306, -105, -2904, 2673, 1902, -3487, 822, 4190, -1980, -2407, 4252, 1511, -3582, 893, 3813, -1848, -1705, 3264, -590, -3543, 2283, 1700, -4433, -442, 3985, -1883, -3903, 2658, 1557, -4286, 160, 3126, -2573, -1440, 3936, -543, -3392, 3035, 2960, -3534, -630, 4449, -107, -3368, 2814, 1677, -2960, 1099, 2780, -2572, -1079, 3769, -552, -4427, 1445]
1578A445J739o916J474N405l915k466N018j479l515L992K038n560M90O195k818
1593A127n262N180K544n499Q74M293l591j530M564j390m780M102L664o869r91
1608c564O802j917n278L874K061m460J329L643m064j636N794r00o208M450M338
1623D264n527j647N470q45l718L403P88m141J913M100m899k809O557R1o643K817
1639h26L570l547j747L754j114k941L991N69n395K500N140m388l440N081J531
1654B738m749R46L279k625p62L778j918l403M602J750n845K94N296k035m442L234
1670A38K014l851P25L124l759p35M814j770n126M211L727m961j673N120q74l423
1686b299K982J040l914K577L116m659j525N921o75n630K395M288m006j575L879
$$ y = [1445, 3184, -3732, -2258, 3147, -768, -3234, 1784, 305, -3210, 782, 2820, -2740, -2250, 3945, 1127, -4135, 1045, 3589, -1910, -1036, 3257, -334, -1864, 2700, 1310, -3470, 632, 4296, -2573, -3564, 3238, 1321, -3957, -83, 1978, -2482, -1153, 2490, -1574, -3210, 2584, 1684, -4524, -74, 4264, -1263, -2910, 2560, 1715, -2003, 1400, 2188, -1953, -40, 4060, -839, -3648, 2909, 3000, -3643, -826, 2744, -803, -2550, 1204, 90, -2851, 1140, 1709, -3686, -1186, 3954, -434, -3874, 1207, 2738, -2011, -1065, 2214, -411, -1173, 2605, 687, -2716, 1886, 3636, -2209, -1915, 3381, 1346, -3096, 138, 2152, -1699, -974, 2150, -1609, -2344, 2470, 700, -4426, -215, 3512, -1449, -3122, 1998, 1124, -2299, 683, 1723, -2191, 386, 3502, -1157, -2682, 3239, 2564, -3066, -671, 3617, -389, -1964, 1915]
1701A915j670k373L657k3m598J891M405m067l237N768M97n141J547L580l332k64
1717a445L356k051k360M222J211n343J059N363l282l496M275P48l975J853J881
1732B016l310j17M039k126m044M133K335n436j10M785j946k821L068K87k934J821
1748c60K800l936j013N321j167m711L369K801l971m82L525j576k466L608j49m032
1764b439K230L493m426j610M598m57m008K060K401l209l83L406j986k308L879
1779A241L68m217J785L769l374j872L849N5l275J944J960k805k04L363k058k980
1795b451L790Q32l929N35L590k237k464L194J22l149J981J899l398m15M150j842
1811B08k771K954K011l868P4L666j886k294L367O1l196J817K583l579n35L992
$$ y = [1915, 245, -2128, 1529, 1506, -3092, -1201, 3204, -863, -4100, 1668, 2165, -2976, -1429, 2151, -1181, -1445, 1911, -140, -2500, 1722, 2933, -2410, -1351, 4012, 730, -2766, 1509, 2257, -1718, 135, 2016, -1294, -1411, 2628, 502, -3542, 591, 2926, -2510, -2620, 2165, 219, -2602, 466, 753, -2181, -360, 2440, -1496, -2509, 2812, 1645, -3066, 303, 3104, -867, -1349, 2176, 600, -1866, 1742, 1593, -2439, -209, 3284, -1142, -2752, 1846, 1389, -2619, -559, 1842, -1367, -1750, 1656, -330, -2638, 1241, 1609, -2608, -823, 2946, -428, -2300, 1549, 1604, -1671, 273, 2233, -572, -776, 2587, 529, -2451, 1339, 2171, -1758, -1223, 2367, 130, -2334, 860, 982, -2167, -186, 1713, -1685, -2100, 2050, 208, -2563, 391, 2402, -1466, -1392, 2274, 388, -1906, 1461, 1522, -1674, 143, 2726, -853, -1388, 2604]
1827B604j334l374K333K018l677j9L389k319k011L172K38l259J308K926l265r67
1843b237L675p11l183K415K326l494L3L369j532k389L128N66l462J244K988l004
1859b68j377L413n61l193J942J753k717p11L266j603k485L264O02l540J234K922
1875A941k525j642L377J28l278J778K559l194l01L234j740j837K906Q51l889J098
1891e34K848k214j961L111m4l206J827J700k734k42K907j324k467K582J132k998
1907a617M03K730j583j809K911o7k386J849J522k563n22L390j137k840K006J951
1923B238l048k46K835j615j470K506j90k845J223K207k751q14L212o07k906J939
1939c32J421k021Q3J908j142j565K753J01k525R54K752k510j110K563n5k423J514
$$ y = [2604, 1270, -2104, 229, 2247, -1430, -1449, 1940, -379, -2390, 782, 1020, -2239, -931, 1995, -1270, -2237, 1438, 727, -2456, -41, 2285, -1209, -1176, 2193, 661, -1728, 1400, 1966, -1496, -252, 2736, -268, -1645, 1768, 1207, -1986, -44, 1709, -1008, -1719, 1547, -56, -2541, 723, 1325, -2215, -981, 1941, -584, -2226, 1151, 1279, -1999, -221, 2338, -856, -1157, 2077, 337, -1500, 1406, 2257, -1632, -534, 2314, 100, -1861, 1250, 1206, -2000, -173, 1527, -1207, -1449, 1458, 134, -2333, 249, 1381, -1617, -1214, 1516, -67, -1876, 1035, 968, -1418, 431, 1953, -610, -1132, 2258, 1121, -1719, 287, 2238, -810, -1056, 1779, 164, -1306, 1200, 1010, -1835, -612, 1595, -1156, -1970, 1242, 635, -2271, -332, 1089, -932, -849, 1059, -83, -1648, 1105, 1206, -1319, -365, 2387, -123, -1233, 1330, 1275, -1148, 366]
1956C66J270k535J22K536j638j984K404P59k814L64K319j556j302K085j40j740
1972a484J128J564k158j46K508j262j651K362P31k514M35K046j169j606K393M0
1988A217k630J651J499k352o44K767r29k102J371J421k354k63K283j161j261K263
2004G76q9k253J261J882k115o92K354r2k328J697J229j956l16K226j265j155J823
2021I87K7k090Q62J724j810j206K441j77k734J679J050j863M5K009j170j383K128
2038E19N54k412P01K216j654j186K348mj947J118J129j732p5K011j171j941K452
2055I26O71k562K41K437k101j061J972M2j948R86J473k031k60K503j276j684J937
2072B65J104k347RK383j108r95J439K88j988J470J311k371k34K377q07k441J766
$$ y = [366, 1636, -899, -777, 1759, 121, -1863, 541, 1300, -1514, -1150, 1169, -387, -1689, 396, 256, -1484, -356, 1208, -950, -1096, 1412, 150, -1501, 861, 1592, -922, -487, 1559, 390, -1216, 1177, 1217, -1413, 238, 1737, -615, -1259, 1508, 579, -1523, -152, 1269, -1085, -1348, 935, -226, -1487, 776, 687, -1566, -305, 1577, -538, -1230, 1124, 1032, -1296, 401, 1630, -326, -642, 1584, 319, -836, 987, 1014, -1076, -214, 1510, -300, -1506, 935, 758, -1976, -297, 753, -1110, -1065, 944, -226, -1609, 519, 1073, -1339, -638, 1578, -76, -1262, 1086, 1082, -865, 253, 1382, -350, -425, 1586, 415, -1526, 926, 1597, -965, -724, 1713, -388, -1449, 523, 565, -1383, -397, 1076, -955, -1215, 1288, 12, -1672, 265, 1369, -978, -969, 1414, 306, -689, 750, 1038, -950, 520, 1831, -540, -774, 1603, 796, -1645, 121]
2089A21J154j952o4J450j061r01K075l99k114J248J447j727r20K278K67k256J163
2106a91J166j530L68J326j416o68K249P0k494R75J760j624r43J479k2j070R57
2123C92K00j624M54J896j722j541K425P24k394J51J983q67j136J653m12j141J415
2140D56M18j839L70K074p80k038J546R85j466N3J231q57o54J141k64j380J090
2157H6J184k014p03K379l79j781P44O43o62K97R04j254l72J594n4j926J202J882
2175A770j856r78J964j87r27N02L56j162N18J361j613j142K061J05j815R9J777
2192H33q92q74R63j12o34R48L28j739N50J731r88j379J587N22j122j88J245n83
2210A96m02J233q72p71J163Q24j831l65J884n18j381N67P95r09j3J057j389k89
$$ y = [121, 1275, -677, -741, 709, -352, -1253, 822, 423, -1691, -443, 1004, -723, -1643, 635, 902, -1354, -191, 975, -555, -187, 1139, -277, -945, 1304, 1374, -1120, -145, 1615, -9, -952, 527, 505, -565, 392, 592, -1032, -578, 1318, -404, -1945, 480, 1204, -1190, -1039, 944, 77, -1059, 594, 182, -959, 456, 874, -965, -595, 1479, 699, -1339, 207, 1192, -274, -221, 1010, 153, -501, 640, 376, -1004, 86, 1270, -744, -1447, 932, 553, -1228, -484, 159, -503, -206, 698, -556, -928, 666, 612, -1314, -112, 1770, -86, -1064, 900, 713, -214, 288, 644, -518, 0, 1361, -252, -1394, 667, 772, -1043, -944, 833, -59, -933, 30, -82, -716, 232, 560, -1179, -629, 1102, 114, -1265, 322, 844, -278, -466, 779, 196, -206, 1027, 155, -616, 547, 1371, -460, -825, 1059, 541, -840, -273, 522, -387, -400, 657, -732, -1021]
2228a021J676n28j686J252J480j618n02J648K0j171N65N54j264O87J251j662o14
2245i33J995k50j734P49J240j192n63J236n11o88N60K15j069O33J078j314q75
$$ y = [-1021, 655, 127, -1559, -307, 1173, -445, -947, 701, 721, -450, 115, 669, -595, 92, 1343, -319, -933, 1062, 812, -922, -173, 1067, -125, -688, 548, 37, -651, -91, 124, -945, -312, 766, -548, -1423]
$$ [...]
8191b62
##END NTUPLES=NMR FID
##END=
