##TITLE=1H_Pr 5009-1
 CDCl3
 8 sc, 
 21.10.2022
##JCAMPDX= 6.0         $$ Bruker NMR JCAMP-DX V2.0
##DATA TYPE= NMR FID
##DATA CLASS= NTUPLES
##ORIGIN= UXNMR, Bruker Analytische Messtechnik GmbH
##OWNER= root
$$ XWIN-NMR		Version 3.5
$$ Fri Oct 21 16:33:02 2022 Russian Standard Time (UT+4h)  she@DPX200
##.OBSERVE FREQUENCY= 200.1313499994
##.OBSERVE NUCLEUS= ^1H
##.DELAY= (6, 6)
##.ACQUISITION MODE= SIMULTANEOUS
##.ACQUISITION SCHEME= undefined
##.AVERAGES= 8
##.DIGITISER RES= 18
##SPECTROMETER/DATA SYSTEM= spect
##.PULSE SEQUENCE= zg30
##.SOLVENT NAME= CDCl3
##.SHIFT REFERENCE= (INTERNAL, CDCl3, 0, 15.7039)
##AUDIT TRAIL= $$ (NUMBER, WHEN, WHO, WHERE, WHAT)
$$ ##TITLE= Audit trail, XWIN-NMR		Version 3.5
$$ ##JCAMPDX= 5.01
$$ ##ORIGIN= Bruker BioSpin GmbH
$$ ##OWNER= she
$$ F:/spectra/data/she/nmr/H-F/1/audita.txt
$$ ##AUDIT TRAIL=  $$ (NUMBER, WHEN, WHO, WHERE, WHAT)
(   1,<2022-10-21 16:32:02.42 +0400>,<she>,<DPX200>,
      <created by zg, POWCHK disabled, PULCHK disabled
       configuration hash MD5:
       00 E9 B6 7A A2 85 ED C7 34 08 36 98 17 FE 4E 26
       data hash MD5: 16K
       43 A9 D7 73 A9 7C 5D 60 EA A6 C8 80 C9 60 34 18>)
$$ ##END=
$$ 
$$ hash MD5
$$ 87 15 7D 57 93 CC 15 3E D9 2B 54 CA 7E AE 60 FE
##$RELAX= 
##$RELAX= 
##$RELAX= 
##$RELAX= 
##$RELAX= 
##$RELAX= 
$$ Bruker specific parameters
$$ --------------------------
##$DU= <F:/spectra>
##$EXPNO= 1
##$NAME= <H-F>
##$PROCNO= 1
##$TYPE= <nmr>
##$USER= <she>
##$AMP= (0..31)
100 100 100 100 100 100 100 100 100 100 100 100 100 100 100 100 100 100 
100 100 100 100 100 100 100 100 100 100 100 100 100 100 
##$AQSEQ= 0
##$AQ_mod= 1
##$AUNM= <au_zg>
##$AUTOPOS= <>
##$BF1= 200.13
##$BF2= 200.13
##$BF3= 200.13
##$BF4= 200.13
##$BF5= 200.13
##$BF6= 200.13
##$BF7= 200.13
##$BF8= 200.13
##$BYTORDA= 1
##$CFDGTYP= 0
##$CFRGTYP= 5
##$CHEMSTR= <none>
##$CNST= (0..31)
1 1 145 1 1 1 1 1 1 1 1 1 1 1 1 1 1 1 1 1 1 1 1 1 1 1 1 1 1 1 1 1 
##$CPDPRG= <>
##$CPDPRG1= <>
##$CPDPRG2= <>
##$CPDPRG3= <>
##$CPDPRG4= <mlev>
##$CPDPRG5= <mlev>
##$CPDPRG6= <mlev>
##$CPDPRG7= <mlev>
##$CPDPRG8= <mlev>
##$CPDPRGB= <>
##$CPDPRGT= <>
##$D= (0..31)
0 1.2 0 0 0 0 0 0 0 0.06 0 0.03 0 0 0 0 0.0002 0 0 0 0 0 0 0 0 0 0 0 0 
0 0 0 
##$DATE= 1666355521
##$DBL= (0..7)
120 120 120 120 120 120 120 120 
##$DBP= (0..7)
150 150 150 150 150 150 150 150 
##$DBP07= 0
##$DBPNAM0= <>
##$DBPNAM1= <>
##$DBPNAM2= <>
##$DBPNAM3= <>
##$DBPNAM4= <>
##$DBPNAM5= <>
##$DBPNAM6= <>
##$DBPNAM7= <>
##$DBPOAL= (0..7)
0.5 0.5 0.5 0.5 0.5 0.5 0.5 0.5 
##$DBPOFFS= (0..7)
0 0 0 0 0 0 0 0 
##$DE= 6
##$DECBNUC= <off>
##$DECIM= 32
##$DECNUC= <off>
##$DECSTAT= 4
##$DIGMOD= 1
##$DIGTYP= 9
##$DL= (0..7)
0 120 120 120 120 120 120 120 
##$DP= (0..7)
150 150 150 150 150 150 150 150 
##$DP07= 0
##$DPNAME0= <>
##$DPNAME1= <>
##$DPNAME2= <>
##$DPNAME3= <>
##$DPNAME4= <>
##$DPNAME5= <>
##$DPNAME6= <>
##$DPNAME7= <>
##$DPOAL= (0..7)
0.5 0.5 0.5 0.5 0.5 0.5 0.5 0.5 
##$DPOFFS= (0..7)
0 0 0 0 0 0 0 0 
##$DQDMODE= 0
##$DR= 18
##$DS= 0
##$DSLIST= <SSSSSSSSSSSSSSS>
$$ [...]
##$SUBNAM2= <"">
##$SUBNAM3= <"">
##$SUBNAM4= <"">
##$SUBNAM5= <"">
##$SUBNAM6= <"">
##$SUBNAM7= <"">
##$SUBNAM8= <"">
##$SUBNAM9= <"">
##$SW= 18.0517283424941
##$SWIBOX= (0..15)
0 0 2 0 0 0 0 0 0 0 0 0 0 0 0 0 
##$SW_h= 3612.71676300578
##$TD= 16384
##$TD0= 1
##$TE= 0
##$TE2= 300
##$TE3= 300
##$TEG= 300
##$TL= (0..7)
0 120 120 120 120 120 120 120 
##$TP= (0..7)
150 150 150 150 150 150 150 150 
##$TP07= 0
##$TPNAME0= <>
##$TPNAME1= <>
##$TPNAME2= <>
##$TPNAME3= <>
##$TPNAME4= <>
##$TPNAME5= <>
##$TPNAME6= <>
##$TPNAME7= <>
##$TPOAL= (0..7)
0.5 0.5 0.5 0.5 0.5 0.5 0.5 0.5 
##$TPOFFS= (0..7)
0 0 0 0 0 0 0 0 
##$TUNHIN= 0
##$TUNHOUT= 0
##$TUNXOUT= 0
##$USERA1= <user>
##$USERA2= <user>
##$USERA3= <user>
##$USERA4= <user>
##$USERA5= <user>
##$V9= 5
##$VALIST= <valist>
##$VCLIST= <CCCCCCCCCCCCCCC>
##$VD= 0
##$VDLIST= <DDDDDDDDDDDDDDD>
##$VPLIST= <PPPPPPPPPPPPPPP>
##$VTLIST= <TTTTTTTTTTTTTTT>
##$WBST= 1024
##$WBSW= 4
##$XGAIN= (0..3)
0 0 0 0 
##$XL= 0
##$YL= 0
##$YMAX_a= 320948
##$YMIN_a= -398458
##$ZGOPTNS= <>
##$ZL1= 120
##$ZL2= 120
##$ZL3= 120
##$ZL4= 120
##$ABSF1= 10
##$ABSF2= 0
##$ABSG= 5
##$ABSL= 3
##$ALPHA= 0
##$AQORDER= 0
##$ASSFAC= 0
##$ASSFACI= 0
##$ASSFACX= 0
##$ASSWID= 0
##$AUNMP= <proc_1d>
##$AZFE= 0.1
##$AZFW= 0.1
##$BCFW= 1
##$BC_mod= 2
##$BYTORDP= 1
##$COROFFS= 0
##$CY= 11.3945322036743
##$DATMOD= 1
##$DC= 2
##$DFILT= <>
##$DTYPP= 0
##$F1P= 2.36226072786647
##$F2P= -0.459571619588291
##$FCOR= 0.5
##$FTSIZE= 0
##$FT_mod= 4
##$GAMMA= 1
##$GB= 0.15
##$INTBC= 1
##$INTSCL= 1
##$ISEN= 128
##$LB= 0.24
##$LEV0= 0
##$LPBIN= 0
##$MAXI= 10000
##$MC2= 0
##$MEAN= 0
##$ME_mod= 0
##$MI= 1.114404
##$NCOEF= 0
##$NC_proc= 0
##$NLEV= 6
##$NOISF1= 3.799351
##$NOISF2= 2.8
##$NSP= 1
##$NTH_PI= 0
##$NZP= 0
##$OFFSET= 15.70392
##$PC= 1
##$PHC0= -18030.86
##$PHC1= 7.0007
##$PH_mod= 1
##$PKNL= yes
##$PPARMOD= 0
##$PSCAL= 0
##$PSIGN= 0
##$REVERSE= no
##$SF= 200.130013532006
##$SI= 16384
##$SIGF1= 3
##$SIGF2= 2
##$SINO= 400
##$SIOLD= 16384
##$SREGLST= <1H.CDCl3>
##$SSB= 0
##$STSI= 0
##$STSR= 0
##$SW_p= 3612.71676300578
##$SYMM= 0
##$S_DEV= 0
##$TDeff= 0
##$TDoff= 0
##$TI= <>
##$TILT= no
##$TM1= 0
##$TM2= 0
##$TOPLEV= 0
##$USERP1= <user>
##$USERP2= <user>
##$USERP3= <user>
##$USERP4= <user>
##$USERP5= <user>
##$WDW= 1
##$XDIM= 8192
##$YMAX_p= 0
##$YMIN_p= 0
$$ End of Bruker specific parameters
$$ ---------------------------------
##NTUPLES= NMR FID
##VAR_NAME=  TIME,          FID/REAL,        FID/IMAG
##SYMBOL=    X,             R,               I
##VAR_TYPE=  INDEPENDENT,   DEPENDENT,       DEPENDENT
##VAR_FORM=  AFFN,          ASDF,            ASDF
##VAR_DIM=   8192,          8192,            8192
##UNITS=     SECONDS,       ARBITRARY UNITS, ARBITRARY UNITS
##FACTOR=    0.0002768,     1,               1
##FIRST=     0,             0,               0
##LAST=      2.2672688,     0,               0
##MIN=       0,             -398458,         0
##MAX=       2.2672688,     320948,          0
$$ Real data points
##PAGE= N=1
##DATA TABLE= (X++(R..R)), XYDATA
0@%%%%%%%%%%qJ6j6J6k3L1l2M0n6O4p2Q8j04J27j51J76k08K40k76L17l62M16m75
$$ 0 0 0 0 0 0 0 0 0 0 0 -8 8 -8 8 -15 16 -16 24 -32 32 -40 48 -56 71 -80 96 -112 128 -148 169 -193 223 -252
33b52N39o09O85p71Q66r70J083j207J343j492J652j828K022k232K463k717K994
$$ -252 287 -322 363 -408 458 -512 571 -636 707 -785 867 -961 1061 -1171 1292 -1425 1569
50A569l297L630m000M414m873N387n971O636p405Q304r371J0667j2271J4323j7056
$$ 1569 -1728 1902 -2098 2316 -2557 2830 -3141 3495 -3910 4394 -4977 5690 -6581 7742 -9314
65i314K0892k6717L6705n8387J88944k02017l38026M17898K34170k41493k08188
$$ -9314 11578 -15139 21566 -36821 152123 -49894 -387920 29978 264148 22655 -185533
76a85533K08161J03449j33540q7636P6272K3490L9294N1690r6452j77442R8876
$$ -185533 22628 126077 -7463 -95099 -18827 4663 43957 95647 -805 -178247 -79371
87g9371K37320l6317k31511P405J62670j3011j10910M4892P7610l8328m0616J7925
$$ -79371 157949 121632 -109879 -102474 60196 47185 -63725 -18833 58777 20449 -20167 -2242
99b242l5590j1682J20031N4344j64814j03489J44751J17146j01465p9771P2468
$$ -2242 -37832 -49514 70517 124861 -39953 -143442 1309 118455 16990 -62781 9687
110I687L0365o9331o112N1248k130l429K5582n6759p7635Q7301J24649q2874j31546
$$ 9687 40052 -29279 -35391 15857 13727 10298 35880 -20879 -98514 -11213 113436 30562 -100984
123a00984P8388R8489j02076n9949J49428M6778j81311m4266J84203K7757j72860
$$ -100984 -22596 75893 -26183 -86132 63296 110074 -71237 -115503 68700 96457 -76403
134g6403J2203J75667m4169j91127M4999J88268k3328j48731Q487Q5313k0826
$$ -76403 -64200 111467 67298 -123829 -78830 109438 86110 -62621 -54134 31179 10353
145A0353l4343M0239L473m3236J8827K6736n6628j3943J00045K1565j23110l7436
$$ 10353 -23990 16249 19722 -23514 -4687 22049 -34579 -48522 51523 73088 -50022 -87458
157h7458J15657L7053r0173j0584P5089j8610p2638L3008O7307k9629m2232L0317
$$ -87458 28199 65252 -24921 -35505 39584 20974 -51664 -18656 48651 19022 -23210 7107
169G107Q127m5253J4287O0552j7185n8453J3030L4255k3064j0115M1395j674n2627
$$ 7107 15234 -30019 -15732 44820 27635 -30818 -17788 16467 -6597 -16712 24683 23009 -29618
182b9618M265M1253j5384j9943M1137O840o9004m900Q4332K885q3722J3002Q5666
$$ -29618 -25353 15900 516 -19427 21710 28550 -40454 -45354 38978 41863 -41859 -28857 56809
195E6809l3116r5530M3645J07529l5011j03316J9031Q0127j0774n1325J1465K8224
$$ 56809 23693 -71837 -28192 79337 44326 -58990 -39959 40168 29394 -21931 -10466 17758
207A7758j1465j1919m97j0874J3696M0824j7038p0679O599Q2309N522p6344o480
$$ 17758 6293 -5626 -6123 -16997 -3301 37523 20485 -50194 -43595 38714 44236 -32108 -38588
220c8588O5031k500n5869J0582M9924j0233l4082J0796J0455j8780J1782L6540
$$ -38588 26443 23943 -31926 -21344 28580 18347 -15735 -4939 5516 -13264 -1482 35058
232C5058k0122m9196J6327M7729j2031l6906J3461K4657j7301j8715J3331Q912
$$ 35058 14936 -34260 -17933 29796 17765 -19141 -5680 18977 1676 -17039 -3708 5204
244E204l778P840m149l1175J436M7923O994n1924j0849M8678O734m5103J463M5594
$$ 5204 1426 9266 5117 -26058 -24622 23301 30295 -21629 -32478 16200 22934 -22169 -20706 24888
258B4888k346m1927J280L0274j659j3610J0383J965k0778R86K4512j585k0524
$$ 24888 22542 -19385 -18105 12169 10510 -3100 7283 9248 -11530 -10544 13968 12383 -8141
271h141M970J3299j3467j0872J7589R076j6373m026J1163q218j0151K0602J4707
$$ -8141 -3171 10128 -3339 -14211 3378 12454 -3919 -7945 3218 -5000 -15151 5451 20158
284B0158k6745j8722K7397J7750k5741j1323K8307Q268k9480q346K6274J0218
$$ 20158 -6587 -25309 2088 19838 -5903 -17226 11081 19349 -10131 -18477 7797 18015
296A8015j6222o807N430j187K83Q125l141j0342N621Q252j2831r380J8612J2384
$$ 18015 1793 -5014 416 -771 -488 7637 4496 -5846 -225 8027 -4804 -14184 4428 16812
310A6812k0547j5016J6375J1658j2821l726J2467k036j3899N202J3696m775q414
$$ 16812 -3735 -18751 -2376 9282 -3539 -7265 5202 3166 -10733 -5531 8165 3390 -5024
323e024P785M139j2172k390J5529M200j3527l835P537L00m029M492K802p483l193
$$ -5024 2761 6900 -5272 -7662 7867 12067 -1460 -5295 2242 2542 -1487 3005 5807 -1676 -4869
338d869O208p94n885N504P180r678j0302R334J0527o674p523O900L616q486j146
$$ -4869 1339 545 -5340 164 7344 -2334 -12636 -3302 7225 551 -6972 -72 3544 -4942 -6088
353f088J0249K259p832j129M026n51j287M875J191o805j255N379m56m277K435
$$ -6088 4161 6420 -1412 -2541 1485 934 -353 4522 5713 -1092 -2347 3032 2576 -1701 734
368G34M406m838o114L079N356j356k412j74j878j768M687L708n105m266N948M149
$$ 734 5140 302 -5812 -2733 2623 1267 -1145 -1319 -3197 -4965 -278 3430 -1675 -5941 7 4156
384D156o610m352Q300P250n942r152J990Q797M394n604p599R18Q811K388r956
$$ 4156 -2454 -6806 1494 8744 2802 -6350 -4360 4437 8831 3227 -4372 -3454 5357 7745 -2211
399b211n699J0324Q397j0168j3418O387J5587j159j4668m379R922O576m393o099
$$ -2211 -7910 2414 10811 643 -12775 -6388 9199 8040 -6628 -11007 -1085 5491 1098 -5001
413e001J66N341L174l099n732P35R315L792r337q038P020J1343k296j0815j651
$$ -5001 -4835 506 3680 581 -5151 -4416 4899 8691 -646 -8684 -1664 9679 7383 -3432 -5083
428e083P985L307n525l503K769K274j212k155p47j115J950M060r47p369l354Q496
$$ -5083 2902 6209 684 -2819 -50 2224 1012 -1143 -1890 -3005 -1055 3005 2058 -5311 -8665 -169
444a69P520o232r924K905J0668Q56q210k599N375N099j049m083m786J931J0756
$$ -169 7351 1119 -8805 -5900 4768 5624 -2586 -5185 190 5289 4240 157 -4629 -2698 8058
459H058L845j4250j2688J3523K1512r802k8153K138L0429N183l0935j2928K7101
$$ 8058 11903 -2347 -15035 -1512 20000 10198 -17955 -15817 14612 19795 -11140 -24068 3033
472C033J9017k0417k3256J0769K2786l30j6753p936P769J3090L178j2125j2984
$$ 3033 22050 1633 -21623 -10854 11932 11602 -5151 -13087 -5318 7772 10950 -1175 -14159
485a4159R335K1425k547k6586n167K8420J4296k6364k2102J9915K5390j1652k5355
$$ -14159 -4824 16601 14054 -12532 -17699 10721 25017 -1347 -23449 -3534 21856 10204 -15151
498a5151L485K0483J836j5512m346Q159M330j711k571l830k176P689Q153p718
$$ -15151 -11666 8817 10653 -4859 -9205 -1046 3284 1573 -998 -4828 -7004 685 8838 1120
512A120j3176O017J7154k488j7784J004J7208L04j5895R43J4871k320j5176N800
$$ 1120 -12056 -6039 11115 8627 -9157 -8153 9055 9359 -6536 -5593 9278 6958 -8218 -2418
526b418J5369r731j8270J2569K1958j4554k6774J2361K9756q818l1014M169K8179
$$ -2418 12951 3220 -15050 -2481 19477 4923 -21851 -9490 20266 11448 -19566 -15397 12782
539A2782M68k3192l789J5914N086n872l705k479p66J0811Q814j5115j7181J5970
$$ 12782 13250 -9942 -13731 2183 7269 1397 -2308 -4787 -5553 5258 14072 -1043 -18224 -2254
553b254K5423j2698l0799O915L2902L82l2499p816K7613J3030k0295j6528J0569
$$ -2254 23169 10471 -20328 -13413 19489 19871 -12628 -20444 7169 20199 -96 -16624 -6055
566f055J5047j263j1599n301M452Q020L267p672j0068N441J5378M8j8204o157
$$ -6055 8992 7729 -3870 -9171 -4719 3301 6568 -1104 -11172 -5731 9647 9695 -8509 -14666
580a4666J9719J3013j7743j7427J4509K0053j0275k0542Q378J8806p277j7230
$$ -14666 5053 18066 323 -17104 -2595 17458 7183 -13359 -4981 13825 6548 -10682
592a0682P232J4572q589j3160R978J1199j2222j1334J3491J0616j3433j0367J1158
$$ -10682 -3450 11122 2533 -10627 -649 10550 -1672 -13006 485 11101 -2332 -12699 -1541
605a541R714q319o699N552K582k410K944J551p853q92J3117K939j6841o010J8918
$$ -1541 8173 -146 -6845 -1293 1289 -1121 1823 3374 -4479 -5371 7746 10685 -6156 -12166 6752
620F752R562j7909j2820J4076J4448r011j4421J983J1955K798p799p375J689R246
$$ 6752 16314 -1595 -14415 -339 14109 5098 -9323 -7340 4615 7413 -386 -7761 -6072 3174
634C174L807q645r039N462J2612k45j2873n222J1508J0323o691j3943J890J6264
$$ 3174 6981 -1664 -10703 -5241 7371 7126 -5747 -10969 539 10862 4171 -9772 -7882 8382
648H382M219j5802r538J4285J3609j1083j5456O537J5085l198j3291L08R396J86
$$ 8382 12601 -3201 -12739 1546 15155 4072 -11384 -4847 10238 7040 -6251 -5943 3453 3639
662C639n521n85J201l93K028J482m403l117N617M635n095m889M706M348l033k851
$$ 3639 -1882 -2467 -1266 -1659 369 1851 -2552 -5669 -52 4583 -512 -5401 -695 3653 620 -2231
678b231L158Q34j951J011K209k659k395M291K493n439k769N110K802n102k944
$$ -2231 927 1761 -190 821 3030 371 -2024 2267 4760 -679 -3448 1662 4464 -638 -3582
693c582L562J933k933j261J933k95q81Q08K73j417M74J716k14j534Q13J259l45
$$ -3582 -20 1913 -1020 -2281 -348 -643 -1524 -716 -443 -1860 -1386 330 116 -1418 -605 654 309
710C09J96P07p70p94J947J604l214j442L585J628m481k155M350K061m410k845
$$ 309 505 1212 442 -352 1595 3199 -15 -1457 2128 3756 -725 -2880 1470 3531 -879 -3724
726c724L905K073l321k435K414J936j335j705M62J063J061n8k048N5L119J067
$$ -3724 181 2254 -1067 -3502 -1088 848 -487 -2192 -1730 -667 394 336 -1712 -1657 1462 2529
742B529l333j450L943J985l865j802L654K000l049k093K331J202j971o33J223
$$ 2529 -804 -2254 1689 3674 -191 -1993 1661 3661 612 -1481 850 2052 81 -552 671
757F71n89j450Q97J232j650j084J049O90p76o84O50P51J14J25n91r01K432J147
$$ 671 82 -1368 -471 761 -889 -1973 -924 -234 -1010 -1694 -1044 -293 -179 -54 -645 -1546 886 2033
775B033j739j610J887K383j717k341J367K120q63j719J95R37l34k26m61r02l93
$$ 2033 294 -1316 571 2954 1237 -1104 263 2383 1520 -199 -4 933 599 373 -88 -990 -1383
792a383J521L07j849j249K232J170j700j057J080J587r53n81j56Q28J264L23j262
$$ -1383 138 445 -1404 -2653 -421 749 -951 -2008 -928 659 -294 -875 -1031 -203 1061 1384 122
809A22j011K020K041k323k364J820L164j769l511Q44L436p39l178l68K333M03
$$ 122 -889 1131 3172 849 -1515 305 3469 1700 -1811 -967 2469 1730 -1448 -1816 517 920
825I20j723j089N11J119N99j365j818J567K803o72l479J023L506P0l059JK856
$$ 920 -803 -1892 -1381 -262 337 -1028 -2846 -1279 1524 852 -2627 -1604 1902 1972 -1087 -1086 1770
842A770M14j809k79J023j65L9K62j049j328J453J411j799j983J145K314j630j852
$$ 1770 2184 375 96 1119 954 993 1255 206 -1122 331 1742 -57 -2040 -895 1419 -211 -2063
859b063R45J078m89m51j73j03J68J512L06k040m06L188N66k779p9K120M60j302
$$ -2063 -1118 -40 -529 -980 -1153 -1256 -1088 424 730 -1310 -1716 1472 2038 -741 -820 1300 1760 458
877D58n7O07r20K37J841r90l273R89L847j401m548Q49M239r13l682L86K232J42
$$ 458 401 1008 88 325 2166 1176 -2097 -1108 2739 1338 -3210 -2361 1878 965 -2717 -2331 -99 43
895D3p76J70o75l81K449J406l165k166M178L296m085l277L167L711k112k910P47
$$ 43 -733 -563 -1238 -1619 830 2236 -929 -3095 1083 4379 294 -2983 184 3895 1783 -1127 -380
912c80J705P4l18j050j478J316K404j901l454J262L654j795k688J431J930k096
$$ -380 1325 1399 1081 31 -1447 -131 2273 372 -3082 -1820 1834 39 -2649 -1218 712 -1384
928a384j90K765p95l463K366M647k876n274L893N200l493m567L416L611l377j754
$$ -1384 -1574 1191 396 -3067 -701 3946 1070 -4204 -311 4889 1396 -3171 245 3856 479 -1275
944a275L225p91l522K801M511n205n844O084O379o537p546O198P132m734o884
$$ -1275 1950 1159 -2363 438 4949 -256 -6100 -16 6363 -174 -7720 -1522 5610 876 -6008
959f008L178N424j211k951O4L96J000K408n49m025q4N903J013n551k550M764L480
$$ -6008 -2830 2594 1383 -1568 -1504 -1108 -108 2300 1751 -2274 -2358 3545 4558 -993 -3543 1221 4701
976D701k637m517K12L942K491l472n633K269P193r24q893j9Q529L76p847L10O287
$$ 4701 2064 -2453 -2241 1701 4192 720 -4913 -2644 4549 3625 -5268 -5287 3242 3618 -4229 -3919 2368
993B368j055m624L048L081m875j701P753O72r010j43J0653m02j0967J374J0468
$$ 2368 1313 -3311 -263 2818 -2057 -3758 3995 4667 -4343 -4486 6167 5765 -5202 -3828 6640
1008F640k514r318L488Q041n587o245O958M365q988l403R990K515j0932j953J0247
$$ 6640 4126 -5192 -1704 6337 750 -5495 1463 5828 -3160 -6563 3427 5942 -4990 -6943 3304
1023C304J928r606j077P352J224n088J55L001j425l34K945q84m193J792N034j403
$$ 3304 5232 -4374 -5451 1901 3125 -1963 -1808 1193 -232 -566 2379 1495 -2698 -906 4128 2725
1039B725n320M39M842O53l003l058R52M084J676n681m450O251N985o107p676N902
$$ 2725 -2595 -2156 2686 3339 336 -2722 -1770 2314 3990 -1691 -6141 110 6095 -12 -7688 -1786
1055a786P776n283o906M920N309m752k643N204K54n480L221N965n663o357P982
$$ -1786 5990 707 -6199 -1279 4030 -722 -3365 1839 2093 -3387 -166 5799 136 -6221 1761
1070A761O621r182p024J0322N752j0112m938R527L475r733j053Q270j091p799
$$ 1761 8382 -800 -7824 2498 8250 -1862 -6800 2727 6202 -3531 -4584 3686 2595 -5204
1084e204L222O595m997n664O020M353o471k905P037J549o499M82N507j237m454
$$ -5204 -1982 4613 -384 -6048 -28 4325 -2146 -5051 1986 3535 -2964 -2482 3025 1788 -2666
1099b666K916L381l490k431M044J365l783o56L014j011j799J790m4k515Q43L476
$$ -2666 250 3631 141 -2290 1754 3119 -664 -1320 1694 683 -1116 674 630 -1885 -1042 2434
1115B434k984l862M017M220n015m156N737L424n852j926N508P73n057J774M269
$$ 2434 -550 -4412 -395 3825 -1190 -5346 391 3815 -2037 -3963 1545 2318 -2739 -965 3304
1130C304k995l325N129K279o393j161P243j5p625Q87P558k187p319L144N703l955
$$ 3304 309 -3016 2113 4392 -2001 -3162 4081 4066 -3559 -2672 4886 2699 -4620 -1476 4227 272
1146B72m782N106K403n446j183N858m93n821K064N752l337m900M476M452n135
$$ 272 -4510 596 2999 -2447 -3630 2228 1735 -4086 -2022 3730 393 -4507 -31 4421 -714
1161g14l060O016J488n885J60N358j297m377K523L470l833k172M272O92n087Q47
$$ -714 -3774 2242 3730 -2155 -1995 3363 2066 -2311 212 3682 -151 -2323 1949 2641 -2446 -1599
1177a599M690k364m685L147M147m207l155M491K163m643j212M922m57m079K034
$$ -1599 3091 727 -3958 -811 3336 -871 -4026 465 2628 -2015 -3227 1695 1238 -2841 -807
1192h07L797k914k760M154J981m669o03M704l43m765J605L987k780l235L505K221
$$ -807 2990 76 -2684 1470 3451 -1218 -1821 2883 2540 -2225 -620 3367 587 -2648 857 3078
1208C078m724q94M722n34n024J228M833k263m322L124L675l725k721M548J248
$$ 3078 -1646 -2540 2182 1648 -3376 -2148 2685 422 -3900 -776 2899 -826 -3547 1001 2249
1223B249m342l2M670q83m300K418L800k997l088L959J961m379j021M264l30l967
$$ 2249 -2093 -2125 2545 1662 -2638 -220 3580 583 -2505 1454 3415 -964 -1985 2279 1949 -2018
1239b018J169L458k563l031L062K030m166j062M331L07m106M70M047j282l141
$$ -2018 -849 2609 46 -2985 77 2107 -2059 -3121 1210 1517 -2589 -2119 1928 646 -2495
1254b495K091K662k773j419L533O55l666N70L801j640l226K192K542k674j894
$$ -2495 -404 2258 -515 -1934 1599 2254 -1412 -842 2959 1319 -1907 285 2827 153 -1741
1269a741L169N06l370K9L340j251l250J581L157k966k422L245J680l143q90L156
$$ -1741 1428 1934 -1436 -1407 1933 682 -2568 -987 2170 -796 -3218 27 1707 -1436 -2326 830
1285H30J73k900J056K627j512j724K202J251k456o65L020M37l841R05L103j571
$$ 830 1003 -1897 -841 1786 274 -1450 752 2003 -453 -1118 1902 2339 -1502 -597 2506 935
1301I35k943K200K188k734j549K731L57k856Q4K793p98k808J390K509j922k026
$$ 935 -2008 192 2380 -354 -1903 828 1185 -1671 -1587 1206 408 -2400 -1010 1499 -423 -2449
1317b449K705J437k746o93L178j1k543O15K368r30k224J923J439k184n73J743
$$ -2449 256 1693 -1053 -1746 1432 1421 -1122 -507 1861 931 -1293 630 2069 -115 -688 1055
1333A055K52k434N47J867j094j601P79J612j585j128K072J71j903M5J615o8j582
$$ 1055 1307 -1127 -580 1287 193 -1408 -629 983 -602 -1730 342 513 -1390 -1345 270 202 -1380
1350a380J288J110j437l67J886M4j891K19K217m20k131J123J608j678j230J970
$$ -1380 -92 1018 -419 -786 1100 1144 -747 -528 1689 1269 -862 261 1869 191 -1039 931
1366I31P59k461n55K312Q7k565J93K226o73k041Q63J382j019q63J522N30j581
$$ 931 1690 -771 -1326 986 1073 -1492 -1299 927 254 -1787 -924 458 -561 -1424 98 628 -953
1383i53J73J550j7j537P79J086k84j038O34O41l71o80N26J54n20K89Q8q20n2P00
$$ -953 -780 770 753 -784 -5 1081 797 -241 393 1034 663 -17 509 663 143 432 520 -300 -352 348
1403C48Q7j230j5J190o69p25M09M76m16k84R80J53j368M56J241l52j218Q24J727
$$ 348 435 -795 -810 380 -289 -1014 -605 -129 -545 -829 151 304 -1064 -608 633 281 -937 -113 1614
1422A614r88j392Q47J591q90j196P37P92j157o49J394j39j168k91J435k26j555
$$ 1614 626 -766 81 1672 782 -414 323 1115 -42 -691 703 564 -604 -895 540 314 -1241
1439a241N2J567p7j412mJ197J10p53k85J000L71m95j54K69O15n05K3N14l61l06
$$ -1241 -1189 378 301 -1111 -1115 82 192 -561 -846 154 525 30 -124 145 760 255 278 792 431 125
1459A25J82P03k88q98L8J126l95j511P6J594m11j449m0J319P7j114l74J398J81
$$ 125 307 1010 722 -176 -138 988 593 -918 -842 752 341 -1108 -1148 171 248 -866 -1240 158 339
1478C39j346M74J023k81j097R76J134j056q60J180Q78j099q28J187J229j561j064
$$ 339 -1007 -533 490 209 -888 88 1222 166 -694 486 1364 265 -563 624 1853 292 -772
1495g72J195Q95j582q55J264N79j550l62J504J17j765J2J866p4j998M55J881O2
$$ -772 423 1318 -264 -1119 145 724 -826 -1188 316 433 -1332 -1320 546 472 -1526 -1071 810 872
1513H72j878Q9J838k34j308N93J191l20j252P01J146j076j060J192O69j176r96
$$ 872 -1006 -917 921 687 -621 -28 1163 843 -409 292 1438 362 -698 494 1163 -13 -1009
1530a009J410N54j205j057J146P39r57j046J233P48r08q10R35P29q75j63O93M88
$$ -1009 401 955 -250 -1307 -161 578 -379 -1425 -192 556 -352 -1162 -227 502 -373 -536 157 645
1548F45j001K2Q81K51j110R6J212J31j456k02J508P1j749K41J193j93j368K1J600
$$ 645 -356 -334 547 798 -312 -216 996 1127 -329 -531 977 1048 -701 -460 733 540 -828 -807 793
1567G93o81j260K69J383q46j058R93R71p08j001R52J210r68o28R14O98r94k45
$$ 793 112 -1148 -879 504 -342 -1400 -407 564 -144 -1145 -193 1017 49 -579 335 1033 39 -206
1585b06J083m5p84l72J031Q1p99k81R15%j387K32Q35k87r61K81Q43j19j139N44
$$ -206 877 832 48 -324 707 788 -11 -292 623 623 -764 -532 303 16 -945 -664 179 60 -1079 -535
1605e35P11k60m36J14N69mn28N04K79M41r67M47M29l67n30O45N07p72m07O7N88
$$ -535 176 -84 -520 -406 163 159 -369 135 414 855 -112 335 764 397 -133 512 1019 247 -160 -93 495
1626D95m50j80M8N44o92m99M04M88q55k33Q53R9k37p52O17N95n14J80M95K66o73
$$ 495 45 -135 -87 457 -235 -734 -330 158 -697 -930 -77 22 -215 -967 -350 245 -269 -89 406 672 -1
1647aj53J273o09m63L31N33m25p64L92O91n09o90L25M00n14k78J87Q1l17k31K99
$$ -1 -154 1119 510 47 378 911 486 -278 114 805 296 -394 -69 331 -183 -461 -274 -193 -510 -741 -442
1668d42J52Q5l51Q44m91k44L59qL03m5j88J99K21l9Q4k55J02q5K8k85N34j29m85
$$ -442 -290 -205 -556 288 -203 -447 -88 -96 207 162 -26 173 394 355 439 184 286 201 229 -56 478 349 -136
1691a36p7M74l95n17J17N86j79n96O20J57m41k98N17L42l03m51Q51k4j00m27Q51
$$ -136 -213 261 -134 -651 -534 52 -127 -723 -103 54 -387 -685 -168 174 -129 -580 271 247 147 -280 571
1712E71Q2o37n2O24p6m08K87Q1k76n08N16L80o03n17K80K51m63l26M55j0rj63
$$ 571 653 16 -36 588 512 104 391 472 196 -312 204 584 -19 -536 -256 -5 -468 -794 -339 -349 -358 -521
1734e21K13M36j86j92K61J76k64K85n1K7r8J03J57J1L08l78o0O0j10j88QR7N1
$$ -521 -308 128 -58 -250 11 187 -77 208 157 184 86 189 346 357 665 287 227 287 177 -11 -3 94 145
1757A45l60q1L45j25k42j0K29l29l51O16Q2r6j11K86K97m64K35L68K23r29N61
$$ 145 -215 -296 49 -76 -318 -328 -99 -428 -779 -163 -81 -177 -288 -2 295 -169 66 434 657 -272 289
1778B89P7J6l27o5N68q7o73K13K07k50j78l3K09n80L85n9m0j27K02J37k58j19
$$ 289 366 382 55 -10 558 471 -202 11 218 -32 -210 -243 -34 -614 -229 -288 -328 -455 -253 -116 -374 -493
1800d93O7J57J1J02K19j53N44k70K6k07J09L53j19j88p3O29l07m73K10l1J27k13
$$ -493 -426 -269 -258 -156 63 -90 454 184 210 3 112 465 346 158 85 714 407 -66 144 113 240 27
1822B7j74J96k72n17N05P7n29J5O09J31m69l1N67K12n30j23J029l88l14r2Q84
$$ 27 -147 49 -223 -740 -235 -158 -687 -672 -63 68 -401 -432 135 347 -183 -306 723 335 21 -71 813
1843H13k79n63K1N66l07l77L27L29n22l65N27q2k86l06L03Q5j41j05J3K86l44
$$ 813 534 -29 -8 558 251 -126 201 530 8 -357 170 88 -198 -504 -201 -116 -257 -362 -349 -63 -407
1864d07J07Q7O4J62l27M27K19J23m65J89L82j58l29L25k7j93m95M91K87l43n20
$$ -407 -300 -213 -149 13 -314 113 332 455 -10 179 561 403 74 399 372 179 -316 175 462 119 -401
1885d01L77N51o45m42K51M48m63n58Q96L34r02O6O66J23q34K19O59j07p26L56
$$ -401 -24 527 -118 -560 -309 139 -324 -882 14 348 -554 -488 178 301 -533 -314 345 238 -488 -132
1905a32Q75k50o16K14P34o83j96K08J28K9n19K48M57n69k17K45J27k04j94j19
$$ -132 743 493 -123 91 825 142 -54 154 282 311 -208 40 497 -72 -289 -44 83 -121 -315 -434
1925d34M12n12Q8N4M72k15j55J80L68O5l51L3L15m1n29M89L46J4m84K29K51n29
$$ -434 -22 -534 -446 -392 80 -135 -290 -110 258 323 -28 5 320 279 -250 239 585 599 115 344 595 66
1947F6l72M17M66n65n48O05J74m65m14N60K79r66p6J048%p65J00P34K4n04L7O61
$$ 66 -306 111 577 12 -536 69 243 -222 -636 -76 203 -763 -839 209 209 -556 -456 278 302 -202 -165 496
1969D96L2o26L57M65j92m89Q7N28m75l59K21R5j80l18M03j59pk51r4M21j47k58
$$ 496 528 -98 259 724 532 43 130 658 183 -176 45 140 -40 -358 45 -114 -121 -372 -466 -45 -192 -450
1991d50J61K76j94l32L42L55j70k3j1M25k0m64K29P66o01m22L17L11k43m83L22
$$ -450 -289 -13 -207 -539 -197 158 -12 -35 -46 379 359 -105 124 890 289 -133 184 495 252 -231 91
2012I1M44n94l26N09J15m59o21Q75q2m38k87P46J26p50J18O48J38p77K34P92k07
$$ 91 535 -59 -385 124 239 -220 -841 34 -48 -486 -773 -27 99 -651 -533 115 253 -524 -290 502 295
2033B95o10N63N28n25k71L14K52k64k94J41J32m3k92L78j40l99k00L49k40k03
$$ 295 -315 248 776 251 -20 294 546 282 -12 129 261 218 -74 304 164 -235 -435 -86 -326 -529
2053e29K92r3M4J83J01lj10L20m69K15K1L45l78J14N60l29m30K95L73k01l99M40
$$ -529 -237 -330 -286 -103 -2 -5 -115 205 -264 -49 -28 317 -61 53 613 284 -146 149 522 321 -78 362
2075C62l5j66n81N34J85n00k15K83L53p06j26P19k38o88N38N96j06o08K72N29
$$ 362 327 161 -420 114 299 -201 -416 -133 220 -486 -612 107 -131 -819 -281 315 209 -399 -127 402
2095D02m87k4K76M18n54o2M48rn46O7M23j97l64M94J84l68j44J45k31k39L10k
$$ 402 -85 -109 167 585 31 -31 417 408 -138 -71 352 155 -209 285 469 101 -43 102 -129 -368 -58 -60
2117f0l77O6M45p6m77K27K31k42k93N12L82k27l28M90J92n52M2P47l92m28L12
$$ -60 -437 -371 74 -2 -479 -252 -21 -263 -556 -44 338 111 -217 273 465 -87 -45 702 310 -118 194
2138A94M30m87n75R33J3j013l0Q22k26m92j26R06l46o79M11O58m31l98M12L04
$$ 194 624 137 -438 495 508 -505 -535 287 61 -431 -557 349 3 -676 -265 393 -38 -436 -24 280
2158B80q73K36O27K45p35J61O10m59m73O91P2n4l48K50J42n22J62K24m31N2J2
$$ 280 -593 -357 270 515 -220 -59 551 92 -381 310 382 328 -20 230 372 -150 12 236 -195 -143 -131
2179a31J39n24M00J50p8o38M17K52o0m27L06L99m83J9P15j77n92J98J135p00p79
$$ -131 8 -516 -116 34 -44 -682 -265 -13 -73 -500 -194 205 -278 -259 456 279 -313 -115 1020 320 -459
2200d59O76N70o93k70O90k25o21n4R65m17q48J55Q70n75n73Q67J60o00m35Q19
$$ -459 217 787 94 -176 514 289 -332 -386 579 162 -686 -531 339 -236 -809 58 218 -382 -817 2
2220BM56j046L68O58k94k76J00N42m13k54O15L7m74L14J62r6n16K18R8k85j81
$$ 2 458 -588 -220 438 144 -132 -32 510 97 -157 458 495 21 335 497 401 -115 103 201 -84 -265
2241b65M39J90n83j73O19n49k73M25J34m21J51M00K55p78K18O63l91l12K46P60
$$ -265 174 364 -219 -392 227 -322 -595 -170 -36 -457 -306 94 349 -429 -211 452 61 -251 -5 755
2261G55l64m65J77N39m67k76M80j25m13K78J92k78l70M14L71q36l82P96k16k42
$$ 755 391 -74 103 642 175 -101 379 254 -159 119 311 33 -337 77 448 -388 -770 26 -190 -432
2281d32j68P04o4n79M52L24j48m00O16l72j1J80L57m51j44M79M04o88k22M93L3
$$ -432 -600 104 40 -539 -87 237 89 -311 305 -67 -78 102 459 8 -136 343 747 59 -163 330 363
2302C63n91Q9M49m12m69K55M57l79m10P20L8o64J25M99P4p22N85M60m01m14L13
$$ 363 -228 -139 310 -102 -571 -316 141 -238 -648 72 110 -554 -429 70 144 -578 7 467 66 -348 -35
2323c5M24l61m24Q21J03m14k72N73m9m54L4N63j83m85K82k84j25k2L12j45l06
$$ -35 389 28 -396 425 528 114 -158 415 366 -88 -54 509 326 -159 123 -161 -286 -308 4 -141 -447
2344d47q7M06J15j48J48J46k01R9J85k15k83L94J48k32J24L51o2n17K38K26Q3
$$ -447 -534 -128 -13 -161 -13 133 -68 31 216 1 -282 112 260 28 152 503 441 -76 162 388 471
2365D71p34L00M39n04l84L52J34k09n60P56J33m34j43O42k13o80N05L52j23m64
$$ 471 -263 37 476 -28 -412 -60 74 -135 -695 61 194 -240 -383 259 46 -634 -129 223 100 -364
2385c64N78K65o28k6O51j73m89J71P43l05l84OK53j95J2O0o9k79l8m5J28qo1J17
$$ -364 214 479 -149 -175 476 303 -186 -15 728 423 39 45 298 103 115 175 106 -173 -211 -256 -128 -136 -197 -80
2409h0n06L76J94m31J95rM37l48j0O51k80l63K14M05k02l18J1N45m76O1MJ55l52
$$ -80 -586 -210 -16 -447 -252 -261 176 -172 -182 469 189 -174 40 445 243 -75 -64 481 5 66 70 225 -127
2432a27L5K42O5o20K06L70j88n36K36K32j23k04K83K96m23J33K88J1l17N2L75
$$ -127 -92 150 215 -405 -199 171 -17 -553 -317 -85 -208 -412 -129 167 -256 -123 165 176 -141 -89 286
2453B86J4n00L76L5J88n22K38K09l27P1n4n2K04m20R0J59j07J05j10j65J44j22
$$ 286 300 -200 176 211 399 -123 115 324 -3 68 14 -38 166 -254 -164 -5 -112 -7 -117 -282 -138 -260
2475b60j7J14K55l20k26L04J83P2j17J75n3J5k45N60k12k39J65L42l62m4p6J31
$$ -260 -277 -163 92 -228 -454 -150 33 105 -12 163 110 125 -120 440 228 -11 154 496 134 90 14 145
2497A45q4k58O8N6l05nK44K41m35J77O8j78P3M9M12j07n40N54J53j14m37M16K62
$$ 145 61 -197 -129 -73 -378 -383 -139 102 -333 -156 -88 -266 -193 -144 268 161 -379 175 328 214 -223 193 455
2520D55j74l13K77j14n8j04P2j41L41j4K0o35L21N4j92J27k32J24j52J86j3o8
$$ 455 281 -32 245 131 73 -31 41 -100 241 227 247 -388 -67 -13 -205 -78 -310 -186 -338 -152 -165 -233
2542b33MJ05rJ08j32L83n5j05P7r0K21K9j83p5K35l95M05l45J7R8Q1k72N8j06
$$ -233 -229 -124 -133 -25 -157 226 171 66 143 53 274 303 120 45 280 -115 290 -55 -38 60 141 -131 -73 -179
2566a79R8k27K26j42K71l72M11j64K03k73r0K28j8R4L1rR8J16k2n6k14L36p0k29
$$ -179 -81 -308 -82 -224 47 -325 86 -78 125 -148 -238 -10 -28 66 97 88 186 302 280 224 10 346 276 47
2590D7J34k60L93k04j96Q8J04k09J3k03Q4J08j92K55l43K69j07J50l8q2j25L90
$$ 47 181 -79 314 110 -86 2 106 -103 -90 -293 -209 -101 -293 -38 -381 -112 -219 -69 -107 -189 -314 76
2612G6k54J61j47K36r9J87m2O9J08p2j40o6K55l30O3j33R7L9kO2J34m36J00J65
$$ 76 -178 -17 -164 72 -27 160 118 187 295 223 83 17 272 -58 5 -128 -31 8 6 68 202 -234 -134 31
2636C1k87J81k96L05o7r2J20J5L87l66J80P1k11K06k1J4J19j28o8L5k64K12l8
$$ 31 -256 -75 -371 -66 -133 -225 -105 -90 297 -69 111 182 -29 177 156 170 289 161 93 128 -136 76 38
2659C8L3k66J4K11n0j07k21L33q6l38M06j9j3J39k28J01K06n21M08K34q5r1J8
$$ 38 71 -195 -181 30 -20 -127 -348 -15 -101 -439 -33 -52 -65 74 -154 -53 153 -368 40 274 189 98 116
2682A16J08K95j54j22j54K3j25O6mJl34J07K87l81K16l27K92o5p8L54l05P1J96
$$ 116 224 519 365 243 89 112 -13 53 49 50 -284 -177 110 -271 -55 -382 -90 -155 -233 121 -184 -113 83
2705H3K9k82K11O2J35q3j49M1K66k13m2JM1K31j59j87K41j07J10j74J66j38k37
$$ 83 112 -170 41 103 238 155 6 47 313 100 58 59 100 331 172 -15 226 119 229 55 221 83 -154
2728a54k57K66j99l6L50k02q4Q4O5J37j9pq6J98J99k73J26p0L55k51J4J80o0l02
$$ -154 -411 -145 -344 -380 -30 -232 -316 -232 -167 -30 -49 -56 -142 56 255 -18 108 38 393 142 156 336 276 -26
2752b6L60k62n5l9j27r5J76k82m4P00n27k7L14m5j14q8J25O3q7K3J43K72n29J98
$$ -26 334 72 17 -22 -149 -244 -68 -350 -394 306 -221 -248 66 21 -93 -181 -56 7 -80 -57 86 358 -171 27
2776B7n6J12M8r2L8R2J42k04J67k20J08K5l63L58l97N3P6K98k60k24R6J25j69
$$ 27 -29 83 131 39 77 169 311 107 274 54 162 187 -176 182 -215 -162 -86 212 -48 -272 -176 -51 -220
2799b20j36N00k41p5J25R4J2p5R7J85k26K3p3K27J50m68M2K45k39l34L80M55q27
$$ -220 -356 144 -97 -172 -47 47 59 -16 81 266 40 63 -10 217 367 -101 -59 186 -53 -387 -7 448 -379
2822c79J53L5L72l32P5j1K54n38K8L46k7P8j07K85l40J74p7L90j36l36R6K7L9
$$ -379 -226 -191 181 -151 -76 -87 167 -371 -343 3 -24 54 -53 232 -108 66 -11 379 243 -93 3 30 69
2845F9j08L49M8k21J04j12r0P6J61m97J02M0J0r7k0lJ12j11M9L0n4J39LJ51j83
$$ 69 -39 310 358 137 241 129 39 115 276 -221 -119 -79 -69 -166 -186 -189 -77 -188 -139 -109 -163 -24 -21 130 -53
2870e3j9K29j09l03M28ML4j28j8K11J83o22L84j53j62M8K21k89N3p5J90j74l4
$$ -53 -72 157 48 -255 173 177 211 83 65 276 459 -163 221 68 -94 -46 175 -114 -61 -136 54 -120 -154
2893a54m5L15l56J61oL5j20K28P2j08j02m2M50j49j25J32o7K49j65j91k1L84k43
$$ -154 -199 116 -240 -79 -85 -50 -170 58 130 22 -80 -122 328 179 54 186 119 368 203 12 -9 375 132
2916A32p5o4k65M62l87J08J85j47k16J98k42J09j60L88J92m14J04P4M15j33k27
$$ 132 57 -7 -272 190 -197 -89 96 -51 -267 -69 -311 -202 -362 26 218 -196 -92 -18 397 264 37
2937C7J58J56l12%N43l91j81OR7N4n5k23L30j67j74j37K15J4k12R2P1m1l8K6J59
$$ 37 195 351 39 39 582 191 10 16 113 167 112 -111 219 52 -122 -259 -44 -30 -242 -150 -79 -120 -158 -132 27
2962B7k0k38J14J98q1o6k8K36k50L27N6k46K4qJ55p3j54jL03k87j54j30L07j84
$$ 27 7 -231 -117 81 0 -66 -94 142 -108 219 275 29 53 45 200 127 -27 -28 275 -12 -166 -296 11 -173
2986a73J46j0j7Q1P9l51L50m38K42J11L03k84Q1j43J60j73j13N89j10j35r1m3
$$ -173 -27 -37 -54 27 106 -245 105 -333 -91 20 323 39 120 -23 137 -36 -149 440 330 195 104 61
3008F1J91k62J01L7j23K5J99k0j91k35L7j44K53koj37J89L9j62L2K69j06Pj17
$$ 61 252 -10 91 128 5 30 229 209 18 -217 -180 -324 -71 -73 -79 -216 -27 12 -150 -118 151 45 52 -65
3032f5m4K9K37L7j67K05j76K5jj37k2K34mj39j22J21m3R0n3K15l19J48j13j16
$$ -65 -109 -80 157 194 27 232 56 81 80 -57 -79 155 151 12 -110 11 -32 58 5 220 -99 49 -64 -180
3056a80K18L1r4j40K49r9J25Lq7J32j26r9J96k26K14r9j0J41l1l4j58k6M8j53
$$ -180 38 69 -25 -165 84 -15 110 113 26 158 32 -67 129 -97 117 18 8 149 118 84 -74 -100 -52 -205
3080b05r4L19k61j44K88n6P0nJ65l28J62Q6j36K5K00j52N4K69k99lK10K0n6qk1
$$ -205 -299 20 -241 -385 -97 -153 -83 -88 77 -251 -89 -3 -139 -114 86 -66 -12 257 -42 -45 165 185 129 121 100
3105A00o8j10J01j28J87nPj94M30l10r6j4k0j64K5L68j80J34k57J15O8j13R3o3
$$ 100 32 -78 23 -105 82 77 84 -110 320 10 -86 -100 -120 -284 -259 109 -71 63 -194 -79 -11 -124 -31 -94
3129i4K27o7JK51J08m43%J03R3m56L88L7q2k16K27qk35o1n8L78m20J07m0J17N3
$$ -94 133 66 67 318 426 -17 -17 86 179 -277 111 148 66 -150 77 69 -166 -227 -285 93 -327 -220 -260 -143 -90
3154i0P2j37J17K6r1j34J92J5J87q3K6q5K69k10J21J5J7o8j16l3j20J69J01k28
$$ -90 -18 -155 -38 -12 -103 -237 -45 -30 157 74 100 15 284 74 195 210 227 159 43 10 -110 59 160 -68
3178f8p8j12J48J8o4M45k49k52j59M06M4ql39L83k41p2M28j09k54j61J61K17k86
$$ -68 -146 -258 -110 -92 -156 289 40 -212 -371 35 79 71 -268 115 -126 -198 230 121 -133 -294 -133 84 -202
3201b02K98J21l3n0k68J94K5Q2k81R2j12j55L05n0J58m22J36J07N7n5p2J72n3
$$ -202 96 217 184 134 -134 60 85 167 -114 -22 -134 -289 16 -34 124 -298 -162 -55 2 -53 -125 47 -6
3224fM4Qk1J31j59K26l13kL12O9l68M09k21j39j06K28o9o1K09l62J39j07j12K07
$$ -6 38 46 25 156 -3 223 -90 -92 220 289 -79 330 109 -30 -136 92 23 -38 171 -191 -52 -159 -271 -64
3248f4j19O9J07p8o9K8J56Mk41K34O8o7j98J50J09k38K76J04j34q6j10K56O6j52
$$ -64 -183 -114 -7 -85 -154 -126 30 34 -207 27 95 28 -170 -20 89 -149 127 231 97 11 -99 157 223 71
3272G1J42k95p2L18k30M3r4N2j6j17J27k8L87j86J6j69j5J23j81M07j02j71J89
$$ 71 213 -82 -154 164 -66 -23 -117 -65 -81 -198 -71 -99 288 102 118 -51 -66 57 -124 283 181 10 199
3295A99o3j03O4r2N4n7J3QN0j20pm7j37Q0J26L7j30l4K2R7L8j88O0K07j27K14
$$ 199 136 33 97 5 59 2 15 23 73 -47 -54 -101 -238 -158 -32 5 -125 -159 -137 -40 -2 -190 -130 77 -50 164
3321A64k8k00j70K12l21L22J08O0j31OJ18j5J42l21K42N7j28k53Q4Jk17M25n2
$$ 164 136 -64 -234 -22 -343 -21 87 147 16 22 140 125 267 -54 188 245 117 -136 -52 -51 -268 157 105
3344A05n15M37j60K8j12L19r0N5k05N0J96k3j35Q7R2n0Q2L8j87r2j19L13M5l56
$$ 105 -410 27 -133 -105 -217 102 12 67 -138 -88 108 85 -50 37 129 79 161 199 12 -80 -199 114 159 -197
3368a97K37L0K66l67K83k66j4j83K9R5J31p0O9j76R3M3J95k76j23K98P9K09j78
$$ -197 40 70 336 -31 252 -14 -28 -211 -182 -87 44 -26 43 -133 -40 3 198 -78 -201 97 176 385 207
3391B07j84J01j62L93k05J31m46NL38j67k02j47J89j89M77k49K34l08K34k95k0
$$ 207 23 124 -38 355 150 281 -165 -160 178 11 -191 -338 -149 -338 139 -110 124 -184 50 -245 -265
3412b65M28k87J14j22k2L20l07J84rq3J32K3P5k97L41j95pO1jl2J7j4j51J96p8
$$ -265 163 -124 -10 -132 -154 166 -141 43 34 -49 83 106 181 -116 225 30 23 84 83 51 68 54 -97 99 21
3437B1r0J28L3j7l94K51N3M1j07P6k6pj53P7K58j22k24N64k92k81K47j04K8J08
$$ 21 -69 59 92 75 -319 -68 -15 26 -81 -5 -31 -38 -191 -114 144 22 -202 362 70 -211 36 -68 -40 68
3461F8k95M08q4kJ07o5j99P5J42k45j45K18pn3Q5K9j60L56m42nJ54J92M0k03K05
$$ 68 -227 181 97 95 202 137 -62 13 155 -90 -235 -17 -24 -77 8 37 -123 233 -209 -214 -60 132 172 -31 174
3486A74j71J31m22M51j52J0q6J02q1P8P6kP4j80L4m59M15k06L61k61kJ68k03M2
$$ 174 3 134 -288 163 11 21 -65 37 -44 34 110 108 182 2 36 -423 -8 -214 147 -114 -116 52 -151 -109
3510a09K0j52K35Q1j51K63j41k43J19K23k57L81k84L13j06p9j7P9j38J65k20n
$$ -109 -89 -241 -6 75 -76 187 46 -197 -78 145 -112 269 -15 298 192 113 96 175 37 202 -18 -23
3532b3J08N1k43l7J11k1n2L1J76m6k12K91k08J53m4L5j76J18L3M4p7L8M2m4J70
$$ -23 85 136 -107 -144 -33 -54 -106 -75 101 55 -157 134 -74 79 35 70 -106 12 45 89 12 50 92 48 218
3557B18j19L1J01o9m59K89R4j4j05j96K36j66J58k24K67q0L8n5J36j3J25l11J35
$$ 218 99 130 231 162 -297 -8 86 72 -33 -229 7 -159 -1 -225 42 -38 0 -55 81 68 193 -118 17
3580A7j3J24j09j95J78L71m29K60j09K5J39l66J44O9kQ2j13j19j41J60j05J7n9
$$ 17 4 128 19 -176 2 373 -56 204 95 120 259 -107 37 106 104 186 73 -46 -187 -27 -132 -115 -174
3603a74n1K27r2Rj3j09nQ8J73L10n27K22j13J30r4P0k55L03j39J62j37m3k32L79
$$ -174 -225 2 -90 -81 -94 -203 -208 -120 53 363 -164 58 -55 75 -19 51 -204 99 -40 122 -15 -58 -290 89
3627H9M2k97K85K5k90K90j58j85J90j57J12k78J91K03j09m6K39j3k92L34o9m2
$$ 89 131 -166 119 144 -146 144 -14 -199 -9 -166 -54 -332 -141 62 -47 -93 146 133 -159 175 106 64
3649F4j57K20j11p5R3Qr5p7Q6j28J18n6J63k33K31p5k0O6k48j03K28K01M1j91
$$ 64 -93 127 16 -59 34 42 -53 -130 -44 -172 -54 -110 53 -180 51 -24 -44 22 -226 -329 -101 100 141 -50
3673e0L08m32P0j74L51o6J59j86K58j20K7k69K35l55L87j07J25lk30K31r2l52
$$ -50 258 -174 -104 -278 73 7 166 -20 238 118 145 -124 111 -244 143 36 161 158 -72 159 67 -285
3695b85M36l43LJ14J89r8J4j44j83J23K13j07J7K93l28K79M0p2m3j21j50L30m6
$$ -285 151 -192 -189 -75 114 16 30 -114 -297 -174 39 -68 -51 242 -86 193 233 161 118 -3 -153 177 131
3718A31k38N5K03k45RK57l75k9J95j76O5p6N4K72l60J73Q8p8m8J59m8l05K35k30
$$ 131 -107 -52 151 -94 -85 172 -203 -232 -37 -213 -148 -224 -170 102 -258 -85 3 -75 -123 36 -12 -317 -82 -312
3742c12K75L76k41J06m14K60mq5L00k99J04l55L36L32k36k20K70j84k47L59l2
$$ -312 -37 339 98 204 -210 50 46 -39 261 -38 66 -289 47 379 143 -77 193 9 -238 121 89
3763H9k07k9K3Q9N8k85J47L10n9j45K1K84j76kJ9Rl64K29p7K52j91R2j45q6Q7
$$ 89 -118 -147 -124 -35 23 -262 -115 195 136 -9 12 296 120 118 137 146 -218 11 -66 186 -5 87 -58 -144 -57
3788e7K00l08kK60k11J49n3j93J77Ok34K88Q4k32K03k26K38m3k30J4j37J45J64
$$ -57 143 -165 -167 93 -118 31 -22 -215 -38 -32 -266 22 106 -126 77 -149 89 46 -184 -170 -307 -162 2
3811BR5q4M7J30j52J8m0LJ79k05j00L39l15j09J42j26K04l2Q2r6J78k63J99P9
$$ 2 97 13 60 190 38 56 16 19 198 -7 -107 232 -83 -192 -50 -176 28 -4 78 -18 160 -103 96 175
3835A75l61J75K86j87N8p9k42K35j13m7J3K20LJ33k2j29p7J51l18K17k3L3q5j38
$$ 175 -186 -11 275 88 146 67 -175 60 -53 -100 -87 133 136 269 247 118 41 192 -126 91 68 101 16 -122
3859a22K52l86J83j70J13J6L0J95j50j60L68Rm42K87l3K02j09JJ36j89j63N5J0
$$ -122 130 -256 -73 -243 -130 -114 -84 111 -39 -199 169 178 -264 23 -10 192 83 84 220 31 -132 -77 -67
3882f7J14J8k19J16K38l37J40j57j14K53k31K77k07MN7J86l2r2Q1q6K31L8l7k17
$$ -67 47 65 -154 -38 200 -137 3 -154 -268 -15 -246 31 -176 -172 -115 71 39 -53 28 -58 173 211 174 -43
3906d3J5K31j67P5P2k95j6K52N7k37j31qnK47L7n4j6j32l2J34N7J74j1j76j37
$$ -43 -28 203 36 111 183 -112 -128 124 181 -56 -187 -195 -200 47 84 30 14 -118 -150 -16 41 215 204 28 -109
3931a09O1oj1J97N6j59M1o9K7K48l46p6J82j81J97j29mM15n83K96j35KL19m00
$$ -109 -48 -54 -65 132 188 29 70 1 28 276 -70 -146 36 -145 52 -77 -81 334 -249 47 -88 -86 233 -167
3955a67J17K63l61K48L9j72j50J52M3l98J63K89J20k67J4%J51L1j43N5j37Q1K18
$$ -167 -50 213 -148 100 139 -33 -183 -31 12 -386 -223 66 186 -81 -67 -67 84 115 -28 27 -110 -29 189
3978A89j26j60K14l78J84O4k7p0J60N7l1j88K60k61O2M5k19J89Q7j5n9k47J96
$$ 189 63 -97 117 -261 -77 -13 -40 -110 50 107 76 -112 148 -113 -51 -6 -225 -36 51 36 -23 -270 -74
4001g4l3L58k69K64k98k8kJ77J92j68Jk15L39j19j59j18L2J23m8k44J28L73l92
$$ -74 -107 251 -18 246 -52 -80 -82 95 287 119 120 -95 244 125 -34 -152 -120 3 -45 -289 -161 212 -180
4024a80K58k18K24K3k34O5L0j34K75M7k14R9p5J63p5N1m5o2k81K98J98k07J0j06
$$ -180 78 -140 84 107 -127 -62 -32 -166 109 156 -58 41 -34 129 54 105 60 -2 -283 15 213 6 16 -90
4048i0J7jL3P8l04P3J43J43m23K44k4Q1j16K04p3O4n0j49J28R3j60J47P5j22J5
$$ -90 -73 -74 -41 37 -267 -194 -51 92 -331 -87 -111 -30 -146 58 -15 49 -1 -150 -22 71 -89 58 133 11 26
4073B6J30k42n0K10Lj49L0j81K5J13k0pJ31j32O8n6J04J37k51J95j67N1Q0J3j45
$$ 26 156 -86 -136 74 77 -72 -42 -223 -198 -85 -105 -112 19 -113 -45 -101 3 140 -111 84 -83 -32 48 61 -84
4098h4M9K14j84K74l82J33K5j13J94M5J8l15J54m9q9L9K8K14j94K64l07o9J11
$$ -84 -35 179 -5 269 -113 20 45 -68 126 171 189 -126 28 -21 -110 -71 -43 171 -23 241 -66 -135 -24
4121b4k7N8nl3M0R5N3k20J00J18j32l9k07L45j07J58J06k59j7j14J76J8k04K17
$$ -24 -51 7 2 -31 9 104 157 -63 37 155 23 -16 -223 122 15 173 279 20 3 -111 65 83 -121 96
4145I6o1p1j2j74K5J24N8Q1p4j17J17k31L49j31J68L1k92N6J19L3O3R1l62J22
$$ 96 35 -36 -48 -222 -197 -73 -15 66 -8 -125 -8 -239 110 -21 147 178 -114 -58 61 94 157 248 -114 8
4169HJ21n1Oj58N4J41r3r7p6K31j17l2Q6k25L32j20j01J20j40j08K01J29k24J95
$$ 8 129 78 84 -74 -20 121 28 -69 -145 86 -31 -63 23 -202 130 10 -91 29 -111 -219 -18 111 -113 82
4193H2K82l44P2n3K9jN9L8P4l45J40O6l5j6J41l08J05q7J22j44j49L42j53o4L
$$ 82 364 20 92 39 68 67 126 164 238 -107 33 99 64 48 189 -119 -14 -101 21 -123 -272 70 -83 -147 -144
4218a44k0K64mq1R9k71J52J9Q0m0k91K13l0L42k24l9J4Lj85L23k31K10k76p9K46
$$ -144 -164 100 96 15 114 -157 -5 14 94 54 -237 -24 -54 288 64 25 39 42 -143 180 -51 159 -117 -196 50
4243E0L3j11J91k47J80k42K5L2J36o2Q6p4J92q7L2j37J75k71j22J33m2K00J4o
$$ 50 83 -28 163 -84 96 -146 -121 -89 47 -15 71 -3 189 102 134 -3 172 -99 -221 -88 -130 70 84 78
4267G8j60Q5k0L3R8m20L13p6j6N6k1k7k55M64j82q2P3J34l4j52K56o5q7k8J21
$$ 78 -82 3 -17 16 114 -306 7 -69 -85 -29 -50 -77 -332 132 -50 -132 -59 75 41 -111 145 80 -7 -35 86
4292H6M7k19L77l48n8N2J61k73L10m25M44k87J96K15j29j94J59k04j78j14L82
$$ 86 133 -86 291 -57 -115 -63 98 -175 135 -290 154 -133 63 278 149 -45 114 -90 -268 -382 0
4313@K2j57L16l26JJ74k26J63o9R2j51K90k60J46o0J07j10J19ol9K14l97M85l04
$$ 0 22 -135 181 -145 -144 30 -196 -33 -102 -10 -161 129 -131 15 -45 62 -48 71 65 26 240 -157 328 24
4337B4r9J08j43K96q0m5m4J38j29M8k16N1J13O6L7o9j65l8J07m6P2j11J60J15
$$ 24 -75 33 -110 186 106 61 17 155 26 74 -142 -91 22 88 125 56 -109 -147 -40 -86 -14 -125 35 150
4361A50j23r4R9j75Q2LL06j23l2l1L5l7J0p0Q6j5K2k8J2p7j20P5j20j11K88J25
$$ 150 27 -67 32 -143 -61 -58 248 125 93 62 97 60 70 0 86 71 93 65 77 0 -120 -45 -165 -276 12 137
4387A37Qj75L9Q3kk08RL47r2j74j31J53l8J24ml29N7K04O2k35L13l07J71j39M6
$$ 137 145 -30 9 92 90 -118 -109 238 146 -28 -159 -6 -44 80 76 -253 -196 8 70 -165 148 -159 12 -127 -81
4412h1jJ49k35L37k17q2J89j69l1l9L11l1j84k5J03l3L8K60l12J01n3M2j59J14
$$ -81 -82 67 -168 169 -48 -130 59 -110 -141 -180 131 100 -84 -109 -6 -39 -1 259 -53 48 -5 37 -122 -8
4436hm2J19j38P7r4N1j21l7J04j3K40j66j27L51k93NJ28j0L7j9lm9K33k75P7K6
$$ -8 -50 69 -69 8 -86 -35 -156 -193 -89 -102 138 -28 -155 196 -97 -92 36 26 63 44 41 -8 225 -50 27 53
4462E3N1r5J27j00j86L00J3j02j32q3J15j98O9N4K20j84K87k82j16l4J68J09j64
$$ 53 104 9 136 36 -150 150 163 61 -71 -154 -39 -237 -168 -114 106 -78 209 -73 -189 -223 -55 54 -110
4485a10M03k04J21m2k16j56M39j74pj22K6k15L47M0j21J77n5k62J18r2K26k55
$$ -110 293 89 210 168 -48 -204 235 61 54 -68 -42 -257 90 130 9 186 131 -131 -13 -105 121 -134
4507a34q3K40p2p1J2L8K5N0j93J21J65k3j8m6l9P2L8N5j15L9r8J7R3Rj9o2LL4
$$ -134 -217 23 -49 -120 -108 -70 -45 5 -188 -67 98 75 57 11 -28 44 82 137 22 61 -37 -20 73 82 63 1 4 38
4535C8r7Q4n2n4p2J02K7o8nq8J24J23lm3J40m0O2p8j57O0J42K7j69j67J89L9K14
$$ 38 -59 25 -27 -81 -153 -51 -24 -92 -97 -185 -61 62 59 16 156 116 178 100 -57 3 145 172 3 -164 25 64 278
4562B78j40q1l3Q0k8k99P0P8J44k38K83k6k77L7J90k0l1M9oP2l53J46K59J41j05
$$ 278 138 57 24 104 76 -223 -153 -75 69 -169 114 88 -189 -152 38 18 -13 36 30 102 -251 -105 154 295 190
4587A90j61k14L33L1k37rJ80j00j08J68j92m5R9OQ6j70R2%N7L3k43R1J7n0J17
$$ 190 29 -185 148 179 -58 -67 113 13 -95 73 -119 -164 -65 -59 27 -143 -51 -51 6 39 -204 -113 -96 -146 -29
4612b9N6J17k24R4N9j30O8R2P2l76M13l49J87j55J89k31L31j69k42P7L63k17k47
$$ -29 27 144 -80 14 73 -57 11 103 175 -201 212 -137 50 -105 84 -147 184 15 -227 -150 213 -4 -251
4635b51j32L65J68n53M51n5O1r8J27rk03K34l0j58J48j55J39L4j07k6J55K7j09
$$ -251 -383 -18 150 -403 48 -7 54 -44 83 74 -129 105 75 -83 65 -90 49 83 -24 -50 105 132 23
4658B3M4mMq1P7j16j06J3M4j49J52J43m13K04Q3j17J31J79k70L25k6k45J61o8
$$ 23 67 63 67 -14 63 -53 -159 -146 -102 -251 -99 44 -369 -165 -82 -199 -68 111 -159 166 140 -105 56 -12
4682a2k6J12p4L6j89L9K08p6L9J75k38L9M4o6N1O2n4r9j92L3K25N1O5r7j02nP2
$$ -12 -38 74 0 36 -153 -114 94 18 57 232 -6 33 77 11 62 124 70 -29 -221 -188 37 88 153 56 -46 -51 21
4709B1k52J27L0j05O7K38k01K5J19q8m4M01l22P5j71K59l87J67J65L4k40N4L4
$$ 21 -231 -104 -74 -179 -112 126 -75 -50 69 -19 -63 338 16 91 -80 179 -208 -41 124 158 -82 -28 6
4732FN8j79J32J68k70L3Nk77K74J69l9M5k9o2K7K9m7l7J99j10m2K9j27R3L0k55
$$ 6 64 -115 17 185 -85 -52 -47 -324 -50 119 80 125 96 34 61 90 43 6 205 95 53 82 -45 48 78 -177
4758a77J80Q9j59j0j62L53j62K1q2K16j65k4%p3J83J31l26L10N5k90K02j42j04
$$ -177 3 92 -67 -77 -239 114 -48 -27 -109 107 -58 -82 -82 -155 28 159 -167 143 198 -92 110 -32 -136
4781a36K64p8j9N9n7J44j04j40m7R4o1K12j71q1J30k28L37k66K08J48l15Q1J32
$$ -136 128 50 31 90 33 177 73 -67 -114 -20 -81 131 -40 -121 9 -219 118 -148 60 208 -107 -26 106
4804A06k11K26J14j35k10K15j80k6j8K4L46k66J5L8o7N7o8N6j19J81k57K16n9
$$ 106 -105 121 235 100 -110 105 -75 -101 -119 -95 251 -15 0 38 -29 28 -40 16 -103 78 -179 37 -22
4827b2rO7m9k27K21M2R7j01p7J02k33L02k02j84K72J44l63J99J20k5M6r3oK3K41
$$ -22 -31 36 -13 -240 -19 23 120 19 -58 44 -189 113 -89 -273 -1 143 -220 -21 99 74 120 27 21 44 285
4852B85k32J12l15J92j22Q6K9Jo9j11L15k17j26L06k33m3K10j69R0J09j64Q6J7
$$ 285 53 165 -150 42 -80 6 35 36 -33 -144 171 -46 -172 134 -99 -142 68 -101 -11 98 -66 20 37
4875C7Q9k33K34r7r0NQ9J28j33P9k2l05J43j15J88o2j4J86j49K71l04J54k73j04
$$ 37 126 -107 127 30 -60 -55 34 162 29 108 86 -219 -76 -191 -3 -65 -79 107 -42 229 -75 79 -194 -298
4899b98K81k53K44j80M97l40J34j95L51m09J61K07l30K01r1J03J95j57j29n7j70
$$ -298 -17 -270 -26 -206 291 -49 85 -110 241 -168 -7 200 -130 71 -20 83 278 121 -8 -65 -235
4920b35R4j82K03n6l1O6m3n8J05r9K02j81J90j38M61j41J13l19N3P5r0Q9j18l6
$$ -235 -141 -323 -120 -176 -207 -141 -184 -242 -137 -236 -34 -215 -25 -163 298 157 270 -49 4 79 -11 78 -40 -76
4944g6KOJ02j60J62k6r5Q8m8K3J69m97M59j55J6J11k47J03k5J53J1j38K19k63
$$ -76 -74 -68 34 -126 36 10 -85 3 -45 -22 147 -350 109 -46 -30 81 -166 -63 -88 65 76 -62 157 -106
4968a06K59M7k30J31k02J06J86l5k62J37j26LJ67o2q6J03l63L08J20q7j98K23
$$ -106 153 200 -30 101 -101 5 191 156 -106 31 -95 -92 75 13 -73 30 -333 -25 95 8 -190 33
4990C3L8l7k1j73m6K35o3J35j49m3P5J56j25q2j1L69m37J14p4P9K78l56K17l39
$$ 33 71 34 13 -160 -206 29 -34 101 -48 -91 -16 140 15 -67 -78 291 -146 -32 -106 -27 251 -105 112 -227
5014b27J66K1J30q1K50m67L16j80Q8L2j04p5P3J87J9j39J0k07l1L98n5k17J02
$$ -227 -61 -40 90 9 259 -208 108 -72 16 48 -56 -131 -58 129 148 9 19 -188 -219 179 124 -93 9
5037Ij68P4L01k00j37P7J50k2k9%l9j30N6J13L1Q8m83L80K2j82k42K93N4k40L88
$$ 9 -159 -85 216 16 -121 -44 106 84 55 55 16 -114 -58 55 86 174 -309 71 93 -89 -331 -38 16 -224 164
5062A64lk17j8j3J75R0l47K49J8p1j24R8j3K89l61K29O5l15J43K0l5k25J30p8
$$ 164 161 -56 -74 -87 88 178 -169 80 98 27 -97 1 -12 277 -84 145 210 -105 38 58 23 -202 -72 -150
5086a50L64k72K81k46RK9R4%o1R8k93M04k01L6M1k8J16k95O5J20N1j26l56N35
$$ -150 214 -58 223 -23 -14 15 109 109 48 146 -147 257 56 92 133 105 221 -74 -9 111 162 36 -320 215
5110B15r4j1J42j89j24M0M7m7j00J41o9o8N5pP8K12o5nk55J32Q0j71K9Q8j33R2
$$ 215 121 110 252 63 -61 -21 26 -21 -121 20 -49 -117 -62 -69 9 221 156 151 -104 28 108 -63 -34 54 -79 13
5136A3Q6m9k1R2j59L17k69k3l3K59j66K3j3j89J6J02j4N6k30J02%L98l60O3P5
$$ 13 99 50 29 121 -38 279 10 -13 -46 213 47 70 57 -132 -116 -14 -28 28 -202 -100 -100 298 -62 1 76
5161G6k84M36k68j79J01K10j09K78j70q9j11J67N0j72n9J11J6nm8J80k47K12q3
$$ 76 -208 228 -40 -219 -118 92 -17 261 91 2 -109 58 108 -64 -123 -12 4 -1 -49 131 -116 96 13
5184A3P2j63j27K67J31j35j05N1m3R5p8K05m91K39j94K21J3q3K29j05j75M6j80
$$ 13 85 -78 -205 62 193 58 -47 4 -39 56 -22 183 -308 -69 -263 -42 -29 -112 117 12 -163 -117 -297
5207b97K52q5J71j87L01k26M9r2j57L26l09L53j50Q3j40r9j2L10k11P0m2N8L21
$$ -297 -45 -130 41 -146 155 -71 -22 -114 -271 55 -254 99 -51 32 -108 -207 -219 91 -120 -50 -92 -34 287
5230B87m31M09j3l25O9J67j65j66L47k67O4J98j72j08J2K97j88r6n7N8qJ2q6J46
$$ 287 -144 265 252 -73 -4 163 -2 -168 179 -88 -24 174 2 -106 -94 203 15 -81 -138 -80 -88 -76 -162 -16
5254a6k43L26o8O8O3R1n3K8j78M3o3J69j91r2J79%p5o4J05J61j44j58l9J98O7
$$ -16 -259 67 -1 67 130 221 168 196 18 61 -2 167 -24 -116 63 63 -12 -76 29 190 46 -112 -151 47 114
5279A14j14J25j41K53l34j07N0O6K48k68J24N0j62p5J26j04J29L5p2Q3J74k81
$$ 114 0 125 -16 237 -97 -204 -154 -88 160 -108 16 66 -96 -171 -45 -149 -20 15 -57 26 200 -81
5301h1K50j88R6l82M58J5k55j35L75k57o8K05L9l90L34J21j91J12j58J30q7K09
$$ -81 169 -19 77 -305 153 168 -87 -222 153 -104 -172 33 72 -318 16 137 -54 58 -100 30 -57 152
5323A52m26M58k77J87o3J70k99J20R1r6J3p2K68k16j63L13k86j4K36j65N9J6m6
$$ 152 -274 184 -93 94 31 201 -98 22 113 17 30 -42 226 10 -153 160 -126 -140 96 -69 -10 6 -40
5346d0k54J22J27JM4J54LKp8j82K28j88R2P0m6J4l51L19K6P7R8j25k64K38o1n1
$$ -40 -294 -172 -45 -44 0 154 157 159 81 -101 127 -61 31 101 55 69 -282 37 63 140 238 113 -151 87 26 -25
5372b5j5K72l7k17l4K5Rj72K3J26kM48k19k31R7q4J57k53J97q5k71M87j76q1J42
$$ -25 -40 232 195 -22 -56 -31 -22 -194 -171 -45 -47 401 182 -49 48 -36 121 -132 65 -20 -291 196 20 -61 81
5397H1k28p0J87J28k90oK17r4j94m4M12k72R6%M5P6q3k3J68l23P4l37K99L03k29
$$ 81 -147 -217 -30 98 -192 -198 19 -75 -269 -313 99 -173 -77 -77 -32 44 -39 -62 106 -217 -143 -480 -181 122 -107
5422a07o9OL26j88J49l59L28l3K51k98l08K28L8K4j11J60j64K86k59K16q8J8j45
$$ -107 -176 -170 156 -32 117 -242 86 53 304 6 -302 -74 -36 -12 -123 37 -127 159 -100 116 28 46 -99
5445i9oj3m3P0K91Nj45j22K6j90L2J13MN6p5J42j31M5Q2n00M82j69J86j47L00
$$ -99 -105 -118 -161 -91 200 205 60 -62 -36 -226 -194 -81 -77 -21 -96 46 -85 -40 42 -458 24 -145 41 -106 194
5470A94p5k35K9P4J11j20o5M3J32J30l4k38L9o2K0N4q6M5J40j31n3N3K20L0k94
$$ 194 119 -116 -87 -13 98 -22 -87 -44 88 218 184 -54 -15 -77 -57 -3 -89 -44 96 -35 -88 -35 185 215 -79
5495g9J02K11j12j65j01N0J63K8K0j39P8j39n4K09k51LK42nn3q2R3l8M5R3j47
$$ -79 23 234 122 -43 -144 -94 69 97 117 -22 56 -83 -137 72 -179 -176 66 61 8 -74 19 -19 26 119 -28
5520b8k2M46o81K19O3K33k78J57R5k5j25J24qj93p5J8k1J07m3J05r8K04j21j66
$$ -28 -50 396 -285 -66 -3 230 -48 109 204 179 54 178 170 -23 -98 -80 -101 6 -37 68 -30 174 53 -113
5544a13k8J46p7J31k68K41j12J97k33K23k59O2J22j33J14M0O1k49J17k18M09k48
$$ -113 -141 5 -72 59 -209 32 -80 117 -116 107 -152 -90 32 -101 13 53 114 -135 -18 -236 173 -75
5566g5j38M23k65o9kR4R1j26J82k13l1j7K92l7J2j29J75n3j72R7o7j38K13LJ07
$$ -75 -213 210 -55 -124 -126 -32 59 -67 115 -98 -129 -146 146 109 121 -8 167 114 -58 39 -28 -166 47 50 157
5591A57Lj4m10K71oQ4k13J4j02k6N20l99N6j48J45Q5j6P7O7n5j21P1J9J01m38
$$ 157 160 146 -264 7 1 85 -128 -114 -216 -242 278 -121 -65 -213 -68 17 1 78 145 90 -31 40 59 160 -278
5616b78J59j01K12L1k39P9J21p0P2K26j09r4N1O2l99L32j97n1J42J09j40JP6k96
$$ -278 -119 -220 -8 23 -216 -137 -16 -86 -14 212 103 9 60 122 -277 55 -142 -193 -51 58 -82 -81 -5 -301
5640c01K86J73m33J57K43j81J60Mj71m0Qo3P8K46j0k58P3j17K39j06j89J89K08
$$ -301 -15 158 -275 -118 125 -56 104 108 -63 -103 -95 -158 -80 166 156 -102 -29 -146 93 -13 -202 -13 195
5663A95k33P7K8j10rQ5l12K16l8J33k04L39j44k60L1R4L15p1j58O1j63J97l17
$$ 195 -38 39 67 -43 -52 33 -279 -63 -101 32 -172 167 23 -237 -206 -112 203 132 -26 35 -128 69 -248
5686b48K74j16M8j14K06J3j86R8j79J08M2k4K63k29j17J72k49K33o7M0J7K00n11
$$ -248 26 -90 -42 -156 50 63 -123 -25 -204 -96 -54 -78 185 -44 -161 11 -238 -5 -72 -32 -15 185 -326
5709c26M27O3m12J50K06j03P7j80L12k49j36K89n3j24J84K1j31j8k33O1N9L71
$$ -326 101 164 -248 -98 108 5 82 -98 214 -35 -171 118 65 -59 125 146 15 -3 -236 -175 -116 255
5731B55j25l1%rl7j85J43j14K0j9L21j79O5k4m9j95K54p5J90j93j4q0q3L30k17
$$ 255 130 99 99 90 53 -132 11 -103 -83 -102 219 40 105 81 32 -163 91 16 206 13 -1 -81 -164 166 -51
5756e1K28k45J47r4kL4O4j95J81l98K79m0O0j07L03J50k31Ok17J26K59l07M3r
$$ -51 177 -68 79 -15 -17 17 81 -114 67 -331 -52 -92 -32 -139 164 314 83 89 -128 -2 257 -50 -7 -16
5780a6L2k05M0K13k43K21k1L0LM0M6j86l41M15L7k5j84o6J92p5L1J23K5k99K87
$$ -16 16 -189 -149 64 -179 42 21 51 54 94 140 -46 -387 28 65 40 -144 -210 -18 -93 -62 61 86 -213 74
5805G4j21R7jj03m1J88J0j06J76k59K12r3K0N4r2NnL7J95k90J64R6k99R3j7m8
$$ 74 -47 50 49 -54 -95 93 103 -3 173 -86 126 33 53 107 15 20 15 52 247 -43 121 217 -82 11 -6 -54
5831e4L7k4K03l94L84k85J65O6k25N7J49m6j08q5J52j25J90k44J97J26o9L9j6
$$ -54 -17 -41 162 -232 152 -133 32 98 -127 -70 79 33 -75 -160 -8 -133 57 -187 10 136 67 106 90
5854I0j12k0K60k17n3J55rm7p3J52o9j45n8L44m5j73J8j54L80k77J04L6O0o8P5
$$ 90 -22 -42 218 1 -52 103 94 47 -26 126 57 -88 -146 198 153 -20 -2 -156 224 -53 51 87 147 79 154
5879A54k75L56l09M1J52k21J9N9J81k13J17k23kj0K40L1l11K72l0j43L01Lj80
$$ 154 -121 235 -74 -33 119 -102 -83 -24 157 -56 61 -162 -164 -174 66 97 -214 58 28 -115 186 189 9
5902Ir5q1J55l9Q5p4K31k05K19L6k13n9L36l24N8O2L9j58q9K29O0k88k2j0m3J70
$$ 9 -86 -167 -12 -51 34 -40 191 -14 205 241 28 -31 305 -19 39 101 140 -18 -107 122 182 -106 -128 -138 -181 -11
5928a1mj91J25J74l3j5olJ3O5L5lk42K28L1l4K41l52n1j04K75jn9j69K39k55r3
$$ -11 -15 -206 -81 93 60 45 39 36 49 114 149 146 -96 132 163 129 370 18 -33 -137 138 137 78 -91 148 -107 -200
5955b00J22N9j3J03Mj0o2K86m52K15J21k78K48j58nL3k33K71l6O6n0p2J11R1j80
$$ -200 -78 -19 -32 71 75 65 3 289 -163 52 173 -105 143 -15 -20 13 -220 51 15 81 31 -41 70 161 -19
5980a9K02L7j16l0j94J76k47J91J01m6J90j46J9r6J55j2m17K38J51j2j97R4j65
$$ -19 183 220 104 74 -120 56 -191 0 101 55 245 99 118 22 177 165 -252 -14 137 125 -72 22 -143
6003a43r7M41k17j46K63j52K32j09o5J24k8R4k47R7l1Qk83K63n5K65m25J5J94
$$ -143 -240 201 -16 -162 101 -51 181 72 7 131 103 197 -50 47 16 24 -259 4 -51 214 -211 -196 -2
6026bj25J78k4r8q6K31L1o2M3k11o7L62q9j27J05K5J23j28j98L43l11K36j07l0
$$ -2 -127 51 27 -71 -157 74 105 43 86 -125 -192 170 81 -46 59 84 207 79 -119 224 -87 149 42 12
6050A2O6Q6j26r9J51l08L06l92R5R3K05k4Lr0O9lQ6k91J98j18p8L83k86J7j54
$$ 12 78 164 38 -61 90 -218 88 -304 -209 -116 89 65 68 -22 47 44 130 -161 37 -81 -159 224 -62 -45 -199
6075a99J84J7j18J85p7O0J5r6j06j4J25r5j0j1J38m14L96O3j39j44K70o6m3P0
$$ -199 -15 2 -116 69 -8 52 67 -29 -135 -149 -24 -119 -129 -140 -2 -416 -20 43 -96 -240 30 -36 -79 -9
6099im2J05lj75L95np6j91%R1k76L05j65J68j31J57j08k91M27K3l35JN1p0n7M74
$$ -9 -51 54 51 -124 271 266 190 -1 -1 90 -186 119 -46 122 -9 148 40 -251 176 199 -136 -135 -84 -154 -211 263
6125B63k69J54k33J80m6j09n8K68j20kJ73j05j07J08m7j19L6N8j01M0L1k77L58
$$ 263 -6 148 -85 95 49 -60 -118 150 30 28 201 96 -11 97 50 -69 -33 25 -76 -36 -5 -282 76
6148G6k33J72J84n9k97J80k00M10n3k87j7K54q3k31O4L6P8Q5j40M04l38L9J86
$$ 76 -157 15 199 140 -157 23 -177 233 180 -107 -124 130 47 -184 -120 -84 -6 79 -61 343 5 44 230
6171B30l13L88k99J3l3j27J33K43j52p2j44m8K24p2P6j62L5J26j18j51J69L5j
$$ 230 -83 305 6 19 -14 -141 -8 235 83 11 -133 -181 43 -29 47 -115 -80 46 -72 -223 -54 -19 -20
6194b0O2q2pK10k17Q5j13J60n5j97M36j18K1j82k08L22j8j83q2O3P7K25r9K2j47
$$ -20 42 -40 -47 163 -54 31 -82 78 23 -174 262 144 165 -17 -225 97 79 -104 -186 -123 -46 179 80 102 -45
6219d5rO9J22k38J72l2L9j46p7J81L2j3qjK82m31K73j00Pj29M3J12m6j28p9J16
$$ -45 -54 15 137 -101 71 39 78 -68 -145 36 68 55 47 46 328 -103 170 70 77 -52 -9 103 57 -71 -150 -34
6245c4j98N5J20M44p17L14J2R1o0m1l4p2R6J40l35M19j07j62j3K88j86J27m3R7
$$ -34 -232 -177 -57 387 -330 -16 -4 87 27 -14 -48 -120 -24 116 -219 200 93 -69 -82 206 20 147 104 201
6269B01n3o2o1J8j0j33J18k6J41j73J78l79O5O2J96O9m77M18q5p7J90j77J30l18
$$ 201 148 86 25 43 33 -100 18 -8 133 -40 138 -241 -176 -114 82 151 -326 92 7 -70 120 -57 73 -245
6293b45R9L25j47L37m27J69J86k08P9l82K23J83r7j68j9K8q1Q8j83K76O8k89Q2
$$ -245 -146 179 32 369 -58 111 297 89 168 -214 9 192 95 -73 -92 -64 -145 -57 -240 36 104 -185 -103
6316a03j02J17M4J4j53J20JO3qM2Q8o9j44K87k49j62J86J57Lo3k53R9K59q0j95
$$ -103 -205 -88 -44 -30 -183 -63 -62 1 -7 35 123 54 -90 197 -52 -214 -28 129 132 69 -184 -85 174 94 -101
6341a01N8j67K05P0L5k10K19j98m8K29m2J3r9J2Q4k19O9N2J43j7k3k55L09k15
$$ -101 -43 -210 -5 65 100 -110 109 -89 -137 92 50 63 -36 -24 60 -159 -90 -38 105 88 65 -190 119 -96
6365i6J52r6J80j96L8N6R5j45j55L01j57R6k6j67Q9J44j04J82o5j32J31k90J26
$$ -96 56 -40 140 -56 -18 38 133 -12 -167 134 -23 73 47 -120 -31 113 9 191 126 -6 125 -165 -39
6388c9p3R6J79k15P5j60J46k9J12l9m7p2M7K4p2L39n29K83n1Q7J2k18L42l31J29
$$ -39 -112 -16 163 -52 23 -137 9 -20 92 53 6 -66 -19 5 -67 272 -257 26 -25 62 74 -144 198 -133 -4
6413dQK90m00L6K99k38K3k23K10Rj1J62j08n4j08K69k2j25l5P7K33m06K22k2m2
$$ -4 4 294 -106 -70 229 -9 14 -209 1 10 -1 161 53 -1 -109 160 138 13 -22 55 288 -118 104 82 40
6438D0k22J57j31l1K67q1j5l9K9L26m78J52N1j52J5M0J07j38J78poQ5j19j7j19
$$ 40 -182 -25 -156 -187 80 -1 -16 -55 -26 300 -178 -26 25 -127 -112 -72 35 -103 75 68 62 147 28 11 -108
6463a08O7j19J70Qk51M19l13j19K94L5j74K33r7k21J31l0O0ol7J90l90K80O8Q6
$$ -108 -41 -160 10 18 -233 186 -127 -246 48 83 -91 142 45 -176 -45 -75 -15 -21 -58 132 -258 22 90 176
6487A76m6k3J6K2j58j80K47j77K8J02J36j74P3m06L87N8l76L90j62L6L3j20J23
$$ 176 130 107 123 145 -13 -193 54 -123 -95 7 143 -31 42 -364 23 81 -295 95 -67 -31 2 -118 5
6510EJ5J23j82j62L70k26K35j78L46m31j48J0J39J90j73J63j38L9L0J47j64k75
$$ 5 20 143 -39 -201 169 -57 178 0 346 -85 -233 -223 -84 106 -67 96 -42 -3 27 174 10 -265
6532b65M36j41J1j40J02J62J8j16j45Ml1L0p5J78R7j54o9J2p4j34M12j03k27M66
$$ -265 171 30 41 -99 3 165 183 67 -78 -74 -105 -75 -150 28 125 -29 -98 -86 -160 -294 118 15 -212 254
6556B54j53L1l43L51M2j79N0rn0k2K05o3n4l60O5J55Q2m1K04Mm80J76L69k01q8
$$ 254 101 132 -211 140 182 3 53 44 -6 -28 177 114 60 -300 -235 -80 2 -39 165 169 -311 -135 234 33 -55
6581e5R1M4k61K61n5j28N9N3j85P2M98o28J43L27l32J9rK15L25k98j73j19L06
$$ -55 36 80 -181 80 25 -103 -44 9 -176 -104 394 -234 -91 236 -96 -77 -86 129 454 156 -17 -136 170
6604A70k43q8J31R3o8n9O1j03m9L23j37l2Lj84K58j69J30O0q6K81k66m7J95m43
$$ 170 -73 -161 -30 63 -5 -64 -3 -106 -155 168 31 -1 2 -182 76 -93 37 97 11 292 26 -21 174 -269
6628b69M51j89ML5j38J28m9J33k62P8P7L9r2k05L06q5J52j73Q2l51K64J20J2k1
$$ -269 182 -7 -3 32 -106 22 -27 106 -156 -78 -1 38 -54 -259 47 -38 114 -59 23 -328 -64 56 68 47
6652D7j5k5P1j19m8K05l64K42k3J5m9L5K1j3J86l70K04m9k40K17M3J77r7q7KJ05
$$ 47 32 7 78 -41 -89 116 -248 -6 -29 -14 -63 -28 -7 -20 166 -204 0 -49 -289 -72 -29 148 51 -36 -34 71
6678G1K40j28k66O7j34NK47j57m8M46l53p8J42J85q9j07j3Q2l71L27l7k13L74
$$ 71 311 183 -83 -16 -150 -145 102 -55 -103 343 -10 -88 54 239 150 43 30 112 -259 68 31 -182 192
6701A92k69J73k49L48k69J40q3K49l28j76L59j05J62j53L2J74l82K72l46M83j17
$$ 192 -77 96 -153 195 -74 66 -17 232 -96 -272 87 -18 144 -9 23 197 -185 87 -259 224 107
6722A07Q3j92J71K5l17k8M31m25J41k81J4J73K71m71J55K26l2j86N4J24k16J89
$$ 107 190 -2 169 194 -123 -151 280 -145 -4 -285 -271 -98 173 -298 -143 83 51 -135 -81 43 -173 16
6744A6J17j55J33r6L25q7l5j77J18pj70P8k26J84Ok8lj09p3Q2O3K19l39O8j5j4
$$ 16 133 -22 111 15 340 253 218 41 159 152 -18 60 -166 18 24 -4 -7 -116 -189 -107 -44 175 -164 -96 -111 -125
6770a25o9J23J52n7k86K35J26R3k37j9P8j06R7K02m24L60o3J62j03r2k62K38k30
$$ -125 -194 -71 81 24 -262 -27 99 192 -45 -64 14 -92 5 207 -217 143 80 242 139 47 -215 23 -207
6793b07pM05n38K61K19K9j69o6j84K17m8L8Q1oq3L05m4k36k23K49J10L0l49M07
$$ -207 -214 191 -347 -86 133 162 -7 -73 -257 -40 -88 -50 31 25 -58 247 203 -33 -256 -7 103 133 -216 191
6817A91j15K0L5j48l3j0K08k46J86K9k8k7j54L80l24r6K0NQ4J31q0J84q3l47L19
$$ 191 76 96 131 -17 -50 -60 148 -98 88 117 89 62 -92 288 -36 -132 -112 -107 -23 108 28 212 129 -218 101
6842A01n4q1J15k3Q0k21J58L3j99Po9K34j66M02j11j11l62K05j9J73j93j17L09
$$ 101 47 -34 81 58 138 -83 75 108 -91 -84 -153 81 -85 317 206 95 -267 -62 -81 92 -101 -218 91
6865I1O7n9J2j12nj18J14m2J57j39Q4P4k44K61j01L0l54K58j63O5K6J17J12j07
$$ 91 158 99 111 -1 -6 -124 -10 -52 105 -34 50 124 -120 141 40 70 -284 -26 -189 -124 -98 19 131 24
6889B4k52J58P8M8J40l38K60j68j07K22M1j68k4n4J42j58R6L98l95J71j37q6P7
$$ 24 -228 -70 8 56 196 -142 118 -50 -157 65 106 -62 -86 -140 2 -156 -60 338 -57 114 -23 -109 -32
6912c2k31K94n4L41k68j95R7J09Ok86L36K8l69K20J01j67j39P2j1J11k1N4m4K31
$$ -32 -263 31 -23 318 50 -145 -48 61 67 -219 117 145 -224 -4 97 -70 -209 -137 -148 -37 -58 -4 -48 183
6936A83j76jm1p7n9K07m5J13j32J5J38o9J04j3l71J59J93l08M21m11J64k02K60
$$ 183 7 6 -35 -112 -171 36 -9 104 -28 -13 125 56 160 147 -224 -65 128 -180 241 -170 -6 -208 52
6959E2j96J56j07k1J28J59j01j19j90J65j33L26m8j10QK44l07J09J80j08M6k19
$$ 52 -144 12 -95 -116 12 171 70 -49 -239 -74 -207 119 71 -39 -31 213 -94 15 195 87 133 -86
6981h6l9R7N6j16J14j03J08j2J23k15K29o0r8p6J16k00J72k55L3J33j67L80j29
$$ -86 -125 -28 28 -88 26 -77 31 19 142 -73 156 96 -2 -78 38 -162 10 -245 -212 -79 -246 134 5
7004EJ29j40Q0k86L29k45K22Lp4l27L45r2n4j32J62j13J20j17K06j0N5j55q4J96
$$ 5 134 -6 74 -212 117 -128 94 97 23 -304 41 -51 -105 -237 -75 -188 -68 -185 21 11 66 -89 -173 23
7028B3qj56L07o5J1j08J92l54J31J5P7J51k96J8N1j30N8N3M5J50j41J99k99J2
$$ 23 15 -141 166 101 112 4 196 -158 -27 -12 65 216 -80 -62 -11 -141 -83 -30 15 165 24 223 -76 -64
7052f4J12L0q0n8j00J97P9l17J42j4J1j5J25q4J33J8K49m21M4l23K62J35j11L84
$$ -64 48 78 -2 -60 -160 37 116 -201 -59 -73 -62 -77 48 -36 97 115 364 -57 -13 -336 -74 61 -50 334
7076C34j46m91R4J54J1J73k25q2K30p8j38L64j14Pj9J7k24J94K19l76J01J7K9
$$ 334 188 -303 -209 -55 -44 129 -96 -178 52 -26 -164 200 86 93 74 91 -133 61 280 -96 5 22 51
7099E1k3n3p9Q8J09m35N54k65K35k98j50K16J05j37j40J23J90n3k59l3J88l2j45
$$ 51 28 -25 -104 -16 93 -342 212 -53 182 -116 -266 -50 55 -82 -222 -99 91 38 -221 -254 -66 -98 -243
7122b43K15j86K35lp2P7L2Qqj53J82N6k44K0P4J53o7q6L13l75J76k5K9J7J5l61
$$ -243 -28 -214 21 18 -54 23 55 63 55 -98 84 140 -104 -84 -10 143 76 -10 303 -72 104 79 108 125 140 -221
7148b21K2L24j14j61k9J0L27j92j7L9j49L08l71J39M26o38J19O2L10l0J09k72
$$ -221 -199 125 11 -150 -179 -169 158 -34 -51 -12 -161 147 -224 -85 341 -297 -178 -116 194 164 273 1
7170Aj02J83j7j41qM0o6K33j64q2L93l17RK71j34k58R7K78k97R9J4oO2M4m47L69
$$ 1 -101 82 65 -76 -84 -44 -110 123 -41 -123 270 -47 -38 233 99 -159 -62 216 -81 18 32 26 88 132 -315 54
7196E4j3j31M01l71J98j28K65m1n50L49j63jj5J04R4k10M57k48Q0j89K00k09K66
$$ 54 41 -90 311 -60 138 10 275 234 -316 33 -130 -131 -146 -42 52 -158 299 51 131 -58 142 -67 199
7219A99j88k13j9L25j67J78j66QJ83j85J09k0j1k01M25j9j88j08L04k01l6m4o8
$$ 199 11 -202 -221 104 -63 115 -51 -43 140 -45 64 44 33 -168 257 238 50 -58 246 45 9 -35 -103
7242a03K9P9p0p6J14j9L1k8l4L04k09j69K58P8l8r6j67n0J86O8o9J7q0j0J50j52
$$ -103 -74 5 -65 -141 -27 -46 -15 -43 -77 227 18 -151 107 185 147 51 -116 -166 20 88 19 36 -44 -54 96 -56
7268e6j8J47N6k14OJ01N8lr4J2K46k35M0k53J64M3K94k40j86N3j78M66j52j01
$$ -56 -74 73 129 -85 -79 22 80 77 -17 -5 241 6 46 -207 -43 0 294 54 -132 -79 -257 209 57 -44
7292d4J12p6m5k2K68k87K52M1j86J47l99J18L4o4K60J11j23j10k03J94J45l93
$$ -44 68 -8 -53 -75 193 -94 158 199 13 160 -239 -121 -87 -151 109 220 97 -13 -216 -22 123 -270
7314b70L57j97K19n8k16J85K1JQ4j53J64l51Q7J34k5J00j85O0K32m16L44l4L9
$$ -270 87 -110 109 51 -165 20 41 42 126 -27 137 -214 -127 7 -18 82 -103 -43 189 -227 117 83 122
7337A22j15l8J8K9o6j82J38O8o6j6L04l47R9J55p1qJ7J56j0l19M3J3Q3o1J08k36
$$ 122 7 -31 -13 16 -50 -232 -94 -26 -92 -108 196 -151 -52 103 32 24 41 197 187 -132 -89 -76 7 -54 54 -182
7363a82L29j22R4j3J57j89j12J63j3r9m8J8K17l26k4L92k55j72o0K04K38j80k22
$$ -182 147 25 119 106 263 74 -38 125 112 13 -35 -17 200 -126 -150 242 -13 -185 -245 -41 197 17 -205
7386b05J66j12L2J80Nl9M5J03j26K59p8j5j45J43k10j76K50kp8j21K65j00O6m7
$$ -205 -39 -151 -119 61 66 27 72 175 49 308 230 215 70 213 3 -173 77 75 -3 -124 141 41 107 60
7410F0lp0j9J0m4K14l38J04M29n63P5J33q0J45k88M06o5o3j83Q4M8R2q2l3L9M6
$$ 60 57 -13 -32 -22 -66 148 -190 -86 343 -220 -145 -12 -92 53 -235 171 106 43 -140 -56 -8 84 2 -31 8 54
7436E4k84J86j31L49k46N5Q2o8p5K51m38L42%j3J27m63J27J17J95N4l75M2J24
$$ 54 -230 -44 -175 174 -72 -17 65 -3 -78 173 -265 77 77 64 191 -272 -145 -28 167 221 -154 -112 12
7459A2R4N8q6O2k0j07j02%l12K64j4J64M7j62J08L6l01K76J73k10m5j83J27K68
$$ 12 106 164 78 140 120 13 -89 -89 -401 -137 -151 13 60 -102 6 42 -259 17 190 -20 -65 -248 -121 147
7483A47j66k8OJ3J87r7j59R8J4LJ26k68K08k13J78p1j38j6K43k16K67k67J60R
$$ 147 -19 -47 -41 -28 159 62 -97 1 15 18 144 -124 84 -129 49 -22 -160 -176 67 -149 118 -149 11 20
7507B0kk69K24M7J70l32J47K30k24k44J20L39k01J09n5O4l07L66l60q7K89r4j6
$$ 20 18 -251 -27 20 190 -142 5 235 11 -233 -113 226 25 134 79 143 -164 202 -158 -245 44 -50 -66
7530f6M2J58j52kJ71k74K1Q0L4j45K12j07k5LJ12j7J12j28O6l3j00K87l65J45
$$ -66 -24 134 -18 -20 151 -123 -102 -22 12 -133 79 -28 -53 -50 62 45 157 29 95 62 -38 249 -116 29
7554B9j18r0R3J16k35J11J72K8M3j34nJ36K8l70J66L0o0M8J95j88Q9N5q4k17L8
$$ 29 -89 -179 -86 30 -205 -94 78 106 149 15 10 146 174 -196 -30 0 -60 -12 183 -5 84 139 55 -162 -124
7579a24J60P0j30Jj23K3O6q6r6J60k5O2J77J14m30PK75r7m3k27N04j74r5K0j54
$$ -124 36 106 -24 -23 -146 -123 -57 -143 -239 -79 -104 -42 135 249 -181 -174 101 4 -39 -266 238 64 -31 -11 -165
7604a65J78K1j6l8j5j12K56j82Q6J04r1r2K46j17n2J4q5L7O9o3J60k16K75j97
$$ -165 13 34 18 -20 -35 -147 109 -73 13 117 26 -66 180 63 11 25 -60 -23 46 -17 143 -73 202 5
7628EK4O4j71J80l4P5k13J16n6n5j27L31M2k28o6Q2M8M3m8j14J48m2j47K65j82
$$ 5 29 93 -78 102 68 143 -70 46 -10 -65 -192 139 181 -47 -113 -31 17 60 12 -102 46 4 -143 122 -60
7653f0p1J51o8J5L0J79j48k09J37P4l5j03J98oJ09p7L6j34j08r6K26k14O0J77
$$ -60 -131 20 -48 -33 -3 176 28 -181 -44 30 -5 -108 90 84 193 116 152 18 -90 -186 40 -174 -114 63
7677F3l4j9k2P8J4o5j92Q4j88K24j85J24qP0Q4O3J62l77M9J13O1Kl0j69J6N5K7
$$ 63 29 10 -12 66 80 15 -177 -93 -281 -57 -242 -118 -126 -56 28 91 253 -124 -75 38 99 101 71 -98 -82 -27 0
7704@J53j71J28k16J39J09j44q0k4O9J63l3j84J96J23m60L26j05J35L3p6L45m50
$$ 0 153 -18 110 -106 33 142 -2 -82 -106 -37 126 93 -91 105 228 -232 94 -11 124 157 81 426 -24
7727b4k5k27K86k2RJM3j8J00k89K65k7q0j97L45j62K14k01M6Q1r5k1j00J95k08
$$ -24 -49 -276 10 -12 -3 -2 41 23 123 -166 99 72 -8 -205 140 -22 192 -9 37 118 23 2 -98 97 -111
7752a11J39p4J92j38k02L43k06P8n0J48l03J58j8K11L9l02L5l0p1L06j79M6n8
$$ -111 28 -46 146 8 -194 149 -57 21 -29 119 -184 -26 -44 167 206 -96 -61 -91 -162 144 -35 11 -47
7775d7J29n1j04p2K17o7l1J66K0K04n15J99j94K56j27J30j76J39k4j04J70j02
$$ -47 82 31 -73 -145 72 5 -26 140 160 364 -151 48 -146 110 -17 113 -63 76 52 -52 118 16
7797A6m6j46K58k15J18L5j01J74QJ8j85q4O9K7J18N7J98l85K01l60K32R9q3l9
$$ 16 -30 -176 82 -133 -15 20 -81 93 101 119 -66 -150 -81 -54 64 121 319 -66 135 -225 7 106 23 -16
7821a6J78j4l31J90K7J26j46o1k7l6L04j33j18O0Lj55J65j1J0m7J72O9k68J77
$$ -16 162 148 -183 7 34 160 14 -47 -74 -110 194 61 -57 3 6 -149 16 5 15 -32 140 209 -59 118
7845A18O6q4q0K09k77M6J55k29L20l7k89J8j10J91Kk12K65j61J23Ml49L83k3j97
$$ 118 184 100 20 229 -48 -2 153 -76 244 207 -82 -64 -174 17 19 -193 72 -89 34 38 -311 72 49 -148
7869a48L62m19M09l68J85lK6K6m3l1j4K78q0k23o9K44j58M1j8J5q8M8p2kK12p8
$$ -148 214 -205 204 -164 21 18 44 70 27 -4 -18 260 180 -43 -112 132 -26 15 -3 12 -76 -28 -100 -102 110 32
7895C2K3K6k54L52k26j12J23M15k82k20K06j65Q3m4O9J76J4k50R2J1J29l02r6
$$ 32 55 81 -173 179 -47 -159 -36 379 97 -123 83 -82 1 -43 26 202 216 -34 58 69 198 -104 -200
7918b00k9J87J0K34k24R2j78j75J61N3L27l80J94N0k84M99m01l0P0K36k59j5P7
$$ -200 -229 -42 -32 202 -22 70 -108 -283 -122 -69 258 -122 72 122 -162 337 -64 -94 -24 212 -47 -62 15
7941A5k6K6j25L40j20L6k77QL79m70K54N8j6l27K02o5J68q1K59j24l41K64r2J88
$$ 15 -11 15 -110 230 110 146 -131 -123 256 -214 40 98 82 -245 -43 -108 60 -21 238 114 -227 37 -55 133
7965A33Kk46O9k5J03j31J71k92L64J3rl50o1K25O4q4k38L73j94L82k79j55K30
$$ 133 135 -111 -42 -67 36 -95 76 -216 148 161 152 -198 -259 -34 30 -54 -292 81 -113 269 -10 -165 65
7988F5Nj70j5J84j31l6J74q5K0J2k2lJ82m08K14K8J14j61J28k09L01k58j78L42
$$ 65 70 -100 -115 69 -62 -98 76 -9 11 23 1 -2 180 -228 -14 14 128 -33 95 -114 187 -71 -249 93
8012I3j76L42q5j17j47J8K85l30P1J54m2r6K35l23J17P5l32J39J71j22j49K41
$$ 93 -83 259 174 57 -90 -72 213 -117 -46 108 66 -30 205 -118 -1 74 -258 -119 52 -70 -219 22
8034B2J31k08K13j40j7J6o1M3j4J84j25o9K57m00Q5K36l08L66j5j31k19J22J52
$$ 22 153 -55 158 18 1 17 -44 -1 -15 169 44 -25 232 -168 -83 153 -155 211 196 65 -154 -32 120
8057A20K2l22J78n5k2K33l77K76n8n3l2K13o8j27K9L6N6J95p6j37j24J22L00m29
$$ 120 142 -180 -2 -57 -79 154 -223 53 -5 -58 -90 123 55 -72 -43 -7 49 244 168 31 -93 29 329 -100
8081a00j22K60K9k29P7m8L20l63R3J05Q2j81J38p1P5J42k16l9N8o7n8R2P8R9j72
$$ -100 -222 38 67 -162 -85 -133 187 -176 -83 22 104 -77 61 -10 65 207 -9 -48 10 -57 -115 -23 55 154 -18
8106a8J54j43M7j72J52O1l6j94J37J79l56J05J32Lj79L08l28K7R2J14k95K88J
$$ -18 136 -7 40 -132 20 81 45 -149 -12 167 -189 -84 48 51 -128 180 -148 -121 -29 85 -210 78 79
8129G9l26L06r1j77L58Nm9p7P7n9j75K85j23q0m4J45l02L55l23K06L1r0J20j28
$$ 79 -247 59 -32 -209 149 154 105 28 105 46 -129 156 33 -47 -91 54 -248 107 -216 -10 21 -69 51 -77
8153g7P4N0j55J47o8L22m24mM0M02j32l00J14M8K00k90J72jj77J28j12J83l05
$$ -77 -3 47 -108 39 -29 293 -131 -135 -95 307 175 -125 -11 37 237 -53 119 118 -59 69 -43 140 -165
8176a65J57OM7k9j33J60j91J46k7n8p0L36j13k12J82
$$ -165 -8 -2 45 16 -117 43 -148 -2 -29 -87 -157 179 66 -146 36
8191C6
$$ Imaginary data points
##PAGE= N=2
##DATA TABLE= (X++(I..I)), XYDATA
0@%%%%%%%%%%%%%qJ6j6J6j7K5l2L9m7N2o0P2q6R9j14J31j49J71j94K19k49K80
$$ 0 0 0 0 0 0 0 0 0 0 0 0 0 0 -8 8 -8 8 -9 16 -16 23 -24 28 -32 40 -46 53 -61 70 -79 92 -102 117 -132 148
35A48l14L53l97M44m92N47o10O74p44Q24r10J004j107J219j343J481j633J799
$$ 148 -166 187 -210 234 -258 289 -321 353 -391 433 -477 527 -580 639 -704 777 -856 943
53I43j985K195k432K702l014L379l811M331m973N791o872Q365j0564J4135k0880
$$ 943 -1042 1153 -1279 1423 -1591 1788 -2023 2308 -2665 3126 -3746 4619 -5945 8190 -12690
68a2690L7819j54734k68853M51125K68281l06998k37290K29421J45099j64839
$$ -12690 25129 -129605 -398458 52667 320948 13950 -223340 6081 151180 -13659
78a3659r8009J14577N5367j5057M365p3682j18810J08799K14021o8354k46744
$$ -13659 -111668 2909 58276 43219 47584 -26098 -144908 -36109 177912 109558 -137186
89a37186J7176J96945m266j34796L0649R1921m5778o3744K9806O255q555Q0027
$$ -137186 -120010 76935 72669 -62127 -31478 60443 14665 -49079 -19273 -13018 -21573 58454
101E8454K9330j50015p9624J61524J18102j22191j02267Q3061N4482o9815j4321
$$ 58454 87784 -62231 -141855 19669 137771 15580 -86687 -3626 50856 -18959 -33280
112c3280O3652J843l1290R825k8881n0041P6620J03992q8896j34901P7717J17152
$$ -33280 30372 32215 925 10750 -18131 -68172 8448 112440 23544 -111357 -33640 83512
124H3512q6250p7542J24852N0008j68874m5671J86467L9250j77529q430J72396
$$ 83512 -2738 -80280 44572 94580 -74294 -119965 66502 105752 -71777 -80207 92189
135I2189l0370j83024M9798J94323l4663j72619J3297J18085j1793n6961L0947
$$ 92189 61819 -121205 -71407 122916 88253 -84366 -71069 47016 35223 -21738 9209
146I209J6811m5234O170L5850l6387j8828P8467J4673j16262l0297J22526M0014
$$ 9209 26020 -19214 -13044 22806 -13581 -32409 46058 60731 -55531 -85828 36698 76712
158G6712j03167k6598Q0894n193p2486K8412P2613l1983n6853K9134K5466l5727
$$ 76712 -26455 -53053 27841 22648 -49838 -21426 51187 19204 -37649 -8515 16951 -18776
170a8776O616N4020j6951o2148J4777M8357j6485k1170L1865J832m9497K739M8686
$$ -18776 -12160 41860 24909 -37239 -22462 25895 9410 -11760 20105 21937 -27560 -24821 23865
183B3865q384l1200K6176J1129n6568m914P8488M406q4926L470Q3639k3123q9352
$$ 23865 15481 -15719 10457 21586 -34982 -39896 38592 42998 -41928 -38458 45181 22058 -67294
196f7294M1067J02925m0772j07648K7231R4140j2754o4990J0933L8864j2721j9633
$$ -67294 -26227 76698 35926 -71722 -44491 49649 36895 -28095 -17162 21702 8981 -10652
208a0652P185J504P508K4689j7229n7573J2544P8658l62q1826p566O9774K296
$$ -10652 -3467 -1963 5545 30234 13005 -44568 -32024 46634 46272 -35554 -43120 26654 28950
221B8950o0256O853N3564j1644m2923R852K3298j3409K385K7766j7130m3872J9323
$$ 28950 -31306 -24453 29111 17467 -25456 -15604 7694 -5715 -3330 24436 7306 -36566 -17243
234a7243N0756j3012m2841J2202L1060j5782k1389J6446J4524r071j861j859j9735
$$ -17243 33513 20501 -22340 -10138 20922 5140 -16249 197 14721 5650 3789 1930 -17805
247a7805L425M0644K213n2056j0202N0410R047m6673k228M5227k738m4753K173
$$ -17805 -14380 26264 28477 -23579 -33781 16629 25676 -20997 -23225 22002 19264 -25489 -23316
260b3316L7486l25k1869N934P453j5827J052K4170r25k2863K915J6417q654j1531
$$ -23316 14170 13845 -8024 -2090 5363 -10464 -9412 14758 13833 -9030 -6115 10302 1648 -9883
274i883J6233J0152j8086p836J3048j690j0108J4293J1727k5443j7745K7549J8866
$$ -9883 6350 16502 -1584 -9420 3628 1938 -8170 6123 17850 -7593 -25338 2211 21077
287B1077k6537j5114K6802R614k9361p382K9174R764k1556q583J1007L270j380
$$ 21077 -5460 -20574 6228 15842 -13519 -20901 8273 18037 -3519 -12102 -1095 2175 795
300G95N741k005r634M231R637q853q503J5645J0462k0214j4699J8640J3457j4387
$$ 795 6536 4531 -5103 -872 8765 -88 -8591 7054 17516 -2698 -17397 1243 14700 313
314C13q774J1830O6j3380L640J3890m518j1590O108O224j0022k364J4917L316
$$ 313 -8461 3369 3435 -9945 -6305 7585 3067 -8523 -2415 3809 -6213 -8577 6340 9656
328I656j4706l946J0879L038n367K676L331o521k720O918J321n588K837N965q242
$$ 9656 -5050 -8996 1883 4921 -446 2230 5561 -960 -3680 3238 4559 -1029 1808 7773 -469
343d69r206R629J0477q457r914O348N119p716k347R292J609r208j567O070P78
$$ -469 -9675 -46 10431 1974 -7940 -1592 3527 -4189 -6536 2756 4365 -4843 -6410 -340 438
358D38k214L266J112n764p26O516J155m204J395M116m013m931M251N945k415m228
$$ 438 -1776 1490 2602 -3162 -3888 2628 3783 -421 974 5090 1077 -3854 397 6342 3927 -301
374c01k33R5j180L327K338n495m246M925L990o369l851P502N566p498q238M397
$$ -301 -534 -439 -1619 1708 4046 -1449 -5695 -770 3220 -3149 -7000 502 6068 -1430 -9668 -5271
390e271R948J650p435n945L510R287O74q997l685J0164P268j0723j0743Q366J4841
$$ -5271 4677 6327 -1108 -7053 -3543 5744 6418 -2579 -6264 3900 11168 445 -10298 -1932 12909
405A2909l986j6098j986J2298N464p035p227J826N238J631m345n139K317P722
$$ 12909 8923 -7175 -9161 3137 8601 1566 -5661 -3835 1403 3034 -1311 -6450 -4133 3589
419C589J265r795n599Q812J0582m570j1175L50R992L114o155l493M104L238j897
$$ 3589 4854 -4941 -10540 -1728 8854 4284 -6891 -6541 3451 6565 410 -3083 1021 4259 2362
434B362k254j02M98J411K124j414o791j330Q083N531p934r628M447J0334p50r859
$$ 2362 108 6 504 1915 4039 2625 -4166 -5496 2587 8118 184 -9444 -4997 5337 4587 -5272
450e272k130P174M068l298m498j573M112P471J123j2203q257J4852J7363j1749
$$ -5272 -7402 -228 3840 542 -3956 -5529 -1417 6054 7177 -5026 -13283 1569 18932 7183
464G183k4809O153K9536J592l1171r502K9308J6006k4358k1562J5250K3339n783
$$ 7183 -17626 -11473 18063 19655 -11516 -21018 8290 24296 -62 -21624 -6374 16965 11182
477A1182k0873m493J2813J0904k596j3328q049J0973J7556o007k3450j206K8299
$$ 11182 -9691 -14184 -1371 9533 6937 -6391 -14440 -3467 14089 8082 -15368 -16574 11725
490A1725R999k7829j7640K3626K4125j5328k6178P708K3400n79j8161l693J1626
$$ 11725 21724 -6105 -23745 -119 24006 8678 -17500 -9792 13608 13029 -5132 -8825 2801
503B801M221m724m082j647M46N622M705q442j1087P058J5236m170j7759J640J7796
$$ 2801 7022 2298 -1784 -3431 -2985 2637 7342 -1100 -12187 -5129 10107 5937 -11822 -10182 7614
518G614J8j6073J48J5886j479j4582M392J5185p328j6495J1619J9725j3509k4361
$$ 7614 7632 -8441 -8293 7593 6114 -8468 -4076 11109 3781 -12714 -1095 18630 5121 -19240
532a9240J3524K8476j1008l0687N787K9220j240k6185k606J9151M637j1528m934
$$ -19240 -5716 22760 11752 -18935 -13148 16072 14832 -11353 -13959 5192 9829 -1699 -6633
545f633J954J746P039M336j3344j2835J6351K1764j4363k8426J0137L2855l020
$$ -6633 -4679 -2933 4106 8442 -4902 -17737 -1386 20378 6015 -22411 -12274 20581 17561
558A7561l2910l938L0399J0935k3953j5226J4980J6390n775j4021k238P746O963
$$ 17561 -15349 -19287 11112 22047 -1906 -17132 -2152 14238 8463 -5558 -7796 -50 6913
571F913j061q905o567O478J2681k825j7319l034J9327R518j9157j4968J6356J9330
$$ 6913 5852 -3053 -9620 -3142 9539 6714 -10605 -13639 5688 15206 -3951 -18919 -2563 16767
585A6767j2241k0226R439K0210p591j7772P502J5936p723j3716R425J2098j1424
$$ 16767 4526 -15700 -6261 13949 6358 -11414 -3912 12024 4301 -9415 10 12108 684
598F84j1358J2870J0786j4138j1057J2354J0079j0120q556O799M556m001pJ977
$$ 684 -10674 2196 12982 -1156 -12213 141 10220 100 -8456 -1657 2899 -1102 -1109 868
612H68n692o63J0884J595j5353l550J8314P962j8249j1180J6294J4265j1287j4621
$$ 868 -4824 -5487 5397 6992 -8361 -11911 6403 14365 -3884 -15064 1230 15495 4208 -10413
626a0413N267J3282O12r712n644M474Q639N73r493o844P290J0790l431j3117k603
$$ -10413 -5146 8136 8748 -964 -6608 -2134 6505 7078 -2415 -9259 -1969 8821 5390 -7727 -10330
641a0330J2302P887r406j2219M379J5451J333j5900o923J5329J2273j2656j4608
$$ -10330 1972 9859 453 -11766 -7387 8064 9397 -6503 -13426 1903 14176 1520 -13088
654a3088R039J5996m906j4216J716J1463K04p274j023L344P1K20M46l403k633
$$ -13088 -4049 11947 7041 -7175 -5459 6004 6208 -1066 -2089 1255 1326 1546 1992 -1411 -4044
669d044M980L617n660n020M860M737m242l423K910K260k678M96K230j681j962
$$ -4044 936 4553 -1107 -6127 -1267 3470 -772 -4195 -1285 975 -1703 -1207 1023 -658 -2620
684b620L885K384m666k512N274L466m943k856M282K232l492j446K252K05j486
$$ -2620 1265 3649 -1017 -3529 1745 5211 268 -2588 1694 3926 434 -1012 1240 1445 -41
699d1k0N37j245j15J059k03j948K76J300m89l26M63k77m98J563J460k618j007
$$ -41 -61 476 -769 -884 175 -28 -1976 -1700 -400 -889 -1215 -752 -1029 -1527 36 1496 -1122 -2129
717b129L465J830l738j884M495K431m491k476M149K299l580k347K818J633k289
$$ -2129 1336 3166 -572 -2456 2039 4470 -21 -2497 1652 3951 371 -1976 842 2475 186
732A86j768O53J424J03j031j844J32K762M06l507q91L874J559l686j637M000K267
$$ 186 -1582 -929 495 598 -433 -2277 -2145 617 1023 -2484 -3375 499 2058 -1628 -3265 735 3002
749C002l111j903K774J515j984j22J498m01j168N02J209j276j187Q31J176j378
$$ 3002 -109 -2012 762 2277 293 171 1669 1268 100 602 1811 535 -652 179 1355 -23
765b3j258M94Q68r4o93j102l3J413R49j674j487K146K014j784k103J916K211n16
$$ -23 -1281 -787 81 -13 -706 -1808 -1841 -428 521 -1153 -2640 -494 1520 -264 -2367 -451 1760 1244
783A244k121R04J454j58l56j53l53k30J431L5j714j160K199N83k193j365J517
$$ 1244 -877 27 1481 1323 967 814 461 231 1662 1697 -17 -1177 1022 1605 -588 -1953 -436
800d36J199j203j322L65N86N84q1r05o08J528J782j801j995K198K984j713k878
$$ -436 763 -440 -1762 -1397 -811 -227 -308 -1213 -1821 -293 1489 -312 -2307 -109 2875 1162 -1716
817a716J180L903q41l473N27K628j52j579j379J090R38j14j320j466J439J784
$$ -1716 -536 3367 2526 -947 -420 2208 2056 477 -902 188 1126 1012 -308 -1774 -335 1449
833A449j167l527J072L411n80l484L49K977L41k257q5J717N09n91O02l09o79J326
$$ 1449 282 -3245 -2173 1238 658 -2826 -2477 500 841 -1416 -1501 216 725 134 736 427 -252 1074
851A074J423j604j908J716K069j880k197J238J612r59j337K45p6m2Q83l11j925
$$ 1074 2497 893 -1015 701 2770 890 -1307 -69 1543 584 -753 -508 -584 -626 257 -54 -1979
868a979j59K663J45k656l78K691Q16k138L45J139m32P4J478m14k533J371L363
$$ -1979 -2138 525 670 -1986 -2364 327 1143 -995 -650 489 57 131 1609 1195 -1338 33 3396
885C396j528l519Q49L834o13l883L5L152n83j583n48K39n49J509J043l182j696
$$ 3396 1868 -1651 -802 3032 2419 -1464 -1429 1723 1140 -443 -991 -752 -1301 208 1251 -1931 -3627
902c627L747K612l951l094L641L502k303l094J883K333n53o52p19l10J555K150
$$ -3627 120 2732 -1219 -4313 -672 2830 527 -2567 -684 1649 1096 444 -275 -585 970 3120
918C120j788l355J655L854j819l684J555K393k163j001J847k82l160J260M242
$$ 3120 1332 -2023 -368 3486 1667 -2017 -462 1931 -232 -1233 614 332 -2828 -1568 2674
933B674k674m890L500N239l712n022L726M603l185k602L350Q82l384J787L860
$$ 2674 0 -4890 -1390 3849 137 -4885 -1159 3444 259 -2343 1007 1889 -1495 292 4152
948D152l442n018N157O436o834p123O494P432n890o966L415O291k551m229N03
$$ 4152 710 -4308 849 7285 451 -6672 -178 7254 1364 -5602 -2187 4104 1553 -2676 -2173
963b173J512O83Q27o87l587O63N117N59n425j850N432L188l656l741J450M559
$$ -2173 -661 22 849 162 -3425 -2762 2355 2914 -2511 -4361 1071 4259 603 -3138 -1688 2871
979B871J129l654m125L002O459j834q295P62Q085J46q194l55O926o71n638J818
$$ 2871 4000 346 -3779 -777 5682 3848 -4447 -3685 4400 4546 -3648 -4003 2923 2252 -3386 -1568
995a568M051m000k876O525J209q168p41J0492j49j0516Q17J0988j668r921L254
$$ -1568 2483 -1517 -4393 2132 3341 -4827 -5568 4924 4775 -5741 -4924 6064 4396 -5525 -2271
1010b271Q450m275o592O321M645p903l701R291K828j0716k328J0694J527r968
$$ -2271 6179 1904 -4688 1633 6278 -1625 -5326 3965 6793 -3923 -6251 4443 5970 -3998
1024c998j645Q066J194o148n39L637m62j751K068j60l556J874M522j541n029J065
$$ -3998 -5643 2423 3617 -2531 -3070 567 105 -1646 422 262 -3294 -1420 3102 1561 -3468 -2403
1040b403N166M25l790j797K376L509J57m899k894N852N061o333p018N687P964
$$ -2403 2763 3188 -602 -2399 -23 3486 3643 -1256 -4150 1702 6763 430 -6588 -901 7063
1055G063o064p437M854O148m699m193M620J218m870J533N972m820n816O879O948
$$ 7063 999 -6438 -1584 4564 -135 -4328 292 1510 -3360 -1827 4145 -675 -6491 388 7336
1070G336q549o888R929O697j0200n451J0142M518r855k401R182l38q041J966P272
$$ 7336 -1213 -8101 1828 8525 -1675 -7126 3016 7534 -2321 -4722 4460 4122 -3919 -1953 5319
1085E319m247o406N540M837o336m101O863K235o902n41O079q67n323K596M046
$$ 5319 1072 -5334 206 5043 -1293 -5394 1469 3704 -3198 -3739 2340 1473 -3850 -1254 2792
1100B792l083l353M206K522l988r47L531Q1k492J229J304k120J34L343k334l888
$$ 2792 -291 -3644 562 3084 -904 -1851 1680 1761 -731 498 1802 -318 -184 3159 825 -3063
1116c063L464M141m779m581N402L389n395l037N810J073n230L16M556k014l959
$$ -3063 401 4542 -237 -4818 584 3973 -1422 -4459 1351 2424 -2806 -2490 2066 52 -3907
1131c907M271K998n702j630P007J063p735M92P936j341p226K530O389l682n116
$$ -3907 364 3362 -2340 -3970 3037 4100 -3635 -3143 4793 3452 -3774 -1244 5145 1463 -3653
1146c653M567L426n587k017N615M14o228J385N679k783n578M051M524n198l483
$$ -3653 914 4340 -1247 -3264 2351 2765 -3463 -2078 3601 818 -4760 -709 3815 -1383 -4866
1161d866N917J915n599n72N575q39m378J853M274l043k720M024J329m354n6N094
$$ -4866 1051 2966 -2633 -3205 2370 1531 -2847 -994 3280 237 -2483 1541 2870 -1484 -1540 3554
1177C554j848m515K648M157l540l805M125K558m820j613M458K07m586J207L691
$$ 3554 1706 -2809 -161 3996 456 -3349 776 3334 -1486 -3099 1359 1566 -3020 -1813 1878
1192A878k208l153L688K195m250q08M851l27m436J062M565k258l333L260K563
$$ 1878 -330 -3483 205 2400 -1850 -2658 2193 1866 -2570 -1508 3057 799 -2534 726 3289
1207C289m005j576M878K68n196O01N004j676m894K392M161l542l455L905K231
$$ 3289 -716 -2292 2586 2854 -2342 -1741 3263 1587 -3307 -915 3246 -296 -3751 154 2385
1222B385m576p44M724r11m089J726L874k604k998L666K419l787j338M384M66m258
$$ 2385 -2191 -2935 1789 878 -3211 -1485 2389 -215 -3213 453 2872 -915 -2253 2131 2597 -1661
1238a661R33L706j608l512K934K499m050j565M022M53m009k62M358j414l749J892
$$ -1661 -728 2978 1370 -2142 792 3291 -759 -2324 1698 2151 -1858 -2120 2238 824 -2925 -1033
1254a033L017k724j829L142Q71l202r3L375p59l193J633L450k447k084K829J357
$$ -1033 1984 -740 -2569 573 1444 -1758 -1851 1524 765 -2428 -795 2655 208 -1876 953 2310
1270B310l243j46L418o87l543J675L185k479k944K759K277l452j614L153P57l163
$$ 2310 -933 -1079 2339 1652 -1891 -216 2969 490 -2454 305 2582 -870 -2484 669 1426 -1737
1286a737J14K767j088k269J871J641k521q63L107M77l199N14L478j199k708J546
$$ -1737 -1623 1144 56 -2213 -342 1299 -1222 -2085 1022 1499 -1700 -1186 2292 1093 -1615 -69
1302f9K663k091k014K594J212k819p07K938l78k903J100K518j982k286K054J823
$$ -69 2594 503 -1511 1083 2295 -524 -1231 1707 1329 -1574 -474 2044 62 -2224 -170 1653
1318A653k814r50K656L46k574K39K437o22k124J605J474j603j004K234M49k232
$$ 1653 -1161 -2111 545 891 -1683 -1444 993 371 -1753 -148 1326 -277 -1281 953 1402 -830
1334h30L00K316q42j762J289J335j630j256J775N24k073p0J849p67j456Q99Q99
$$ -830 -530 1786 944 -818 471 1806 176 -1080 695 1219 -854 -924 925 158 -1298 -399 500
1351E00j318r95J768O31k069K53K204o49j836J233J788j358j439J872J084k100
$$ 500 -818 -1813 -45 586 -1483 -1230 974 325 -1511 -278 1510 152 -1287 585 1669 -431
1367d31n16K624j20k177O1K326p80k018P88J559r81j549J060O28j114o34J650
$$ -431 -947 1677 1557 -620 -559 1767 987 -1031 -243 1316 335 -1214 -154 474 -640 -1274 376
1384C76m9j769N80J264m90j008L93J644q21p39N71N63m25J97N95l97l00Q10l7
$$ 376 327 -1442 -862 402 -88 -1096 -703 941 120 -619 -48 515 90 287 882 485 185 995 958
1403I58j383L58Q18k08p57K1O69n27l95L54J73j042J81J205p11j156O37J617r76
$$ 958 -425 -67 751 543 -214 -193 476 -51 -446 -92 81 -961 -780 425 -286 -1442 -805 812 -164
1422a64j206Q94J342p70r20R97Q75j063k45J136K00r52l94J263n1j121m38J792
$$ -164 -1370 -476 866 96 -824 173 1048 -15 -260 876 1076 124 -270 993 942 -179 -617 1175
1440A175l01j486k92J359j18j368N3O64L18o09l27N52L54m40J52L22R7l98L29
$$ 1175 874 -612 -904 455 337 -1031 -978 -314 4 -605 -932 -380 -26 -466 -314 8 105 -293 36
1459C6O02k06r19P87J083p69j146K65J507n9j674j64J672n0j788Q3J354m26q59
$$ 36 638 432 -487 300 1383 614 -532 -267 1240 1181 -493 -657 1015 965 -823 -740 614 188 -671
1478f71NQ52n00j025Q74Q45r60q88J218J045r51j103J567J128j476r97J545J055
$$ -671 -666 186 -314 -1339 -465 380 -580 -1468 -250 795 -156 -1259 308 1436 -40 -1037 508 1563
1496A563j382q56J365Q72j293r89J831K82k011n1J448J76k148j36K358o03j770
$$ 1563 181 -675 690 1562 269 -720 1111 1393 -618 -669 779 955 -1193 -1329 1029 426 -1344
1513a344J16J715q2j541j10J859m83j265P90J216o66p71Q67J071j003r54J307
$$ -1344 -1228 487 405 -1136 -1246 613 130 -1135 -345 871 205 -566 301 1372 369 -585 722
1530G22O42j048j230J355J075j669o13P25Q45q73j096Q13P86j212j66Q23J37p68
$$ 722 1364 316 -914 441 1516 -153 -766 -41 804 -69 -1165 -352 434 -778 -944 -121 16 -752
1548g52q9Q36K42j301K74J486k79q42l49J802j09j415L60J224pj275m3J453m72
$$ -752 -841 -5 237 -1064 -790 696 417 -425 -774 1028 919 -496 -136 1088 1081 -194 -237 1216 744
1567G44p92m1Q14o27p83O41O86j074j011J156Q82r98q68P82R13p41q71J515K65
$$ 744 -48 -89 725 98 -685 -44 642 -432 -1443 -287 595 -403 -1271 -489 424 -317 -1188 327 592
1586E92r24j84J135Mq51J6J041J54j236K24R81m17p35J99O96m38p68J19P40l85
$$ 592 -332 -516 619 623 -228 -212 829 983 -253 -29 952 535 -200 -1 695 257 -511 -392 348 -37
1606c7l84P2J78j79m56M78K88j23m16L41K69l6m30K40O92m49jK23O68m76n51M28
$$ -37 -421 -349 -171 -350 -806 -328 -40 -163 -579 -238 31 -5 -435 -195 497 48 47 270 938 462 -89 339
1628C39N62m91m50L31L30n63n01N54K97o97j09J57J88o33k5L71K83n16R5M84N3
$$ 339 901 410 -40 291 621 58 -443 111 408 -289 -398 -241 -53 -686 -711 -340 -57 -573 -478 6 59
1649E9n67J63Q98k98o30L66O28p8m61L65L33n58l28L66J58k75k92K17n1j89k05
$$ 59 -508 -345 553 255 -375 -9 619 541 80 445 778 220 -108 258 416 141 -151 66 15 -174 -379
1670c79K73q7l88M07p9J3k94J87p7K62K5k94M75M8J24j66q9K27M00n23K69K36
$$ -379 -106 -193 -581 -174 -253 -240 -534 -347 -424 -162 -137 -431 44 92 216 50 -39 188 588 65 334 570
1692E70J70p40N4L70j27k55J32K65n08n84O69L64j064oN23M62q48l75Q03J82o38
$$ 570 740 0 54 424 297 42 174 439 -69 -653 16 380 -684 -690 -167 295 -553 -928 -125 57 -581
1713e81K40N27L3l54R9O62j85l74L68L64l90k70K57K5n03j7L43M9m23j15M26k05
$$ -581 -341 186 219 -135 -36 626 441 67 435 799 409 139 396 421 -82 -99 244 293 -130 -245 181 -24
1735b4j81l06L95k27J42k07l6K43J43q2j07L27k65O4R5J44K64m96J98O57l41k49
$$ -24 -205 -511 -116 -343 -201 -408 -444 -201 -58 -140 -247 80 -185 -121 -26 118 382 -114 84 741 400 151
1757A51J95K45j74n67J92M23m79k67R1K64k25n43M55K41m67k07N12J46m15j81
$$ 151 346 591 417 -150 42 465 -14 -281 -190 74 -151 -694 -239 2 -465 -672 -160 -14 -429 -610
1777f10N52M56n93m5M74K33m45n1K22k0OJ94K57l78J54j42o2Q4l01j18J61j45
$$ -610 -58 398 -195 -240 234 467 22 -29 193 173 179 373 630 252 406 264 202 286 -15 -133 28 -117
1799a17j19j50K18N6k12M7j48K26m0k55M09O1o4q1K07L40j67k13Q8M73J2o98L65
$$ -117 -236 -386 -168 -112 -324 -277 -425 -199 -239 -494 -85 -24 -88 -169 38 378 211 -2 86 559 571 -127 238
1822B38K56k33k99M93K06r11j87O06j47l98j47L76J40p59J67M53J91p05J82N34
$$ 238 494 261 -38 455 661 -250 -437 169 22 -376 -523 -147 -7 -766 -599 -146 45 -660 -478 56
1842E6k25l68O28J90j38m00L09M21l56l61M77M92l63j68L05k46k61L8J97j8n66
$$ 56 -169 -537 91 281 143 -257 52 473 117 -244 233 725 362 194 499 253 -8 30 227 209 -357
1863c57j87K40J48j11j28K22l06L01n82N96L39l13l01L60L51r2k61J5R27m48p13
$$ -357 -544 -304 -156 -267 -395 -173 -479 -178 -760 -164 175 -138 -439 -79 272 180 -81 -66 861 413 -300
1884c00N75M25q21m1N77J51q39j5L58M71r02j80P82K39j052j52R21n0q33L11P27
$$ -300 275 700 -121 -162 415 566 -273 -288 70 541 -361 -541 241 480 -572 -724 197 147 -686 -375 352
1905C52k19o36K2J048m38o10M57N44k82l25K26N75m90p7J36K58o89R2J45N13l58
$$ 352 133 -503 -481 567 129 -481 -24 520 238 -87 139 714 224 147 283 541 -148 -56 89 602 244
1926B44l52j76K78k31k39j13L15J54l67K33K69L7m62K34L45j00m91L63M43j82
$$ 244 -108 -284 -6 -237 -476 -589 -274 -120 -487 -254 15 52 -410 -176 169 69 -422 -59 384 202
1946B02k61O22Q8m45l12M30M42q20j96O86K21q91k52M21K52p80j27Q62J81j170
$$ 202 -59 563 651 206 -106 324 766 -54 -250 436 657 -234 -486 -65 187 -593 -720 142 323 -847
1966h47L54O49l53m69L93M61k06l96N19J15O1l11J08M44l25m0J18J13m96lM86
$$ -847 -493 156 -197 -666 -273 188 -18 -414 105 220 281 -30 78 522 197 157 275 388 -108 -111 375
1987C75r8k35k79K61J22k04j59m7L79j93l25L5J59K80n22J05N17k51l48L45N13
$$ 375 277 42 -237 24 146 -58 -217 -264 115 -78 -403 -368 -209 71 -451 -346 171 -80 -428 -83 430
2008D30l12m45O25L30m43j94L78N33p73k16N36ro23n9M74J50q88l10Q33o6p42
$$ 430 118 -327 298 628 185 -9 369 902 129 -87 449 440 -183 -242 232 382 -506 -816 17 -49 -791
2029g91K77O96l63n94O89K04J47o36L29O06p31o2L91K23k96p1M16Q2m02j31L69
$$ -791 -514 182 -181 -775 -86 118 265 -371 -42 564 -167 -229 162 385 89 18 434 516 114 -17 352
2050C52M5l98q6J66K2l65L24L3j98k41P4j42M96j64n95L96K07L00o19K11O03j04
$$ 352 397 -1 -87 79 101 -264 60 93 -105 -346 -272 -414 82 -82 -677 -281 -74 226 -393 -182 421 317
2072C17n05K22O90n93k29M28K72n07j84M78L80q83p8N81M6q86O8O71j96p04K28
$$ 317 -188 34 724 131 -98 330 602 95 -89 389 769 -114 -192 389 435 -451 -383 288 92 -612 -384
2093c84O61m24l64L62M56o66j20O50Nl41M19J75l08k33L82M55m86j82N28k33l53
$$ -384 277 -147 -511 -149 307 -359 -479 171 176 -165 254 429 121 -112 270 725 239 57 585 352 -1
2114aJ89O45p87j16J43Q3j04k53QK19l31L50l1k78k48K24N77o78J91N84k65q41
$$ -1 188 833 46 -70 73 156 52 -201 -193 26 -305 45 14 -264 -512 -288 289 -389 -198 386 121 -720
2136g20O90M53k38n22N19P41q54l51P41L71j346K00Q25j40j033M00P24m48p39
$$ -720 -30 423 185 -337 182 923 69 -282 459 830 -516 -316 509 369 -664 -264 460 12 -727
2155g27O97J70p30J0Q14J9p06LP34n3n93L20M92k85k39K90K33n13J57L36k13l96
$$ -727 -30 140 -590 -580 234 253 -453 -450 284 231 -362 -42 450 165 -74 216 449 -64 93 429 216 -180
2177a80M43J00m66j97M63L0o04J39M04k36m01L13L34l78l13M78J63p79M06P12
$$ -180 263 363 -103 -300 163 193 -411 -272 132 -104 -505 -192 142 -236 -549 -71 92 -687 -281 431
2197D31n67l82O24L64m34n01Q32K56o67m2P48l04n61K89N57l36q62M04Q36p44
$$ 431 -136 -518 106 470 36 -465 367 623 -44 -86 662 358 -203 86 643 307 -555 -151 685 -59
2217e9n75O25o7l99Q4O52j85r03O71M59p15m9N40N4n03J82O33j92m07M12Q8l34
$$ -59 -634 -9 -76 -475 -391 261 76 -827 -156 303 -412 -461 79 133 -370 -188 445 253 -154 258 346 12
2239A2J4N37j28n50J73K80K3n64K55K76m31n08R31P0j132M44M72l88o80O73L77
$$ 12 26 563 435 -115 58 338 361 -203 52 328 -103 -611 320 390 -742 -298 174 -214 -894 -221 156
2260A56l74k20N68K18m20j75P72J90q15K23O24n43k63L97J53k32o35O73M8p07
$$ 156 -218 -438 130 348 -72 -247 525 715 -100 123 747 204 -59 338 491 259 -376 297 345 -362
2280c62K51K92Q1p03M76K15n22j12O6N70o59K25J62n0l05M0O82l26k94L49K03
$$ -362 -111 181 262 -441 35 250 -272 -384 -318 252 -407 -182 -20 -70 -375 -335 347 21 -273 76 279
2301B79n24L46L03j55m91K56L38k36n17O04J38o22N1N51q2p87J99M14m4q19M88
$$ 279 -245 101 404 249 -242 14 352 116 -401 203 341 -281 -230 321 239 -548 -349 65 21 -798 -310
2322c10L45k53j47M10J44n20J8M81Q2n33L22L58j34m64M81J51n55J60J42J88m95
$$ -310 35 -218 -365 45 189 -331 -313 168 250 -283 39 397 263 -201 280 431 -124 36 178 366 -129
2343a29j9M87l65k84L42p8k74j21O54n15k07J67M89m71k58P09R9k18j41M06K38
$$ -129 -148 339 -26 -310 32 -46 -320 -441 213 -302 -509 -342 147 -324 -582 127 226 8 -133 273 511
2364E11p85M7Q78n41K5J50M84p85k1L71J41o32n3N76n98R9n27Q66k25n93N29J6
$$ 511 -274 -227 651 110 135 285 769 -16 -37 334 475 -157 -210 366 -232 -133 -660 206 -19 -612 -83 -67
2386f7k31o5K42O0j84J55J16J89j66P4M53k43k52o6J79J30k13J24j30%oj48P3
$$ -67 -298 -363 -121 -61 -245 -90 26 215 49 123 576 333 81 15 194 324 111 235 105 105 99 -49 24
2409B4K6J03l34k30J79J13l54J22K47J08m44Q0M95j44l56J7N67j21l13K70J95
$$ 24 50 153 -181 -411 -232 -119 -473 -351 -104 4 -440 -360 135 -9 -365 -348 219 98 -215 55 250
2430B50k29N0J59J01l66J62M42l76m38L40K28j86m49K44K99n63J60J49j58p6k02
$$ 250 21 71 230 331 -35 127 569 193 -245 95 323 137 -312 -68 231 -332 -172 -23 -181 -257 -459
2451d59O33k57j61L35J12J8k49j84N03m15L0J89J62L7Q4j75j74L55n3Lk59L6j47
$$ -459 174 -83 -244 91 203 221 -28 -212 291 -124 -94 95 257 294 378 203 29 384 331 334 75 111 -36
2474c6M8m4j3n1nl7J75j01q0J85j42R6l3O3J49l35J24L52m0j81k18P72m10m45
$$ -36 12 -32 -45 -96 -101 -138 37 -64 -144 41 -101 -5 -38 25 174 -161 -37 315 275 94 -124 648 238 -207
2498b07O39j4m41k8L57Ml63j62L55m73Or4L96N4l40J51K80l71k6J25K1l2n7K89
$$ -207 432 418 -23 -51 306 310 -53 -215 140 -333 -327 -421 -25 29 -311 -160 120 -251 -277 -152 -131 -163 -220 69
2522F9J07j27M2l7NQJ12K1k21J46R6%j07JKj38K31j17n3k1l98N35n13K13K60q5
$$ 69 176 49 91 54 59 67 179 200 -21 125 221 221 114 115 117 -21 210 93 40 19 -379 156 -357 -144 116 31
2548C1j08L0Nk89J0K31k1K96j30OJ28n2j89J78J73l23J45K32k69R6r8n3r7Q0J14
$$ 31 -77 -47 -42 -331 -321 -90 -111 185 55 61 189 137 -52 126 299 -24 121 353 84 180 82 29 -68 12 126
2573A26k63j28J73K11l27k01M53K05k88j49J81O0k7m4j28K56j98K01J51j57M4
$$ 126 -137 -265 -92 119 -208 -409 44 249 -39 -188 -7 53 26 -18 -146 110 -88 113 264 107 151
2594A51q1J82j55M6K4k3n7k09Q2J71j88L7k48o2L27l12K30K9J1j70j60L28j17
$$ 151 70 252 97 143 167 144 87 -122 -40 131 -57 -20 -268 -330 -3 -315 -85 -56 -45 -215 -375 -47 -164
2617a64k2K94P5j68J50J34j74R2r7k1K65l51QK35j57j16J81J51k55k24K28l7k30
$$ -164 -186 108 183 15 165 299 125 217 120 99 364 13 21 256 99 -17 164 315 60 -164 64 27 -203
2640b03P1J43R7l59k53M47k05K31m55M32j7K21k50O3j25L51n3j14K91k35L59n25
$$ -203 -132 11 108 -251 -504 -57 -262 -31 -486 -54 -71 150 -100 -37 -162 189 136 22 313 78 437 -88
2662h8J70m5K4J52J2k38j9m4Jr1j81K40j58L7L5J64j93J00p4J87J45k86J1L01
$$ -88 82 37 61 213 225 -13 -32 -76 -75 -166 -347 -107 -265 -228 -193 -29 -222 -122 -196 -9 136 -150 -139 162
2686A62L7j7J91K3J0j92k32L50k29j89L27l23K20j48n1j36K12l37K54n7o2Q5L8
$$ 162 199 182 373 396 406 214 -18 332 103 -86 241 -82 138 -10 -61 -197 15 -322 -68 -125 -187 -102 -64
2709f4j2m23L22N3J48l45K04K55k83M1P6L5K47l9k5j04r9J96j61K64Q2l33r8Q0
$$ -64 -76 -499 -177 -124 24 -321 -117 138 -145 -104 -28 7 254 215 190 86 -13 183 22 286 368 35 -63 17
2733A7J68j63J7m3J43m10k62L79Q1j00j22J67J59k91P3K98K71n40J51K04q9k61
$$ 17 185 22 39 -4 139 -271 -533 -154 -73 -173 -295 -128 31 -260 -187 111 382 -158 -7 197 108 -153
2755a53L00J84l5k79K71J54m37m6P0j96K37k69K09j34j68J89k0J08l7j91L84j70
$$ -153 147 331 296 17 288 442 5 -41 29 -167 70 -199 10 -124 -292 -103 -123 -15 -52 -243 141 -29
2777b9k69K57O6J00k10K82r3j82K41j63nK51r2k51K41q7q2l3j57J13J26l2n1j78
$$ -29 -298 -41 25 125 -85 197 104 -78 163 0 -5 246 154 -97 144 57 -25 -58 -215 -102 24 -8 -59 -237
2801b37J85M7p4N6k09k56O06j22k03J41J58j84q2J99J22J00m74N22J42l39n4j
$$ -237 -52 -5 -79 -23 -232 -488 118 -4 -207 -66 92 -92 -174 25 147 247 -227 295 437 98 44 43
2823D3L57n82J46P3l0j22r7K78k10MK47j35l0l10m9K86J01n54L65J96J57k20R5
$$ 43 400 -182 -36 37 7 -115 -212 66 -144 -140 107 -28 -58 -368 -417 -131 -30 -584 -219 -23 134 -86 9
2846IL97l24J52j47K36k2l21L36j67J2P5k62o3K22n4m13L68j39r8M1q1Q1K9k61
$$ 9 406 82 234 87 323 301 -20 316 149 161 236 -26 -89 133 79 -334 34 -105 -203 -162 -243 -162 -133 -394
2870c94L71j47k7J21J11j53q2M08J7k02P9j3J49j37J25k00j8P2J64j43j14J27
$$ -394 -23 -170 -197 -76 35 -118 -200 208 225 23 102 89 238 101 226 26 8 80 244 101 -13 114
2892A14l31L56j63j2j51K38j43k39K69rJ7l52K34R2oJ47j57J00mL9K1Q8j83L5
$$ 114 -217 139 -24 -36 -187 51 -92 -331 -62 -71 -54 -406 -172 -80 -86 61 -96 4 0 39 60 148 -35 0
2916@Q3K94j52k37J79j33J80l47n4Q2J40m8l05K51J5N9k30J98l47K92N7j19l02
$$ 0 83 377 225 -12 167 34 214 -133 -187 -105 35 -13 -318 -67 -52 7 -223 -25 -372 -80 -23 -142 -444
2939d44M46J40o9q0q1K24J76k38m4L91j95k38J25p7K11k74j43L90j50j53j05J96
$$ -444 2 142 73 -7 -88 136 312 74 30 421 226 -12 113 36 247 -27 -170 220 70 -83 -188 8
2961Hm0m24Q4K55j35M3j74M64m25RL36j54m0K94J28l90O9k0L11q8K16k02j9Nk0
$$ 8 -32 -456 -372 -117 -252 -209 -383 81 -344 -335 1 -153 -193 101 229 -161 -92 -112 199 111 327 125 106 111 91
2986I1J15k69K00o5j15O9k08n8j10O01p10M97jj62L73k19Jj0Q2j17%K2j81L48
$$ 91 206 -63 137 72 -43 26 -182 -240 -350 251 -459 38 37 -125 248 29 30 20 102 -15 -15 7 -174 174
3010A74k70K86P0Kj11K0j51j67L48M7r3j8j51n6j23k02J44L41m67K60J11j47L38
$$ 174 -96 190 260 262 151 171 20 -147 201 248 155 137 -14 -70 -193 -395 -251 90 -377 -117 -6 -153 185
3033A85m43J27J63m5k3K59k50k6J04o4OK25j17J01n9j41J86k76J30P5J63k79j47
$$ 185 -258 -131 32 -13 -36 223 -27 -53 51 -13 -7 218 101 202 143 2 188 -88 42 117 280 1 -146
3056a46M1J50p5j32K52k59o8K59l98K63p3L02j62Q7k77K32j4j63M42k30Q0QJ3
$$ -146 -105 45 -30 -162 90 -169 -237 22 -376 -113 -186 116 -46 41 -236 -4 -18 -181 261 31 111 119 132
3079A32k79K77k15J89r4j01L77k93j42K7k5N3K39j71l54M42k44jK01k19L0l2P7
$$ 132 -147 130 -85 104 10 -91 286 -7 -149 -122 -147 -94 145 -26 -380 62 -182 -183 18 -201 -171 -203 -126
3102a26M1M39k23q9J73j13lQ5k16K07k81J54j63J69M1l06M55m2l38k7J06R2j27
$$ -126 -85 354 131 42 215 102 99 184 -32 175 -106 48 -115 54 95 -211 244 202 -136 -163 -57 35 -92
3125i2J58j67j00K74j7p9p8K25j94%J61q5J13k29K69k27r0M30o9j11r8m5K00n0
$$ -92 66 -101 -201 73 56 -23 -101 124 -70 -70 91 6 119 -110 159 -68 -158 272 203 92 -6 -51 149 99
3149I9J52k67r4J17j89L5jJ9J24j36m5L74p5j23k10K83k26n0J1L24j76J30j19
$$ 99 251 -16 -110 7 -182 -147 -148 -129 -5 -141 -186 188 113 -10 -220 63 -163 -213 -202 122 -54 76 -43
3172d3Q7K01m00N85k46j63J4j03p6J20K3q1J48k42R4Nj52J19J60k56J26j36k1
$$ -43 44 245 -155 430 184 21 35 -68 -144 -24 -1 -82 66 -176 -82 -77 -229 -110 50 -206 -80 -216 -237
3195b37L38l22O7J06p1K2R5KK9o6J20j2KJ72j26k6l10K92N1j65l8j30J37K96l39
$$ -237 101 -221 -154 -48 -119 -97 -2 0 29 -37 83 71 73 245 119 93 -217 75 126 -39 -77 -207 -70 226 -113
3220a13J45k62O7R0j29K30m2j3q7p8j1K85j5n2n0J69j26m8M8P0l28M41l36J18
$$ -113 32 -230 -163 -73 -202 28 -14 -27 -114 -192 -203 82 67 15 -35 134 8 -40 8 78 -250 191 -145 -27
3244b7K14k31o8q4R6p6K06OJ14l19J46k17Q2K65k65J57M9K2j18j31J47k1j43Q
$$ -27 187 -44 -112 -196 -100 -176 30 36 150 -169 -23 -240 -158 107 -158 -1 48 70 -48 -179 -32 -53 -196 -188
3268a88O08l42j54J22n8J54j30j69L07j12j52K29k55K74j22R7l8k4j56N8Q6j45
$$ -188 420 78 -76 46 -12 142 12 -157 150 38 -114 115 -140 134 12 109 71 47 -109 -51 35 -110
$$ [...]
8191A09
##END NTUPLES=NMR FID
##END=
