##TITLE=1H_Pr 5007
 CD3OD
 8 sc, 
 3.10.2023
##JCAMPDX= 6.0         $$ Bruker NMR JCAMP-DX V2.0
##DATA TYPE= NMR FID
##DATA CLASS= NTUPLES
##ORIGIN= UXNMR, Bruker Analytische Messtechnik GmbH
##OWNER= root
$$ XWIN-NMR		Version 3.5
$$ Tue Oct  3 15:32:13 2023 Russian Standard Time (UT+4h)  she@DPX200
##.OBSERVE FREQUENCY= 200.13135
##.OBSERVE NUCLEUS= ^1H
##.DELAY= (6, 6)
##.ACQUISITION MODE= SIMULTANEOUS
##.ACQUISITION SCHEME= undefined
##.AVERAGES= 8
##.DIGITISER RES= 18
##SPECTROMETER/DATA SYSTEM= spect
##.PULSE SEQUENCE= zg30
##.SOLVENT NAME= MeOD
##.SHIFT REFERENCE= (INTERNAL, MeOD, 0, 15.7039)
##AUDIT TRAIL= $$ (NUMBER, WHEN, WHO, WHERE, WHAT)
$$ ##TITLE= Audit trail, XWIN-NMR		Version 3.5
$$ ##JCAMPDX= 5.01
$$ ##ORIGIN= Bruker BioSpin GmbH
$$ ##OWNER= she
$$ F:/spectra/data/she/nmr/H-F/1/audita.txt
$$ ##AUDIT TRAIL=  $$ (NUMBER, WHEN, WHO, WHERE, WHAT)
(   1,<2023-10-03 15:31:10.48 +0400>,<she>,<DPX200>,
      <created by zg, POWCHK disabled, PULCHK disabled
       configuration hash MD5:
       00 E9 B6 7A A2 85 ED C7 34 08 36 98 17 FE 4E 26
       data hash MD5: 16K
       0B 4D B8 B8 B2 86 61 3F 66 08 F4 41 77 3D 32 58>)
$$ ##END=
$$ 
$$ hash MD5
$$ B6 2E D2 9A 13 97 C7 82 4C 40 CD 96 67 72 FE DA
##$RELAX= 
##$RELAX= 
##$RELAX= 
##$RELAX= 
##$RELAX= 
##$RELAX= 
$$ Bruker specific parameters
$$ --------------------------
##$DU= <F:/spectra>
##$EXPNO= 1
##$NAME= <H-F>
##$PROCNO= 1
##$TYPE= <nmr>
##$USER= <she>
##$AMP= (0..31)
100 100 100 100 100 100 100 100 100 100 100 100 100 100 100 100 100 100 
100 100 100 100 100 100 100 100 100 100 100 100 100 100 
##$AQSEQ= 0
##$AQ_mod= 1
##$AUNM= <au_zg>
##$AUTOPOS= <>
##$BF1= 200.13
##$BF2= 200.13
##$BF3= 200.13
##$BF4= 200.13
##$BF5= 200.13
##$BF6= 200.13
##$BF7= 200.13
##$BF8= 200.13
##$BYTORDA= 1
##$CFDGTYP= 0
##$CFRGTYP= 5
##$CHEMSTR= <none>
##$CNST= (0..31)
1 1 145 1 1 1 1 1 1 1 1 1 1 1 1 1 1 1 1 1 1 1 1 1 1 1 1 1 1 1 1 1 
##$CPDPRG= <>
##$CPDPRG1= <>
##$CPDPRG2= <>
##$CPDPRG3= <>
##$CPDPRG4= <mlev>
##$CPDPRG5= <mlev>
##$CPDPRG6= <mlev>
##$CPDPRG7= <mlev>
##$CPDPRG8= <mlev>
##$CPDPRGB= <>
##$CPDPRGT= <>
##$D= (0..31)
0 1.2 0 0 0 0 0 0 0 0.06 0 0.03 0 0 0 0 0.0002 0 0 0 0 0 0 0 0 0 0 0 0 
0 0 0 
##$DATE= 1696332669
##$DBL= (0..7)
120 120 120 120 120 120 120 120 
##$DBP= (0..7)
150 150 150 150 150 150 150 150 
##$DBP07= 0
##$DBPNAM0= <>
##$DBPNAM1= <>
##$DBPNAM2= <>
##$DBPNAM3= <>
##$DBPNAM4= <>
##$DBPNAM5= <>
##$DBPNAM6= <>
##$DBPNAM7= <>
##$DBPOAL= (0..7)
0.5 0.5 0.5 0.5 0.5 0.5 0.5 0.5 
##$DBPOFFS= (0..7)
0 0 0 0 0 0 0 0 
##$DE= 6
##$DECBNUC= <off>
##$DECIM= 32
##$DECNUC= <off>
##$DECSTAT= 4
##$DIGMOD= 1
##$DIGTYP= 9
##$DL= (0..7)
0 120 120 120 120 120 120 120 
##$DP= (0..7)
150 150 150 150 150 150 150 150 
##$DP07= 0
##$DPNAME0= <>
##$DPNAME1= <>
##$DPNAME2= <>
##$DPNAME3= <>
##$DPNAME4= <>
##$DPNAME5= <>
##$DPNAME6= <>
##$DPNAME7= <>
##$DPOAL= (0..7)
0.5 0.5 0.5 0.5 0.5 0.5 0.5 0.5 
##$DPOFFS= (0..7)
0 0 0 0 0 0 0 0 
##$DQDMODE= 0
##$DR= 18
##$DS= 0
##$DSLIST= <SSSSSSSSSSSSSSS>
$$ [...]
##$SUBNAM2= <"">
##$SUBNAM3= <"">
##$SUBNAM4= <"">
##$SUBNAM5= <"">
##$SUBNAM6= <"">
##$SUBNAM7= <"">
##$SUBNAM8= <"">
##$SUBNAM9= <"">
##$SW= 18.05172834244
##$SWIBOX= (0..15)
0 0 2 0 0 0 0 0 0 0 0 0 0 0 0 0 
##$SW_h= 3612.71676300578
##$TD= 16384
##$TD0= 1
##$TE= 0
##$TE2= 300
##$TE3= 300
##$TEG= 300
##$TL= (0..7)
0 120 120 120 120 120 120 120 
##$TP= (0..7)
150 150 150 150 150 150 150 150 
##$TP07= 0
##$TPNAME0= <>
##$TPNAME1= <>
##$TPNAME2= <>
##$TPNAME3= <>
##$TPNAME4= <>
##$TPNAME5= <>
##$TPNAME6= <>
##$TPNAME7= <>
##$TPOAL= (0..7)
0.5 0.5 0.5 0.5 0.5 0.5 0.5 0.5 
##$TPOFFS= (0..7)
0 0 0 0 0 0 0 0 
##$TUNHIN= 0
##$TUNHOUT= 0
##$TUNXOUT= 0
##$USERA1= <user>
##$USERA2= <user>
##$USERA3= <user>
##$USERA4= <user>
##$USERA5= <user>
##$V9= 5
##$VALIST= <valist>
##$VCLIST= <CCCCCCCCCCCCCCC>
##$VD= 0
##$VDLIST= <DDDDDDDDDDDDDDD>
##$VPLIST= <PPPPPPPPPPPPPPP>
##$VTLIST= <TTTTTTTTTTTTTTT>
##$WBST= 1024
##$WBSW= 4
##$XGAIN= (0..3)
0 0 0 0 
##$XL= 0
##$YL= 0
##$YMAX_a= 164514
##$YMIN_a= -247696
##$ZGOPTNS= <>
##$ZL1= 120
##$ZL2= 120
##$ZL3= 120
##$ZL4= 120
##$ABSF1= 10
##$ABSF2= 0
##$ABSG= 5
##$ABSL= 3
##$ALPHA= 0
##$AQORDER= 0
##$ASSFAC= 0
##$ASSFACI= 0
##$ASSFACX= 0
##$ASSWID= 0
##$AUNMP= <proc_1d>
##$AZFE= 0.1
##$AZFW= 0.1
##$BCFW= 1
##$BC_mod= 2
##$BYTORDP= 1
##$COROFFS= 0
##$CY= 11.3945322036743
##$DATMOD= 1
##$DC= 2
##$DFILT= <>
##$DTYPP= 0
##$F1P= 15.7292609196834
##$F2P= 12.9074282941183
##$FCOR= 0.5
##$FTSIZE= 0
##$FT_mod= 4
##$GAMMA= 1
##$GB= 0.15
##$INTBC= 1
##$INTSCL= 1
##$ISEN= 128
##$LB= 0.24
##$LEV0= 0
##$LPBIN= 0
##$MAXI= 10000
##$MC2= 0
##$MEAN= 0
##$ME_mod= 0
##$MI= 1.114404
##$NCOEF= 0
##$NC_proc= 0
##$NLEV= 6
##$NOISF1= 3.799351
##$NOISF2= 2.8
##$NSP= 1
##$NTH_PI= 0
##$NZP= 0
##$OFFSET= 15.70392
##$PC= 1
##$PHC0= -21716.07
##$PHC1= 16.25271
##$PH_mod= 1
##$PKNL= yes
##$PPARMOD= 0
##$PSCAL= 0
##$PSIGN= 0
##$REVERSE= no
##$SF= 200.130013532006
##$SI= 16384
##$SIGF1= 3
##$SIGF2= 2
##$SINO= 400
##$SIOLD= 16384
##$SREGLST= <1H.CDCl3>
##$SSB= 0
##$STSI= 0
##$STSR= 0
##$SW_p= 3612.71676300578
##$SYMM= 0
##$S_DEV= 0
##$TDeff= 0
##$TDoff= 0
##$TI= <>
##$TILT= no
##$TM1= 0
##$TM2= 0
##$TOPLEV= 0
##$USERP1= <user>
##$USERP2= <user>
##$USERP3= <user>
##$USERP4= <user>
##$USERP5= <user>
##$WDW= 1
##$XDIM= 8192
##$YMAX_p= 0
##$YMIN_p= 0
$$ End of Bruker specific parameters
$$ ---------------------------------
##NTUPLES= NMR FID
##VAR_NAME=  TIME,          FID/REAL,        FID/IMAG
##SYMBOL=    X,             R,               I
##VAR_TYPE=  INDEPENDENT,   DEPENDENT,       DEPENDENT
##VAR_FORM=  AFFN,          ASDF,            ASDF
##VAR_DIM=   8192,          8192,            8192
##UNITS=     SECONDS,       ARBITRARY UNITS, ARBITRARY UNITS
##FACTOR=    0.0002768,     1,               1
##FIRST=     0,             0,               0
##LAST=      2.2672688,     0,               0
##MIN=       0,             -247696,         0
##MAX=       2.2672688,     164514,          0
$$ Real data points
##PAGE= N=1
##DATA TABLE= (X++(R..R)), XYDATA
$$ [...]
2254a834K407n44q57K621k579K56J567k509K824q97k032K421j501M70J812k957
2270a332J615M4j391L102k315r09K092j629J638l33k167K618j334m18K334k776
2286a161O69J171j705K571j663j541K917j840P18R45k815K020l6r31K410k608
2302h79k60K333k080J648k85k143K564j122r0J891l094J271J210k044K289j700
2318d91o30K547k506J556P30l029K507l27n85J376k676J167J944k567J649n30
2334A35j681K493j228K93J235l214K130Q75j759J826j862l10K576k448J508rk355
2351a795L074j068q17J627k304J272J188k332K177j330j190K921j731M7R29k441
2367a773K590j26j652K305k105p7K125j896J232p13j320K973j391r74J503j779
$$ plain form
2254 -1834 573 29 -828 1793 -786 -530 1037 -1472 1352 455 -1577 844 -657 -187 1625 -1332
2270 -1332 283 327 -1064 2038 -277 -1186 906 -723 915 582 -1585 1033 -301 -719 1615 -1161
2286 -1161 -492 679 -1026 1545 -118 -1659 1258 -582 136 1081 -1734 286 250 -681 1729 -879
2302 -879 -1139 1194 -886 762 477 -1666 898 -224 -314 1577 -1517 -246 964 -1080 1209 -491
2318 -491 -1121 1426 -1080 476 1206 -1823 684 357 -228 1148 -1528 -361 1583 -984 665 135
2334 135 -1546 947 -281 12 1247 -1967 163 1038 -721 1105 -757 -1067 1509 -939 569 560 -1795
2351 -1795 1279 211 -606 1021 -1283 -11 1177 -1155 1022 -308 -1498 1423 -308 -261 668 -1773
2367 -1773 817 691 -961 1344 -761 -838 1287 -609 623 -90 -1410 1563 172 -802 701 -1078
2383a078J768M53k242K195j713m74K681k248Q31K76k016K911q72j339K101k534
2399a300J182J718k534J450o88j122K854k004P4J390k700K146O23k021J612j508
2415h28L51K220k640P26O64j685K385j155p06J647k356J613R30k341J664n97p20
2432h28K532k377L31J290k278K312m41j702K095j490M38J481k423J184L5j369
2448a210K742j732o40J720k075J864K95k383K236j107l22K214k653P88Q09j745
2464a199K656j362j437K196j573O88J040k306J769r6j408K397k038j30J595j834
2480a042J855j80k022K332j286q6J771k452J161O23j540K186j401q83J951j877
2496h90J082O29k243K084o81o27J835k007L36J356j786J904p61j619K202j281
$$ plain form
2383 -1078 690 1143 -1099 1096 -617 -1091 1590 -658 173 449 -1567 1344 472 -867 1234 -1300
2399 -1300 -118 1600 -934 516 -172 -1294 1560 -444 -370 1020 -1680 466 1089 -932 680 -828
2415 -828 -477 1743 -897 -171 493 -1192 1193 38 -668 979 -1377 236 1166 -1175 489 -108 -828
2432 -828 1704 -673 -342 948 -1330 982 541 -1161 934 -556 -118 1363 -1060 124 159 -1210
2448 -1210 1532 -200 -840 880 -1195 669 964 -1419 817 -290 -612 1602 -1051 -263 546 -1199
2464 -1199 1457 95 -1342 854 -719 -31 1009 -1297 472 376 -1032 1365 -673 -803 792 -1042
2480 -1042 813 633 -1389 943 -343 -429 1342 -1110 51 674 -866 1320 -81 -964 987 -890
2496 -890 192 821 -1422 662 -19 -646 1189 -818 -482 874 -912 992 231 -1388 814 -467
2512d67L65J262k466J689J84j652K335j768k88J918j946J424k36j751K360j047
2528h4k21J568k457Q19J288j742J744j060r65K151j511N59P38k189J804p7j179
2545h14J989j946N11J459k058J330k22j524K206r73l37J383k221J468O22j853
2561i80J893j388l13K023j845P59L96j747K115q15p63J596j814O12J408k056J505
2578E86o46j100K367j703J87J123j928J577N8j497J942j544lJ864j948R97R4j613
2596a187K196j039o85J508j910J201R11k204K005q97j005K488j691J56N03j734
2612a384K343m89j640K256j656K93J359j998J500l83j247K254j384m42J516j757
2628h59J186K47j844K059j212k77J773j653O93M64j676K027q56j041K041j800
$$ plain form
2512 -467 -102 1160 -1306 383 567 -1085 1250 -518 -806 1112 -834 590 354 -1397 963 -84
2528 -84 -305 1263 -1194 -375 913 -829 915 -145 -1110 1041 -470 89 827 -1362 442 365 -814
2545 -814 1175 -771 -260 1199 -859 471 249 -1275 931 -42 -379 1004 -1217 251 873 -980
2561 -980 913 -475 -788 1235 -610 149 545 -1202 913 98 -665 931 -883 -271 1137 -919 586
2578 586 -60 -1160 1207 -496 -309 814 -1114 463 521 -976 966 -578 -581 1283 -665 332 426 -1187
2596 -1187 1009 -30 -715 793 -1117 84 995 -1209 796 -101 -1106 1382 -309 -153 350 -1384
2612 -1384 959 470 -1170 1086 -570 -277 1082 -916 584 201 -1046 1208 -176 -618 898 -859
2628 -859 327 574 -1270 789 -423 -700 1073 -580 113 577 -1099 928 72 -969 1072 -728
2644g28N57J178k240J772n08p49J932j696L4J163j628J411k54j063J702j602K38
2661d81J561j983R68L71j135J571j164k37J511j783R88M42j601J453q24n30J859
2678I86j531M42J080j958J739n63j188J826j327K26J107j948J557Oj419J826j084
2695b23l24J333j799J613K7j666J713n46o00J365j840J105O27j862K050r56p45
2712g28J558j470O92N37j772J805m24j247J887j425J19J083j489J464k19j489
2728a118K051j030l57J444j813J205K07j539J626p91m65J465j530P72N80j759
2744a052J614n64o45J658j629J79J271j696J397o84p02K001j718K06J307j881
2760i38J361j25r75J512j261j91J707j875R66L20j388J612q45l90J342j469N28
$$ plain form
2644 -728 -171 1007 -1233 539 31 -718 1214 -482 -448 715 -913 498 244 -819 883 -719 -481
2661 -481 1080 -903 65 436 -699 872 -292 -529 982 -801 187 629 -972 481 -343 -873 986
2678 986 -545 -103 977 -981 758 195 -993 833 -494 -268 839 -1109 448 454 -965 861 -223
2695 -223 -547 786 -1013 600 627 -1039 674 128 -472 893 -947 158 785 -1077 973 17 -728
2712 -728 830 -640 52 589 -1183 622 198 -1049 838 -587 -468 615 -874 590 371 -1118
2728 -1118 933 -97 -454 990 -823 382 589 -950 676 -115 -580 885 -645 127 707 -1052
2744 -1052 562 -2 -647 1011 -618 -439 832 -864 533 -151 -853 1148 -570 -364 943 -938
2760 -938 423 298 -677 835 -426 -617 1090 -785 181 501 -887 725 -120 -510 832 -637 -109
2777a09Q69j549J259m88o65J578j576O54Q67j704J282j31j001J491j394N68J070
2794A021j919J288J3j311J532q44q6J102j639J261J30j711J753n65o87J692j782
2811g52R36M96j783J827m67p61J376j563M54Q36j514J488k30j098J766j294j02
2828c85J319j836J233K1j236J717j027OR25j449Q00K04j083J440r22l90J637j539
2846e65M50O88j365J463p03o14J674j362mQ47j068J116m62q21J630j333K09J083
2864H63j640J065R3j321J845j265o2J348j719R85L19j314J463q68k66J236j407
2881f45Q33M74j564J470m55n58J288j373N47P10j664J386k70r03J310j157N13
2898e8J061k107J528j15j186J777j176J76Q93j700J190M83j845J625p83k58J203
$$ plain form
2777 -109 760 -789 470 -18 -683 895 -681 -27 840 -864 418 287 -714 777 -617 -49 1021
2794 1021 -898 390 403 -908 624 -220 -306 796 -843 418 548 -1163 590 25 -662 1030 -752
2811 -752 184 680 -1103 724 257 -504 872 -691 -237 599 -915 573 343 -755 1011 -283 -385
2828 -385 934 -902 331 352 -884 833 -194 -188 737 -712 88 292 -791 649 -273 -663 974 -565
2846 -565 -115 573 -792 671 -32 -646 1028 -334 -338 509 -559 557 95 -726 904 -429 -220 863
2864 863 -777 288 381 -940 905 -360 -422 926 -793 192 511 -803 660 -208 -474 762 -645
2881 -645 188 662 -902 568 113 -445 843 -530 17 727 -937 449 179 -724 586 -571 -58
2898 -58 1003 -1104 424 309 -877 900 -276 -100 793 -907 283 766 -1079 546 -237 -495 708
2915G08j592R38M95j690J834n07o31J366j542M39Q42j501J354l68j110J876j424
2932e13K53R67j445J342n09j015J781j051l68J525j618P19L36j124J751j411k04
2949e84J534j517M87N82j314J627j032l22J619j506M27O29j594J380k53r34J521
2966G50j176k0J268j402R44o4j096J448j042p1J337j766R41L56j311J481q89k56
2984e68J207j501Q65O22j651J518j99p25J231j440N56R69j900J454k7j078J577
3001I10j137J30R10j825J504n4j379J428p77n1R94j591J071K91j528J658p43n96
3019g85J613j340N69L78j338J468o71n73J545j414M90M88j093J245l58r42J526
3036H08j183Q8J099j572J186j84j126J552r23j28J264j670J149m1j100J488r19
$$ plain form
2915 708 -884 54 549 -1141 693 186 -445 921 -621 -182 660 -841 513 145 -965 911 -513
2932 -513 -260 707 -738 604 95 -920 861 -190 -558 967 -651 68 404 -720 1031 -380 -584
2949 -584 950 -567 -80 502 -812 815 -217 -539 1080 -426 1 630 -964 416 163 -771 750
2966 750 -426 -446 822 -580 364 300 -796 652 -390 -461 876 -890 51 407 -904 577 -312 -568
2984 -568 639 -862 3 625 -1026 492 293 -432 799 -641 -85 884 -1016 438 411 -667 910
3001 910 -227 -97 813 -1012 492 438 -941 487 -290 -341 653 -938 133 424 -1104 554 -189 -785
3019 -785 828 -512 57 435 -903 565 -106 -679 866 -548 -58 430 -663 582 224 -718 808
3036 808 -375 -287 812 -760 426 242 -884 668 -255 -383 881 -789 360 319 -781 707 -212
3053b12l99J424j619Q87M02j305J470r40j37J469j524M45O68j400J203k17q95
3070f80J587j253L8R87j318J112k40q47J339r10p8J098j860J262M93j556J452
3087F26p21m40J183j138O20N04j533J399n19p07J700j587L31P88j409J241j60
3104A78q64J608j473M04R07j491R78l1j003J449j078Q2J169j542Q85L40j337J592
3122G73q58k58R83j223N89O08j334J339q06k67J305j427K25Q81j175J352n22q55
3140f70J500j315K46Q75j486J000Q5j032J409r08kR56j420J083N3j199J396n71
3158@m81J294j445Q04N41j593J531m03o86J028j256O46O31j361J333j62j106J495
3176H10j196P8R90j337J088l6j227J548j099N0R99j378R69J43j300J744j078N
$$ plain form
3053 -212 -611 813 -806 81 483 -822 648 -292 -429 1040 -484 -39 629 -771 432 215 -680
3070 -680 907 -346 -308 679 -639 473 233 -614 725 -185 -263 835 -1025 237 730 -826 626
3087 626 -95 -535 648 -490 130 634 -899 500 -19 -726 974 -613 -282 506 -903 338 178
3104 178 -686 922 -551 -147 760 -731 247 216 -787 662 -416 -334 835 -707 178 518 -819 773
3122 773 -85 -343 640 -583 6 614 -720 619 -187 -454 851 -576 -351 530 -645 707 185 -670
3140 -670 830 -485 -239 636 -850 150 235 -797 612 -296 -298 658 -762 321 374 -825 571 0
3158 0 -481 813 -632 172 713 -880 651 248 -438 590 -666 -20 611 -750 583 421 -685 810
3176 810 -386 -308 682 -655 433 397 -830 718 -381 -331 668 -710 259 402 -898 846 -232 -227
3194b27R90j506Q34M17j429J553q12n12J478j452O50O08j510J239p9q97J630j553
3212e78L79P96j357J090n3j109J600j246M0J007j363R60K50j142J261p05j27J109
3230H12j404O51M43j341J250k98p31J336j469O63Q23j425J082j94p33J215j230
3247e50M20P24j392J134K33j266J632j350k4J116j282R49j0r39J238p83l02J308
3265H56j325N72K40j152J346p49o32J835j306K22N89j218J381n05j033J618j143
3282d04K69P90j453J078M0j124J572j346K86R85j165P13J24j288J593r84j76J346
3300H56j194K81O10j083R59n84m16J355j445P14N83j323Q45j0p17J162j033J94
3318b46J024j563J093J70r04J182j163J36R92j434Q55J54p73J087p95k04J247
$$ plain form
3194 -227 763 -743 91 508 -921 632 -180 -692 786 -666 -16 592 -918 321 242 -655 975 -578
3212 -578 -199 597 -760 330 277 -832 768 -478 -438 569 -794 166 416 -726 535 -170 -297 812
3230 812 -592 59 502 -839 411 113 -618 718 -751 -88 735 -690 392 198 -535 680 -550
3247 -550 -130 594 -798 336 569 -697 935 -415 -439 677 -605 344 334 -605 633 -150 -452 856
3265 856 -469 103 343 -809 537 -212 -844 991 -315 -93 496 -722 659 154 -879 739 -404
3282 -404 -135 655 -798 280 320 -804 768 -578 -292 693 -472 241 365 -923 670 -314 -490 856
3300 856 -338 -57 553 -530 429 -155 -571 784 -661 53 636 -687 158 148 -569 593 -440 -246
3318 -246 778 -785 308 478 -426 756 -407 -271 721 -713 142 296 -477 610 -185 -389 858
3335H58j419N73L83j131J409q17j47R69j063K61N83j213J209k76q62J318j058
3352d23K89Q53j163P47k2r75J555j250J16R29j173P41P9j180J537n67n35J043
3370F01j198P44L46j155J201o81m61J325j350M49N13j027J251n13p72J369j031
3387c89J19R98j517J153j24q73J334q02j74J129j595J143O8j085J292p83j65R01
3405F30j098M76M85j126J235o03n90J441j215L61O30j119Q79l62m27J243j259
3422d19J80Q44j379J114j79o78J158p80j12R06j336R11r9q58J285p16j99J054
3440F97j309O20M76j096J187o85m27J277j352M18P78j377J200l14o22J088q68
3457c09Q4J080j562P86J97j059J258o84l3Q40j211Q65l4j034J373m58k98Q21j137
$$ plain form
3335 858 -561 12 395 -736 673 -144 -291 678 -385 -124 459 -754 455 179 -683 635 -423
3352 -423 -134 719 -444 303 281 -694 861 -389 -273 656 -517 224 303 -877 660 93 -442 601
3370 601 -597 147 493 -662 539 -142 -603 722 -628 -179 334 -693 558 45 -727 642 -389
3387 -389 -270 728 -789 364 240 -633 701 -101 -275 854 -741 402 470 -615 677 -106 -271 630
3405 630 -468 8 493 -633 602 -1 -591 850 -365 -4 626 -493 386 24 -403 840 -419
3422 -419 -239 605 -774 340 161 -517 641 -139 -251 655 -681 230 131 -727 558 -158 -357 697
3440 697 -612 8 484 -612 575 -110 -537 740 -612 -194 584 -793 407 93 -529 559 -309
3457 -309 -225 855 -707 79 276 -783 475 -209 -242 598 -613 252 218 -816 557 99 -199 622 -515
3476e15P26K13r82J248p67l38J072j148N83K80j052J171l07p10J145j045L51M89
3494D14j135Q79P2q85J390r68j64J113j459Q55K35j158J467r42J27R07j283M43
3512i2M57j316J454m71o08J110q18J49N76r39Q71l02p83J480j281J17J052j351
3530f95Q52K19r42J135o09j77P40j012M64K38p28R54m00m96R48j146O82M29j012
3549e56R96m96m65J098q06L49L53j208R93j37n11J019r76K33O72j261R47O9j103
3568g90J308p77J8R05j209O29K83j024J280p28k80R62j119M78O02j183J173o07
3586g9o77J287j148O20N69j154J120l44o65R99j002L92N86j006O92J20p36P89
3604C63n50j12O58r32N60L37o11R26q35k23R64j156O86K31j097J297m27k60P51
$$ plain form
3476 -515 211 424 -558 690 -77 -415 657 -491 92 372 -680 491 184 -526 619 -426 -75 414
3494 414 -721 158 230 -655 735 -233 -397 716 -743 112 347 -811 656 -286 -159 748 -535 -92
3512 -92 365 -951 503 32 -576 534 -284 -135 441 -498 373 71 -712 768 -513 -396 656 -695
3530 -695 157 376 -566 569 -40 -217 523 -489 -25 213 -515 439 39 -457 491 -655 27 456 -556
3549 -556 440 -56 -521 577 -229 120 473 -735 258 121 -390 629 -347 -114 558 -703 244 313 -790
3568 -790 518 -259 -241 664 -545 84 367 -657 623 -105 -385 577 -542 -64 538 -645 528 -79
3586 -79 -756 531 -617 3 572 -582 538 194 -471 528 -474 -82 504 -502 190 310 -426 363
3604 363 -187 -299 359 -573 -13 324 -287 639 -196 -419 545 -611 75 306 -791 506 79 -181 570
3623E70p88J50L90j028R97l90m22J071j058M10N08r26Q86j32r09J274p18l19J028
3642E94j085P56O6q93J043p55j49J075j145O00L24j085J263o07l44J061j021Q1
3660b21O05q48R39n30k76J018r68K05M81q77Q36k94n89J165p73N4O90j258Q17
3679A76jq12J027n01k70J098j269N61L57r31J102n43m25Q91r07M62M42j016J048
3698D89l78n22R62q35J05O50j060Q85r4n14R76r05J28O30j093J011j71p79R85
3717D70m79j50Q01j123N66M35j084J000m58m00J024j120M33O40j061Q12k45n38
3735d77R22p15J27P51j122Q15p0o02Q23p14m9R36j060M50K62o92P68o05N6P63
3755E67r97O45N4q38R76m94l15J001q49M10L4p27J030l77m60R80j090M03N06r55
$$ plain form
3623 570 -218 -68 322 -706 291 -99 -521 550 -508 -98 410 -516 370 238 -671 603 -115 -434 594
3642 594 -491 265 331 -562 481 -274 -423 652 -493 107 431 -654 609 2 -342 719 -302 -221
3660 -221 384 -464 475 -55 -331 687 -281 -76 405 -472 364 70 -519 646 -127 -73 617 -641 176
3679 176 175 -637 390 -111 -381 717 -552 9 366 -565 537 -6 -431 460 -447 15 457 -559 489
3698 489 111 -411 551 -284 -179 471 -589 296 202 -312 664 -241 -113 517 -576 435 264 -515 470
3717 470 -9 -159 642 -481 85 520 -564 436 -22 -422 602 -518 -85 555 -506 306 61 -477
3735 -477 445 -270 -143 608 -514 301 231 -371 452 -262 -311 625 -435 15 277 -415 353 -252 -196 567
3755 567 -430 215 269 -569 407 -87 -402 599 -250 160 194 -533 497 120 -340 640 -450 -47 459 -496
3775d96Q63l29p22J181n91j74Q20r38P27k33p41R19o89J81Q24r29N30M6p63R13
3795C99m05l48P38o74K41L92q73P34j69k65Q37o99L1O57j126P29o7n66Q72o18
3815a80L8O11q04L52M6m06Q41n87k43Q01r19O08L6o96R57m74l80P98q16L02M14
3836B99r40R43k59m40P34n68J70N90j086P60q7m96Q23m51k5M33o99N37no43Q76
3857D66p05r8P77r13N99j12m68Q69m92k19O82r08M66N57r40O25j32l98R28r15
3877c31J07P16j043Q98k80m91J036p83qL44o64P12mo36R37o36m8N50q44O81J2
3898B25p86Q49l53o9M70o92L92L79p73O76l76l64J034j020L84K44n58M23Q1n47
3918c81N39l14j33N58o92P81k60n46O78m93O4P92p22J54K41p68Q12l44l04O77
$$ plain form
3775 -496 367 38 -684 497 -94 -268 552 -386 341 108 -633 286 -403 -222 602 -327 203 249 -514 399
3795 399 -6 -354 384 -290 -49 343 -530 204 35 -230 607 -92 -61 596 -530 199 132 -434 438 -180
3815 -180 -142 469 -335 17 63 -343 498 -89 -332 469 -450 158 194 -502 455 -19 -399 399 -417 -115 299
3836 299 -641 302 43 -397 337 -231 -61 529 -557 203 116 -380 443 -8 -33 400 -299 238 233 -410 466
3857 466 -239 -337 440 -473 126 14 -454 415 -77 -296 386 -522 -56 501 -439 186 54 -344 584 -331
3877 -331 -224 492 -551 347 67 -424 612 -171 -179 165 -499 213 209 -427 510 -126 -174 376 -468 213 225
3898 225 -561 288 -65 -134 336 -356 36 415 -358 318 -58 -422 612 -408 -24 220 -338 85 166 -381
3918 -381 158 -156 -289 269 -423 358 98 -448 230 -263 -199 593 -129 25 266 -502 310 -34 -338 339
3938C39n50K27J04o29Q62k25n06Q27o87J97M65q89O64Qn79P81p67L77M61r21M52
3959A1r0j27N61n42JP26q37L86J07p14Q83o98J91O70q91M33K09p99J057m51l80
3980b94P71q47O50J12n76L65o8n56Q78n95J41J90n98N25K63o17N02n11p2Q05p50
4001b82L28J67q70J001m82k40P15p68M66J87q37R47k17m46Q76q48K21M99p88P05
4021C34k79m08O49n42L9M08o14O38k6o51P35m65R5M84p72N54M5p50Q74n99L3O36
4043D18q87P30N0o07N58k35j78N18p94M02L27q46Q58k12k15M05o32K60M77q56
4063d59O22q2l57M90l20J5M80p87M19L37p82R34m95j22M05p03N70J50o95N43r5
4084F8n67P83n83r0N34p40R03j43o11R15o44Q1O24j053O43Q8o27Q64l49l53M93
$$ plain form
3938 339 -211 16 120 -509 353 128 -378 449 -238 -41 424 -465 199 207 -372 409 -358 19 480 -441 11
3959 11 -79 -206 355 -187 -186 540 -297 89 196 -518 365 -333 -142 528 -363 70 279 -520 537 86 -294
3980 -294 477 -370 280 392 -184 181 113 -443 435 -160 -19 171 -427 98 361 -256 246 -265 -337 468 -282
4001 -282 46 213 -657 344 -138 -378 337 -431 35 222 -615 332 115 -331 545 -303 -82 417 -371 334
4021 334 55 -353 296 -246 -207 201 -413 225 199 -452 283 -182 -87 397 -375 179 224 -526 348 -251 -218 418
4043 418 -469 261 311 -296 262 27 -151 367 -427 -25 302 -544 314 102 -113 292 -340 -80 397 -459
4063 -459 163 81 -276 214 -106 -91 389 -398 21 358 -424 510 15 -107 298 -405 165 315 -380 163 68
4084 68 -499 284 -299 -389 145 -595 308 165 -446 469 -175 -94 530 -523 120 208 -419 445 96 -257 236
4105B36k94K33J62q23R73o78L1O40r55O65M9n67M96k37k63Q89p97R9L93o80O08
4126A80q6l01P32r36K67N22p73N80l2l84O61m52k43N15o65N98O8o08O39l13j51
4147a82N73q23M66J81p31Q29k73k38O07q50N30L16q72R50m55l94O67k41r9K24
4167A85p29P12Ll89O36o19R2N60r03M42K82p02Q39m28l82O53o60M60L38p32M85
4188A43j95k44P66m87j16M82q51P77j27m35N33n75K51N56p96M86j43l02O07m31
4208a01j19O32o77N32po12P02n39j34P21o33M16J2o04P74j99l37M66l93lN05q47
4230d45N62O3m86N75l04K40N3p41N65j01j96M23l18k1O99q54M77q4l58P53o08
4251a06k33P13q22N86rn90O60l59O2M98o33K06M11q44O01k5m09M88m26R0L87n19
$$ plain form
4105 236 -58 175 337 -486 487 -191 -160 480 -475 190 239 -328 168 -69 -332 557 -240 -141 252 -428 180
4126 180 94 -207 525 -411 -144 378 -395 185 153 -231 430 -22 -265 250 -415 183 251 -357 282 -31 -182
4147 -182 391 -432 34 215 -516 313 40 -198 409 -441 89 405 -467 483 28 -366 301 60 -39 185
4167 185 -544 168 171 -218 418 -201 -109 451 -452 -10 272 -430 409 -19 -401 252 -408 52 390 -342 143
4188 143 -52 -296 470 -17 -133 349 -502 275 148 -287 246 -329 -78 478 -318 168 25 -277 330 -101
4208 -101 -220 412 -265 267 260 -352 350 -189 -323 398 -235 181 193 -411 363 164 -173 293 -100 -103 402 -445
4230 -445 117 180 -306 269 -35 205 258 -483 82 -19 -215 208 -110 -131 568 -286 191 107 -251 502 -106
4251 -106 -339 374 -448 138 129 -461 199 -160 -98 400 -233 -27 384 -460 141 116 -293 195 -231 -141 246 -273
4273b73L61J51n79P31o33J83K02n07N58N6o74O28l54L1N50p37M78P3o24Q28n06
4294e7j49M47m14M02O9o16O11j72m60P70o27J27J62m44O42j19n39P56m22PL21
4315B95q26O80K55o78N53m40j35O93o59K31K12o68P23k42r0M24o54L10K78o37
4335c75N94j28n67J057p73L37L12j084Q44J91o61O50o98J68M20l23K81j30n89
4354d74P93n06K09N26j078M69L05n93O41k46k40O60n26K35L2p64P42o7l32L56
4374A42k77K6L77n80M30m0l60P10o61J74K41m66N63K5n69N12m41j5N56m41K15
4395A21r0l57O43l89j87O85n51N8M38p28O72m09l66R66n42j66N45o95M79L7l16
4416a52L16m21N9P18q73M14K6o22J047m06l40N26n57L15L04p83P13l40j09N88
$$ plain form
4273 -273 88 239 -340 391 -242 -59 143 -364 194 250 -424 204 -150 -119 431 -306 172 245 -379 449 -57
4294 -57 -206 241 -173 229 298 -318 293 121 -339 431 -196 -69 93 -351 291 172 -367 389 -33 -26 295
4315 295 -531 149 404 -274 279 -161 -296 397 -262 -31 181 -487 236 -6 -96 328 -326 -16 262 -375
4335 -375 219 91 -476 581 -192 145 457 -627 217 408 -253 397 -301 -133 287 -36 245 115 -474
4354 -474 319 -187 22 548 -530 -61 244 -349 292 46 -194 466 -60 175 207 -557 185 118 -214 142
4374 142 -135 -109 268 -312 118 78 -282 428 -233 -59 182 -284 279 304 -265 247 -194 -209 347 -94 121
4395 121 31 -326 317 -72 -259 426 -125 -67 371 -357 315 -94 -460 506 -36 -202 343 -352 127 164 -152
4416 -152 164 -257 -198 520 -353 61 87 -535 512 106 -234 292 -265 50 354 -429 284 -56 -165 423
4436D23n91L3L58o11O69l23j28M51m39j1O88p82N71j76l24Q02q10o8L88m77N34
4457A77n5m02L31l16K64M05o90K54L33o15M72k18l19O77o48K13N82o41K27M7k65
4478a87N33l55k15N13n97N74o3n58O08m00J68L87p28K21K9J21K24l25j63M20m18
4499b11L91P1n56M17j24j20N21o69J90M61n81L96k21j21N29n71Q5M18m47K18J96
4520B72o32P77o87J43M87m48R6J49n85O54k57j87N85o44L33J07l26M20l79m29
4540e51Q40p62N46J09n11M93Pl37N02n45J71N23o37K78Nm47N38k31l2J74m71N09
4562A71L08q79P49n35Q7N35o27M56r3n65P20p5m04L11m71M87K4l56M41l77j96
4583b89N11k74q1M20o89O17l36j63M54n27L53L39n78L18p5k75M69n34J04L84l36
$$ plain form
4436 423 -168 -135 223 -388 281 -42 -170 281 -158 -169 519 -263 308 132 -192 610 -200 -268 120 -357 177
4457 177 122 -280 51 -265 -1 404 -286 -32 301 -314 158 -60 -379 298 -350 -137 445 -196 31 78 -187
4478 -187 346 -9 -224 289 -308 266 203 -355 253 -147 21 408 -320 -99 -70 51 275 -50 -213 207 -211
4499 -211 180 251 -305 112 -12 -132 389 -280 -90 371 -210 186 -35 -156 373 -198 -113 305 -142 76 272
4520 272 -360 417 -270 -127 360 -88 8 157 -428 226 -31 -218 367 -277 56 163 -163 257 -122 -551
4540 -551 289 -473 73 182 -329 164 171 -166 336 -209 -38 485 -152 126 131 -316 222 -9 -41 133 -338 171
4562 171 479 -400 349 -186 -99 436 -191 265 172 -393 327 252 -152 159 -312 175 199 -157 284 -93 -289
4583 -289 222 -52 -133 287 -402 215 -121 -284 170 -357 -4 335 -243 75 0 -275 194 -340 -236 148 -188
4604a88K11K54l81L79l59k31P89o26r6N08o54M91j64j33M69n56K09M63p09M23
4624I9J05n12M57k04k64M72n06M71k9j21L05m17J55L28n18J38K24o72P67m31P2
4645h1K16l63J54N28p66M45k88mL64m19N7J81k29L25p1n66P90m90J90L21m70L58
4667A82j39l62O19l35k10N37n37M13K51p67N99j80l61N49n56K49J38n63P07m03
4687a69j35O14n32J02L67p43N56K34m95O62n67p6L80m34L18N4m44O03k60k91M53
4708A97m14K04J62m16M99l57j59N28l94J88K32p59P52l01k60M71n55M43J08m75
4728c06M43j11l91O09n72L84K79o72K21J68r0J10k68P1M78n36L10J4m46M22m8
4749F9q2K63m41O9L22o38N31j32l39P73n32K99J02n82N22k03j19L79m33K5L01
$$ plain form
4604 -188 23 277 -104 275 -84 -315 474 -152 -248 260 -394 97 -67 -200 269 -287 -78 385 -324 99
4624 99 204 -308 149 -55 -319 153 -353 118 89 -32 273 -144 11 339 -179 -41 183 -489 278 -153 -81
4645 -81 135 -228 -74 454 -312 133 -155 -159 205 -214 -157 24 -205 120 49 -517 273 -217 -27 294 -176 182
4667 182 43 -319 300 -35 -245 292 -245 168 419 -348 251 71 -290 259 -297 -48 90 -473 234 -169
4687 -169 -304 310 -222 -120 247 -496 60 294 -201 461 -106 -182 198 -236 82 136 -308 295 35 -256 197
4708 197 -217 -13 149 -267 232 -125 -284 244 -150 38 270 -489 263 -38 -298 173 -382 61 169 -306
4728 -306 137 26 -365 244 -328 56 335 -337 -116 52 -38 72 -196 -125 353 -183 127 141 -305 117 69
4749 69 -13 250 -191 -122 200 -438 93 -39 -378 395 -137 162 264 -318 204 1 -118 261 -172 -147 154
4770A54k44J54r3k29L70l32rL89l75K51J37l76M15l83j94M90m35K90J58l42O91
4791D87l39l18L97l20j22N15o70M93k70k34N55l29K45K9l44L53kl20L87m52J67
4812i2L79o68K16M32n41M88p3k18L22l39K20Pj88L04k93j69M74k56j08M52n19
4833a70L42j35l59N24k33k1L43l46LJ35l74M68k44k20N98o54L65K63l12K69k95
4854e3j1L35k93m4J39k81L50ql58O36m82k7J75n52N51j05j6Q6k06J4L95l00N9
4877Dj6k16M04j62r5N49q88N14K2n65O79j24m43M89k64J39K11n64K90K28m86N97
4899C03n73L09k3k65M63k66j86K84k00J46Ok88O00l56k30L70j94j03J98j38J78
4920C5K15n43L89l08J93L07m37L40j08l99N29j14l56L38p3J6K76o45L71J72o89
$$ plain form
4770 154 -90 64 -29 -258 112 -220 -229 160 -215 36 173 -203 212 -171 -365 125 -310 -20 138 -204 487
4791 487 148 -170 227 -93 -215 300 -370 123 -147 -381 174 -155 90 119 -225 128 126 -194 193 -259 -92
4812 -92 287 -381 -165 267 -274 214 141 -77 245 -94 126 133 -55 249 -44 -213 261 5 -103 349 -170
4833 -170 172 37 -322 202 -31 -52 291 -55 -52 83 -291 177 -67 -287 311 -343 22 285 -27 242 -53
4854 -53 -64 271 -22 -66 73 -208 142 134 -224 412 -70 -97 78 -474 77 -28 -44 42 -164 -150 245 -55 4
4877 4 -12 -228 176 14 -81 468 -420 94 116 -449 230 106 -337 152 -112 27 238 -326 -36 192 -294 303
4899 303 -270 39 16 -249 214 -52 -238 46 -154 -8 -2 -290 310 -46 -276 94 -100 -203 -5 -143 35
4920 35 250 -293 96 -212 -19 288 -149 191 83 -316 213 99 -257 81 8 24 300 -345 26 198 -491
4941d91O81k26k6L34l29J43Ql98M55k91j3N07m02Q6p1k09L10j11j8L35l62n9K80
4964A33m26M61j78j15M13m20K50n2k98M30n9l79M26j15j59K55l37K74j1l24M73
4985B42l68L0J98k32K00Q7k75J80j52k4L65l69j2M57m28L33j85k72M71m64K91
5006G3J57o70M65K97m53L34j11j76L79n77N08j97j86N65k87j29L08m86J32J26
5026G2m78N98j74k71L51l37K56K98n54L55k02j25K70k71K63L37n78K88j67l40
5046d09N52p2q5L45m74K08l8k49L35k34lK43l81J70J14k26L83j40l39M20j70Q8
5068C8R3m10N67j07k39M09l04k2K04m49L38p0j73L88m14J47L24n70L42J4k71J79
5090A4Rk38N46k35k45M55m63L00k92R9Q7j20J65J39m40K67K9l27M80k90k8M18
$$ plain form
4941 -491 190 -36 -62 272 -57 86 94 -304 151 -140 -153 354 -48 38 -33 -242 68 -43 -61 274 -88 -147 133
4964 133 -293 168 -10 -125 288 -132 118 66 -232 198 139 -240 186 71 -88 167 -170 104 93 -231 242
4985 242 -126 -96 102 -130 70 157 -118 62 -90 -114 251 -118 -130 327 -101 232 47 -225 246 -218 73
5006 73 230 -440 25 322 -131 203 92 -84 295 -282 226 29 -157 408 121 -8 300 -186 -54 72
5026 72 -406 192 18 -253 98 -239 17 315 -239 116 -86 -211 59 -212 51 388 -190 98 -69 -409
5046 -409 143 71 -14 331 -143 65 27 -222 113 -121 -124 119 -262 -92 22 -204 179 39 -300 120 -50 38
5068 38 131 -279 288 181 -58 351 47 25 229 -220 118 48 -125 263 -151 -4 320 -250 92 106 -165 14
5090 14 23 -215 331 96 -149 306 -157 143 -149 -50 37 -83 82 221 -219 48 77 -250 230 -60 -88 330
5112C30n00K15j93r2N01n12J89L21n07K13J45k75J79P3l37M16n30K74L28m65L83
5133A56k07q8M53m40K07o8l12L41o4j71M07k72L4K09m78J93J77l19L75j56J10
5154H7R9m47J57K57l67L60j52l5K18j44k9M1l21L04k1k30K52j11rJ85k70R1L30
5177B45n13L88o6k10J90k63M17j95l7K36j70j10J73m07L65J62m18M83l76j93L78
5198G9j87N0L38o90L99l3k23M17k77L09Rm05L81l12L9K16l00K56M5l85M68p3l06
5221a85M38k68j02L07l37J53K47l36k3K79k63M22n23L18J50l98K53k44Q9K50j59
5242F8l6J87o14N81k74P4J35k67J37K52m48K60o5l0J51k00J21J05k04K49j09l54
5264b81M42j39j73L17j55M2N6j59K4J18l1P0k82J04L20p09N95r2k61M25l17J52
$$ plain form
5112 330 -170 45 -148 -240 261 -251 -62 259 -248 -35 110 -165 14 87 -250 166 -364 -90 238 -227 156
5133 156 -51 -139 314 -126 81 13 -299 42 -22 -193 214 -58 -24 185 -293 -100 77 -242 133 -23 87
5154 87 186 -261 -104 153 -214 146 -6 -41 177 33 4 45 -276 28 7 -223 29 -82 -91 94 -176 -85 245
5177 245 -268 120 54 -156 34 -229 188 -7 -44 192 22 -88 85 -322 43 205 -213 270 -106 -299 79
5198 79 -108 -58 280 -410 -11 -44 -267 150 -127 182 191 -214 167 -145 -106 110 -190 66 111 -274 194 121 -185
5221 -185 253 -15 -117 190 -147 6 253 -83 -106 173 -90 332 -191 127 277 -121 132 -112 -23 227 68
5242 68 32 219 -395 186 -88 -14 121 -146 -9 243 -205 55 -10 -40 111 -89 32 137 -67 182 73 -281
5264 -281 161 22 -151 166 11 53 109 -50 -26 92 61 131 -151 -47 273 -436 159 67 -194 231 -86 66
5286F6K33m87K67l9k64L27j35k64L13k40J49J75k58K13k59R6J71k03J77J19m39
5307b82L64j65l5L93k91Jj2l4K39m1j39L63o22L89J60m38L33k42N8J43j69l0J62
5330A05k12J71J23m26M04j07l02L84l33K27J04j79J52j38Q9K58l98O9K50k19Q3
5351A05j41j6R9k76K35mk89M40rk99J51nM7J5k60L02m3m11O65p7k37J95l81K88
5375I4O1l21L00o3KJ35m36N07j24k38K74j98k83M96k30J66m0k68K76j39l3J94
5397A32k00j02L10l18M13k19j31L15k25j79K38k14K71J22n20M49k09K7L78l30
5417HJ49k0m82O35m04q1K32m4l9L3l48K68J66j82K52k45l7L71k79O6K2j31M20
5440C30l56PJ99l56L23Nl78K13J45j42Q3j83K5J42j81J00R7k06L28j77l5K27m03
$$ plain form
5286 66 299 -188 79 40 -224 103 -32 -296 17 -223 -74 101 -157 56 -203 -107 64 -139 38 157 -282
5307 -282 82 -83 -118 275 -16 -15 -27 -61 178 137 -2 361 -261 128 288 -150 183 -59 -1 142 -27 -57 105
5330 105 -107 64 187 -239 165 58 -244 140 -193 34 138 -41 111 -27 62 320 -78 -9 241 22 105
5351 105 -36 -52 47 -229 6 2 -287 153 144 -155 -4 -9 38 53 -207 95 52 -359 306 229 -8 187 -194 94
5375 94 155 -166 134 71 73 208 -228 279 155 -83 191 -7 -290 206 -24 142 102 -166 110 -29 -62 132
5397 132 -68 -170 140 -178 235 16 -115 200 -25 -204 34 -180 91 213 -307 142 -67 -40 338 8
5417 8 157 137 -345 290 -114 -195 37 -7 -46 -13 -361 -93 73 -109 143 -102 -139 232 -47 19 41 -90 330
5440 330 -26 -19 180 -176 147 152 -226 -13 132 -10 73 -110 -85 57 -124 -24 73 -133 195 18 -17 210 -193
5463a93J42J31j70L28k20R1J20l85J65j96J42L07m58K24J22k87O5K69n47O37m19
5484a32O2K75m40J13J64j72L46m2m33N96l93L7J4k97K98L4r1L16m74J95J00j89
5506a13J09K0k34K13N8l42O63m72J62o1l28N80m32K03j2n0N4J36l41L10j16k53
5528b46N86k27k45J76j86J63l8j20M02l25j32K82k03J91j0l40M55nm01K37l12
5549b98K37J91k12M4m5J13Pj19J31j37m3J83o0mJ97k34n4K80m44K53Q2k17K32
5572H3j33O8j5m56O87j17m51L57j07j2K97k53O1J76l79L25r4l09L74k34O8J06
5594D2j69K38J03m45K35j79K26jl89L92K60n19M00k78n3L66k98R7K5j11L60k47
5616E5j75K71k46J33J01l58K18j36M8R6j76J78J02j06n0M4k28L42l00J21J98l29
$$ plain form
5463 -193 -51 80 -90 238 18 109 229 -156 9 -187 -45 262 -196 28 150 -137 -72 197 -350 287 -132
5484 -132 -70 205 -235 -122 42 -130 216 174 -259 337 -56 -19 -5 -302 -4 30 -61 255 -219 -24 76 -113
5506 -113 -4 16 -218 -5 53 -289 374 -98 64 3 -325 255 -177 26 14 -36 18 154 -187 123 7 -246
5528 -246 340 113 -132 44 -142 21 -17 -137 265 -60 -192 90 -113 78 68 -272 183 178 -223 14 -298
5549 -298 -61 130 -82 -38 -83 30 37 -82 49 -88 -131 52 -8 -12 185 -49 -103 177 -267 -14 68 -149 83
5572 83 -50 18 3 -453 234 117 -334 23 -84 -96 201 -52 9 185 -194 131 37 -272 102 -132 -64 42
5594 42 -127 111 214 -231 4 -175 51 50 -339 53 313 -206 194 -84 -137 229 -69 28 53 -58 302 55
5616 55 -120 151 -95 38 139 -219 -1 -137 -89 7 -169 9 111 5 -45 -1 -229 113 -187 -66 132 -197
5638a97L96j08m12M29r0J51j07j08LJ18j72J63p4k09M82n50K87K30m80K83q3k3
5660g1N04m59p6L47l60J23J82m48N79n11J84N4j15N3J4p3K18k9j06R3k64L16k0
5683A35l05L86k57J23J22k41LQ8j74K74k45j56L76k69L8J59k82J94m2r8L12k34
5705i3J50L5k2Q0k74LK16j18J77N2m08O4R5pJ29o5k48M50l82pL13l33K88k4k7
5730D4K38l53k5L82k30M5k0k06K55l17J9L28m41L52n5k25K59k90K44K24l49K66
5752A45L3k50N8R3l18M11l80L70m04j55O79l83L6L80o11L37l0j20K37k33l3L43
5774B05l30J32J19k25L79k06j57J57k9P7J62l57O0M1p8J21J17j26J97l78J95P3
5796A49j97J50j37q1L74k62O6K20l26J70k37M5L17m25J40R0j75K68j68k19K18
$$ plain form
5638 -197 199 91 -321 108 18 169 62 -46 -43 75 -97 66 -8 -217 265 -285 2 232 -248 35 -48 -71
5660 -71 433 -26 -102 245 -115 8 190 -258 321 -190 -6 48 -67 -14 0 -73 145 116 10 103 -161 155 135
5683 135 -170 216 -41 82 204 -37 -34 54 -120 154 -91 -247 129 -140 -102 57 -225 -31 -73 -171 141 -93
5705 -93 57 92 70 150 -124 -121 95 -23 154 206 -202 -138 -43 -50 79 14 -234 216 -166 -173 140 -193 95 71 44
5730 44 282 -71 -96 286 56 101 81 -125 130 -187 -168 160 -281 71 16 -209 50 -240 4 228 -121 145
5752 145 178 -72 -14 79 -239 172 -208 162 -242 -397 282 -101 -65 315 -296 41 11 -109 128 -105 -138 205
5774 205 -125 7 126 -99 280 74 -83 74 45 122 284 -73 -13 28 -50 71 188 62 259 -119 76 149
5796 149 -48 102 -35 -116 258 -4 62 282 -44 126 -111 -66 251 -174 -34 56 -119 149 -19 -238 -20
5817b0L4j29Q9k17K40J6Q0j65o3J28K04l02R0L6j76K34m8j68M43m94L28j5l45
5840b20N67k79k48K19j50Q5l9k09L13R4j91K66k79P0L03n64J14J91r5QOj2K18
5863A68k41J88j71k0J10J74k64J12n1N1K01m08K53m9j06J38j42RJ9k12K65K89
5885C13n76K26j19J72K7j10P1L2o2M7j2r2m6l3J12J78k85N99l68k17J86j25K8
5908e4Ko5J24k2p2L24k31j30K40l34K03k3Q5P3j35M3p5M4J19O2k96L33k14k2J05
5933H4k90L37j24m1L46l87pO5Q4p5k8k80L33j02j7K44j03r7J19r3R9k12P5L22
5957B52l21J6J29j35j05J97j13M3L9k77N14m27K46J9n5J38m2j18J20j90n9M05
5979B76l38J79j11J24mk01n6K54j43o4J30k27K69l6l31M60l74K09R2j57J02q3
$$ plain form
5817 -20 14 -115 -26 -243 -3 13 93 -72 -135 -7 197 -105 -15 21 -155 79 31 -137 306 -188 140 125 -220
5840 -220 347 68 -180 39 -111 -26 -65 -274 39 133 -58 208 -71 -1 302 -262 -148 43 -52 -44 -38 -50 168
5863 168 -73 115 -56 -76 34 208 -56 56 5 56 257 -151 102 53 -53 85 -57 -48 -29 -241 24 313
5885 313 -263 -37 -156 16 43 -67 4 36 -26 21 9 -83 -129 -162 -50 128 -157 442 74 -143 43 -82 -54
5908 -54 -52 -117 7 -15 -87 237 6 -124 116 -218 -15 -38 47 120 -15 28 -47 -3 116 178 -118 215 1 -21 84
5933 84 -206 131 7 -34 312 -75 -82 -17 67 -8 -36 -316 17 -85 -102 142 39 -58 61 -32 67 -145 -70 252
5957 252 -69 -53 76 -59 -164 33 -80 -37 2 -275 239 -188 58 77 22 160 118 0 120 -70 -129 276
5979 276 -62 117 6 130 126 -75 -131 123 -20 -84 46 -181 88 52 -279 181 -193 16 108 -49 53 -30
6001c0o1J61L1p1J68l45K10j39n9K73j57j60L05k18J92j50j89J84j16K1K04k75
6023b21K87j7j53J42k18J76J74j99J53Nj47K40j80j23J89l53K16L09m07K91o3
6044A01j49J97j88l5J78j74K64L6l41K24l3OJ26n81K17J35L9j6j68J33K61k94
6066f2J00n8m10N59j49j41K25k71K35n0N2J4j13j66L98k08K45pk10O3Q7j91J89
6089A31j26Q0M2l66Q9K8O0N8r8J54N9k96K99j78J1L20k70lQ0n3J00j37Q9J17j0
6114A80m22J79j0K25j2j33K40m0k92L00o3p9j3l1J91j82o4m3r7N4L15l27K68j94
6138e0O0M4j7J0Kj05nr4J73J44p5r3P1q2J29L3j98J02M9L3l9k66m2K41k30K62
6164E7qj70L87m52J52J40j48K34j75j55L27k07o2Q9j55K07m8j18L55k33k10M55
$$ plain form
6001 -30 -91 70 101 30 198 -147 63 -76 -135 138 -19 -179 126 -92 100 -50 -239 -55 -171 -150 54 -221
6023 -221 66 49 -104 38 -180 -4 170 -29 124 129 -18 222 42 -81 108 -245 -29 280 -127 164 101
6044 101 -48 149 -39 -74 104 -70 194 230 -111 113 80 86 212 -369 -152 -17 22 6 -162 -29 232 -62
6066 -62 38 -20 -430 129 -20 -161 64 -207 28 -22 30 44 -69 -235 163 -45 200 193 -17 46 133 -58 131
6089 131 5 85 127 -239 -150 -122 -62 -4 -102 52 111 -185 114 -64 -53 267 -3 -6 74 21 121 -16 73 190 180
6114 180 -242 -63 -73 152 140 7 247 207 -85 215 152 73 60 29 220 38 -26 -69 -166 -112 203 -124 144 -50
6138 -50 10 54 37 47 49 -56 -61 -155 18 162 87 -6 65 -17 112 145 -53 49 98 131 92 -174 -216 25 -205 57
6164 57 49 -121 266 -186 -34 106 -42 192 17 -138 189 -18 -80 9 -146 61 13 -105 250 17 -193 262
6186B62j08l07l8P8M4J9mJ19j41L1J49l15L32p4j57K72k81j38M14l66L22Q4l57
6209a60L30l8j53Q7k09L12om21M32l00J09L25l58P9J90l53M86l14l28L27k69J13
6231a19K95m15M95j40l95K25K17k8j62j58L00j83J69j5J00j49Q6k83O8J44k44
6252a92K39j61J19J22k24p6J01qJ46J1k33J17j2q8K28k23J71j38O8J31k41J02
6274d1J35k28J80J18l71K80O6l48L91l11J24J05j40J21j83J21J71k69r9M32l20
6295f6L76l95L7K25nl00M38l91M8j12k86M92j75k8Q9k6L2j6k80M88k05OK22k18
6319e0K03j35j02J99j13j48L26k71J76M5k75L32j46k03J56m2M0J16M7Q9k90rJ71
6342A16j99n4K22j80K79m8k99J47K4q7J36q1Qn4J08j1M2j11J15k81J84J08l30
$$ plain form
6186 262 154 -153 -191 -113 -69 -50 -54 65 -76 -45 104 -211 121 47 -110 162 -119 -257 157 -209 113 197 -160
6209 -160 170 132 -21 66 -143 169 163 -258 174 -126 -17 308 -50 29 219 -134 352 38 -290 37 -232 -119
6231 -119 176 -239 256 116 -279 -54 163 135 -27 -185 115 -68 101 86 186 37 123 -160 -92 52 -192
6252 -192 47 -114 5 127 -97 -173 -72 -80 66 77 -156 -39 -51 -139 89 -134 37 -101 -33 98 -143 -41
6274 -41 94 -134 46 164 -207 73 139 -209 182 -129 -5 100 -40 81 -102 19 190 -79 -178 254 -66
6295 -66 310 -85 -48 177 172 -128 310 -81 -33 -145 -431 61 -114 -142 -53 -79 -47 -63 -343 145 -60 -54 168 -50
6319 -50 153 18 -84 115 2 -146 180 -91 85 130 -145 187 41 -162 -6 -48 -8 108 155 244 -46 -55 116
6342 116 -83 -137 85 -95 184 136 -163 -16 8 -79 57 -24 -16 -70 38 27 69 -42 73 -208 -24 84 -246
6365b46J86Q7j63K81k56j18K81j45L07k16L2n9K6p1J75j90P5j07k4Q3nJ58R0k35
6389e4R8j57j4L82j02j86K60l84K0J79k86M80j92j13m8o6L5K91j93j01J02k0R4
6412B5k23L24q7j96M70k68j49M2n1R5P4o3J96j80p0J46j94K5K41l43K76l7j28
6435g5J16K8k36L50r6j54J14qo9J2r9K84j87N4K06l93J54k18O7J79j66kL62j15
6459A08K3N5m53K60JM2pj81J70n9J58N1j05j39K25k28R9J88k34K93k19j23R5N
6483B5j17M10o30K77J28k7n5r1p8L04k84K89j5m0j3j26p4L52k59q6J44k34J50
6506e0J98k86J40k5k43M59m25P1K07k45J18O3j61M31k54K1n9KJ28p6j72J67Q8
6529I7j6n2M1N7j21o1K54k07l11K99K3j6j38N9L25k04n8J37j94K22o2l0J11k10
$$ plain form
6365 -246 -60 27 -136 145 -111 -229 52 -93 214 -2 30 -29 -3 -74 101 -89 -14 -121 -145 -62 -67 91 181 -54
6389 -54 44 -113 -127 255 153 -33 227 -157 -137 42 -244 236 44 -69 -117 -183 -148 143 -50 -151 -49 -69 25
6412 25 -198 126 39 -157 313 45 -104 -62 -113 -18 56 -7 189 9 -61 85 -109 -84 157 -186 90 53 -75
6435 -75 41 69 -167 183 87 -67 47 39 -30 -18 -117 167 -20 34 240 -153 1 -217 -150 29 -137 -139 223 108
6459 108 131 186 -267 -7 -6 36 29 -152 18 -41 117 168 63 -76 149 -79 20 208 -26 267 48 -75 20 25
6483 25 -92 318 -312 -35 93 66 11 -80 -158 146 -138 151 136 96 83 -43 -117 235 -24 -110 34 -200 -50
6506 -50 148 -138 2 -23 -266 193 -232 -161 46 -199 -81 -18 -179 252 -2 19 -40 -38 90 14 -158 9 97
6529 97 81 29 70 127 6 -55 199 -8 -319 -20 3 -13 -151 -92 233 29 -29 108 -86 136 74 44 155 -55
6553e5J44J21n35K96J89l83M21k16j37M21l81J18n2j94K72m9j16L52k55L9K08
6574B08l53J40n1M5N8j19j02K43j05N2n4j1J81k59J13l2j30J72q6J68j43J09L6
6597H0n5n5J45j8k05K16o2%Q3q2O1j8q8jj0r4M15k85Q3j74j3K41j23j07J95j52
6623b3k55K55J12Ro1k38K82O2j49J28j78L9K23k03J79k53o5J42j91j4L51k18J49
6646H3j57k5J47q3Q2l4m2K9K3o7J94l6j50J43m95M28o1j02J48n9r0J99k99J99
6670b5m5O1J32k80J46K0P6p9P6k96R6K32j49K23k63j2J90l60N27j70j18R0k9j44
6694a01K52j02q2R3j32L11m89K25J17k01J30n4j17J25Q6l21L36k17k9J99m2K3
6716A0j70J78o0n6j0K01k55J59m9J76j65J7J6K36k44k6l7k3K31j01o9K98m15J15
$$ plain form
6553 -55 89 210 -325 -29 160 -223 198 -18 -155 266 -115 3 -49 -243 29 -20 -136 216 -39 0 208
6574 208 -145 -5 -56 -11 47 -72 -174 69 -36 16 -38 -49 132 -127 -14 -46 -176 -4 -90 78 -65 44 80
6597 80 25 -30 115 97 -108 108 46 46 129 47 108 90 2 1 -9 -103 312 27 110 -64 -77 164 41 -66 129 -23
6623 -23 -278 -23 89 98 37 -201 81 143 -6 122 -56 -17 206 3 182 -71 -136 6 -185 -199 152 -66 83
6646 83 -74 -99 48 -35 47 13 -29 0 23 -44 150 114 -36 107 -388 40 -21 -123 25 -34 -124 75 -224 -25
6670 -25 -70 -9 123 -157 -11 9 85 6 82 -214 -118 114 -35 188 -75 -87 103 -257 270 100 -18 72 43 -101
6694 -101 151 49 -33 60 -72 239 -250 -25 92 -109 21 -33 -150 -25 61 -260 76 -141 -170 29 -13 10
6716 10 -160 18 -42 -98 -108 93 -162 -3 -52 124 -41 -24 -8 228 -16 -42 -79 -102 129 28 -41 257 -158 -43
6740d3P0k43L06k60J63p1m7J60j14j46K42J5j53K73j55O3L44n12J96k5k72K03
6762fl31M37O1l86K66J21k62J71p5l88N27k36J73J6q5K2Ok16J64j09J02R7j24
6785e5P3k6q0L03j80k2Q1j49J87j5j34L15j33J16l09n9J16r8R8m6N3q7J35j44
6809f0J60j19j37J91j87J91j6k76K61J00l88L20j73K69j48j2J1Jn8o8K35j22R2
6832F7j52R7Q7k30L23j27k91L33k07J54R0j02o1j3J25n9L7k4Ok75K6J70q3J45
6856C6Q0l52K20O5j88M46n24L16j02l2J03N5p3N3k2J35j45j96J11Q8j56Q6K21
6879B25k21l4j17J70L7p0J63j89Q6m4k03J90q5n6J76J12j53L08m19J34p4Q3N4
6902G3j37O6R6j83nJ99m28N26k05l7o3M4q5P4J40p9M1n2J15l05j4J54n5K43k07
$$ plain form
6740 -43 27 -216 90 -170 -7 -78 -125 35 -79 -225 17 32 -121 152 -3 60 404 -108 88 63 -209 -6
6762 -6 -337 100 161 -225 41 162 -100 71 -4 -392 135 -101 72 88 3 25 31 -185 -21 -130 -28 69 -55
6785 -55 18 -8 -88 215 35 13 94 -55 132 117 -17 298 165 281 -28 -87 29 -69 29 -17 36 -51 84 -60
6809 -60 100 -19 -156 35 -152 39 23 -253 8 108 -280 40 -133 136 -12 -24 -13 -12 -70 -138 97 -25 67
6832 67 -85 12 99 -131 192 65 -226 107 -100 54 144 42 -19 -32 93 34 71 47 53 -222 -196 -26 -109 36
6856 36 116 -236 -16 49 -139 307 -217 99 -3 -35 68 123 50 103 81 216 71 -125 -14 74 -82 4 225
6879 225 4 -30 -147 23 60 -10 153 -36 50 6 -197 -7 -92 -148 28 140 -13 295 -124 10 -64 19 73
6902 73 -64 2 98 -85 -90 109 -319 207 2 -35 -98 -54 -139 -65 75 -4 37 -15 100 -205 -219 -65 -120 123 -84
6927h4J22O4m06K82J03J7l5p7N9R8j83K60r2l22K42k3j23J16J25l23K00O2j11
6950b9J52m15L21J36k29K10k59J78N4k85K83o2L5nk07Q5r1P6J08j50lM1L8J4K17
6975B13p4k27m2o4J96n2J52l8j88Q5P1j76J09J65m6N4Pk26K70j40Jj09n9K61l57
7000b14K64j14K0K22j68l8L8k28K05k1k4J78m3m29L70j38%J98j74k8K12M0K7p9
7024G6j8j75L6J0J35m4K3j45r7J81r0L6K8k93L64K52n13K61j93J23P0l65L57J36
7048A55n17M88j70J04P9j70qJ33j82P2N0m6j24k5K42J74l29K77r4j93N0p8o2L20
7072A46l78m9K75q8L54m00M4j3j1J95n5o0Q2j15O3rk00P2K79k11J17Oj15j2N6
7097b7j38K08n1r2J47j90K56k65K18l5k9j45K41k57J33k34L13O4l61L24nj8n4
$$ plain form
6927 -84 38 102 -304 -22 81 98 63 -14 45 143 -40 220 128 -194 48 25 -98 18 143 -180 20 82 -29
6950 -29 123 -292 29 165 -64 146 -113 65 119 -166 117 55 90 85 -122 -37 -128 -52 56 -94 -97 -56 -18 -4 213
6975 213 139 -88 -130 -194 2 -50 102 64 -124 -39 32 -144 -35 130 84 138 145 -81 189 49 50 -59 -118 143 -214
7000 -214 50 -64 -44 178 10 -28 10 -218 -13 -34 -58 120 77 -352 18 -120 -120 78 -96 -124 88 128 155 76
7024 76 58 -117 -81 -71 64 20 43 -102 -199 -18 -108 -72 -44 -337 27 279 -234 27 -166 -43 27 -338 19 155
7048 155 -362 126 -44 60 139 -31 -39 94 -88 -16 34 -12 -136 -161 81 255 -74 203 109 -84 -34 -112 -174 146
7072 146 -232 -281 -6 -94 260 -140 -96 -109 -120 75 20 -40 42 -73 -10 -19 -219 -147 132 -79 38 44 -71 -83 -27
7097 -27 -165 43 -8 -100 47 -143 113 -152 66 31 2 -143 98 -159 -26 -260 53 117 -244 80 75 57 3
7120CMM4P9k81l4K41l32L47p1J10O6k73K03q6l7J76k10R5J7k45J75N7j86N9L36
7145B57n24K52K3Mj0j19L27j52j69K08j40l14M67j17m7K27l23J27r5q1J79k6J13
7168F7k5j91J82oj40K16L3k31J68k2jR3m36L01l5P9kk6k65K86j90K66J02m09M27
7193B41l82jR8p8K29M5k25R3k0R4o4j79K75l03N0K07k84L89l01J28R0J0k09K91
7217A94k35J08j39J89j61O5q6r8rJ36K21j57j16J33j45K73k67M7L25m01M89l10
7239E6n0J29j99O2K20k14j23K27r5R0j75q8J17NJ5p2J38j21K49k18J2j07J81j17
7263g8mK9L36k60j41J09k7J80k92J47K5j27J24j38R1m6J27p1q1J18J29J47l53
7286e6J44M9k02J86j11J4L3k21K35k04Q9L06k56R8Kq6K1%l5J12r9N9J12k65L2
$$ plain form
7120 3 7 51 130 -151 -185 56 -276 71 0 110 176 -97 106 20 -17 159 -51 44 61 -184 -9 48 -138 -79 257
7145 257 -267 -15 8 12 2 -117 210 58 -111 97 -43 -357 110 -7 -54 173 -150 -23 -118 -199 -20 -46 67
7168 67 42 -149 33 27 -113 103 136 -95 73 51 50 143 -293 8 -27 52 50 24 -241 45 -145 121 223 -186 241
7193 241 -141 -142 -44 -122 107 152 -73 20 0 94 30 -149 126 -177 -127 80 -204 185 -116 12 102 112 -97 194
7217 194 -41 67 -72 117 -44 21 -65 -163 -172 -36 185 28 -88 45 -100 173 -94 -47 278 -123 366 56
7239 56 6 135 -64 -2 218 4 -119 108 13 103 -72 -160 -43 -38 -23 -95 43 -78 171 -47 -35 -142 39 -78
7263 -78 -82 -53 283 23 -118 -9 -36 144 -148 -1 24 -103 21 -117 -26 -72 55 -16 -97 21 150 297 -56
7286 -56 88 137 -65 121 10 24 57 -164 71 -133 -44 262 6 104 106 20 41 41 6 118 19 78 190 -75 -43
7311d3Q9k71K56j51Q8lp8R7o8M9J70l54K24L0j67K40L3k32K47k75K26j31N2J69
7335A97k84J27J7R6j54N11m26K9p4r7j75L13J28Kr3r2K14k10rJ7o6O8k19J36K18
7360A74j50M3p0l9K9J70j49mj41J93J12m37K03rJ61K44m80K34m6m3q5Q5k30L05
7384G0j46J9K29k15J02p9K08l24Q2q9Q7K00q2n0k57K77j44K6J60p0K8k6k8P4l2
7409B0r5K8lR0R8l06J96j25j6J61jr2Q6P9k10J17k99J95K01j10L0k18J78l6R7
7434F5nj25J00q0p6J50j30j1J01QP0n8r7J56J6J52r4j21j15J09j0Q2j20%R9K6
7460I2Q5k06K50k51J1j55J93q1M1Q1M5J07j33j04J1K31l74K64N3k45J23JOj40
7484i5K80k12n1J44j3q9P6m2j32J83O0l28K10M1M6j52p7O9J53l24J88L0k49L09
$$ plain form
7311 -43 46 -225 31 -120 -32 -35 -113 -16 -84 -35 135 -219 5 35 -132 108 141 -91 156 -119 107 -24 28 197
7335 197 -87 40 57 153 -1 510 84 113 39 -58 -233 80 208 210 117 25 239 29 20 37 -29 39 -180 -44 174
7360 174 24 67 -3 -42 -13 157 8 4 -137 56 168 -269 -66 -75 86 330 -150 84 38 -5 -90 -5 -235 70
7384 70 -76 -57 172 -43 59 -20 188 -136 -54 -143 -56 144 62 12 -245 32 -112 -86 74 4 32 6 -22 52 20
7409 20 -75 -47 -50 40 138 -168 28 -97 -113 48 47 -45 41 120 -90 27 -272 -77 124 14 44 -174 4 -32 65
7434 65 60 -65 35 -45 -121 29 -101 -112 -11 -3 67 9 -88 68 84 236 142 21 -94 15 5 87 -33 -33 66 92
7460 92 177 -29 221 -30 -19 -174 19 -62 -21 60 105 212 79 -25 -14 217 -157 107 160 -85 38 39 45 -95
7484 -95 185 -27 -78 66 53 -36 40 -2 -134 49 109 -219 -9 32 78 -74 -151 -82 71 -253 -65 -35 -284 25
7508B5J9K6P7Jj92K42j75P5k3j84K75l19J78Q1k55K40m0k9lp6N4k6j62L80l13
7533a24Q2N2O0j3j37K19J5j93l05N06q5k26K23j80K48k72J18r7J64j70J89n1j66
7556a43K80k82J54k16K19JP7k02O7p9J42j08J62K33l23J22o1j37N0J01p1o3j29
7579b06K57J4j72J18o8J40L3o5j57J12q1J67N0J2k87J47M0R9k97J61j43J64n6
7602a8Q4j30K67k75J49j83M9r9K01q0O4r8J28J23m04L46k20rJ40mJ52p1j67L53
7626B98j79M9k68O1n8M8J74P8M9l89K20o6o5O9J37j28O4j40KJ7P3m6o5J23r5J33
7652I6j88J94j12J29j82n9j3K30k54J08p3J82k38J09N8J2N8j34j88K98k4O4n7
7675A6J10J48l90L5J57N6k56J38o4K01j03j80J66o5j3j9K73j70J15j4j07K2j34
$$ plain form
7508 25 44 70 147 148 -44 198 23 98 75 -109 166 -153 25 106 -149 91 51 22 19 -57 -3 -29 -191 189 -124
7533 -124 -42 10 70 57 -80 139 154 -39 -344 162 77 -149 74 -106 142 -130 -12 -109 55 -115 74 23 -143
7556 -143 137 -145 9 -207 12 13 90 -112 -45 -124 18 -90 72 305 -18 104 43 -94 -44 57 -14 -77 -206
7579 -206 51 65 -107 11 -57 83 116 51 -106 6 -75 92 142 154 -133 14 54 153 -144 17 -126 38 -18
7602 -18 66 -64 203 -72 77 -106 -57 -156 45 -35 29 -69 59 182 -222 124 -96 -105 35 31 183 112 -55 298
7626 298 119 168 -100 -39 -97 -49 125 203 252 -137 83 17 -48 21 158 30 94 -46 -44 -27 46 0 -65 58 -37 96
7652 96 -92 102 -10 119 -63 -122 -135 95 -159 -51 -124 58 -180 -71 -13 -1 57 -77 -265 33 9 73 16
7675 16 126 274 -116 -81 76 132 -124 14 -50 151 48 -132 34 -31 -44 -63 210 40 155 141 34 56 -78
7698g8j1QJ86j49J45l2m3l52K63M0r0k6j5J60l5n4J38k58K06J25j36jp6j48L54
7723A21k10P6J68j92k0P2m6K70k95K9L8k07K41l2k24P1L43p2o7j74r0K63p3L30
7747C20j44k68K32k10J35j0r0J24j94J49j17L09l27J51R6j97J05j20N2m6K4m5
7769g1j87J88j31K61p1j71K5N2M2k68L04k2K82j80k62P5J96K6J7j9j29M2J24M6
7793A69m0j15L9j41j47M45l72K69j14J3M5n3k4R9j09J57k1J5R5l06q3L05o0l6
7817C0J13j45M0R6k17K0k1K6J06j51K8L1J5R5k02K07j1j13K4K08j98j0j64r9K76
7842a6j7l4J16k0K6l09J92M24k55j09J31k29J27kj18L25k57j83J93m2J62J47k60
7865hM2J52j61r0J8r4M1R3P9kj77J04j35M01k85J42k97K01j05k0J82j92J59o4
$$ plain form
7698 -78 -89 -81 105 -44 101 69 26 -326 -63 -23 -113 -139 -154 6 -29 -83 55 -203 3 128 -8 -9 -85 -233 121
7723 121 -89 -13 155 -37 -57 15 -31 239 -56 -27 11 -196 45 13 -211 -140 203 131 64 -110 -200 63 -10 320
7747 320 176 -92 140 -70 65 55 -35 89 -105 44 -73 236 -91 60 156 -41 64 -56 -4 -50 -26 -71
7769 -71 -258 -70 -201 60 -11 -182 -157 -105 -63 -331 -27 -49 233 53 -209 -134 62 88 105 86 -43 -1 123 169
7793 169 129 14 53 -88 -235 210 -162 107 -7 6 51 -2 -26 73 -36 121 100 115 210 -96 -179 126 66 30
7817 30 143 -2 38 134 -83 -63 -84 -58 48 -103 -75 -44 -29 66 -136 71 60 -53 -29 179 -19 -29 -193 -292 -16
7842 -16 -33 -67 49 29 55 -254 -62 362 107 -2 129 -100 27 25 -93 232 -25 -208 -15 -57 105 252 -8
7865 -8 34 186 25 -65 -47 -141 -100 -7 72 70 -107 -3 -138 263 -22 120 -177 24 -81 -101 81 -111 48 -16
7889a6n2M5k92L42n9k61M28k06J30j8p0N5R0j48K8L5RJ2q6PR7l10R8m2J63P4r7
7916d4j4N5p3M1Lj8L6l6p7oJ80K22m07J42rJ0K4J94k39J92j25r5loJ59j18ln1
7944f6J84j50J01o6O0p6l3j1N4J07j20K24k08l1k5M9J13k15Q8l5K80j74nJ98k38
7969EM3q6J20j23OqJ84k62K07m4J20m7k06K2J69J17k67K23k11MK11k79J62J31
7993A91l48K66j54K67j33k57K01l1l5K4KKO7r9Q2M8k69P1J36J8o6J45p2j13LL0
8019b4j3j21QJ50Q7k12l3J87J05j81J73l10J23j14K58j20mk82J92J75L6k02P7
8042d5K5k2J02P3r2j77L84l78K32J13l05N2m1J39j31j16K35l4J15j38M2j92J36
8065b3L6k7J6%O2Q1j25l2M4k7J86j23j20O0j6J53k08J63j48j09R5J18j38K49n2
$$ plain form
7889 -16 -68 -23 -315 27 -32 -293 135 -71 59 41 -29 26 116 -32 -4 31 40 52 -34 -27 70 -240 -142 -184 -21 53 -44
7916 -44 -58 -3 -76 -35 -32 -50 -14 -50 -127 -133 47 269 -138 4 -5 5 29 223 -16 176 51 -44 -47 -53 106 -12 -15 -66
7944 -66 118 -32 69 3 63 -13 -46 -57 -3 104 -16 208 0 -31 -56 -7 106 -109 -21 -56 224 50 45 243 5
7969 5 48 -38 82 -41 -35 -43 141 -121 86 42 162 115 -91 -69 100 217 -50 173 -38 -34 177 -102 60 191
7993 191 -157 109 -45 222 89 -168 33 2 -33 -9 -7 -5 62 -37 45 93 -176 -105 31 49 -17 128 56 -57 -54 -24
8019 -24 -37 -158 -150 0 87 -125 -158 29 134 -47 126 -184 -61 -175 83 -37 -41 -323 -131 44 80 -122 -45
8042 -45 -20 -42 60 133 41 -136 248 -130 102 215 -90 -38 -79 60 -71 -187 48 14 129 -9 33 -159 -23
8065 -23 13 -14 2 2 64 145 20 -12 32 5 191 68 -52 8 -8 145 -63 100 -48 -157 -62 56 -82 167 115
8090A15k70J79J19m6L1m8k69LJ06Mj25K2O9L3q9P9nK68k44J53j38O7J13j20r7
8115i0j42L00p1K88l73J85O1j00Nk8j55K10n6P5p2k84N6L5R2n8J79J3J01l82J73
8140c8K08k01K07j63j95L44j34J2m5k01L39j02J5Pj80J89k0k40L21J0k18J3J10
8163C8j72J31O4J08k86N8J00j34l6J16j39L5L49l61r4M25k21J65j52k9L93l86
8185b8O1O7q0J22j74P
$$ plain form
8090 115 -155 24 143 97 128 80 -189 -186 -80 -76 -201 -179 -110 -77 -166 -87 -92 176 -68 85 -53 14 127 7 -90
8115 -90 -232 68 -3 285 -88 97 158 58 63 35 -120 90 34 109 37 -247 -191 -156 -64 -122 57 70 171 -211 -38
8140 -38 170 -31 176 13 -182 162 28 40 -5 -206 133 31 46 53 -127 62 42 -198 123 133 -85 -72 38
8163 38 -134 -3 61 169 -117 -59 41 -93 -129 -13 -152 -117 232 -129 -223 202 -19 146 -6 -35 358 -28
8185 -28 33 100 20 142 -32 -25
8191b5
$$ Imaginary data points
##PAGE= N=2
##DATA TABLE= (X++(I..I)), XYDATA
0@%%%%%%%%%%%qJ6j6J6j6K4l2M0m8N6p1Q0r0J09j31J52j76K03k32K67l06L47l93
34b09M46n03N65o33P07p91Q81r81J092j209J338j479J632j800J985k188K410k655
52a392K926l227L563l939M365m853N417o077O864p816Q997j0514J2539j5393J9759
67A1219k7337M4199j51782N2314K28313j21229m9809N2367J18158q9435j57091
78i0113j1306K1651K270Q7056K2737J5147J7607J4262J503j14118q9704P3210
90d9798J0266q220N3058M5881M0165k0533m3991j4523q7169j4625P2826k0948
102c7611q652P8461P8039p948j22285j4862O7290q0354o5299N8336O8040M0823
114E3978k0107J3880L1448p9819m0671J3247m4365Q705O0544M7451J087l7788
$$ plain form
0 0 0 0 0 0 0 0 0 0 0 0 0 -8 8 -8 8 -8 16 -16 24 -24 32 -39 41 -49 60 -71 81 -95 108 -124 143 -163 184 -209
34 -209 237 -266 299 -334 373 -418 463 -518 574 -635 703 -776 856 -944 1041 -1147 1263 -1392
52 -1392 1534 -1693 1870 -2069 2296 -2557 2860 -3217 3647 -4169 4828 -5686 6853 -8540 11219
67 11219 -16118 28081 -123701 -71387 156926 35697 -14112 38255 156413 66978 -90113
78 -90113 -101419 -79768 -77498 9558 32295 47442 65049 79311 80814 -33304 -123008 -49798
90 -49798 -39532 -47752 5306 51187 91352 70819 26828 12305 -74864 -89489 -16663 -37611
102 -37611 -46263 32198 110237 102289 -19996 -34858 32432 -47922 -113221 -54885 13155 53978
114 53978 33871 47751 79199 -620 -41291 -28044 -72409 -63704 -3160 44291 45378 7590
126G590O2082K3869j49570n8076Q1807M8782l0015m9648Q5349J03073o3658o8670
138g085k0839j8211K3615p001j1095K4605K8218P2294k995r6656j0044J5213j7779
151b7760j2471j3119M8514M2188m957L3680k8892p3060J7293J5524k9344l4998
163f7402K7066J11223j198q5253K6789L6796l5626o5358k9705P0126L3210k8448
175g780L0695J3779p461M690m2046l0009r184J0512N0784j2490r110N9402k995
188D8787l9426k2368j1112J2631l0834k845P1343M721j5507J5456j1267q402k9691
201a8514k1225K1706j4655J7247N6554j0650j5159k817l919L487m8011j5397M1937
214i416K226J9931K2854k0250J38n715n763j2272m9815K4723N6827j5132m659
$$ plain form
126 7590 69672 93541 -56029 -114105 -32298 16484 -13531 -63179 22170 125243 61585 -7085
138 -7085 -27924 -46135 -22520 -29521 -40616 -16011 12207 84501 81506 -15150 -25194 -9981 -27760
151 -27760 -40231 -53350 -4836 37352 32395 66075 37183 -35877 -18584 -3060 -32404 -67402
163 -67402 -40336 70887 69689 -15564 11225 48021 12395 -52963 -82668 -12542 20668 -7780
175 -7780 22915 36694 29233 33923 -8123 -38132 -47316 -36804 13980 1490 -7620 51782 48787
188 48787 9361 -13007 -24119 -11488 -42322 -45167 26176 30897 15390 30846 19579 11177 -18514
201 -18514 -39739 -18033 -32688 -15441 41113 30463 15304 12487 8568 12055 -35956 -51353 -9416
214 -9416 -7190 12741 35595 15345 15483 9768 4005 -8267 -58082 -33359 23468 8336 3677
227C677J4293J5287j903n6050o802K7912k0435O300J8632J0209K6528j5615j5366
240F667m272k9757J4503N784k6429K6657K6982J0402l727l2781J0817J82l8751
253c3723J3472J1258j832K2345L985J4464p476l8015J2648k259k4515J4975O743
266g930J6171J3535j3893J7217j0369l5116R237n404j228J6505l869J9582O493
279B0931j0843J3105k8363k5135K1391M8J572J678L676L4908j1278k5786J0033
292E937j5576p464M487m875K4818J880n974K1966j4840j1619J821k2346N877P572
306h336L345K1572j3267K055K1491k3639j1923l932p896J8410m282M908K2287
319B0793j5789L959O600k2539j726r442K636K2616j1008Q259J6644j5870L546
$$ plain form
227 3677 17970 33257 31354 -24696 -31498 -3586 -24021 -17721 911 11120 37648 22033 6667
240 6667 2395 -27362 -12859 -7075 -33504 -6847 20135 30537 26810 -5971 4846 5028 -33723
253 -33723 -20251 -8993 -10825 11520 15505 29969 22493 -15522 -2874 -5133 -29648 -14673 -7930
266 -7930 8241 21776 7883 25100 14731 -20385 -11148 -16552 -17780 -1275 -5144 14438 20931
279 20931 10088 23193 -5170 -30305 -8914 -8866 -7294 -5616 -1940 32968 21690 -4096 5937
292 5937 -9639 -17103 -12616 -17491 7327 9207 3233 25199 10359 -1260 561 -21785 -15908 -8336
306 -8336 -4991 16581 3314 5369 26860 3221 -8702 -12634 -20530 -2120 -6402 -1494 20793
319 20793 5004 8963 15563 -6976 -8702 -18144 -15508 7108 -3900 4359 21003 5133 8679
332H679p618j3549P581j3625Q999K0340j0259J2772J764j6644P468j1317n783
345a1192L984j2771K2806J4187j4857Q794n450m363M011k2146M358J0236p547
358i950J9882J027p102R754j4997r78N45j7266J5210L037n116K0700n557l149
372F040J836j7841Q838l644j2690J8826j683K510J4062j3205L421m694j6822J4112
386i34m855m399J4293o010J1714O043j7316M589r628o239J6578j1773J843J2217
400F123m316J4038p212j6459P941r642L703R947j5340J0736J0063k747P766j9719
414e118n508J4911j1728K707J223l508K1084n429q518P264j4094L903L414j4447
428a3844J2547K225P68J2926j5702J056P675j5288M587m168l135K0161p458j571
$$ plain form
332 8679 1061 -12488 -4907 -18532 -9533 10807 548 13320 15084 -1560 5908 -5409 -11192
345 -11192 -7208 -19979 2827 17014 2157 10951 5501 1138 5149 -16997 -12639 -2403 -9950
358 -9950 9932 10959 3857 13611 -1386 -2364 -1819 -19085 -3875 -838 -5954 14746 9189 6040
372 6040 7876 -9965 -1127 -4771 -17461 1365 -318 2192 16254 3049 6470 1776 -15046 -934
386 -934 -5789 -10188 4105 -1905 9809 15852 -1464 3125 -6503 -12742 3836 -7937 -6094 6123
400 6123 1807 15845 8633 -7826 115 -9527 -5824 4123 -11217 -481 9582 6835 14601 -5118
414 -5118 -10626 4285 -7443 -4736 -3513 -7021 14063 8634 116 7380 -6714 -2811 603 -13844
428 -13844 -1297 928 1696 14622 -1080 -24 7651 -7637 -3050 -7218 -10353 9808 2350 779
442G79Q473j1014P143m919j3771J2971n347J806J3727r734O045p25j1527J2775
456F682q734j0887J0452k305J2142K301j5910J2300j347q399P080j3003J370R513
470A255l518J4885o991j5864J5508K80l671p432j5541K4306J2499j7420L14j795
484c185J0040P729k5752j05J0179j311J1167j0099m295J5584p905J800k226j7041
498a5420J3230N897l216L454j3539J2926J5580k0914o509J03P487J3514k0914
511h321l109K0988l108M08q776p866J5021p842k722J0505j1805O733Q597o495
525B208L409j3097n37J7005j2453k005N894k410J1973p480p238J1620j1685j289
539f085Q936o255P069o161l197J9578q921j1122K321k653J5198n958j7552J6928
$$ plain form
442 779 9252 -1762 5381 462 -13309 -338 -5685 -3879 9848 114 6159 5434 -6093 6682
456 6682 -2052 -12939 -2487 -4792 7350 9651 -6259 6041 4694 -3705 3375 -9628 -8258 1255
470 1255 -2263 12622 5631 -10233 5275 5555 1884 -5548 -21089 3217 15716 -1704 -1390 -3185
484 -3185 6855 14584 -11168 -11273 -1094 -2405 8762 -1337 -5632 9952 2047 3847 1621 -15420
498 -15420 -2190 3707 491 3945 -9594 3332 18912 -2002 -8511 -8408 -921 12593 -8321
511 -8321 -11430 9558 6450 6858 -1918 -9784 5237 -2605 -5327 5178 -6627 106 8703 2208
525 2208 5617 -7480 -8017 8988 -3465 -5470 424 -1986 9987 2507 -4731 6889 -4796 -6085
539 -6085 2851 -3404 3665 -2496 -5693 13885 4964 -6158 -3837 -6490 8708 2750 -14802 2126
553B126N068k446p31j3463J0560L462j2271J0513m544m691J3105l065K513p925
567a789j2510K2296J471j9308J649N328J6662k930k6069J1805J2526p052k095
580a6j2370Q594J5403j1856J109j335m550J3443p935o497N636p392J1994M714
594H942j3742N161j908L126P895j8601Q31J2403k707L982r420r49J6003j1584
608e68m094O237o945P608k328l476J1417j0213k04J0063j1189K541K67l978J0731
623E869q016n21J0774j1449K759L895o634O134q063P50J4128j1255p24N082m781
638b052Q473p802p484J2371m125J560J811r949J2560J46j0282O008n575L414O293
653E367j0854O952Q91o696J0845n648n219M868n569J0148r21j4042J1940K790
$$ plain form
553 2126 7194 4748 4017 -9446 1114 4576 -7695 2818 -1726 -6417 6688 3623 6136 -1789
567 -1789 -14299 7997 9468 -9840 -8191 -2863 13799 10869 -15200 -3395 9131 2079 -16
580 -16 -12386 -3792 11611 -245 864 -471 -5021 8422 487 -6010 -374 -7766 4228 8942
594 8942 -4800 361 -1547 1579 9474 -9127 -8296 4107 1400 5382 -4038 -4987 11016 -568
608 -568 -4662 1575 -5370 2238 -90 -3566 7851 -2362 -2566 7497 -3692 -1151 -884 -4862 5869
623 5869 -2147 -2668 8106 -3343 -584 3311 -3323 2811 -5252 -4502 9626 -1629 -2353 2729 -2052
638 -2052 6421 -1381 -8865 3506 -619 941 2752 -7197 5363 5509 -4773 1235 -4340 -926 5367
653 5367 -5487 1465 2356 -4340 6505 857 -4362 506 -5063 5085 4164 -9878 2062 4852
667D852l582J276j1186Q973O352j2244N927j173r80J0120j0926j07N868p229P356
682C297l418o263J1939n613j012N540r036O622l64p544R903n701j184Q577q329
697b586L848P90p037R818o028l831R312o868L357K631q062Q461k918m868P658
712C677p968L655N545r442O371j07m241P835r275J073Q417r293M291P13m355R004
728E900p560j560P934q505M284J422o959R141m001k593P728q733L499L281q579
743e301Q184k450m215Q590p066K331L728r467Q082m50o501P751n196J746N237
758E003j0178O695J233p248P622n255J4P465r194M383K456o991P842n365k142
773c660Q649q144K985L103p069Q109l444m858Q619o895K048L681q004Q056j596
$$ plain form
667 4852 1270 2546 -8640 333 6685 -5559 368 -805 -1785 8335 -2591 -2698 3170 -4059 3297
682 3297 -121 -6384 5555 -58 -1070 4470 -4566 2056 1692 -5852 4051 -1650 -2834 5743 -2586
697 -2586 1262 2052 -4985 4833 -1195 -5026 4286 -2582 775 3406 -4656 3805 887 -3981 3677
712 3677 -4291 -636 4909 -4533 1838 1731 -2510 5325 -3950 -2877 5540 -3753 538 1251 -3104 5900
728 5900 -1660 -3220 4714 -3791 493 1915 -5044 4097 96 -2497 5231 -3502 -3 3278 -5301
743 -5301 2883 433 -3782 4808 -2258 73 3801 -5666 2416 1966 -4535 3216 -1980 -234 5003
758 5003 -5175 1520 2753 -4495 3127 -2128 -2114 5351 -3843 540 2996 -3995 3847 -1518 -3660
773 -3660 4989 -3155 -170 2933 -4136 3973 529 -4329 4290 -2605 -557 3124 -4880 3176 1580
788A580n591Q595o330k66N777q151O359k7o177Q809n083j687O086q505N877J528
804B794p819Q161l195k033O820q633L696L813p926O527k759k626Q749q185J335
819a281N114p629O289k077m746Q832o022K41N213q297O403R1o495P508m859j94
835a909O431q366M511K175o717P249m416k151P489p548L447K996p987Q179k424
850I59m134O629o934L268M414r098O579k84m495P729p008N70N871p997N791m63
866A397n858Q726m578j603N561p743N355J136p197Q377l836k534P178o720K759
881D20J672p115Q442k415m792P280n864K488L766q347N976n19m036P662p022j95
897b599O503o220M344j560n303R419n128k110O032p153M856K287o428N430m449
$$ plain form
788 1580 -4011 4584 -1746 -2012 3765 -4386 1973 1946 -4231 4578 -505 -2192 3894 -4611 1266 2794
804 2794 -5025 3136 -59 -2092 4728 -3905 -209 3604 -4322 2205 -554 -3180 5569 -2616 -1281
819 -1281 3833 -3796 2493 416 -4330 4502 -1520 -1279 3934 -4363 2040 2131 -4364 3144 -1715 -1909
835 -1909 4522 -3844 667 2842 -3875 3374 -1042 -3193 4296 -3252 195 3191 -4796 3383 959
850 959 -3175 3454 -3480 -212 4202 -4896 1683 1399 -3096 4633 -2375 -1805 4066 -3931 1860 1397
866 1397 -4461 4265 -313 -1916 3645 -4098 1257 2393 -4804 3573 -263 -2797 4381 -2339 420
881 420 2092 -5023 3419 1004 -3788 3492 -2372 116 3882 -4465 1511 992 -3044 4618 -2404 -2599
897 -2599 3904 -2316 2028 468 -4835 4584 -544 -2654 3378 -3775 1081 3368 -3060 2370 -2079
912b079Q3Q218r572O65N091l804N673o032l012J0163o423K3L433p024P102n54
928A951m874O474o626J863O320q752L711Q66l976P924o169j562O398o410M611
943A749M76p735Q075j664k546M992o951M828K135q557P795j166m900N689m355
958b135L794J420r348Q319J415o710M513l582K942L298q709O578O26o635P412
973C198l320j857L808n853P049P73r784P428k34j464L437q891N318N138p209M026
989A563l389p83R043p930j298M105l978O605l652n023Q589n154N02N251q327L110
1005g66J386j567O014r181k03J0796o634j223K44j291Q301p412l358R670n878
1020a102M22K674m687N520l955k151Q555p883O86N363n560M156k295l340Q185
$$ plain form
912 -2079 -1996 6222 -3350 -2685 2406 -1398 4275 -1757 -4769 5394 -1029 -1006 2427 -4597 2505 1951
928 1951 -2923 3551 -3075 -1212 5108 -3644 67 933 -3043 4881 -1288 -2850 3548 -2862 1749
943 1749 2225 -5510 2565 901 -1645 3347 -3604 1224 3359 -5198 2597 1431 -3469 2220 -2135
958 -2135 1659 3079 -6269 2050 3465 -3245 1268 -2314 628 3926 -4783 1795 2421 -4214 3198
973 3198 -122 -1979 1829 -4024 3025 3798 -5986 1442 1208 -256 3181 -5710 -392 4746 -2463 1563
989 1563 -1826 -2609 6434 -1496 -2794 1311 -2667 3938 286 -4737 3852 -1302 -800 4451 -3876 -766
1005 -766 620 -947 5067 -4114 -4317 6479 -155 -1378 -1134 -2425 5876 -1536 -4894 4776 -1102
1020 -1102 -680 1994 -2693 2827 -1128 -3279 5276 -2607 -1921 3442 -2118 2038 -257 -3597 4588
1035D588o370K8N028o803N247K64n691O763l728p25M216o670N797O26q009P599
1051B160k41k658J961o005P290K059j0761O508J864l075L476n857L934K505p997
1066d837P418l77o783N869j173J403K23q039Q664J635p852M720k049J044M166
1081D032p670M210J269n375P372m462l285P272m326J658M05n191Q118l665m082
1096c720P313n387Q30L846n516M667k422k424Q204p517j423O905m555K148j713
1111g64k052Q179o939j911P708n932J168J478l090N881n390q52P692p703J065
1126a462M060m644L787k896n92O691p954J052N998o398L341j209k211N987n622
1141b072J202M675p881N183J400n352M417l201J478L858p975M938K665o911N029
$$ plain form
1035 4588 -1782 -1754 3274 -3529 1718 1982 -3709 3054 -674 -1399 2817 -3853 1944 2570 -5439 2160
1051 2160 1919 -739 1222 -4783 2507 4566 -6195 313 2177 -898 2578 -3279 655 3160 -4837
1066 -4837 2581 2204 -4579 1290 117 1520 1743 -6296 2368 4003 -3849 871 -1178 -134 4032
1081 4032 -3638 572 1841 -3534 3838 -624 -3909 3363 -963 695 1100 -4091 4027 362 -3720
1096 -3720 3593 -1794 -964 2882 -2634 2033 -389 -2813 5391 -2126 -3549 3356 -1199 949 -764
1111 -764 -2816 5363 -1576 -3487 4221 -1711 -543 935 -2155 3726 -1664 -2516 5176 -2527 -1462
1126 -1462 2598 -2046 1741 -1155 -1747 4944 -3010 -1958 4040 -2358 983 -226 -2437 3550 -2072
1141 -2072 -870 3805 -4076 1107 2507 -2845 1572 -1629 -151 3707 -4268 670 3335 -3576 1453
1156A453j535j006L459o066N002J901p879O958q03l689M244m339L409J152p377
1171e116P707j96n838N362k879Q98K114o117O416p63o012P884l185k195L804m067
1187b183M139j088n266P806k707l612N533l969J887Q15m790O673l404l182P134
1202C786n024K43L188m067L971k888k321P832o068j059N213m486K875j054k799
1217b658O228n586k77O570o285J451J595k667N012n229m15O278o660J995L317
1232B669n372M303k125p05M808o901K498M494o776L789J82k711M557m893K010
1247a73L559p341M732J662n031M124k667J090L103o844M501K041n970N052j761
1262G7j394L914n261L519J468o495O142q08l711M400l649K805J204o172O152o93
$$ plain form
1156 1453 -82 -1088 2371 -3695 1307 3208 -4671 2287 1484 -2205 2039 -2300 1109 2261 -5116
1171 -5116 2591 2395 -3443 1919 -960 -62 2052 -4065 2351 1588 -4424 3460 275 -1920 1884 -2183
1187 -2183 1956 868 -4398 3408 701 -2911 2622 -1347 540 1355 -3435 3238 -166 -3348 3786
1202 3786 -1238 -995 2193 -1874 2097 -791 -3112 4720 -1348 -2407 2806 -1680 1195 141 -2658
1217 -2658 3570 -2016 -2293 4277 -2008 -557 1038 -1629 3383 -1846 -2261 4017 -2643 -648 2669
1232 2669 -2703 1600 -525 -1230 3578 -3323 -825 3669 -3107 682 864 -1847 2710 -2183 -173
1247 -173 3386 -3955 777 2439 -2592 1532 -1135 -45 3058 -3786 715 2756 -3214 1838 77
1262 77 -1317 2597 -2664 855 2323 -4172 1970 1162 -2549 1851 -1798 1007 2211 -3961 2191 1498
1278A498m568N393l199K6K819m757N220j279n095O861k932j713L698m255L685
1293A402J7m778O536l172k523N560m614J773Q52l913N785k927k717O153m767P10
1309f23K624m614M602k090k643O253m837j24M311n304L238k61k799N257m412q4
1325a506M846n683K503J201l613M299l337o1M906o500K727K788m752L567j916
1340e31j102M984n818J846L548n478L822n82k377M232m322J179L785o132L916
1355I70L09l635M751l228l03L654n313L740N41m591N595k122k014L870m400K882
1371G06J145n079N155j204k854M513l932J582J769m781M874j320l369N092l131
1386h34P20K076m837M313p8m158M869k677l97L804n392L345N97l880M870k795
$$ plain form
1278 1498 -3070 2323 -876 -850 1969 -2788 2432 1153 -3942 2919 -13 -1726 1972 -2283 1402
1293 1402 1419 -3359 3177 5 -2518 3042 -1572 201 1053 -2860 2925 -2 -2719 3434 -1333 -623
1309 -623 2001 -2613 1989 -101 -2744 3509 -1328 -1452 2859 -2445 793 532 -2267 2990 -1422 -1506
1325 -1506 3340 -2343 160 1361 -2252 2047 -1290 -1351 3555 -2945 -218 2570 -2182 1385 -531
1340 -531 -1633 3351 -2467 -621 2927 -2551 1271 689 -1688 2544 -1778 -599 3186 -2946 970
1355 970 1279 -2356 2395 -833 -1136 2518 -2795 945 1486 -3105 2490 368 -1646 2224 -2176 706
1371 706 1851 -3228 1927 723 -2131 2382 -1550 32 1801 -2980 1894 574 -2795 2297 -834
1386 -834 -114 1962 -2875 1438 1360 -2798 2071 -606 -1003 2801 -2591 754 1351 -2529 2341 -454
1402d54j336M496m775K425J608m522M303j606j772M514m827J429K947m593L632
1417A469j574k047N195m470L25L371m565L445n01k839M767l722k81M030m588K236
1433B51P15l254M636l031j056M468m373J634J101l796M837j834k623M506l685
1448a504J424J717m316M229q59k954M573l280M58K496m567L996k66l540M204k549
1464g38J13K663m664L385Q57l907M143k571l36L522m813K689J580m591M152j147
1480C37j667L519m285K020K503m994L321j94j887L987m271N86L667m667K731J44
1496H50k901M406l171k25L525m539K321J208l495L839k566n90M087m413J193J914
1512A443l322L940k380j726M641l604N57J768l261L753j508k977M964l140L3K486
$$ plain form
1402 -454 -1790 2706 -2069 356 1964 -2558 1745 139 -1633 2881 -1946 -517 2430 -2163 1469
1417 1469 -105 -2152 3043 -1427 -1102 2269 -2296 1149 648 -2191 2576 -1146 -1427 2603 -1985 251
1433 251 966 -2288 2348 -683 -1739 2729 -1644 -10 1091 -2705 2132 298 -2325 2181 -1504
1448 -1504 -80 1637 -2679 1550 691 -2263 2310 -970 -512 1984 -2583 1413 1147 -2393 1811 -738
1464 -738 -625 2038 -2626 759 1616 -2291 1852 -719 -1055 2467 -2346 343 1923 -2668 1484 337
1480 337 -1330 2189 -2096 -76 2427 -2567 754 560 -1327 2660 -1611 -1025 2642 -2025 706 850
1496 850 -2051 2355 -816 -1041 2484 -2055 266 1474 -2021 1818 -748 -1338 2749 -1664 -471 1443
1512 1443 -1879 2061 -319 -2045 2596 -1008 -451 1317 -1944 1809 301 -2676 2288 -852 -819 1667
1528A667l659L300p43l095M733k641q96L040l417K607l5l550N023k151j733L539
1544A989l603K031J009m097M474j208k400L645l226J348J880m227L411m85k421
1559a880M072l324O82K358m025L052j95k794M085k747q1K920m212K427R10l150
1575a902L435k341k39L589m598K049J928l830K910j392p15L554m156J429K278
1590A999l953L076p36j931L597l510Q21K841m338K845L03k581L523l009O1L340
1606B348m098K159N33k842L732k261r29L343l393J788P05l665M168j188k125L207
1622A482k602J495J125l918L721p41k455L806k666J66K124l702L333m62l058M408
1638B056k476n40K614l412K763N9l438M150j951j199L205l334J746R16l370L959
$$ plain form
1528 1667 -1992 1308 565 -2530 2203 -438 -1334 1706 -1711 896 861 -2689 2334 183 -1550 1989
1544 1989 -1614 417 1426 -2671 1803 595 -1805 1840 -1386 -38 1842 -2385 1026 541 -1880
1559 -1880 2192 -1132 -450 1908 -2117 935 740 -2054 2031 -716 -797 2123 -2089 338 1248 -1902
1575 -1902 1533 -808 -1047 2542 -2056 -7 1921 -1909 1001 -391 -1106 2448 -1708 -279 1999
1590 1999 -1954 1122 386 -1545 2052 -1458 -637 2204 -2134 711 1014 -1567 1956 -1053 -992 2348
1606 2348 -1750 409 942 -1900 1832 -429 -1358 1985 -1408 380 1085 -2580 1588 400 -1725 1482
1622 1482 -1120 375 1500 -2418 1303 562 -1893 1913 -753 -587 1537 -2165 1168 706 -2352 2056
1638 2056 -420 -960 1654 -1758 1005 1064 -2374 1776 -175 -1374 1831 -1503 243 1159 -2211 1748
1654A748j798j483L559l446J111J818l540L393r44k275M012l396M19K839l911
1669a894K536K2k220L480l170J37L463l893J683P67k429L170k446l70L542m179
1685a801J439J441k578K895j757j097L780l648R72J985l655K890m41j923L246
1700A748k935O11K469l693K747j37k675L760k694n4K571l533K537L48l172L509
1716A407j507q76K779l403J947R70l620L779j188j540K820k968J395J422l513
1731b096L320n83k291L395k405L77J549l518L289k69k697L386k087J26K220l337
1747a621K225K34k962M025j831j201K866l330J906J039k947K787j373j270L710
1762B257l254N52J643k903K896j063j930L643k861M70K453l539K044j77j809L627
$$ plain form
1654 1748 -50 -1533 2026 -1420 -309 1509 -2031 1362 418 -1857 2155 -1241 -822 2017 -1894
1669 -1894 642 664 -1556 1924 -1246 -1109 2354 -1539 144 911 -1518 1652 -794 -1164 2378 -1801
1685 -1801 -362 1079 -1499 1396 -361 -1458 2322 -1326 -354 1631 -2024 866 425 -1498 1748
1700 1748 -1187 -576 1893 -1800 947 810 -1865 1895 -799 -853 1718 -1815 722 1070 -2102 1407
1716 1407 -100 -976 1803 -1600 347 1317 -2303 1476 288 -1252 1568 -1400 -5 1417 -2096
1731 -2096 1224 641 -1650 1745 -660 -283 1266 -2252 1037 768 -1929 1457 -630 -504 1716 -1621
1747 -1621 604 838 -2124 1901 70 -1131 1735 -1595 311 1350 -1597 1190 -183 -1453 2257
1762 2257 -997 -445 1198 -1705 1191 128 -1802 1841 -1020 -550 1903 -1636 408 231 -1578 2049
1778B049k898q2K695l330K254J93k674L360k124m09L016l496J531R37k818K996
1794A200r76j536K975l156J649J733l680K472l22j695L092k909N42K148l565L169
1810A141j72k569K828j895J92K443m048K484L93k379L121j960q08K623k740J603
1826B57J027l433L218q36j250L033l261J031J415k827L110j333k009L424k096
1841e30L19J694l086K313k93j923L552k680m94K662k613J760q8k495L738j840
1857dj229L103l149J466O57k592L429j774j656L520k481Q56J194l398L046o70
1873C18j573L147k955K13K340l037K312l95k092L505k170j9K194l967K409J167
1889A397k821K709k101j78L185l602J423J229l081K670o73q60K221l468J524K046
$$ plain form
1778 2049 -849 -931 1764 -1566 688 881 -1793 1567 -557 -966 2050 -1446 85 1022 -1796 1200
1794 1200 224 -1312 1663 -1493 156 1889 -1791 681 359 -1336 1756 -1153 -611 1537 -2028 1141
1810 1141 969 -1600 1228 -667 -475 1968 -2080 404 797 -1582 1539 -421 -1229 1394 -1346 257
1826 257 1284 -2149 1069 233 -1017 2016 -1245 -214 1201 -1626 1484 151 -1858 1566 -530
1841 -530 -211 1483 -1603 710 417 -1506 2046 -634 -1128 1534 -1079 681 593 -1902 1836 -4
1857 -4 -1233 1870 -1279 187 844 -1748 1681 -93 -1749 1771 -710 146 1340 -2058 988 318
1873 318 -1255 1892 -1063 -850 1490 -1547 765 370 -1722 1783 -387 -406 1788 -2179 230 1397
1889 1397 -1424 1285 -816 -994 2191 -1411 12 1241 -1840 830 157 -703 1518 -1950 -426 1620
1905A620k792J993q01j633L487k562L14J838l463K679K90k244K831k556M4K780
1921A825l025J679P6k423L546j636j109K327k678J569J130k947L187j496j524
1936a499L431k600O30Q37k891L622r07k419L172k443Q54J662k894K361o55j944
1952a683L686k006p90J765k712K810K40l099K859j632j16K677l301J259R82k880
1968a941L504j242j603K483k641J606J635l217K016o81j115L201k851J94J821
1983A169k783K448J5k326K624k331R23K543l808J482P87k181L165j966j030K750
1999A481k813J678R06l051K548j037o72L098l189L74J363k035K746j039k126L280
2015A512k433O92J746k979J810p8j767L533k586m97K268k523K453l68k792L075
$$ plain form
1905 1620 -1172 821 20 -1613 1874 -688 -374 1464 -1999 680 970 -1274 1557 -999 -955 1825
1921 1825 -1200 479 555 -1868 1678 42 -1067 1260 -1418 151 1281 -1666 1521 25 -1499
1936 -1499 1932 -668 -38 799 -2092 1530 623 -1796 1376 -1067 -213 1449 -1445 916 261 -1683
1952 -1683 2003 -3 -793 972 -1740 1070 1310 -1789 1070 -562 -678 1999 -1302 -43 939 -1941
1968 -1941 1563 321 -1282 1201 -1440 166 1801 -1416 600 -81 -1196 2005 -846 -652 1169
1983 1169 -1614 834 849 -1477 1147 -1184 -261 2282 -1526 -44 743 -1438 1727 -239 -1269 1481
1999 1481 -1332 346 1252 -1799 749 -288 -960 2138 -1051 -677 686 -1349 1397 358 -1768 1512
2015 1512 -921 -229 1517 -1462 348 270 -1497 2036 -550 -1047 1221 -1302 1151 783 -2009 1066
2031A066j368k29K105k976J282Q52j991K936j716j533L065k327J322R05l551K718
2047E60k68j098K601k983M32K088k708K498p13k137K944j684M58J687l863K090
2063i6R88k129K834k375l56K640k378J574L90l143L009p71q09K186l212J223J936
2080A511k779K587j405j640L330j959M51J071l228K676J41j897K787k596j02K548
2096A496k424J620l83k339L489j359p05J887k905J802J160k473K533j821j118
2111a540L411k382L11J046k790L152p23j766K681k614P91K060k615J732q15j458
2127a519L324j968l10J682k998K033J040k380K261k210O6L143l123J128N56k289
2143a564K853r91r97J916k999J808J756l125J707n41r07L006k633M56J389k864
$$ plain form
2031 1066 -302 -531 1574 -1402 -120 732 -1259 1677 -39 -1572 1493 -834 488 1393 -2158 560
2047 560 292 -806 1795 -1188 -756 1332 -1376 1122 409 -1728 1216 -468 -10 1677 -2186 -96
2063 -96 892 -1237 1597 -778 -1134 1506 -872 702 1092 -2051 958 187 -622 1564 -1648 -425 1511
2080 1511 -1268 1319 -86 -1726 1604 -355 96 1167 -2061 615 756 -1141 1646 -950 -1052 1496
2096 1496 -928 692 309 -2030 1459 100 -605 1282 -1623 179 1339 -1134 1399 -422 -1540
2111 -1540 1871 -511 -200 846 -1944 1208 485 -1281 1400 -1214 -423 1637 -978 754 -61 -1519
2127 -1519 1805 -163 -473 1209 -1789 244 1284 -1096 1165 -1045 -979 2164 -959 169 725 -1564
2143 -1564 1289 298 -699 1217 -1782 26 1782 -1343 364 -177 -1084 1922 -711 -255 1134 -1730
2159a730K653J61k272J972j773P74K079k980J269K41k029L347j564j106J833k385
2175a510K240O01k804K210j150l28K631k553L94P59k058L059q94k370K669j649
2191g53Q93J285l199K224k86j613L288k044q14J844k068K275o4k710K538j167
2207c71l13K415k669P13P15j688K861j583j751K867k148J004J448k934J982p44
2223a96n95K999l125j00K215k054J801n10j915K544j894O99J953l430J387Q20
2239E99j241K163k322k89K382k151J401O94k875K327q96j92K147l310J126J657
2255A220k088J917r04j581K551j747R25J110l210K220K12j491K500k388K0J962
2271A228k252K076o33k687L289o47o06J579k998J754J044k341K533j407j329K782
$$ plain form
2159 -1730 923 1084 -1188 784 -989 -215 1864 -1116 153 394 -1635 1712 148 -958 875 -1510
2175 -1510 730 1331 -1473 737 -413 -741 1890 -663 -269 490 -1568 1491 597 -1773 896 -753
2191 -753 140 1425 -1774 450 164 -1449 1839 -205 -1019 825 -1243 1032 968 -1742 796 -371
2207 -371 -684 1731 -938 -225 490 -1198 1663 80 -1671 1196 -952 52 1500 -1434 548 -196
2223 -196 -791 2208 -917 -1017 1198 -856 945 435 -1480 1064 -830 -131 1822 -1608 -221 599
2239 599 -642 1521 -801 -1090 1292 -859 542 1236 -1639 688 -208 -400 1747 -1563 -437 1220
2255 1220 -868 1049 145 -1436 1115 -632 293 1403 -1807 413 625 -866 1634 -754 -734 1228
2271 1228 -1024 1052 419 -2268 1021 374 -232 1347 -1651 103 1147 -1194 1339 -68 -1397 1385
2287A385j766P57L61k811L104m63j459K149k425N99J796k187J779r72j586L243
2303A504j384l23J309k731K016O06j842K202k301l34L099k537Q74M74k321K877
2319A188r88j056K279k759J166J628k325J797j545n31K945k230J71J366k800K242
2335E48L7j338K107k602M23K486k540J070M1j666K960j773k33J319k172J665J007
2352A339k395J823j150n10K515k300N89P48k213K532k71j873J990k065J333J309
2368A401k815J827k32j455K806j811k16J105k062K256J40k285K093j262K98J758
2384A546k684J272L11j807K765j050j372K033j990J472O96k711K232r09p28K725
2400A801k371K46J372k165K250o84j816K258j681M62J990k622J081o0r49K401
$$ plain form
2287 1385 -381 376 737 -2074 1030 567 -892 1257 -1168 -569 1227 -960 819 -153 -1739 1504
2303 1504 120 -203 1106 -1625 391 997 -845 1357 -944 -1278 1821 -716 158 632 -1689 1188
2319 1188 200 -856 1423 -1336 -170 1458 -867 930 -615 -1146 1799 -431 -260 1106 -1694 548
2335 548 585 -753 1354 -1248 -825 1661 -879 191 232 -1434 1526 -247 -480 839 -1333 332 1339
2352 1339 -1056 767 -383 -893 1622 -678 -89 659 -1554 978 707 -1166 824 -1241 92 1401
2368 1401 -1414 413 181 -1274 1532 -279 -495 610 -1452 804 944 -1341 752 -510 -212 1546
2384 1546 -1138 134 445 -1362 1403 353 -1019 1014 -976 496 1192 -1519 713 -196 -924 1801
2400 1801 -570 -324 1048 -1117 1133 449 -1367 891 -790 -328 1662 -960 121 61 -888 1513
2416A513j983n18K018k008J548mj820K097j032k93K226k768N60J020j457K278
2432A377j227j371K263j678O81J104k759J949K8j225K388k228p0J437j677J954
2448I46m96j852K175p82l69J538k550J351Q90j782K006j347q44K168j650Q81O91
2465I74k705K364k84j030K022k399O35J416j985J961n27j792K348j236Q7J365
2481A214k663J731K24j187J727j672j55J987j765R64K75k279K291l79q68J527
2497I72k242Q75J331j648J602j115j029K477j647K67R60k362K185l80j007J722
2513I61j704r4J962j992J264m50j132K340j157m43J403k177J476P02j682J677
2529I54j243o04K136j760M88O32j931K196n21j087J602j808P58J243j902J386
$$ plain form
2416 1513 -470 -988 1030 -978 570 566 -1254 843 -189 -482 1744 -1024 -464 556 -901 1377
2432 1377 150 -1221 1042 -636 45 1149 -1610 339 367 -858 1530 -698 -768 669 -1008 946
2448 946 450 -1402 773 -9 -378 1160 -1390 -39 851 -931 1075 -272 -1116 1052 -598 283 974
2465 974 -1731 633 349 -681 1341 -1058 -423 993 -992 969 442 -1350 998 -238 -151 1214
2481 1214 -1449 282 506 -681 1046 -626 -781 1206 -559 405 680 -1599 692 313 -555 972
2497 972 -1270 -395 936 -712 890 -225 -1254 1223 -424 -157 803 -1559 626 246 -761 961
2513 961 -743 -837 1125 -867 397 -53 -1185 1155 -2 -445 958 -1219 257 959 -723 954
2529 954 -289 -893 1243 -517 -29 603 -1328 868 347 -740 862 -946 -188 1055 -847 539
2545E39m65j068K334j914Q6J453k317J751K45j498J814j421o6J927k183Q59J5
2562I1j182K066q67q02J702j690Q74Q35k289J932r25n77K076j958L07J195j800
2579a012J926m63j502K091j622L52J420k283J296J20j396K181j190n17J465j888
2595a022J428N42k167J827q36l72J688j854P65N10j516J716l52j340J563j228
2611f48O13J043k167J326J62j267J970j575J12J423k161J747j22j632J790j076
2627d62K22J384k095J012N17j351J783j174n94J657j736J090M75j914J934q67
2643a19m69J765j884M36J039j812J809p47j367K410j393p4J181j770J221J81j271
2660h64J994j447n59J746j423Q50J32j624J912q35m92J658j827P41Q79j692J515
$$ plain form
2545 539 74 -994 1340 -574 -488 965 -1352 399 644 -854 960 -461 -527 1400 -783 76 91
2562 91 -1091 975 108 -694 1008 -682 192 1027 -1262 670 -255 -832 1244 -714 -407 788 -1012
2579 -1012 914 451 -1051 1040 -582 -230 1190 -1093 203 323 -1073 1108 -82 -599 866 -1022
2595 -1022 406 948 -1219 608 -228 -600 1088 -766 -1 509 -1007 709 357 -983 580 -648
2611 -648 -35 1008 -1159 167 329 -938 1032 -543 -431 992 -1169 578 456 -1176 614 -462
2627 -462 -240 1144 -951 61 578 -773 1010 -164 -758 899 -837 253 728 -1186 748 -119
2643 -119 -588 1177 -707 -271 768 -1044 765 18 -1349 1061 -332 -406 775 -995 226 407 -864
2660 -864 1130 -317 -876 870 -553 297 429 -1195 717 -118 -610 1048 -779 -38 841 -851 664
2677F64o71r80J935j497O84P37k043J614j48j092J818j510L03R35j561J280j14
2694C54j304J949j241R5R18k034J462M84j487J433p87k06J497k032R44N43j591
2711a003J758m85p62J274j694J095P19j885J371j97j036J994j502K28Q37j753
2727a041J340L36j615J759j128r4J447j874J176K4j430J885q47o62J654j584O10
2744d4O91j693J854q88p58J894j513K20Q63j546J609o63q50J807j504K2J316j746
2762i29J093kj154K038j306l37J517j786J250N6j386J801j262l19J612j564P71
2779I3L87j321J419o14o24J728j638K72J223j739J203kq36J303j546L57J181j765
2797i19J101M93j578J865j333J19J036j774J089N61j302J313r49k28J489j701
$$ plain form
2677 664 -7 -987 948 -549 135 872 -1171 443 295 -797 1021 -489 -186 749 -812 468 354
2694 354 -950 999 -242 -147 771 -1263 199 683 -804 629 -158 -364 1133 -899 45 588 -1003
2711 -1003 755 270 -492 782 -912 183 902 -983 388 191 -845 1149 -353 -125 712 -1041
2727 -1041 299 635 -980 779 -349 -443 1004 -870 306 330 -1100 785 -62 -724 930 -654 -44
2744 -44 647 -1046 808 -80 -838 1056 -457 -237 626 -920 689 26 -824 983 -521 -499 817 -929
2762 -929 164 162 -992 1046 -260 -597 920 -866 384 440 -946 855 -407 -726 886 -678 93
2779 93 480 -841 578 -36 -660 1068 -570 -298 925 -814 389 387 -449 854 -692 -335 846 -919
2797 -919 182 675 -903 962 -371 -252 784 -990 99 660 -642 671 -278 -506 983 -718
2813g18R72M97j680J629o03n74J326j598N50R44j513J325l40j031J615j300R6
2830d03J189j702J233Jj358J760r59k65J224j484J067N3j324J961j081p56J478
2847F34j275Q46K55j254J594o94r94J696j064J42P47j541J425m83q41J693j259
2864c73j63J348j572R92P9j142J643j061k30J189j652J130L10j401J710r97o54
2881h44J750j605O72R79j821J324o00n13J637j705L85J224j639J024k5q11J533
2898I65j502K25J214j819R58J80j034J498j003o2J280j743R77N68j610J799r46
2915e5n68J492j673Q50M54j344J184k78p75J598j487M76P04j499J608l12j195
2932h20J714j176J79Q30j712J358j12j393K149j206l26J223j471J118O4j482K074
$$ plain form
2813 -718 254 751 -929 700 97 -477 849 -749 -199 745 -768 557 217 -814 801 -499 -403
2830 -403 786 -916 317 318 -1040 720 -239 -504 720 -764 303 356 -968 993 -88 -844 634
2847 634 -641 205 460 -794 800 106 -888 808 -256 -114 633 -908 517 34 -807 886 -373
2864 -373 -536 812 -760 232 311 -831 812 -249 -479 710 -942 188 498 -903 807 -190 -844
2881 -844 906 -699 -27 952 -869 455 -145 -658 979 -726 -341 883 -756 268 243 -568 965
2898 965 -537 -312 902 -917 41 221 -813 685 -318 -380 900 -843 134 702 -908 891 -55
2915 -55 -623 869 -804 46 500 -844 340 62 -713 885 -602 -126 578 -921 687 375 -820
2932 -820 894 -282 -103 727 -985 373 261 -1132 1017 -189 -515 708 -763 355 419 -1063 1011
2949A011j110m65J124j291R30L83j550J585n50q44J648j445M04Q04j632J573l96
2966A79r74J807j149j23R61j514J103m1j320J914j145l02J476j737P17O31j304
2983h21J660q82n72J737j939R55O18j357J291p94m34J360j505N17Q79j490J166
3000C89j2r64J436j431P1J401j697J183Qj001J461j060M4J045j430M48O91j284
3018g02J463q15m28J216j406O44N87j300J607q44p81J689j461J97J137j613J426
3035F16l21j087J432j072K19Q44j334J061q6r56J526j111k36J359j504Q55K73
3052D78j360J748j127l61J447j274M49N71j364J378p08n55J573j363K69Q19j444
3069h24J203j54q22J350j140J59P76j131P91L15j396J539r15j92J293j678R12
$$ plain form
2949 1011 -99 -564 560 -731 199 582 -968 617 67 -777 871 -574 -170 634 -998 575 179
2966 179 -795 1012 -137 -260 701 -813 290 249 -1071 843 -302 -604 872 -865 -148 483 -821
2983 -821 839 -43 -615 1122 -817 138 756 -601 690 -104 -538 822 -683 -166 713 -777 389
3000 389 377 -587 849 -582 -511 890 -807 376 384 -617 844 -216 -172 873 -557 -109 582 -702
3018 -702 761 -54 -482 734 -672 -28 559 -741 866 22 -759 930 -531 -334 803 -810 616
3035 616 295 -792 640 -432 -213 631 -703 358 272 -684 842 -269 -505 854 -650 205 478
3052 478 -882 866 -261 -622 825 -449 0 571 -793 585 -123 -678 895 -468 -199 620 -824
3069 -824 379 225 -597 753 -387 -228 548 -583 208 523 -873 666 -249 -441 852 -826 86
3086H6N11j424J371l97n79J348j583P46O29j646J193k96o21J495j409N66P83j320
3104e47J086m05p60J572j279J09R46j470J246k12j098J696j205J5J044j441Q94
3121A91K68j365J637r32k58J172j311N58M12j176J506p76o03J299j106K75Q87
3138F78j782J648k28r59J551j431L69P28j237R70m6r56J354q92o4J045j309O89
3156A28L39j282J439p14m85J449j590O04P05j437J550n70p39J488j379N35R46
3173I87j890J227l4j095J625j292J93R73j644J374j89q13J173r28j40J267j763
3190i69J299J87j327J452o41l64J177j442M29R22j426J258o88l93J324j357O13
3207E4N12j399J227k32q41J376j232K39P99j034Q04O2j057J348p72k03J114j479
$$ plain form
3086 86 597 -827 544 147 -432 916 -667 79 708 -938 255 -41 -662 833 -576 -10 773 -547
3104 -547 539 134 -626 946 -333 -224 722 -748 498 286 -812 884 -321 -306 738 -703 191
3121 191 459 -906 731 -201 -459 713 -598 -40 372 -804 702 -74 -677 622 -484 -209 678
3138 678 -1104 544 316 -643 908 -523 -154 574 -663 307 261 -695 659 -233 -297 748 -561 128
3156 128 467 -815 624 -90 -575 874 -716 -112 593 -844 706 136 -603 885 -494 41 987
3173 987 -903 324 290 -805 820 -472 -279 694 -950 424 235 -578 595 -333 -473 794 -969
3190 -969 330 517 -810 642 1 -363 814 -628 -199 723 -703 555 -133 -526 798 -559 54
3207 54 566 -833 394 162 -679 697 -535 -296 503 -531 273 335 -722 626 -146 -349 765 -714
3225g14Q66M09j275J385o72o10J577j565Q60K51j276J459n26o65J204j182K59
3242b15J021j639R94Q0q66J550j420L88P06j262P44Q0q72J158q35J41R25j326
3260f48P33L66j187J219o95k44J148j248P04N04j440J296o50n11J385j297O44
3277G9L12j031J041k8j082J388j087J44R35j317J055k6r55J182p58k05J003j378
3295g28R38J34j096J370p56l66J413j555O85N13j434J586r39l95J329j214O47
3312A32L34j146J184j20r79J608j214J08O13j060R04R3j249J438r02k78J372j437
3330e99O95J55j217J590r25k29J365j380N30L80j146J161n89m19J454j364K42
3347b96R45j330J057k21q73J262q67K86O21j272R84N5j184J440q62j43J112j351
$$ plain form
3225 -714 152 561 -714 671 -1 -611 966 -599 261 512 -764 695 169 -496 708 -474 -215
3242 -215 806 -833 161 241 -625 925 -495 -107 599 -663 81 161 -711 447 -388 -247 678 -648
3260 -648 85 451 -736 483 -212 -456 692 -556 148 652 -788 508 -142 -653 732 -565 79
3277 79 391 -640 401 373 -709 679 -408 -264 671 -646 409 383 -572 610 -148 -353 650 -728
3295 -728 210 344 -752 618 -138 -504 909 -646 39 552 -882 704 -235 -630 699 -515 132
3312 132 466 -680 504 384 -595 1013 -201 -93 520 -540 364 457 -792 646 -256 -534 838 -599
3330 -599 96 251 -966 624 -301 -530 835 -545 -15 365 -781 380 -209 -628 826 -538 -296
3347 -296 649 -681 376 155 -718 544 -323 -37 584 -688 296 351 -833 607 -255 -398 714 -637
3365f37R86l4j126J182m69m35J380j434O02M49j108J062m14n27J059j089N85N99
3383F31j370J226l77p17J342j207K35R36j424R58J34r52J119p75n3Q62j207O83
3401D4J29j032J427n75m55J090j171N47L63r60J185n64o03J311r69J39O88j124
3419e30Q47k82o41J221p59o8O89j179J038j11r43J472j068n8R88j124N25M01j050
3438f32J261p84j17J175j759R28L80j024J005k92n22J009j107L96P01j172R58
3455D04j93p80J185r91K92P59j227Q42N3r33J218j197K41Q93j157P66J11r51J191
3474E26m00n92J004j064N43L65j011J099m80n76J198q11J61M66r57P61j55p07
3492f30J205p76J04O48j311J051J04q72J011n45k29R48j405Q88J1j013J399o12
$$ plain form
3365 -637 349 315 -811 371 -98 -533 847 -587 15 464 -644 418 4 -523 536 -553 32 631
3383 631 -739 487 110 -607 735 -472 -237 699 -725 233 367 -585 534 -241 -294 568 -639 44
3401 44 173 -859 568 -7 -462 628 -543 4 367 -593 592 28 -575 736 -233 -94 594 -530
3419 -530 317 35 -606 615 -144 -212 477 -702 336 225 -718 754 -314 -372 616 -508 17 418 -632
3438 -632 629 -155 -272 903 -856 72 452 -572 433 141 -381 628 -479 -83 618 -554 404
3455 404 211 -569 616 -375 -83 676 -551 291 344 -589 629 -568 -327 566 -591 175 286 -665 526
3474 526 126 -466 538 -526 17 382 -629 470 -10 -586 612 -199 -38 428 -529 232 77 -630
3492 -630 575 -201 -97 551 -760 291 395 -477 534 -11 -240 708 -697 191 202 -811 588 -24
3510b4n72J276j042L51M46j075R80l95q02J547j139L38N16j150J273l19q02J280
3528F87j034Q7O77j012J032k17q11J102p22k34J205j256O62K33j073J372q98k75
3546d75J167j247P39K92j031J042n25l17J098j239L81P06j225Q87N8r40J199j021
3564d51K21R38j373R45m1q18J284p84k35P92r75P02K99j127J152n66k40Q34r77
3583d20M54M35j109J087l70l44P68q69M26M39j082J070k33n88Q76r73L16O06j121
3602f32J068j26o99R42p80L2R18j173O26N2r93J424p74k10R53r80K10O57r39P90
3622C66l00n09R45r36M35M96j149Q78j17n87J061j099K70P36j007P81j09o56J058
3641E57q70k4R98j259P99j70o75J207p16k22R41j110P11J53r62J004m35m10J037
$$ plain form
3510 -24 -596 680 -362 -11 435 -640 340 -55 -857 690 -449 -111 405 -745 528 209 -593 687
3528 687 -347 -260 417 -595 437 220 -591 511 -211 -445 760 -496 166 399 -674 698 -200 -475
3546 -475 692 -555 184 476 -555 487 -38 -355 743 -496 -115 591 -634 253 311 -629 570 -451
3564 -451 -230 708 -665 280 239 -579 705 -79 -314 478 -497 205 504 -623 529 -37 -277 557 -420
3583 -420 34 469 -640 447 77 -267 501 -368 58 497 -585 485 252 -336 540 -433 -117 489 -632
3602 -632 436 310 -389 553 -227 -195 723 -450 176 228 -765 659 -115 -325 628 -352 -142 515 -424 366
3622 366 66 -443 502 -434 1 497 -652 226 109 -478 583 -516 -246 490 -517 264 155 -501 557
3641 557 -313 -337 661 -598 201 31 -644 563 -153 -375 566 -544 167 320 -642 362 -73 -483 554
3660E54r99N71L13j202J164m83l43J077r22K49N29q95O90q5r16J284o45k24P98
3679E15j052P56j91p01J094l17k74O46r64M89L68p89Q43j98p84J184r76K71O68
3698E88j190Q97o3o40R50o66O8N01q68O99m8o61J081r82L8O29q33O40q3o97P76
3719A36r6KM51j125O69K29p43Q61m31l20Q55r02K58M59p95Q18k24m54R26j047
3739d73L41M24q76Q72J32r67J069o22J9O71j007P28k8p47J075o69j59P40q48M75
3759A50K03r34R39l53l25R15r14L93J89p93P07j28o48J079p91K63N04q31P23j12
3779B36m68O99n33j80P35j060O81J65q33J235r73o6R46j005N46J90o94Q05o11
3798a85k29Q84j014M77M98q53Q65n02k16P68o67M4M58q53O46J00o77R05p12oO62
$$ plain form
3660 554 -445 126 439 -763 401 -82 -425 652 -270 -21 508 -387 303 218 -698 586 -59 -283 515
3679 515 -537 219 28 -673 421 104 -170 476 -488 1 369 -420 423 225 -559 625 -351 -80 588
3698 588 -602 295 232 -408 542 -124 -56 445 -423 276 228 -433 648 -334 -296 333 -500 140 57 -640 136
3719 136 40 42 493 -632 37 266 -477 384 -47 -367 488 -414 -156 303 -492 326 102 -352 574 -473
3739 -473 -132 292 -584 288 420 -547 522 -100 -81 590 -417 311 283 -464 611 -58 -217 523 -325 150
3759 150 353 -581 358 5 -320 595 -319 74 263 -530 177 49 -599 480 -311 -48 456 -375 348 236
3779 236 -232 467 -66 -246 489 -571 110 275 -558 677 -296 -362 584 -421 125 315 -379 426 -185
3798 -185 -414 470 -544 -67 431 -422 443 -59 -275 493 -174 -130 328 -525 121 221 -456 449 -263 -269 393
3819C93p10M15J50q09R98o94P6P20r18M41L60j035R61m51k28O96n07OM19q25R61
3840D19l61l03P33q61J64O68r92O63P5o36R13q92J86N78p97N66K22r01J070o26
3860a12k18P93q95K68M18q61J095m40l82P53o09K94J62n39N48j33m41R83q81J07
3880i0N91j061N90J87p05Q10m86j5P47q87J22M72o76R06o06j98P76r30M93L43
3900C83j052J007k36m04Q89j074N51J12o01Q58n73j31N57m76K40M6n67O26k9n62
3920d36P99o87K58N34q42N71J35r64R32n14p3O60p76M39L60q34Q74k75n19Q64
3940E06o95R1K80o02O13j07m60R00q42L65L51p17M27l7o59J068o58J17N90r31
3960d00N15J41n12P28o46j59P62o27M80o2o37P96n67k66J131r23L29L09o28M52
$$ plain form
3819 393 -317 98 248 -561 437 -257 -181 539 -379 62 422 -613 348 -103 -331 365 -142 -136 283 -542 419
3840 419 58 -245 488 -373 -209 459 -533 130 205 -431 482 -410 -224 354 -443 123 345 -556 514 -112
3860 -112 -330 463 -432 -164 254 -607 488 48 -334 419 -190 104 266 -273 275 142 -299 684 -197 -90
3880 -90 501 -560 30 217 -488 322 -164 -179 568 -319 -197 275 -401 505 -101 -299 477 -453 40 383
3900 383 -669 338 102 -302 587 -487 64 176 -425 433 -140 -271 286 -190 50 96 -471 155 126 -436
3920 -436 363 -324 -66 468 -374 197 332 -632 300 -214 -287 373 -403 36 396 -438 436 161 -358 506
3940 506 -189 -98 182 -420 193 86 -374 526 -316 49 400 -317 110 73 -586 482 -176 -59 531 -400
3960 -400 115 256 -256 472 -174 -333 429 -198 282 220 -417 379 -188 -454 677 -246 83 392 -236 216
3980B16k94m62J030o51j99N95o75O63l2o51J139q19N5M61o97L26J87n09P65l94
4000E4l39Q43j148O68K31o80N74l72q7Q38p90K83K76o95O22k23m19P46n81p0P57
4021D88j054P89j91m27P90n51j22O39o74L20R3n13O37l30l4N43p83N17N8n38O20
4042B77j52j95M22o72M31P8n33N87k50l33P80o41J03K16l67N40j95n74Q01l98
4062g5q3O85j002P14l7n93N31m40J71O10q35N95j01p37J029l06l43O50r18L54
4082a31M13p52P10l59k71P92n84K38K36p02O29k73PN68o79JN55p90O26J05o59
4103c20O29n01Q6N45q08N71M16r53O63l78k24N46l80k9M69r32J090m50k38P05
4123E07p18K03L65o16N03j07n04Q63o34R7K66o81P81j7p45P80m94oM75n54M50
$$ plain form
3980 216 -78 -540 490 -161 -360 235 -440 223 191 -460 679 -140 -85 376 -321 5 192 -317 448 54
4000 54 -285 558 -590 78 309 -371 203 -169 -256 582 -208 75 351 -344 278 55 -364 382 -199 -269 488
4021 488 -566 223 32 -395 395 -156 -278 361 -313 7 100 -413 224 -106 -140 403 -380 137 195 -343 277
4042 277 125 -70 352 -320 111 189 -344 243 -7 -340 440 -201 -98 118 -249 291 96 -478 323 -75
4062 -75 -158 527 -475 239 202 -391 140 -300 -129 481 -354 241 140 -597 432 126 -217 433 -485 -131
4082 -131 282 -470 240 -119 -390 402 -182 56 292 -410 219 -54 -47 521 -158 -157 398 -392 234 339 -320
4103 -320 309 -192 -106 439 -369 202 618 -335 328 -50 -274 272 -108 -137 332 -600 490 40 -198 507
4123 507 -211 -8 357 -259 244 137 -367 496 -138 -41 225 -456 325 308 -437 343 -151 -157 318 -236 214
4144B14j16m54O98l52l61O87n37N5M92o43O10l12l43Q24o29J39K08n28O91k51
4164I2m06N60l47j58O61q06M23J42p94J003n75l5O73r59O83Q0o06N40k50l20P35
4185C36o42J53L10o36Q86k89m85Q78p04K5O52r18M09M5l78P52n15PL29n12M61
4206A64M8o17Q19m21j45O04r50O35J52m99M97l69m30O44m67M68Pp19Q02k38r0
4227a05N73q07K33L23o77P07j79k70M54m29K34L93r67M37J90l01O19p28J25O65
4247D90q21N32k1p26Q74k53j56M31q79M21K08l73N91l61j83M65k90j00Q69j145
4267d27P62j80m03P49p42N3N97q34O87k6o32P14n45J88N62j025L86M45p74O86
4287B41l57k7L47l39J08M12r62R01j69n17O07q46P25K25p85N90o6n50R85n96N1
$$ plain form
4144 214 98 -356 342 -10 -371 316 -221 -166 326 -317 293 -19 -362 462 -167 -28 180 -348 343 92
4164 92 -314 246 -101 -259 402 -404 19 161 -633 370 -205 -240 433 -526 157 237 -369 171 -79 -399 336
4185 336 -306 -153 157 -479 407 118 -367 511 -193 -168 484 -434 -25 20 -358 394 -121 -114 215 -297 164
4206 164 212 -405 414 -7 -152 452 -498 137 289 -210 287 -82 -512 132 -335 133 140 -579 223 -15 -105
4227 -105 468 -339 -106 217 -460 247 68 -202 252 -177 57 450 -517 -80 110 -191 428 -300 -175 490
4247 490 -331 201 180 -546 328 75 -81 350 -529 -108 100 -273 318 -43 -226 239 -51 -151 718 -427
4267 -427 335 155 -248 501 -241 -188 409 -425 262 236 -396 318 -227 -39 523 -502 -116 329 -445 241
4287 241 -116 -143 204 -135 -27 385 -577 324 155 -362 245 -601 124 349 -436 154 88 -462 523 -73 -22
4308b2K25n20M39N3l15M15o36L4O76p59Q02m72k27N72m15R9L91p33M67K87m92
4329a31M92n55j57P89n73J43L66o20L48R3o20Q22p24K19N00p53O28j1n84P40n03
4350i1j53M17n82M35L60p06N44k03l02N43m37K64j4l17N13l16k53M75n17K14N39
4371D13o73O25m00j64N10l58QK11o24P81k29n66Q02o65J18N37p07M26L37p24J012
4392F70p87j17M54m96L65K42o12L97q4k32O08m73J44Q3m88N32q2n94O60k87l4
4413a31M11n90J49M08l02M91l80k57N47n43K67K02p25O83n26J70O29q50K4N31
4433B08l76M76m17l50R36o75L56K6n43L32k01N2M75n41N0N77o58M76l4n81Q29
4454D17n88K52L43p43L81R2m20Q23q30j78Q23o32L73J92p46N30J24m41N84n09
$$ plain form
4308 -22 203 -317 122 175 -140 275 -361 -327 349 -410 392 -80 -307 265 -150 -51 340 -393 74 361 -131
4329 -131 361 -194 -351 438 -135 8 374 -246 102 195 -425 397 -327 -108 392 -361 267 256 -328 412 -91
4350 -91 -244 173 -409 26 386 -320 224 21 -281 262 -175 89 75 -242 271 -45 -298 177 -340 -126 413
4371 413 -260 365 -35 -199 311 -47 -39 172 -452 329 100 -466 336 -329 -211 326 -381 45 382 -342 670
4392 670 -117 -234 220 -276 89 331 -281 116 32 -200 408 -65 79 162 -326 206 124 -470 190 -97 -131
4413 -131 280 -310 -161 247 -55 436 56 -201 346 -197 70 272 -453 230 -296 -126 503 -347 -323 208
4433 208 -168 308 -109 -459 477 -198 158 184 -359 -27 -228 -176 299 -242 -192 385 -273 203 169 -412 417
4454 417 -171 81 424 -319 62 154 -266 557 -273 -451 372 -260 113 305 -441 89 213 -228 356 -153
4474a53J03J06m85P40k61k59O46m80K3L15p09O52j01m17P50m85k91Q06o83L88
4494B05O8o89P04j78l56M11n31N14R5m05L42j36j32N57o37J93K02o73O21k69l8
4515a32M63p03J33N04m21J87r4l48Q39o08J49L35q22O75R7n86M78m64l5P88n25
4536i0L76k02n01Q08l33q8L09m22K10K68n57M34l22L6L69n96J18L54n44N39K89
4557D55n54L26n46K55M60r59P29k1n74Q62l17j79M18o94O64O4o70L61k17p0N85
4578C78m37J24P4l95L93n9l60M85m51L68L90q22K93k2o5M35m61p6M95o23L97K26
4600B87m87M16l61j02O94p75K46P1k71Q43m78l45M85o48M48M10q80O53j63o2K88
4621B69o30L48K91m65L99j55l48O24m16R7J63n10K64L8k66M33k75M6L92l25J33
$$ plain form
4474 -153 -50 56 -429 311 50 -209 437 -43 -20 295 -414 238 137 -280 470 -15 -306 500 -183 205
4494 205 273 -416 288 110 -246 165 -366 148 243 -162 180 44 -88 469 -168 25 227 -446 175 -94 -132
4515 -132 331 -372 -239 265 -156 31 -63 -411 428 -180 -31 304 -518 157 254 -332 146 -318 -353 435 -90
4536 -90 286 84 -417 391 58 -30 279 -143 67 335 -222 212 -110 -74 295 -301 -183 171 -373 166 455
4557 455 -99 227 -319 -64 396 -563 166 145 -429 433 116 -63 355 -339 325 389 -281 80 -137 -207 378
4578 378 -59 65 139 -256 137 78 -282 203 -248 120 510 -312 -19 -41 -106 329 -132 -208 287 -336 61 287
4600 287 -200 216 -145 -247 447 -328 -82 -11 -282 561 83 -262 223 -425 23 433 -447 206 43 -19 269
4621 269 -361 -13 278 -187 212 57 -291 333 -83 14 177 -333 -69 -31 -297 136 -139 -93 299 -26 107
4642A07j07l96O03n3l13M43l73K1K93n06O30l04k05L01k68J20K81o28L84j04J42
4663F8O8k91P3L38l48J55%j75L32k12r8N86o83K25J26m37N02j37k74N01n31K38
4685B6J95n24N65m16L4N42o57J01N64n97L09j62k57L87k23N4M12n21J85L00o48
4706c31O41l64j69L33k86M0L19n04N19k76j61M98l71L13M2n82N60k91l7L03l22
4727a26K05J01n32N63N6n31M30k61k5L99l76K28l8l77N87l82p4L95n54K36K96
4748B20o52N37k23q0M13l25J79J15n79M67K2l43M17m41K65K90l40R5j2j86L79
4769B18k89o3L94m48M45j00o97P52j32l08N44l93N0K55l84L41q8k20L74n26K92
4790A7L05p05N32j18k47N07l23n6L72n88N76N2m54L41m19L1N96p00K86J62m35
$$ plain form
4642 107 0 -396 207 154 -159 284 -89 -68 225 -281 349 45 -160 141 -127 -7 274 -354 30 -74 68
4663 68 136 -155 -82 256 -92 63 63 -112 220 8 -90 496 -187 38 164 -273 229 92 -182 319 -212 26
4685 26 221 -303 262 -154 -120 422 -235 -134 430 -167 142 -20 -277 110 -113 -59 353 -168 17 317 -331
4706 -331 310 -54 -223 110 -176 -136 183 -321 198 -78 -239 259 -112 201 243 -339 221 -70 -107 196 -126
4727 -126 79 180 -352 211 267 -264 166 -95 -120 279 -97 131 93 -284 303 -79 -153 242 -312 -76 220
4748 220 -432 105 -118 -198 215 -110 69 184 -395 72 94 -249 168 -273 -8 282 -58 37 25 -161 218
4769 218 -71 -134 260 -188 257 157 -540 212 80 -228 316 -77 -27 228 -156 185 97 -123 251 -275 17
4790 17 322 -383 149 31 -216 291 -32 -88 284 -304 272 324 -130 211 -208 -177 419 -281 5 167 -268
4811b68M28j92L0L74o60L47P4n67O40p3j56J86l60J99L13n59L74j24p8L39m94
4832b27J46M10n75L87Qj41L21l49J4K85o14L82n6k52N73m36k7L22l34L25L8m00
4854b00M64j08m04O35n21O8J13k02M89k13l38M32l31l3L62k78J48j04j76L59n7
4875A05m69P20o05J57J47k40N07m29K5L84m23K21Pn80O47km17M52m36J14K05k71
4897a81J96N2j34L68n13J65K03m45L63k4m04O98m32l6M16l28J80Pl35K80k58M7
4919a15K59m62L91N0m89N17j92j03M38m30J47Q8j55L25k50j45M48m57Q2K05m09
4940b57L82m7l26M55k12J19Q8n49M86j71j32K84j06j40L53n63M21Nl87O85m35
4961d7NK21j69j20K98n34M75j24k80O94n28M4L29l32K07ql86L06n7K4K48m20M11
$$ plain form
4811 -268 160 -32 -2 372 -288 59 133 -434 206 133 -23 163 -197 2 315 -244 130 6 -72 267 -227
4832 -227 -81 329 -246 141 149 8 329 -20 -6 279 -335 47 -9 -261 312 -124 -151 171 -163 162 200 -200
4854 -200 264 156 -248 387 -134 -66 47 -155 334 121 -217 215 -116 -149 213 -65 83 -21 -197 162 105
4875 105 -364 356 -249 -92 55 -185 322 -107 -82 302 -121 100 107 -473 174 172 -245 207 -229 -115 90 -181
4897 -181 15 67 -67 301 -212 -47 156 -289 74 50 -354 344 -88 -124 292 -36 144 151 -184 96 -162 -115
4919 -115 144 -318 73 123 -366 151 -41 -144 294 -136 11 99 -56 269 19 -126 322 -135 -53 152 -257
4940 -257 125 78 -248 207 -5 114 202 -347 139 -32 -164 120 14 -126 227 -336 85 90 -297 388 -47
4961 -47 -42 179 10 -110 188 -346 129 5 -275 419 -109 -65 264 -68 139 131 -255 51 -6 18 266 -154 257
4984B57j06m78M07l82L20K7l20M97r0k68K28L5l69L70k25K13K3m39M12k38j40
5005b66M31k33j16N38o58K74J99l12L00l27K65O9n02L51K24m19M54l66j05L56
$$ plain form
4984 257 151 -327 80 -302 18 45 -275 222 132 -136 92 127 -242 128 -97 116 139 -300 112 -126 -266
5005 -266 165 -68 -184 354 -304 -30 169 -143 157 -170 95 164 -338 13 237 -182 272 -94 -199 157
$$ [...]
8191b
##END NTUPLES=NMR FID
##END=
