##TITLE=1H_Pr 5007-d
 CDCl3
 8 sc, 
 16.2.2023
##JCAMPDX= 6.0         $$ Bruker NMR JCAMP-DX V2.0
##DATA TYPE= NMR FID
##DATA CLASS= NTUPLES
##ORIGIN= UXNMR, Bruker Analytische Messtechnik GmbH
##OWNER= root
$$ XWIN-NMR		Version 3.5
$$ Thu Feb 16 14:36:32 2023 Russian Standard Time (UT+4h)  she@DPX200
##.OBSERVE FREQUENCY= 200.13135
##.OBSERVE NUCLEUS= ^1H
##.DELAY= (6, 6)
##.ACQUISITION MODE= SIMULTANEOUS
##.ACQUISITION SCHEME= undefined
##.AVERAGES= 8
##.DIGITISER RES= 18
##SPECTROMETER/DATA SYSTEM= spect
##.PULSE SEQUENCE= zg30
##.SOLVENT NAME= CDCl3
##.SHIFT REFERENCE= (INTERNAL, CDCl3, 0, 15.7039)
##AUDIT TRAIL= $$ (NUMBER, WHEN, WHO, WHERE, WHAT)
$$ ##TITLE= Audit trail, XWIN-NMR		Version 3.5
$$ ##JCAMPDX= 5.01
$$ ##ORIGIN= Bruker BioSpin GmbH
$$ ##OWNER= she
$$ F:/spectra/data/she/nmr/H-F/1/audita.txt
$$ ##AUDIT TRAIL=  $$ (NUMBER, WHEN, WHO, WHERE, WHAT)
(   1,<2023-02-16 14:35:20.79 +0400>,<she>,<DPX200>,
      <created by zg, POWCHK disabled, PULCHK disabled
       configuration hash MD5:
       00 E9 B6 7A A2 85 ED C7 34 08 36 98 17 FE 4E 26
       data hash MD5: 16K
       B3 10 73 E7 F2 6D 81 9E 26 A3 C1 02 D1 5E BD E3>)
$$ ##END=
$$ 
$$ hash MD5
$$ 1D 48 69 1C F4 EA 77 71 B3 C3 04 4D C7 6D FF 75
##$RELAX= 
##$RELAX= 
##$RELAX= 
##$RELAX= 
##$RELAX= 
##$RELAX= 
$$ Bruker specific parameters
$$ --------------------------
##$DU= <F:/spectra>
##$EXPNO= 1
##$NAME= <H-F>
##$PROCNO= 1
##$TYPE= <nmr>
##$USER= <she>
##$AMP= (0..31)
100 100 100 100 100 100 100 100 100 100 100 100 100 100 100 100 100 100 
100 100 100 100 100 100 100 100 100 100 100 100 100 100 
##$AQSEQ= 0
##$AQ_mod= 1
##$AUNM= <au_zg>
##$AUTOPOS= <>
##$BF1= 200.13
##$BF2= 200.13
##$BF3= 200.13
##$BF4= 200.13
##$BF5= 200.13
##$BF6= 200.13
##$BF7= 200.13
##$BF8= 200.13
##$BYTORDA= 1
##$CFDGTYP= 0
##$CFRGTYP= 5
##$CHEMSTR= <none>
##$CNST= (0..31)
1 1 145 1 1 1 1 1 1 1 1 1 1 1 1 1 1 1 1 1 1 1 1 1 1 1 1 1 1 1 1 1 
##$CPDPRG= <>
##$CPDPRG1= <>
##$CPDPRG2= <>
##$CPDPRG3= <>
##$CPDPRG4= <mlev>
##$CPDPRG5= <mlev>
##$CPDPRG6= <mlev>
##$CPDPRG7= <mlev>
##$CPDPRG8= <mlev>
##$CPDPRGB= <>
##$CPDPRGT= <>
##$D= (0..31)
0 1.2 0 0 0 0 0 0 0 0.06 0 0.03 0 0 0 0 0.0002 0 0 0 0 0 0 0 0 0 0 0 0 
0 0 0 
##$DATE= 1676543720
##$DBL= (0..7)
120 120 120 120 120 120 120 120 
##$DBP= (0..7)
150 150 150 150 150 150 150 150 
##$DBP07= 0
##$DBPNAM0= <>
##$DBPNAM1= <>
##$DBPNAM2= <>
##$DBPNAM3= <>
##$DBPNAM4= <>
##$DBPNAM5= <>
##$DBPNAM6= <>
##$DBPNAM7= <>
##$DBPOAL= (0..7)
0.5 0.5 0.5 0.5 0.5 0.5 0.5 0.5 
##$DBPOFFS= (0..7)
0 0 0 0 0 0 0 0 
##$DE= 6
##$DECBNUC= <off>
##$DECIM= 32
##$DECNUC= <off>
##$DECSTAT= 4
##$DIGMOD= 1
##$DIGTYP= 9
##$DL= (0..7)
0 120 120 120 120 120 120 120 
##$DP= (0..7)
150 150 150 150 150 150 150 150 
##$DP07= 0
##$DPNAME0= <>
##$DPNAME1= <>
##$DPNAME2= <>
##$DPNAME3= <>
##$DPNAME4= <>
##$DPNAME5= <>
##$DPNAME6= <>
##$DPNAME7= <>
##$DPOAL= (0..7)
0.5 0.5 0.5 0.5 0.5 0.5 0.5 0.5 
##$DPOFFS= (0..7)
0 0 0 0 0 0 0 0 
##$DQDMODE= 0
##$DR= 18
##$DS= 0
##$DSLIST= <SSSSSSSSSSSSSSS>
$$ [...]
##$SUBNAM2= <"">
##$SUBNAM3= <"">
##$SUBNAM4= <"">
##$SUBNAM5= <"">
##$SUBNAM6= <"">
##$SUBNAM7= <"">
##$SUBNAM8= <"">
##$SUBNAM9= <"">
##$SW= 18.05172834244
##$SWIBOX= (0..15)
0 0 2 0 0 0 0 0 0 0 0 0 0 0 0 0 
##$SW_h= 3612.71676300578
##$TD= 16384
##$TD0= 1
##$TE= 0
##$TE2= 300
##$TE3= 300
##$TEG= 300
##$TL= (0..7)
0 120 120 120 120 120 120 120 
##$TP= (0..7)
150 150 150 150 150 150 150 150 
##$TP07= 0
##$TPNAME0= <>
##$TPNAME1= <>
##$TPNAME2= <>
##$TPNAME3= <>
##$TPNAME4= <>
##$TPNAME5= <>
##$TPNAME6= <>
##$TPNAME7= <>
##$TPOAL= (0..7)
0.5 0.5 0.5 0.5 0.5 0.5 0.5 0.5 
##$TPOFFS= (0..7)
0 0 0 0 0 0 0 0 
##$TUNHIN= 0
##$TUNHOUT= 0
##$TUNXOUT= 0
##$USERA1= <user>
##$USERA2= <user>
##$USERA3= <user>
##$USERA4= <user>
##$USERA5= <user>
##$V9= 5
##$VALIST= <valist>
##$VCLIST= <CCCCCCCCCCCCCCC>
##$VD= 0
##$VDLIST= <DDDDDDDDDDDDDDD>
##$VPLIST= <PPPPPPPPPPPPPPP>
##$VTLIST= <TTTTTTTTTTTTTTT>
##$WBST= 1024
##$WBSW= 4
##$XGAIN= (0..3)
0 0 0 0 
##$XL= 0
##$YL= 0
##$YMAX_a= 235947
##$YMIN_a= -315090
##$ZGOPTNS= <>
##$ZL1= 120
##$ZL2= 120
##$ZL3= 120
##$ZL4= 120
##$ABSF1= 10
##$ABSF2= 0
##$ABSG= 5
##$ABSL= 3
##$ALPHA= 0
##$AQORDER= 0
##$ASSFAC= 0
##$ASSFACI= 0
##$ASSFACX= 0
##$ASSWID= 0
##$AUNMP= <proc_1d>
##$AZFE= 0.1
##$AZFW= 0.1
##$BCFW= 1
##$BC_mod= 2
##$BYTORDP= 1
##$COROFFS= 0
##$CY= 11.3945322036743
##$DATMOD= 1
##$DC= 2
##$DFILT= <>
##$DTYPP= 0
##$F1P= 2.36226072786647
##$F2P= -0.459571619588291
##$FCOR= 0.5
##$FTSIZE= 0
##$FT_mod= 4
##$GAMMA= 1
##$GB= 0.15
##$INTBC= 1
##$INTSCL= 1
##$ISEN= 128
##$LB= 0.24
##$LEV0= 0
##$LPBIN= 0
##$MAXI= 10000
##$MC2= 0
##$MEAN= 0
##$ME_mod= 0
##$MI= 1.114404
##$NCOEF= 0
##$NC_proc= 0
##$NLEV= 6
##$NOISF1= 3.799351
##$NOISF2= 2.8
##$NSP= 1
##$NTH_PI= 0
##$NZP= 0
##$OFFSET= 15.70392
##$PC= 1
##$PHC0= -19113.11
##$PHC1= 13.20078
##$PH_mod= 1
##$PKNL= yes
##$PPARMOD= 0
##$PSCAL= 0
##$PSIGN= 0
##$REVERSE= no
##$SF= 200.130013532006
##$SI= 16384
##$SIGF1= 3
##$SIGF2= 2
##$SINO= 400
##$SIOLD= 16384
##$SREGLST= <1H.CDCl3>
##$SSB= 0
##$STSI= 0
##$STSR= 0
##$SW_p= 3612.71676300578
##$SYMM= 0
##$S_DEV= 0
##$TDeff= 0
##$TDoff= 0
##$TI= <>
##$TILT= no
##$TM1= 0
##$TM2= 0
##$TOPLEV= 0
##$USERP1= <user>
##$USERP2= <user>
##$USERP3= <user>
##$USERP4= <user>
##$USERP5= <user>
##$WDW= 1
##$XDIM= 8192
##$YMAX_p= 0
##$YMIN_p= 0
$$ End of Bruker specific parameters
$$ ---------------------------------
##NTUPLES= NMR FID
##VAR_NAME=  TIME,          FID/REAL,        FID/IMAG
##SYMBOL=    X,             R,               I
##VAR_TYPE=  INDEPENDENT,   DEPENDENT,       DEPENDENT
##VAR_FORM=  AFFN,          ASDF,            ASDF
##VAR_DIM=   8192,          8192,            8192
##UNITS=     SECONDS,       ARBITRARY UNITS, ARBITRARY UNITS
##FACTOR=    0.0002768,     1,               1
##FIRST=     0,             0,               0
##LAST=      2.2672688,     0,               0
##MIN=       0,             -315090,         0
##MAX=       2.2672688,     235947,          0
$$ Real data points
##PAGE= N=1
##DATA TABLE= (X++(R..R)), XYDATA
$$ [...]
1863d72K23L82n36R2J61J34j55L9J98K23l48j02K83K11k87q3M27J54n72N6K03
$$ -472 -249 133 -403 -311 -150 -16 -171 -132 66 289 -59 -161 122 333 46 -37 390 544 -28 28 231
1884B31J2l22J35l8L2r1J12m4j11q4K72r4p9j56j79N84o7n13L63M55l82j35J87
$$ 231 243 -79 56 18 50 -41 71 27 -84 -168 104 10 -69 -225 -404 180 113 -400 -37 418 36 -99 88
1907H8K99n3m02K35J13j20j29j2J25Q5j88p6M68o50n1K16J81j32l36L74J82j51
$$ 88 387 334 -68 167 280 160 31 19 144 229 41 -35 433 -217 -268 -52 129 -3 -339 35 217 66
1929F6k26k3M57k44k45K49Pp0l17L65P5J09k50M79l11R4q3J87j2l51L4J04o6m83
$$ 66 -160 -183 274 30 -215 34 41 -29 -346 19 94 203 -47 432 121 215 132 319 307 -44 -10 94 28 -455
1953d55N30oqk23k20L43j54j25J78L45j76j47N3J11K00l05r5N87k75j83M40k5
$$ -455 75 69 61 -162 -382 -39 -193 -318 -140 205 29 -118 -65 46 246 -59 -154 433 158 -25 415 390
1975C90j65j12J10M4J10m28oJ66j57k44K04K40ll41q9M51j66r4J6jj09l3J96K3
$$ 390 225 113 223 267 377 -51 -57 109 -48 -292 -88 152 149 -192 -281 170 4 -90 -74 -75 -184 -217 -21 2
1999Bq3l1Q9L14m07j11M07j14K34j70r5K03k95K13j85K68k12k3M3j66n6Q5Or8
$$ 2 -81 -112 -23 291 -116 -227 180 66 300 130 35 238 -57 156 -29 239 27 4 47 -119 -175 -90 -84 -182
2023a82K72j94J51J01l88K04J3m7O2N6J74k23k10K65K6r8K09Q6n02M62m04L18
$$ -182 90 -104 47 148 -240 -36 -23 -70 -8 48 222 -1 -211 54 80 -18 191 277 -225 237 -167 151
2045A51J01j82L6k41K12J80j87k76J68k8P7j18J92l16P2j81M17j01k99M19j6k89
$$ 151 252 70 106 -135 77 257 70 -206 -38 -66 11 -107 85 -231 -159 -340 77 -24 -323 96 80 -209
2067b09J99J16k7k53K59N0o7J8j49J44J61k50R7kk9n07P31j02j96l25M24J0l82
$$ -209 -10 106 79 -174 85 135 68 86 -63 81 242 -8 89 87 58 -449 282 180 -16 -341 83 93 -289
2090b89J27M06m9k81K03Q9k41k6L33j63j25j98K77k53K74J19n3j72J50K22k06
$$ -289 -162 244 195 -86 117 206 -35 -61 272 109 -16 -214 63 -190 84 203 150 -22 128 350 144
2111A44k83L01n4j31j01L73j61O1j40R9j87r3P2K28j62l74N09K38l93q6N52L7
$$ 144 -139 162 108 -23 -124 249 88 149 9 108 -79 -172 -100 128 -34 -408 101 339 -54 -140 412 449
2133D49n30j5K05K51n90L60L49l97j61M54m95J43k27J54K92m83K39J19k42k44
$$ 449 -81 -96 109 360 -230 130 479 82 -79 375 -120 23 -204 -50 242 -241 -2 117 -125 -369
2153c69K1M61l55j8M38K6l17k7M32k21p9J7K13l03J20L80n99k55O30m8m8l27L68
$$ -369 -348 113 -242 -260 178 204 -113 -140 292 71 -8 9 222 -81 39 419 -180 -435 195 147 99 -228 140
2176A40p3j68p9K88n7j19r3L86m77K6M02j74j62j22N44O5m81J32ooj98K12M33
$$ 140 67 -101 -180 108 51 -68 -161 225 -252 -226 176 2 -160 -282 262 327 -154 -22 -28 -34 -232 -20 413
2199D13m45n3K42Q6m67J84K94l03p6K04J89j68m06K88J57k79j79M53j02k75r6
$$ 413 -32 -85 157 243 -224 -40 254 -49 -125 79 268 100 -306 -18 139 -140 -319 134 32 -243 -339
2220c39N42L0n62K87J51j61R5L14k02j73r2M60k86k75L98j73q5L4K49m7k26M5
$$ -339 203 233 -329 -42 109 -52 43 357 155 -18 -110 350 64 -211 187 14 -71 -37 212 165 -61 -16
2242a6K09j78l16K90J63k91k56M42K50n53j04L11O3j67j8P7K88m31J97M85l07
$$ -16 193 15 -301 -11 152 -139 -395 47 297 -256 -360 -49 14 -153 -171 -94 194 -237 -40 445 138
2263A38l88K56Q8k63K63K83q4l55O7L19n24K02L17k61l59K66L18n68mL47m2l68
$$ 138 -250 6 94 -169 94 377 293 -62 5 324 -200 2 319 58 -301 -35 283 -285 -289 58 16 -352
2285c52M1K48J14l50L31K26m05j57L93K81l89k52O03j12k96j17M76l31j04J80
$$ -352 -311 -63 51 -299 32 258 -147 -304 89 370 -19 -271 332 220 -76 -193 283 -48 -152 28
2305B8p9qj54L32k32j55j69L76J38l03L01K7l31p0K84R6j16k29L98J22l40N2J53
$$ 28 -51 -59 -213 119 -113 -268 -437 -61 77 -226 75 102 -229 -299 -15 81 -35 -264 134 256 -84 -32 121
2328A21n3m12N02R4k90J00J07o2j19J22j33N8k90j17M41j30N5M5r6j27L42J4j42
$$ 121 68 -344 158 252 -38 62 169 107 -12 110 -23 35 -255 -372 69 -61 -6 39 -57 -184 158 172 30
2351C0k03L9M37k14m36L57J07l58J10K29j46p4J35K27k77l5L2O2P6k11j18R2L50
$$ 30 -173 -134 303 89 -347 10 117 -241 -131 98 -48 -122 13 240 -37 -72 -40 22 98 -113 -231 -139 211
2374B11l05N5P7k38l3J43J73k19J78l41J60K55r7K31k65Q6L0j8n6jJ56j59M2K17
$$ 211 -94 -39 38 -200 -233 -90 83 -136 42 -299 -139 116 19 250 -15 71 101 83 27 26 182 23 65 282
2398B82k14k23J76K49k21j00K17j45K6m16L91k47j14L71J08Pl56L04M0l38R0K47
$$ 282 68 -155 21 270 49 -51 166 21 47 -369 22 -225 -339 32 140 147 -209 95 135 -203 -113 134
2420A34l00J83K0J93m3j86P2N6m3j55k12O36q9J09n10J29j66L87l08j7N1L9k58
$$ 134 -166 17 37 230 187 1 73 129 86 -69 -281 355 266 375 -135 -6 -172 215 -93 -110 -59 -20 -278
2443b78J80r9J96j37J45N6k14J32O0J59l98J76J08J37l12J02J60q6j40J15J0N2
$$ -278 -98 -197 -1 -138 7 63 -151 -19 41 200 -198 -22 86 223 -89 13 173 87 -53 62 72 124
2465A24o8o3K26l33J61j32J29j70K1mK20l48R5K98r4l21k0L85J1j35PJ01k4j76
$$ 124 56 -7 219 -114 47 -85 44 -126 -105 -109 111 -237 -142 156 62 -259 -279 106 117 -18 -11 90 66 -110
2489a10j43K05j99K97J42l35J49K1j1j1Np5J27k79L3J90m65L51J99N2j69j20j1
$$ -110 -253 -48 -247 50 192 -143 6 27 16 5 10 -65 62 -217 -184 6 -459 -108 91 143 -26 -146 -157
2512a57M10j76q5K8o9J46k28K98l59L40j96k7r0M49j79O6r8j7J32k71J05L7j00
$$ -157 253 77 -8 20 -49 97 -131 167 -192 148 -48 -75 -165 284 105 171 73 56 188 -83 22 59 -41
2535d1n2l1L37m59L11j56j11K85k24j28J18MJ91J86j34q5J49K6l31L05J39k7j82
$$ -41 -93 -124 213 -246 65 -91 -202 83 -141 -269 -151 -147 44 230 96 11 160 186 -145 160 299 272 90
2558I0k1j69K02j56K13j83j51K27j13l9o6jJ23K88k77J32q0R8L0j05M3k30N3%
$$ 90 69 -100 102 -54 159 -24 -175 52 -61 -100 -166 -167 -44 244 -33 99 19 117 147 42 85 -145 -92 -92
2582i2j51K82J31j28KJ21j28k16L46J8j76L6m8J97l51K22P8j70J94j08J7j1j79
$$ -92 -243 39 170 42 44 165 37 -179 167 185 9 45 -3 194 -157 65 143 -27 167 59 76 65 -114
2605a14n7K18M8k12M7j90J94l5K57k2j44q3J45k6J47m1K2O2j56K2J47p1j53P7
$$ -114 -171 47 95 -117 -70 -260 -66 -101 156 134 -10 -93 52 26 173 132 154 216 60 82 229 158 5 82
2629H2n6l9j19K20J31m21K31k81K79K18l85K6J43J3j37J11M4j52QK0O9J62l42
$$ 82 26 -13 -132 88 219 -202 29 -252 27 245 -140 -114 29 42 -95 16 60 -92 -84 -64 5 167 -175
2652a75K45oP7k52J24m0J73L5k8k20P1l10R5L75k09j13M86k30l47J03j0kK69k27
$$ -175 70 64 141 -111 13 -27 146 181 153 -67 4 -306 -211 164 -45 -158 328 98 -249 -146 -156 -158 111 -116
2676a16J94j32m6k0L08j05j61L85j69k06k26K91N5O3o9n6K92k42j48J41k7p5K6
$$ -116 78 -54 -100 -120 188 83 -78 307 138 -68 -294 -3 52 115 46 -10 282 40 -108 33 6 -69 -43
2699d3k7j7m8k89L92j30J96r8P1j57N46o07J91K77l64R1j15k1R3R1q7J56J47k83
$$ -43 -70 -87 -135 -424 -32 -162 34 -64 7 -150 396 -211 -20 257 -107 -16 -131 -152 -59 32 -55 101 248 -35
2723c5j09K76k57j70M44r9k35j49L26k3r8K0K57j59j0j08K62j08J3j76J55j27
$$ -35 -144 132 -125 -295 149 50 -185 -334 -8 -31 -129 -109 148 -11 -21 -129 133 25 38 -138 17 -110
2745a10m0L79j80k58J55K0J46k18q0K78j04o5P5Ll1r3J08P7j83k4k37J81NK04
$$ -110 -150 229 49 -209 -54 -34 112 -106 -186 92 -12 -77 -2 1 -30 -123 -15 62 -121 -145 -382 -201 -196 8
2769Hnj7j34R5L9j12M00j83j14n9K98l62K20K07l26n2Q5j09J74o8j01K45j55j42
$$ 8 3 -14 -148 -53 -14 -126 274 91 -23 -82 216 -146 74 281 -45 -97 -12 -121 53 -15 -116 129 -26 -168
2793a68n8R1K72j07l26N01P4k67k10K80J3K2r1k7j57L31k98k9K53j84K43k38K26
$$ -168 -226 -135 137 30 -296 205 279 12 -198 82 95 117 26 -1 -158 173 -125 -154 99 -85 158 -80 146
2816A46k04L01j84K44l81K20j14J6o3K08k33Q5k50J48J81j58J06k42j8J78k21
$$ 146 -58 243 59 303 -78 142 28 44 -19 189 -44 41 -209 -61 120 -38 68 -174 -192 -14 -235
2837b35K87J8k4q4K37l78K29m5J30N7J73l57J0K26j92M2L2M8l87L32J41m23o5
$$ -235 52 70 46 -38 199 -179 50 5 135 192 365 8 18 244 52 94 126 174 -213 119 260 -163 -228
2860b28o1L46N9n31M88p1q2M7j62L28l0k32R6J76j23r7R8p2J64J06k36P8l9J79
$$ -228 -289 57 116 -415 73 2 -80 -33 -195 133 103 -129 -33 143 20 -77 21 -51 113 219 -17 61 22 201
2884B01j82q9k3j11L26O3l61L42k03k0n2P2Q1j76m6K64r0j7K44k53o1%K10p6j29
$$ 201 19 -70 -93 -204 122 185 -176 166 -37 -57 -109 -37 44 -132 -178 86 -4 -21 223 -30 -91 -91 119 43 -86
2909h6K55k06n6K19k19P8j5o5J51j15j78L00r5l07K24J80j00k37L56J66k54o6
$$ -86 169 -37 -93 126 -93 -15 -30 -95 56 -59 -237 63 -32 -339 -115 65 -35 -272 84 250 -4 -70
2931g0K04j57p1j52P4J95j9J14k64J60k0O0L3K8m0j01P4K77m48K01L3k1q0j8j
$$ -70 134 -23 -94 -246 -172 23 4 118 -146 14 -6 54 87 115 75 -26 48 325 -123 78 111 90 10 -8 -9
2956ik87J82Q3K91l14j9r5L37l19J60q4Q4J23l14P3K58j63Nj33L69k25p1J60m
$$ -9 -296 -114 -31 260 -54 -73 -168 169 -150 10 -74 10 133 -181 -108 150 -13 -8 -141 228 3 -68 92 88
2980H8m7k81L29j24R2j54j04R9j41n1L66p1K4J58k87J73J1m6j0K06m0j75J35k62
$$ 88 41 -240 89 -35 57 -97 -201 -102 -243 -294 72 1 25 183 -104 69 80 34 24 230 190 15 150 -112
3004a12J41j80K10J11m79K84K13j24m9j3K05n6k19M18m04j42p2J76K35k44J89
$$ -112 29 -151 59 170 -309 -25 188 64 15 2 207 151 -68 350 -54 -196 -268 -92 143 -101 88
3025H8l6j42j5J25Q9j47Q0j39K22O5n2J01j79M6j84J10J94k71J4K01k67J97Q4
$$ 88 52 -90 -105 20 109 -38 42 -97 125 190 138 239 60 106 -78 32 226 -45 -31 170 -97 100 184
3048A84L1k82k15M69Mk12N2k75K24N3J3r4j95K60j08Q7J80j33N0j13J55kJ17l29
$$ 184 215 -67 -282 187 191 -21 31 -244 -20 33 46 -48 -243 17 -91 -4 176 43 93 -20 135 133 250 -79
3072g9Q1L20o84L67J72k46Q0o3j65L50j32j01K52J36j06m0r0r1O8RJ75l36j9K92
$$ -79 2 322 -362 5 177 -69 11 -52 -217 133 1 -100 152 288 182 142 52 -39 29 38 213 -123 -142 150
3096A50l45K28j54J11R5K18k71j99L52Oj82n3M18l62j9K90j28k43k2J24j51J36
$$ 150 -195 33 -121 -10 85 303 32 -167 185 191 9 -44 374 12 -7 283 155 -88 -110 14 -137 -1
3118ak07J81K17m60J56j44K07j08j64M76q3NJ32k54J64J28k14O9J49m37L45k06
$$ -1 -208 -27 190 -270 -114 -258 -51 -159 -323 153 70 75 207 -47 117 245 31 100 249 -188 157 -49
3140d9K72j69J09m3k2j23k9J19j91J08p9L9K5R3l84L60J89k74M4R5r3l9P8p0L7
$$ -49 223 54 163 120 98 -25 -54 65 -126 -18 -97 -58 -33 60 -324 36 225 -49 -5 90 -3 -42 36 -34 3
3165CJ7r3J46q5j78M51k35k62K56K01o2k36J21j80N3J20m2J3j16K03k58K53J95
$$ 3 20 -73 73 -12 -190 261 26 -236 20 221 159 -77 44 -136 -83 37 -5 8 -108 95 -163 90 285
3188B85l36Q7k33J78J22j53J52n26K64K70k61M02k2j46J5r4J03K4j0j30K61k35
$$ 285 -51 36 -197 -19 103 -50 102 -424 -160 110 -151 251 229 83 98 4 107 131 121 -9 252 17
3210A7k03M75m29O4k9o5R9j62M31j21k88K65P0o1O0o1j14m6L2L68m16O5K12q9
$$ 17 -186 289 -140 -76 -105 -170 -71 -233 198 77 -211 54 124 63 123 62 -52 -98 -66 302 -114 -49 163 74
3234G4N5k16j7K9OR0K5J42J01k12j39l08J44J06k3J96k0r0J5k25L12L1r1l21K06
$$ 74 129 -87 -104 -75 -69 21 46 188 289 77 -62 -370 -226 -120 -143 53 33 -57 -42 -267 45 76 -15 -336 -130
3259a30L10j02M5ol59Q7J08L7J25j46J18p4j62K91j93J32k17K85l71J85Rj36J84
$$ -130 180 78 123 117 -242 -155 -47 -10 115 -31 87 13 -149 142 -51 81 -136 149 -222 -37 -28 -164 20
3282B0k60L81j77j78K46L54k39n0j12j3K54k0l18L16l66K86k5j01L28l56K49r0
$$ 20 -240 141 -36 -214 32 386 147 97 -15 -28 226 206 -112 204 -162 124 99 -2 326 -30 219 129
3304A29M0m88K51l4K21m18L92j20Pk44K35K13l99p2L88R8l02j27K67K05l52K07
$$ 129 169 -319 -68 -102 119 -299 93 -27 -20 -264 -29 184 -215 -287 101 199 -103 -230 37 242 -110 97
3326I7j15j37K00q7J44l2qk22J68K46j38J9k88R7M1r8J13K57l56L51n07K09J75
$$ 97 -18 -155 45 -42 102 70 62 -160 8 254 116 135 -153 -56 -15 -113 0 257 -99 252 -255 -46 129
3349A29l65L5K31J58k55Q6M2l9K46k18J86k61q5J61P3j18j36K01J07j08j88K87
$$ 129 -236 -201 30 188 -67 19 61 22 268 50 236 -25 -110 51 124 6 -130 71 178 70 -118 169
3371A69k06J16J64k74JK4J14j06j02K31J02k84p2J82J77j21j49j14J52j10J15
$$ 169 -37 79 243 -31 -30 -6 108 2 -100 131 233 -51 -123 59 236 115 -34 -148 4 -106 9
3392IM31n03K41j56Q8j09qP8j09N3Q2k14J08n3k42M08o6q3OJ43m3J25k63k34J94
$$ 9 440 -63 178 22 110 1 -7 71 -38 15 97 -117 -9 -62 -304 104 38 -45 -39 104 61 186 -77 -311 -117
3417a17K26J89l14o4J78J86l77K03Qk74L9k2J50j00J48J2O0k44K8M4M8j01Q5j16
$$ -117 109 298 -16 -80 98 284 -93 110 118 -156 -117 -139 11 -89 59 71 131 -113 -85 -41 7 -94 -9 -125
3441a25K06k6k07M13k10L6J9J14k49l4Rk80O03j87P6l47K08p4J9O5m2MJ4k54K58
$$ -125 81 55 -152 261 51 87 106 220 -29 -63 -54 -334 269 82 158 -189 19 -55 -36 29 -13 -9 5 -249 9
3466Ij51L53m72r0L82o6n2J08J99k35q3L35k83j37J5O7J23N3r0l7J38P3q7j02
$$ 9 -142 211 -261 -351 31 -35 -87 21 220 -15 -98 237 -46 -183 -168 -101 22 75 -15 -52 86 159 72 -30
3490c0k7J58q0j50P9K11M8j41l26L98k40m22L72K41k49J78J0l14j28K46l0R1j0
$$ -30 -57 101 21 -129 -50 161 209 68 -258 140 -100 -522 -150 91 -158 20 30 -284 -412 -166 -196 -105 -115
3513a15J64j39j01Q7J1L9l1L47N1m54J20K48k8n6k98K69l50L71P1j12k71R4J31
$$ -115 49 -90 -191 -104 -93 -54 -85 262 313 -141 -21 227 199 143 -155 114 -236 135 206 94 -177 -83 48
3536D8qj61L6p0J04q5K53L9m45J66m0J21K8k5j96P8n1pL39N5o3n9j50K05k9o0
$$ 48 40 -121 -85 -155 -51 -136 117 156 -289 -123 -163 -42 -14 -39 -235 -157 -208 -215 124 179 116 57 -93 112 83 23
3562B3p0O7lJ33k72K31k86RJ26M9k9m9r0K04N4l64J89k6K86k48J91k43L43l7k98
$$ 23 -47 20 17 150 -122 109 -177 -168 -42 7 -22 -71 -161 43 97 -267 -78 -104 182 -66 125 -118 225 188 -110
3587a10J97j72q2K60O3k48Q0j16K12k31J89K6J65p7r6j22P8l40N72j94j15J34
$$ -110 87 -85 -167 93 156 -92 -12 -128 84 -147 42 68 233 156 60 -62 16 -324 248 54 -61 73
3609G3k22J42m9j43L12j89J42R5k46NO1J91Q7n3O5kk32j64p3L14k0J00k59K20
$$ 73 -149 -7 -56 -199 113 -76 66 161 -85 -80 -19 172 259 206 271 269 37 -127 -200 114 94 194 -65 155
3633A55k28J22k42J45m6n1J53K3N0K09l82K02m02M23j33L1J94l50J70j91J62o1
$$ 155 -73 49 -193 -48 -94 -145 8 31 81 290 -92 110 -292 131 -2 29 223 -127 43 -148 14 -47
3655d7K5J2j3lJ24j20j3J06P4l4r5j64J03j2j19K60k26K78j97J1J95l26M67k28
$$ -47 -22 -10 -23 -26 98 -22 -35 71 145 111 16 -148 -45 -57 -176 84 -142 136 -61 -50 145 -181 286 58
3679E8j74M15j11j99N4k13M07o1j73k27M31j66l57J53J90j88J58J23m38L18l6
$$ 58 -116 299 188 -11 43 -170 237 176 3 -224 207 41 -316 -163 27 -161 -3 120 -318 0 -36
3700c6n1J42r3J30J82k14J7j72K43p5q3K73j82K89n09N2l6J46j3N1j21J7p6K37
$$ -36 -87 55 -38 92 274 60 77 -95 148 73 -10 263 81 370 -139 -87 -123 23 10 61 -60 -43 -119 118
3724A18o9q0P6J31k26R7j20N2j7p2K15n7K6j26J34l28L43o9j8J60k23J03j01J00
$$ 118 49 -31 45 176 -50 47 -73 -21 -38 -110 105 48 74 -52 82 -246 97 28 10 170 -53 50 -51 49
3748D9OL03l07M9lj66K89n6k53K96k38J30J9Ol37N5p0L31k29J69K02k81R9k69
$$ 49 55 358 51 100 97 -69 220 164 -89 207 -31 99 118 124 -213 -158 -228 103 -126 43 245 -36 63 -206
3772b06R2K8P4j87K97j60K10m58L57m6R0O2l00K19J07p4k86M55k18j56K66k68
$$ -206 -114 -86 -12 -199 98 -62 148 -310 47 1 91 153 -147 72 179 105 -181 274 56 -100 166 -102
3794a02j23M84k34q0O3N6j52j61J45J64J3j02J22j03qK86o8Q2k08k81K76m9N0
$$ -102 -225 259 25 -55 8 64 -88 -249 -104 60 73 -29 93 -10 -18 268 200 282 74 -207 69 20 70
3817G0K10l58n1P9l3K81j78j85j02M25j74J29J16n60L51j44J68J77l03k3K33j13
$$ 70 280 -78 -129 -50 -83 198 20 -165 -267 158 -16 113 229 -331 20 -124 44 221 -82 -105 128 15
3839A5K3J39o5m8m0j17M8L32m39M1J14k16K74o3J46j0j66R0j8k63r5L46j22N3
$$ 15 38 177 112 64 24 -93 -45 287 -152 -111 3 -213 61 -2 144 134 -32 58 40 -223 -318 28 -94 -41
3863d1J06r5N8j51K45l7k05L3J3Q1j28J93j66K58j51J02j7m29L55J02N1k68K62
$$ -41 65 -30 28 -123 122 85 -120 -87 -74 7 -121 72 -94 164 13 115 98 -331 24 126 177 -91 171
3886A71k28J47j55P4P2J7m8k29J21n3M62m80O4J07K51l41M3j96J94O0k9M4p1J19
$$ 171 -57 90 -65 9 81 98 50 -179 -58 -111 351 -129 -65 42 293 -48 -5 -201 -7 53 24 68 -3 116
3910A16k75o3o4M39j77k24K14K32j64j89K30l83M89j35j43N2Q2L7j1j4J78l48
$$ 116 -159 -222 -286 153 -24 -248 -34 198 34 -155 75 -308 181 46 -97 -45 37 74 63 49 227 -121
3932a21J03N8m9K59q3k24Q0k30N57l53J22k84J48j12L25l6k38J68k47M32k48J48
$$ -121 -18 40 -9 250 167 -57 23 -207 350 -3 119 -165 -17 -129 196 160 -78 90 -157 275 27 175
3954A75M0j71P0m05K72j71J83Q7Lj68j5K07kj90n2J46k47M87k30l6J12J7k1j4
$$ 175 215 44 114 -291 -19 -190 -7 80 83 -85 -100 107 105 -85 -137 9 -238 249 19 -17 95 112 91 77
3978G7k24J11O2j4N8J1J22k34p4L7K56m5R2k08p3J5K31k48K83k18Q9j2J91k3l91
$$ 77 -147 -36 26 12 70 81 203 -31 -105 -68 188 143 235 27 -46 -31 200 -48 235 17 106 94 285 262 -129
4003a29K18J3j24J3J20j9j51l4L25O0j7l17L91l87q7L89j28o3j94L8J55o8n3L9
$$ -129 89 102 -22 -9 111 92 -59 -93 232 292 275 -42 349 -38 -125 264 136 73 -121 -83 72 4 -49 -10
4027a0j36j1J37j35K90j07L9m2N4Lk05o2K25J26k16J92j64K38m43K06p9M5j79
$$ -10 -146 -157 -20 -155 135 28 67 25 79 82 -123 -185 40 166 -50 142 -22 216 -227 -21 -100 -55 -234
4050b34L0L01k04o4J50M1P5l4J03k39J06k23j02J16K96j47o6Q1j79K60q3P5m6
$$ -234 -204 97 -107 -171 -21 20 95 61 164 -75 31 -192 -294 -178 118 -29 -95 -14 -193 67 -16 59 13
4073A3N2j15J84k23O0O3p4M8j63J51J24j93J14j47Ml0k29K49O0N9k23L79r3l99
$$ 13 65 -50 134 -89 -29 34 -40 8 -155 -4 120 -73 41 -106 -102 -132 -361 -112 -52 7 -216 163 70 -329
4097c29J53R0K07k84R2L7o9M6k4K59L2j69j18J20J29o4j48K79j66k64J5o7K79
$$ -329 -176 -86 121 -163 -71 -34 -103 -57 -81 178 210 41 -77 43 172 108 -40 239 73 -191 -176 -243 36
4120C6J60k76Q7l9J27j64j87L92l17J42o1j92L43J08j8k53P2K19l91N07l63N23
$$ 36 196 -80 7 -32 95 -69 -256 136 -181 -39 -100 -292 51 159 141 -112 -40 179 -212 295 -68 455
4142D55m43j87M14j24k23J24q5K54l81K50l5l19K67%J79o7ok11j66M15j41n5m3
$$ 455 12 -175 239 115 -108 16 -69 185 -196 54 19 -300 -33 -33 146 79 73 -138 -304 111 -30 -85 -128
4165a28J00J64m52M31j65j09K85m32M94m51O01l76k9r0j16J57P5R3r1M1j91J33
$$ -128 -28 136 -316 115 -50 -159 126 -306 188 -263 338 -38 -67 -157 -273 -116 -41 52 -39 2 -189 -56
4187e6k91L82n8K12k44K75K0j21j09j41J90m06O33j67m44L65k36K62M3j08P8N5
$$ -56 -347 35 -23 189 -55 220 240 119 10 -131 59 -347 286 119 -325 40 -196 66 109 1 79 134
4209A34j50Q0K04k55p3R5l6J73m33J2J79m4K59l10J79j36J48j97J60J82j81m3
$$ 134 -16 64 268 13 -60 35 -1 172 -261 -249 -70 -114 145 -165 14 -122 26 -171 -11 171 -10 -53
4231e3L7o1J24j4J24o7k38K27J64j44j29P0O9j7K4k29J13j08J69n8J09k60K50
$$ -53 -16 -77 47 33 157 90 -148 79 243 99 -30 40 109 92 116 -113 0 -108 61 3 112 -148 102
4254A02J29k18o9J43r9Kk8K74j36j07n3J88l0n33L10O0P7m0R2j72K56j29j11M00
$$ 102 231 13 -56 87 -12 -10 -38 236 100 -7 -60 128 98 -435 -125 -65 12 -28 64 -108 148 19 -92 308
4278C08m4p49N50J54l83J93L1N5l9j72J69j91J0J39q8k33K43K61j37J63m67M67
$$ 308 264 -485 65 219 -164 29 60 115 76 -96 73 -118 -108 31 -57 -290 -47 214 77 240 -227 240
4300B40k37m1J55j90K46k9j46O3M1l45K25k7L3R0j38q9J98o0J8K42k76J23j43
$$ 240 3 -38 117 -73 173 144 -2 61 102 -243 -18 -45 -12 78 -60 -149 49 -11 7 249 -27 96 -47
4323d7L04j69J11k67j06L67o2J5j69K46m5k33mj9J17j91n3K32k13J59K2O3m59
$$ -47 257 88 199 -68 -174 193 131 146 -23 223 178 -55 -59 -78 39 -152 -205 27 -186 -27 -5 58 -401
4346d01L38J39K1L6J79l31k6L46l40L25l85K1J1L3J1J20J55l66J07m7k43K22l6
$$ -401 -63 76 97 133 312 -19 -45 301 -39 286 -99 -78 -67 -34 -23 97 252 -114 -7 -54 -297 -75 -111
4369a11R6M6j26M22l38j04Q6j42J08N6k4J65o7q8L2J33m28J86M7j79L29k60K94
$$ -111 -15 31 -95 327 -11 -115 -29 -171 -63 -7 -31 134 67 -21 11 144 -284 -98 -51 -230 99 -161 133
4392A33p0kj32K44r6k78J66j35J46J38p5K05j60k78K60m66N78J05m49K49rk57
$$ 133 63 61 -71 173 77 -201 -35 -170 -24 114 39 244 84 -194 66 -400 178 283 -166 83 74 -183
4414a83K52j21J36k90Q1J96k28r7K85j70J27O5j94J55j70R5M9j94J02K2K83j39
$$ -183 69 -52 84 -206 -125 71 -157 -254 31 -139 -12 53 -141 14 -156 -61 -12 -206 -104 -82 201 62
4436F2R6k43J88m09M75j31j74K44k19K55j42k5j43J13QK23k16J15n7K9nq5j29
$$ 62 158 -85 103 -306 169 38 -136 108 -111 144 2 -23 -166 -53 -45 178 -38 77 20 49 44 -41 -170
4459a70q0M1O7K75P6k04q1J30o1K5j44K39j66q3JP6J15J80j60l8j17J84j63j10
$$ -170 -250 -209 -142 133 209 5 -76 54 -7 18 -126 113 -53 -136 -135 -59 56 236 76 38 -79 105 -58 -168
4483a68J74o3L47k39j32K43l9m0j3q3J0J63k82j02K83m7M1L8j82j63K71j58O9
$$ -168 6 -57 290 51 -81 162 123 83 70 -13 -3 160 -122 -224 59 12 53 91 -91 -254 17 -141 -72
4506g2j32O8K0j17J98q8J44P9k95K23l34O55o63K66J91k50N5k5J07Oj45J18q0
$$ -72 -204 -136 -116 -233 -35 -123 21 100 -195 28 -306 349 -314 -48 143 -107 -52 -77 30 36 -109 9 -71
4529g1J05%l28L72l31K38lq1K27k04L2J28J62l19M3m4j19K1P9N8j07K8J93j44
$$ -71 34 34 -294 78 -253 -15 -18 -99 128 -76 -44 84 246 -73 -30 -74 -193 -172 -93 -35 -142 -114 79 -65
4553f5N3J84J87l55K73l77q5m2J66pM1O4K88l47o8P2J13j06L3j89L85o1l05J59
$$ -65 -12 172 359 4 277 -100 -185 -227 -61 -68 -27 37 325 -22 -90 -18 95 -11 22 -167 218 157 -148 11
4577A1k29L19k20J31J65p1k67L86j20p9j25J10J23K4m2j38l31M55kQk72J88k22
$$ 11 -218 101 -119 12 177 106 -161 225 105 26 -99 11 134 158 116 -22 -353 102 100 108 -164 24 -198
4600a98J52N1r0K68l2j61O4j32J14j02L8p8J93j61J53J56K9m74L17l26J21O7j01
$$ -198 -46 5 -85 183 151 -10 54 -78 36 -66 -28 -106 87 -74 79 235 264 -210 107 -219 -98 -31 -132
4623a32L92k76k07J58P9rj37J40J07j45P2N7j12K26k82J89J1j99M17n46R0r7R4
$$ -132 260 -16 -223 -65 14 5 -132 8 115 -30 42 99 -13 213 -69 120 131 -68 349 -197 -107 -204 -110
4646a10O4J08k88K37L53m67l9L15k28M17m05j4P9j52Q3K9q6Rj09J79K4j28J93
$$ -110 -46 62 -226 11 364 -103 -142 173 -55 362 -43 -57 22 -130 -47 -18 -104 -95 -204 -25 -1 -129 64
4669F4P0j91L2M5j50J54p6K33r4j16Q4R0k52K1J68Q3l48J50j20L4J81j71L13k28
$$ 64 134 -57 -25 20 -130 24 -52 181 87 -29 55 145 -107 -86 82 165 -183 -33 -153 -119 62 -109 204 -24
4693b4J56k27L1j17J33J53J63k96m9M2QL0Q8k8M6k33J0lr8J33J23j31lj01o2N14
$$ -24 132 -95 -64 -181 -48 105 268 -28 -77 -35 -27 3 91 63 109 -124 -114 -117 -215 -82 41 -90 -93 -194 -256 258
4719B58k47K8J01J75o65L77J48j35k01J09Q9J01n8M5k09k9J98J20J04n42J73j26
$$ 258 11 39 140 315 -350 27 175 40 -161 -52 37 138 80 125 -84 -113 85 205 309 -233 -60 -186
4741a86J00K21n4P2l9j16Rk4m8J0M8o6j7J58j43j08L79j75r8K66P6q8J01l30j82
$$ -186 -86 135 81 153 114 -2 7 -17 -65 -55 -7 -73 -90 68 -75 -183 196 21 -77 189 265 177 278 -52 -234
4766b34M04m57R3J95M0K0l32M66m29m8L33P3P3j54j70k5K99j66Q0l6L98m43O6
$$ -234 170 -287 -194 1 41 61 -271 195 -234 -282 51 124 197 43 -127 -152 147 -19 61 25 423 -20 46
4789D6j92K63J22k4l55K74l03J75K59k39r4K16k77r0j3K36K19K6j77j80J13Mj13
$$ 46 -146 117 239 215 -140 134 -169 6 265 26 -68 148 -129 -219 -232 4 223 249 72 -108 5 9 -104
4812a04K85j51k10pO71m20l0r2R1j55j55K7K06P5n9J51k06K39q4k83K86J76l26
$$ -104 181 30 -180 -187 484 64 34 -58 33 -122 -277 -250 -44 31 -28 123 -83 156 72 -211 75 251 -75
4835g5L44k59K46l22K14k97J47j4j52K07Q4l60J58K03k02K03j17K53l09R9R8n3
$$ -75 269 10 256 -66 148 -149 -2 -16 -168 39 123 -237 -79 124 -78 125 8 261 -48 51 149 96
4857I6k46K13k8J1q6n1l8J40k25K51K4j82l3K78m4q9j00NP2Q3N1K4m5j05J3j52
$$ 96 -150 63 35 46 -40 -91 -129 11 -214 37 61 -121 -154 124 80 -9 -109 -104 -32 51 102 126 81 -24 -11 -163
4883a63L7R7J44l35L30l04J64K67k77L30k59k48M58q7j78j4K92l51N7J41o2n0
$$ -163 -126 -29 115 -220 110 -194 -30 237 -40 290 31 -217 241 154 -24 -38 254 -97 -40 101 39 -11
4905a1j54K61K9k29J83n9J3j87M13j46j26Kn7K47j78J79j32j22M5K12k40LK83
$$ -11 -165 96 125 -104 79 20 33 -154 259 113 -13 -11 -68 179 1 180 48 -74 -29 183 -57 -54 229
4928B29k07j43J18J80j60j6L9p8l8J09j87K5K04r2j3J43j21J39L6k90o2L78q6
$$ 229 22 -121 -3 177 17 1 40 -38 -76 33 -154 -129 75 -17 -30 113 -8 131 167 -123 -185 193 107
4951A07l22K79k10K11j42mj4K74j80q4r6L67p7k82L0J48Q9k32J92O7j40J29m7
$$ 107 -215 64 -146 65 -77 -81 -95 179 -1 -85 -181 186 109 -173 -143 5 94 -138 54 121 -19 110 63
4974F3M5r4Q8j66N8k83K76k7R7j84N3L00o27M63j64K60k16J60m05K16J24J72m52
$$ 63 108 14 102 -64 -6 -289 -13 -40 57 -127 -74 226 -401 62 -102 158 -58 102 -303 -87 37 209 -243
4997b43L97m91L72M1n4M7j63p4K15l7l8J63k75J66J10k03j00R1J45m0k7j37J29
$$ -243 154 -337 35 76 22 69 -94 -168 47 10 -28 135 -140 26 136 -67 -167 -76 69 29 2 -135 -6
5020frj35L91k03j77K75k59M8O3oj7J15p7j69J26O6L57n58J1M22k56L9J2m4k61
$$ -6 -15 -150 241 38 -139 136 -123 -75 -12 -18 -35 80 3 -166 -40 26 383 -175 -164 258 2 41 53 9 -252
5045b52J29L32K3k77J29L9k47L50k64p6R7K87k56j80K56k29K60K8p7J33l49J25
$$ -252 -123 209 232 -45 84 123 -124 226 -38 -114 -17 270 14 -166 90 -139 121 149 72 205 -144 -19
5067a9j28R4K05j93j4M3R0n8oj91N9L4j18M76m45J41L69l01k37p8K58R9p5l05
$$ -19 -147 -53 152 -41 -55 -12 78 20 14 -177 -118 -84 -202 274 -171 -30 339 38 -199 -277 -19 80 5 -300
5091c00J23L0K19k65J42J89j4k8K00m31J72j42L9R3j30K03L2n5j88M05m14K69
$$ -300 -177 -147 72 -193 -51 138 124 96 296 -135 37 -105 -66 27 -103 100 132 77 -111 294 -120 149
5113A49j72J06k33j02K58L6n4O1n2j2j1l8j89N17j31k67M9K20j94J24m4J29j17
$$ 149 -23 83 -150 -252 6 42 -12 49 -3 -15 -26 -64 -253 264 133 -134 -85 135 -59 65 21 150 33
5136C3K92k96k43M03j86P5j25K40j33j83J78j99qj17R4K95j04Oj38M9j97q3L44
$$ 33 325 29 -214 189 3 78 -47 193 60 -123 55 -144 -152 -269 -175 120 16 22 -116 -67 -264 -347 -3
5159cm2r7J06Q2n9j74J53N1j69J14k49L90k34jK11l87L06N5k70K43L08M4m43J13
$$ -3 -45 -142 -36 46 -13 -187 -34 17 -152 -38 -287 103 -131 -132 79 -308 -2 53 -217 26 334 378 -65 48
5183D8k6K88l45J39j48k20L60r3j17Q4J72k50K56k31L90k04k72K24k6j32P5p1
$$ 48 22 310 -35 104 -44 -264 96 3 -114 -30 142 -108 148 -83 307 103 -169 55 29 -103 -28 -99
5205i9J88k00M7K30k79J04K21j78r4J10p8j81M48M1m23L79l06P6P6om16K34K56
$$ -99 89 -111 -64 166 -113 -9 212 34 -60 50 -28 -209 239 280 -143 236 -70 6 82 76 -340 -106 150
5228A50q9R2l50J19j61K72k07O2J41J10J19j32j66O4j72J61k32K01k9R9k67L60
$$ 150 61 153 -197 -78 -239 33 -174 -112 29 139 258 126 -40 24 -148 13 -219 -18 -47 52 -215 145
5250A45j27j11J45m1oq9J63J06l42l9K25j87J70k10M27k80N3lj86K47M0k99k0
$$ 145 18 -93 52 11 5 -84 79 185 -157 -196 29 -158 12 -198 229 -51 2 -1 -187 60 100 -199 -219
5273b19L3K81L4n9m2j90L02p9k56K49K9O3n8K38l76j27J28O5j63j66R9L39q4K14
$$ -219 -186 95 129 70 28 -162 140 61 -195 54 83 146 88 326 -50 -177 -49 16 -147 -313 -214 125 41 255
5297B55k89P4jj0K31k02PL0J22r4j67P9j50J98j64k0p5J15Q7m5j09M9N9K1j3n3
$$ 255 -34 40 39 29 260 58 65 95 217 123 -44 35 -115 83 -81 -101 -176 -61 26 -19 -128 -79 -20 1 -12 -65
5323f5K71j28k41P7J17J03L8r2J28m30J95K86j34j49J13j32J24O2j07K1K16k63
$$ -65 206 78 -163 -86 31 134 172 80 208 -222 -27 259 125 -24 89 -43 81 143 36 57 273 10
5345A0J2K9J55p5m13K38O8J28j40q7J92j59RJ92l60J02q3L42k2j66j94M57n75
$$ 10 22 51 206 131 -282 -44 24 152 12 -75 117 -42 -33 159 -201 -99 -182 160 138 -28 -222 235 -340
5368c40M39n4J14k96R5L33j10j70j47J42j8J89j66J00j60r4K35J76k83N1k05N7
$$ -340 99 45 159 -137 -42 291 181 11 -136 6 -12 177 11 111 -49 -143 92 268 -15 36 -169 -112
5390a12K31K7j81J26J80j47q9l1j51K53J1j45Om2oM95n27pJ88j23J76lj97J73
$$ -112 119 146 -35 91 271 124 35 4 -147 106 117 -28 -22 -64 -70 425 -102 -109 79 -44 132 129 -68 105
5414A05j58J6l5M15m63j4o1J77M5P3m5R3k92J27L41l96J38R6k99L4K33L5j06k93
$$ 105 -53 -37 -72 343 -120 -134 -195 -18 27 100 55 148 -144 -17 324 -72 66 162 -137 -103 130 165 59 -234
5438b34J83k8P6j8l0Q2J1k23J21q4K62l18M08k85P9J2j16j73K79r6K02k33J19
$$ -234 -51 -79 -3 -21 -51 31 42 -181 -60 -144 118 -200 208 -77 2 14 -102 -275 4 -92 110 -123 -4
5461dj9k6J49J76l35J50J94j35rk40J05O8o3j86L48q1r7P1J02k52K93j48J51r6
$$ -4 -23 -49 100 276 -59 91 285 150 141 -99 6 74 11 -175 173 92 -5 66 168 -84 209 61 212 116
5485A16k18K79k76q1j8J41O5j68J44K24j67j41j2K25m2J29j35N1o4l10K61j71
$$ 116 -102 177 -99 -180 -198 -57 8 -160 -16 208 41 -100 -112 113 71 200 65 116 52 -258 3 -168
5507a68J47j7Q2j25J87j49J70k05O8j07M6K06r0o2P5K17l81P4k3Q2j03Q6j39J67
$$ -168 -21 -38 44 -81 106 -43 127 -78 -10 -117 -71 135 45 -17 58 275 -106 -32 -55 27 -76 10 -129 38
5531C8j74J2Q3J06k69M99k37l73L11l2J74q5Kp5j53J77L20l23K9J12k93L71k33
$$ 38 -136 -124 -41 65 -204 295 58 -315 -4 -36 138 53 55 -20 -173 4 324 1 30 142 -151 220 -13
5554a3j97L02K45l27R5j97J29K98k36l5l43K19Q0q8K40j65n9jo2lN0M7K86l55
$$ -13 -210 92 337 10 105 -92 37 335 99 64 -279 -60 20 -68 172 7 -52 -53 -115 -118 -68 -21 265 -90
5578i0p8K16p1k0Q7l46L03n4P9l1k22L09k1J4J0j18J36k24J17o6K91l57J83J99
$$ -90 -168 48 -23 -43 44 -302 1 -53 26 -5 -227 82 61 75 85 -33 103 -121 -4 -70 221 -136 47 246
5602B46j49J71k83K70J2k38J20J38j81J03k62m2Q2J14k07J58j82K5L2J12k28M86
$$ 246 97 268 -15 255 267 29 149 287 106 209 -53 -95 -13 101 -106 52 -130 -105 -73 39 -189 297
5624B97l05J71j3j53J60j24L9k91K35j26J10j38R2n6J29n2J54k81J85P7k1k26
$$ 297 -8 163 150 -3 157 33 72 -219 16 -110 0 -138 -46 -102 27 -25 129 -152 33 110 89 -137
5646a37LK01l60K86O7j26J49l8NR2K9k3j4L7k56O1K73k41L54k05K1k17q9K22k90
$$ -137 -134 67 -293 -7 60 -66 83 45 50 142 171 148 134 171 -85 -24 249 8 362 157 178 -39 -128 94 -196
5671a96L09p6j58KJ97m5k28J66l0K58l99m6J06j55K57q0J10N1j42k8PJ3L12k28
$$ -196 113 37 -121 -119 78 33 -195 -29 -59 199 -200 -246 -140 -295 -38 -118 -8 43 -99 -127 -120 -107 205 -23
5695b3j31L20j80q4L22j83Pp0J95j19r9J00L3m6J3j1k0J52j43k08R8o7K74K2k97
$$ -23 -154 166 -14 -98 224 41 48 -22 173 54 -45 55 88 42 55 44 24 176 33 -175 -77 -144 130 152 -145
5720a45J19j29J63l70M59l8j4j42QK19n3j05q2m8m5K79j86L81n15L10L12l89J95
$$ -145 -26 -155 8 -362 97 59 45 -97 -89 130 77 -28 -110 -158 -203 76 -110 271 -244 66 378 -11 184
5743A84K6j95j25L88m0l21M8L34o30M75k74J59n6n7J10K67j2m14M0J14j09l8L46
$$ 184 210 15 -110 278 238 -83 -35 299 -331 144 -130 29 -27 -84 26 293 281 -133 -93 21 -88 -126 220
5766B20l13lp8K99j9p6J12j78o3O2J64j33k3j32m6M4J11Q0N5J03j10o5o9K11l80
$$ 220 -93 -96 -174 125 106 30 142 -36 -99 -37 127 -6 -29 -161 -207 -163 -52 28 83 186 76 11 -58 153 -227
5791b27M65k44j67J91j02L69k19j97K21k81pJ80q2j2J8J47R8j90l4K37k89J62
$$ -227 238 -6 -173 18 -84 285 66 -131 90 -191 -198 -18 -100 -112 -94 53 151 -39 -73 164 -125 37
5813C7p7Rj16OK51J94l63K67k23j61J22k6O4J27k48J41J77l40K30K23m18J43J45
$$ 37 -40 -31 -147 -141 110 304 -59 208 -15 -176 -54 -80 -16 111 -137 4 181 -159 71 294 -124 19 164
5836A64k69J46K4j87K52k94L89j92k1K52k08L5Pj04lk6k0j06K05n2R5r7J83k56
$$ 164 -105 41 65 -122 130 -164 225 33 12 264 56 91 98 -6 -9 -35 -55 -161 44 -8 87 -10 173 -83
5860h3J06q8n1J23j87K16J70m12J70m8M1mr8K63o9k11L5kJ34q1Q7R5k6L7n4l1
$$ -83 23 -65 -116 7 -180 36 206 -206 -36 -84 -43 -47 -145 118 49 -162 -127 -129 5 -76 11 106 80 117 63 32
5886C2pj43J70Q1j42J44r3K86l44J72Oj00m86M44J5m9Q2J65qm36K50j09J43k5
$$ 32 25 -118 52 133 -9 135 42 328 -16 156 162 62 -424 20 35 -14 68 233 225 -211 39 -70 73 48
5910D8Q6k07k48N32k21l20K77M01l07l1j50m4k60L36K29n1q0J03j18k76K69M1
$$ 48 134 -73 -321 211 -10 -330 -53 348 41 10 -140 -184 -444 -108 121 70 -10 93 -25 -301 -32 9
5932IM4J59j76K93m48K7J01J73m78J82J94j99K01K48l68k3K87k72J62k23J49J42
$$ 9 53 212 36 329 -119 -92 9 182 -296 -114 80 -119 82 330 -38 -61 226 -46 116 -107 42 184
5954A84j00j35r2K19j96J99o0j9n1r2J57K11r4P3j39j9J70k20Q5r3J08k33O9K05
$$ 184 84 -51 -143 76 -120 79 19 0 -51 -143 14 225 131 204 65 46 216 -4 81 -12 96 -137 -68 137
5978A37j51k3q1P4RP0K28k65j58J4O0o2K47J62j73j06q4j29J16K33k4m2l93L57
$$ 137 -14 -37 -118 -44 -35 35 263 -2 -160 -146 -86 -148 99 261 88 -18 -102 -231 -115 118 94 52 -341 16
6002A6N3m49K76K91o20M53l4L8j76j13K33n8O7j26M7J57P9k2r7O0m0r0k87M38
$$ 16 69 -380 -104 187 -433 20 -14 24 -152 -265 -32 -90 -23 -149 -102 55 134 112 15 75 35 -55 -342 96
6026I6j53P9J9K22k19J71k36K37k32p0J38k94M87j77l4l8J88j16MJ63l50Q5Q6
$$ 96 -57 22 41 263 44 215 -21 216 -16 -86 52 -242 245 68 34 -4 184 68 72 235 -115 -30 56
6049E6O2j17J86k48j70J00Qo9K01oJ05j66j51M82q7N1j37pj07J44k69n7N9j35
$$ 56 118 1 187 -61 -231 -131 -123 -192 9 3 108 -58 -209 273 186 237 100 93 -14 130 -139 -196 -137 -272
6073b72K49k35p6J60K36n1jk36M87l27Q6k68L49L6O4l97r9L51M2k51Mj37M15l98
$$ -272 -23 -258 -334 -174 62 11 10 -226 261 -66 20 -248 101 137 201 -196 -295 56 98 -153 -149 -286 129 -269
6097b69Q5J05m2J31j47Q0K5m7n7m9R9Q6k3n2J9L2k27K74n1j69M9J19J50j6K3o0
$$ -269 -184 -79 -121 10 -137 -57 -32 -79 -136 -185 -86 0 -23 -75 -56 -24 -251 23 -28 -197 -148 -29 121 105 128 68
6123F8k04J60J16kj49J70O3m61J38J66Mq2J36l31R6j56J40j94J86L74j20l06K28
$$ 68 -136 24 140 138 -11 159 222 -239 -101 65 69 -13 123 -208 -112 -268 -128 -322 -136 238 118 -188 40
6146D0K75l22K58m30L96k90R9J71l51K06j18K15j78J20J3j16J46l4k20J57j94
$$ 40 315 -7 251 -179 217 -73 26 197 -154 52 -66 149 -29 91 104 -12 134 100 -120 37 -157
6167a57N1L44K6j88k15K08P6j35P0q7p1J83j10J21j36J83j55l5j1q2M7j43K84
$$ -157 -106 238 264 76 -139 69 145 10 80 -7 -78 105 -5 116 -20 163 8 -27 -38 -120 -73 -216 68
6190F8k86L00j53O3m6K0j91L39k8J86p8l41O9K34j49n2N7n0J00j92K87k09K09
$$ 68 -218 82 -71 -8 -54 -34 -225 114 86 272 194 -147 -78 156 7 -45 12 -38 62 -130 157 -52 157
6213A57Q5o7N6J4l24OMl2J13nQ4kJ2j06j27N2NL25k64K82j11k39J77Q2j44J01
$$ 157 242 175 231 245 -79 -73 -69 -101 12 7 91 89 101 -5 -132 -80 -75 250 -14 268 157 -82 95 177 33 134
6239A34k13l3M4J30J18k25m9k5j00M54l9k99L68l98M2j16l7K55M0k08L42l41J03
$$ 134 -79 -112 -68 62 180 -45 -94 -119 -219 235 196 -103 265 -133 -91 -207 -244 11 51 -157 185 -156 -53
6262e3J95k43J58k62L80j81m0qj38J86J17k25L7j2ML41o5j80p6o4l2J85l14K77
$$ -53 142 -101 57 -205 175 -6 -46 -54 -192 -6 111 -114 -77 -89 -85 256 191 11 -65 -129 -161 24 -290 -13
6286a3J1J58K05n14M49k47K3j77J30K3q8J79j24l2J52j61m1K28p4k62K81k01K27
$$ -13 -2 156 361 -153 296 49 72 -105 25 48 -40 139 15 -17 135 -26 -67 161 87 -175 106 -95 132
6309A32j62L7k47qJ80J88J3k40L74j87r2j54J96QN6l63K48J20j70J2L13O4k28
$$ 132 -30 7 -240 -248 -68 120 133 -107 267 80 -12 -166 30 38 94 -269 -21 99 -71 -59 254 318 90
6332I0j27k17J53K59j9r3q0J4R6l8k6QkK73o09K46K4M73n27j15K19k20K7K17r6
$$ 90 -37 -254 -101 158 139 46 -34 -20 76 38 12 20 18 291 -318 -72 -48 425 -102 -217 2 -218 -191 26 -70
6357g0J62o7j90L28l02M70m08L14n5j15K98o98M60oj52J41k67L05k47J66l4J01
$$ -70 92 25 -165 163 -139 331 -77 237 182 67 365 -333 127 121 -31 110 -157 148 -99 67 33 134
6379A34l61K28j59k4l4K73K2k18l4K1J90Q5l85K93j87j32M66j54j83R6j87M67
$$ 134 -227 1 -158 -182 -216 57 79 -139 -173 -152 38 123 -262 31 -156 -288 178 24 -159 -63 -250 217
6401B17m82K82j02Q3J9K03l83l1K36k8J8k8L4K42l41J95k81J59j66L9k82N54j68
$$ 217 -265 17 -85 -2 17 220 -163 -194 42 14 32 4 38 280 -61 134 -147 12 -154 -115 -397 157 -11
6424a1j29K87l78L12j43j6l0P6K19j46k75K10k2K65j7k56l5o8J98j82K33q5K63
$$ -11 -140 147 -231 81 -62 -78 -108 -32 187 41 -234 -24 -46 219 202 -54 -89 -157 41 -141 92 7 270
6447B70k46J44O6m65J98j89J41rK25m25L20o0K7L3K79j96n74M10r3j86L78km7
$$ 270 24 168 234 -231 -33 -222 -81 -90 135 -290 30 -30 -3 30 309 113 -461 -51 -144 -330 48 46 -1
6470aj00N7M9j50N8P7L06j68kO7k99M83l62K44j26n4N3j56J56j62r1n1K24j4o6
$$ -1 -101 -44 5 -145 -87 -10 296 128 126 193 -106 377 15 259 133 79 132 -24 132 -30 -121 -172 52 38 -28
6495b8K4N5k3q6J76r9R3j64LJ62N8k94P1j81M88j83k52J46k25J32J54N3o3N5K5
$$ -28 -4 51 28 -58 118 19 112 -52 -49 113 171 -123 -52 -233 255 72 -180 -34 -259 -127 27 80 17 72 97
6520I7j23P2M9m8m2N1O2K1k47O9o7Q0K47j92L0j60L14l46j64K75LNr9P5O7J06
$$ 97 -26 46 95 47 5 56 118 139 -108 -39 -106 -26 221 29 59 -101 213 -133 -297 -22 -19 -14 -113 -38 29 135
6546A35j27J50l12Q2KO2J4J35j19jR6j91nK01k07q2J62r7P2P2J06m37K02q5J80
$$ 135 8 158 -154 -72 -70 -8 6 141 22 21 117 -74 -79 122 -85 -167 -5 -102 -30 42 148 -289 -87 -172 8
6571HO8J22j26J32m94K52r1O7P6J80l76lR1K00j08l50L28M00k02m15M15P5j77
$$ 8 76 198 72 204 -290 -38 -129 -62 14 194 -182 -185 -94 106 -2 -352 -24 376 174 -241 174 249 72
6594G2k28k6J52N9k42K38J39J11lj97Q9j00m6kn2K88m85L83j00r6O1K31k14J87
$$ 72 -156 -182 -30 29 -213 25 164 275 272 75 164 64 18 16 -36 252 -233 150 50 -46 15 246 32 219
6618B19j47J54l82mK80r0Ko1K38k97j71J64J25K92j03l91L17l3n8k57J59Q5j46
$$ 219 72 226 -156 -160 120 30 32 -29 209 -88 -259 -95 30 322 219 -172 145 112 54 -203 -44 41 -105
6641a05M0K57j1k88M8J17k49M56k87l43P21m92O3O5L0r3k71M08J79k7p2j8k38
$$ -105 -65 192 181 -107 -59 58 -191 265 -22 -365 356 -136 -73 -8 22 -71 -342 66 245 218 146 128 -110
6664a10J17K20j98j17Ol7o4J93k45K35k85mM06l62J71M05l90j0K29p6r5k7N3l5
$$ -110 7 227 29 -88 -82 -119 -183 10 -235 0 -285 -289 117 -245 -74 331 -59 -69 160 84 -11 -38 15 -20
6688b0J25l41L28J17q8k59K09J58j83J52l0j26j48L05j75k24J64j72R5J95k6l32
$$ -20 105 -236 92 209 121 -138 71 229 46 198 168 42 -106 199 24 -200 -36 -208 -113 82 56 -276
6710b76j1K49j58O6L25j51j62L47l05pK25p7N2j47J90k74K11j89j07K36l0r1J10
$$ -276 -287 -38 -196 -130 195 44 -118 229 -76 -83 142 65 117 -30 160 -114 97 -92 -199 37 7 -84 26
6733B6J1r3J79P6m79J14L04j82J25j62J21n4k11L54q5j42j82L39j72K24o3j26
$$ 26 37 -56 123 199 -280 -166 138 -44 81 -81 40 -14 -225 129 44 -98 -280 59 -113 111 48 -78
6755g8N0k3j6k0p7Q9K56k55j10K68k20J46q3L4k8J2J37k22Q0J60Q9l09J45Q5O
$$ -78 -28 -51 -67 -87 -164 -75 181 -74 -184 84 -136 10 -73 -39 -67 -55 82 -140 -60 100 189 -120 25 110 116
6780A16N5J78k17q8M5k75K91j53L31m61J67k05L3K99l1j00pJ6j38K95k84K32R1
$$ 116 171 349 132 44 89 -186 105 -48 283 -178 -11 -216 -183 116 85 -15 -22 -6 -144 151 -133 99 190
6803A90O0l25J71j60m5J45j24MK43r9p4j4o0Q5j21q2j5J24K0K21k03ln4J66j80
$$ 190 250 -75 96 -64 -109 36 -88 -84 159 60 -14 -28 -88 -3 -124 -206 -221 -97 -77 144 -59 -62 -116 50 -130
6828a30o5L25l3M0k48L23j90j19M5O9R5j18k9R0P6k64J55k09L47R3k70J0M4k19
$$ -130 -195 130 97 137 -111 212 22 -97 -52 17 112 -6 -35 55 131 -133 22 -187 160 253 -17 -7 37 -182
6852a82K02k7n4K45j77j18K08k2qJ55n7j65k7K57l46L7J58l2J36q0J77l40K2M7
$$ -182 20 -7 -61 184 7 -111 97 75 67 222 165 0 -27 230 -116 -79 79 47 183 103 280 -60 -38 9
6876IL8k82K57o5O5j36K64k95K47M3k78L02j19Q8j51k9P5j05j09N40m24L16p3
$$ 9 47 -235 22 -43 22 -114 150 -145 102 145 -133 169 50 138 -13 -42 33 -72 -181 359 -65 251 178
6899A78j06q1j53M24l04J25n2j59K77j05l7k05K08k7J69k80J12j47K41k72M11
$$ 178 72 -9 -162 262 -42 83 31 -128 149 44 7 -198 10 -17 152 -128 -16 -163 78 -194 217
6920B17k15J88L4r5R8ol48N9K52j77j02N2J33l44O0J63p8N3J03k52J32J70n2k35
$$ 217 2 190 224 129 227 221 -127 -68 184 7 -95 -43 90 -254 -194 -31 -109 -56 47 -205 -73 97 45 -190
6944a90J99J94l71P0L90l16M5j73J28K77l83J15j87M09k61j04J35J6j37m12M74
$$ -190 9 203 -168 -98 292 -24 21 -152 -24 253 -130 -15 -202 207 -54 -158 -23 -7 -144 -556 -82
6965h2J31m3K6%K1j86J28o0L85m85j70J13J55Q2j78K1J16J34k86J44K78k30K89
$$ -82 49 6 32 32 53 -133 -5 -65 320 -165 -335 -222 -67 15 -163 -142 -26 108 -178 -34 244 14 303
6988C03k93o1J5M4Mj55L02j04j13J94j97K93l22J89j07P1O5j80J1O7p1k19M48
$$ 303 10 -51 -36 8 12 -143 159 55 -58 136 -61 232 -90 99 -8 63 128 -52 -41 26 -45 -264 184
7011A84k46j39O1L03k73K1M4l7J43j52R9j7O2q9J31j60J70k37RK68N0m27J62N8
$$ 184 -62 -201 -140 163 -110 -89 -45 -82 61 -91 8 -9 53 -36 95 -65 105 -132 -123 145 195 -232 -70 -12
7035a2M7O3j66m1K84n4J09j97p6K52O7n27K33R1j22k81L85r0K11l06K48j14j00
$$ -12 35 98 -68 -109 175 121 230 33 -43 209 276 -251 -18 73 -49 -330 55 -35 176 -130 118 4 -96
7058i6J88j03J70l65K6J28J53J7J07k43l4J26RPK5k0N4m1k77R2J58o3K4k52M80
$$ -96 92 -11 159 -206 -180 -52 101 118 225 -18 -52 74 83 90 115 95 149 108 -169 -77 81 18 42 -210 270
7083B70j0J6j22q1r2q5J03L9p1j02N7J95p8k08L52k62o9N4R7k6l19L53J21p7k44
$$ 270 260 276 154 73 -19 -104 -1 38 -33 -135 -78 117 39 -169 183 -79 -148 -94 3 -23 -342 11 132 55 -189
7108a89L37k35K84k16J17j56K74m92K18J11k54L16q4j93K3J38k99J91K16k7J45
$$ -189 148 -87 197 -19 98 -58 216 -276 -58 53 -201 115 31 -162 -139 -1 -300 -109 107 80 225
7129B25j68O8j72J99j51J00L5m06L25j29J56l1k92K22J08p3j26P8K4j65K42Jj03
$$ 225 57 125 -47 152 1 101 136 -270 55 -74 82 51 -241 -19 89 16 -110 -32 -8 -173 69 70 -33
7152c3Q5n6j11M0q0K32k50L66k31j29J95j77M9p4J13K94k64j63M43l71p3J49P9
$$ -33 52 -4 -115 -75 -155 77 -173 193 -38 -167 28 -149 -100 -174 -61 233 -31 -194 249 -122 -195 -46 33
7175C3j69K63k29k35M24K4j55K49k08n2q4L39n43L08nj57p2N11l39J83O8k07K14
$$ 33 -136 127 -102 -337 87 111 -44 205 -3 -55 -139 200 -343 -35 -40 -197 -269 242 -97 86 154 -53 161
7198A61N1k72M13l52J5k11Q4K07j83J91R9M6j12k14O0M3j25J79K13l38r5J87p1
$$ 161 212 -60 353 1 16 -195 -111 96 -87 104 203 249 137 -77 -17 26 -99 80 293 -45 -140 47 -24
7221b4O0K1J6m74L12J79J3N2o6p6J70l90K17Lj17K72k86O0L69k77j23j92K44P6
$$ -24 36 57 73 -401 -89 90 103 155 89 13 183 -207 10 13 -104 168 -118 -58 311 34 -89 -281 -37 39
7245C9k08jk3J0J34n7l6K42J2j98K09m60M79M9k25l3k21M88m2LrM9j82K17k79
$$ 39 -169 -170 -193 -183 -49 -106 -142 100 112 -86 123 -337 142 191 -34 -67 -288 200 158 161 152 201 19 236 -43
7270d3L7j04oJ1j20K72j39K8n6p8L15k82K55J14r6pnj66lL33j96r0K51j57k42
$$ -43 -6 -110 -116 -105 -225 47 -92 -64 -120 -198 117 -165 90 204 108 101 96 -70 -73 260 64 -26 225 68 -174
7295a74J38n6O0l15L35j10R7lJ44l3j30k8N4qo7p4%p6L22J02j73K9j19j20K14
$$ -174 -36 -92 -32 -347 -12 -122 -25 -28 116 83 -47 -75 -21 -29 -96 -170 -170 -246 76 178 5 34 -85 -205 9
7320Ik3O5J62j55L3J3l42L10l64L26K40j52O4k32j28M21k75m8K27l06K96l09J09
$$ 9 -14 51 213 58 91 104 -238 72 -292 34 274 122 186 -46 -174 247 -28 -76 151 -155 141 -168 -59
7343e9k61L61j69O8P8J30l09J5L08K0k77K21j32k79M09j40p0kq2J16J82j91JK39
$$ -59 -320 41 -128 -60 18 148 -161 -146 162 182 -95 126 -6 -285 124 -16 -86 -88 -170 -54 128 -63 -62 177
7367A77j57L0m9n1R0R9k52M20j47j43Q9k8k23j16L30l9j34K81k21K21o0k88K81
$$ 177 20 50 1 -50 40 139 -113 307 160 17 106 78 -145 -261 69 30 -104 177 -44 177 117 -171 110
7390A10l12P3O7L9m8Q2K42k22j57K40k50L79j48k34K18Q3j04J0j59N2j44P0L47
$$ 110 -202 -129 -62 -23 -71 11 253 31 -126 114 -136 243 95 -139 79 162 58 68 -91 -39 -183 -113 234
7413B34j67J61n07L33l15R7j27J46L10j35k76M80k95O8r1j5j26J49J13q5m5J12
$$ 234 67 228 -279 54 -261 -164 -291 -145 165 30 -246 234 -61 7 -84 -99 -225 -76 37 -48 -93 19
7435A9k05K83j45j33M81l93P6k8J14J53m2n4J63n27K73k15K33qn0Q6j90K06j6
$$ 19 -186 97 -48 -181 300 -93 -17 -45 69 222 180 126 289 -238 35 -180 53 45 -5 81 -109 97 81
7458H1k99K63j7K48l7k34j88Q7K07J3j55rOj20J76j17M09l27p5MK7j65M28k43
$$ 81 -218 45 28 276 239 5 -183 -96 111 124 -31 -40 -34 -154 22 -95 314 -13 -88 -84 -57 -222 206 -37
7482c7L20k70k73K03j71L58l28K33j38l9L06k31J26k56r4K30jJ12L5o7J5P7O4
$$ -37 283 13 -260 -57 -228 130 -198 35 -103 -142 164 -67 59 -197 -291 -61 -62 50 85 18 33 110 174
7505A74j99J79j6j30pj6K9J03K2n62M13j07N3L44k90K03j99j02N0j08J59j9k50
$$ 174 -25 154 138 8 1 -15 14 117 139 -423 -10 -117 -64 280 -10 193 -6 -108 -58 -166 -7 -26 -276
7528b76J64J59j1l47j46K26L45p1l7K21l20J83j62J04k0k12K59K30k57Q4K16l53
$$ -276 -112 47 36 -311 -457 -231 114 43 6 227 -93 90 -72 32 12 -200 59 289 32 116 332 -21
7550b1K9r5M2j24L13Nk59M34l08Kr6J23o2o0J12J33l77J10K01k75K1J68K21j08
$$ -21 8 -87 -45 -169 144 149 -110 324 16 18 -78 45 -17 -77 35 168 -209 -99 102 -173 -152 16 237 129
7574A29N3k0q7o2N5j47K85n1J01k15m6j24L47m4k75J84n9k20J05j2o5L19l34J67
$$ 129 182 162 75 13 68 -79 206 155 256 41 -5 -129 218 174 -101 83 24 -196 -91 -103 -168 151 -183 -16
7598a6j83J51J54k25L17l44J6L15p4J58j07k99J27J6O5j25O6k2o3K47l6j34Q2
$$ -16 -199 -48 106 -119 198 -146 -130 185 111 269 162 -137 -10 6 71 -54 12 -10 -73 174 138 4 86
7621H6j67l9J64R5r7J14j67J03J31m7j41P0j7p7j96m1J18J04J98o6k70J30l8m0
$$ 86 -81 -120 44 139 42 156 -11 92 223 176 35 105 88 11 -185 -226 -108 -4 194 128 -142 -12 -50 -90
7645i0L07k94J14k17K06J38q7j0J60j66m0k35K5M07k59k8J20J26k26q6j02L34
$$ -90 217 -77 37 -180 26 164 77 67 227 61 21 -214 -189 218 -41 -69 51 177 -49 -135 -237 97
7667I7Qn4l4K71l52K96j33J74j78j98L06l36L39l83M7K98l41K92lK4K70l25k54
$$ 97 105 51 17 288 -64 232 99 273 95 -103 203 -133 206 -177 -130 168 -173 119 116 140 410 85 -169
7690a69K20k06J36J86j69n9J62j64m16O22m01J58J20O8J03o6j1l67M50l91K86
$$ -169 51 -155 -19 167 -2 -61 101 -63 -479 143 -258 -100 20 88 191 125 114 -253 197 -194 92
7711I2k44K3K86k00P1J01j36J31j06l1k20M46q7j82K2j09P7O7L76m79P6j4N2J27
$$ 92 -152 -129 157 -43 28 129 -7 124 18 -13 -233 213 126 -56 -34 -143 -66 1 377 -102 -26 -40 12 139
7735A39k93J69k93L11K96m43P8N2k8J22O7k51j04J85j29j25J37J01j09P6M4P4
$$ 139 -154 15 -278 33 329 -114 -36 16 -12 110 177 -74 -178 7 -122 -247 -110 -9 -118 -42 2 76
7757G6q0k4K08k69J28J61j88R6J27l29j57L83q6k90J30J91k16K01j0j40J20M8
$$ 76 -4 -28 180 -89 39 200 12 108 235 -94 -251 132 46 -244 -114 77 -139 62 52 -88 32 80
7779H0k1j65K95k65P5o0RK12l9j49N5N1k4j85L22J09k36k86M09k22J15n1p3m2
$$ 80 59 -106 189 -76 -1 -61 -52 160 121 -28 27 78 54 -131 191 300 64 -222 187 -35 80 29 -44 -86
7803h6P1J51o9j64j00J11P5J7N2j88M58n35K88J20n2k30P4p2K00k17J27J26k32
$$ -86 -15 136 67 -97 -197 -86 -11 6 58 -130 328 -207 81 201 149 -81 -7 -79 121 -96 31 157 -75
7826g5j13L16l79J19J61J80j21m3j40K39k74q3K29J30p3No5N2J17j14j14J59L1
$$ -75 -188 128 -251 -132 29 209 88 45 -95 144 -130 -213 16 146 73 78 13 65 182 68 -46 113 144
7849A44n54M27j61K83k14JK22j15j4J07j45M8j36N9J40rj48K15k10J21j14L8o1
$$ 144 -410 17 -144 139 -75 -74 148 33 19 126 -19 29 -107 -48 92 83 -65 150 -60 61 -53 -15 -76
7872g6R1K8j14q2q1L74m12L88j13J06m98N50Jr8K5k20J42Qj48K38j16j57J05J11
$$ -76 15 43 -71 -153 -234 140 -272 116 3 109 -389 161 162 64 89 -131 11 19 -129 109 -7 -164 -59 52
7896E2k25J20J66J56m17L83k54K7K04l87J40J68l41J24p8J78O7l7M9k25L51k15
$$ 52 -173 -53 113 269 -148 235 -19 8 212 -175 -35 133 -208 -84 -162 16 83 46 95 -130 221 6
7918FK3o5O6j42R5k0k08N69m53J77l9J07r2k5NK4j24R7o6qQK9K1k82K97q0R3k57
$$ 6 29 -36 30 -112 -17 -37 -245 324 -129 48 9 116 24 -1 4 28 -96 1 -65 -73 -65 -36 -15 -297 0 -80 13 -244
7946b44K01J41j96j35K31M8m7j47JL56l95L25p7J7j01N8k36J88PJ33m63N26m28
$$ -244 -43 98 -98 -233 -2 46 -1 -148 -147 209 -186 139 62 79 -22 36 -200 -12 -5 128 -335 191 -237
7969b37K02M4k27K1L7L04P4o6j69M2R2l25K75N3m6K80k66j16J49j74J03n8j58
$$ -237 -35 9 -218 -197 -160 144 218 152 -17 25 117 -208 67 120 74 354 88 -28 121 -53 50 -8 -166
7992a66J98k8J72j16j03J24j13P3k2j56M2j62R8J68%R8r5K05j94L0j00J82j47
$$ -166 32 4 176 60 -43 81 -32 41 19 -137 -95 -257 -159 9 9 107 12 217 23 53 -47 135 -12
8015a2J27N1r5l78L05K7q7K43m88L15J89M7l39q2Q9K20j05kj16J9o5K68L1j16
$$ -12 115 166 71 -307 -2 25 -62 181 -307 8 197 244 -95 -177 -88 132 27 25 -91 -72 -137 131 162 46
8039D6K42m4j13o5P9j49l35K97j46K38k3J26j55J57j92m3K66o3j75j24J15J42
$$ 46 288 244 131 66 145 -4 -339 -42 -188 50 27 153 -2 155 -37 -80 186 123 -52 -176 -61 81
8061H1J08j68o9K0k12P7J5Q4j14R7L36k24J29K7l4MN6l40l4O3jL1K46lm34L08
$$ 81 189 21 -48 -28 -240 -163 -148 -64 -178 -81 255 31 160 187 153 157 213 -127 -161 -98 -99 -68 178 175 -259 49
8087D9j12m5J10j9j81K90j17l00M14j07J40k37Q4J76k06O3OR8K81o83L25J72R
$$ 49 -63 -108 2 -17 -198 92 -25 -325 89 -18 122 -115 -31 145 -61 2 8 106 387 -296 29 201 210
8110B10j61J87j82Jl9k09K97n6l87L25P1o4K56j79J45k02Q8j99K53o7k12J43j33
$$ 210 49 236 54 55 16 -193 104 48 -339 -14 57 -7 249 70 215 13 101 -98 155 88 -124 19 -114
8133a14J99k25kK41j15R8k22M0L87m37J10r5J98J3mq5q3N9j3j80J38m9K08k92
$$ -114 85 -140 -142 99 -16 82 -140 -100 287 -150 -40 -135 63 76 72 -13 -96 -37 -50 -230 -92 -141 67 -225
8157b25K79l2j30J23P5j17k2J0K64k62k6RO8K45m86K25L26m82K03q0QK65l65J79
$$ -225 54 22 -108 15 90 -27 -49 -39 225 -37 -63 -54 14 259 -227 -2 324 -158 45 -35 -27 238 -127 52
8181E2k93L28j70m6O6J37k4L13k45n8
$$ 52 -241 87 -83 -129 -63 74 50 363 118 60
8191F0
$$ Imaginary data points
##PAGE= N=2
##DATA TABLE= (X++(I..I)), XYDATA
0@%%%%%%%%%%%%%%Qj6J6j6J6k2L0l2L6m4N2o0P2q4R2j04J20j37J57j78K01k26
$$ 0 0 0 0 0 0 0 0 0 0 0 0 0 0 0 8 -8 8 -8 8 -14 16 -16 20 -24 28 -32 40 -44 48 -56 64 -73 84 -94 107 -119
36a19K52k82L16l54L93m34M80n33N90o49P17p92Q72r60J057j165J285j418J570
$$ -119 133 -149 167 -187 206 -228 252 -281 309 -340 377 -415 457 -503 554 -611 674 -744 826
55H26j739J930k154K415k726L101l563M153m934O016p616J0224j5178K7721j14408
$$ 826 -913 1017 -1137 1278 -1448 1653 -1910 2243 -2691 3325 -4291 5933 -9245 18476 -95932
70i5932k19158L31734K19303k21658j82967J79722J27902j37833j05096R1669
$$ -95932 -315090 16644 235947 14289 -168678 11044 138946 1113 -103983 -12314
80a2314O6279k2471k0847l0900m9427N7503J12894l4750j39800o66J00837L716
$$ -12314 53965 31494 10647 -20253 -69680 -12177 100717 65967 -73833 -74499 26338 30054
92C0054n5196K4971L3746l6243j9509K4407k5256j9315Q4346M4169j21866p9452
$$ 30054 -25142 -171 33575 -2668 -22177 2230 -23026 -42341 42005 86174 -35692 -115144
104a15144J23423J04515r6356r5697O8955O3495n8685l5833N3356L0696k6482
$$ -115144 8279 112794 16438 -79259 -10304 53191 -5494 -41327 12029 42725 16243
115A6243k2783j8750j3380M8292N4878n2472p2242M8713N9189o2155l9733R1379
$$ 16243 -6540 -25290 -38670 9622 64500 12028 -60214 -11501 47688 -14467 -54200 37179
127C7179K9186j21024k9734J33129K5964j27007n439J27128j9833j40124K8153
$$ 37179 66365 -54659 -84393 48736 74700 -52307 -57746 69382 49549 -90575 -62422
138f2422J49599j4509j29064L076R0472q799n5238K3338L4033l0125j8530K2652
$$ -62422 87177 72668 -56396 -53320 37152 28353 -26885 -3547 30486 361 -18169 4483
150D483n319j2898L4304J2981n7671k5510N9308K8558m6323j2330L6350j1658
$$ 4483 -836 -13734 20570 33551 -24120 -49630 9678 38236 -8087 -20417 15933 4275
162D275l8154K5130L9855k5559k7872K8550Q387l8768P671N2325r912n4107N919
$$ 4275 -33879 -8749 31106 5547 -22325 6225 14612 -24156 -16485 35840 25928 -28179 -22260
175b2260M3684r587k7002K3308J6889l3390j6480K8339J0372j6147N930P475k6906
$$ -22260 21424 11837 -15165 8143 25032 -8358 -24838 3501 13873 -2274 3656 11131 -15775
188a5775q187L9234O214m1954K910M4057j7250n2587K6853O4802k4727o6233J6692
$$ -15775 -23962 15272 21486 -20468 -17558 26499 9249 -43338 -16485 48317 23590 -42643 -25951
201b5951N4789j1519l7207J5735K5336j7642j6215J2585K389m044J7138K057l6163
$$ -25951 28838 17319 -19888 -4153 21183 3541 -12674 -89 2300 -1744 15394 17451 -18712
214a8712j0706M5601J8818m4886k0503L7579J3584l3464q122K9989O925k1176
$$ -18712 -29418 16183 35001 -9885 -30388 7191 20775 -12689 -20811 9178 16103 -5073
226e073n563N082k270J0865J5837j6052k6401J5192K9811j3066k5541J6222K0560
$$ -5073 -10636 -5554 -7824 3041 18878 2826 -23575 -8383 21428 8362 -17179 -957 19603
239A9603j8363j8349J7275J4222j0916m586O159j0446r346K1707J4321k4933j7338
$$ 19603 1240 -17109 166 14388 3472 -1114 5045 -5401 -14747 6960 21281 -3652 -20990
252b0990K2415J3983k2935j0087K4534Q393k2716q723J5062P264m469N54k062
$$ -20990 1425 15408 -7527 -17614 6920 15313 -7403 -16126 -1064 6200 1731 2285 223
265B23r113N020J4127n334j2488R207J1046j4521j2204J7295J3685j6145j0924
$$ 223 -8890 -3870 10257 4923 -7565 1642 12688 -1833 -14037 3258 16943 798 -10126
278a0126J2647L918j3056K506J5125o149j8740O700J6582p219j2313R293R802
$$ -10126 2521 6439 -6617 -4111 11014 4865 -13875 -7175 9407 2188 -10125 -832 8970
291H970j1234j0231R616J0871m130o022q15l71M602N325m855o828O753Q385j1098
$$ 8970 -2264 -12495 -2879 7992 3862 -2160 -2975 -3346 1256 6581 1726 -5102 1651 10036 -1062
306a062j0420J4996J3611j5128j6389J1417J4561j0090j0664J0107P024j1535
$$ -1062 -11482 3514 17125 1997 -14392 -2975 11586 1496 -9168 939 7963 -3572
318c572o277R686N395o252k276L379j550l017M562L766k822k428N95n59J058M060
$$ -3572 -9849 -163 5232 -1020 -3296 83 -1467 -4484 78 3844 1022 -1406 -811 -1370 -312 3748
334C748L93n342j26N261k233n791N183P861o520j1073N144J1654n314r746M887
$$ 3748 4141 -1201 -1327 3934 1701 -4090 1093 8954 2434 -8639 -3495 8159 2845 -6901 -2014
349b014P285o048p298N945Q047m690o793K095L853Jr51L23P42J90p94j402O54
$$ -2014 5271 -777 -8075 -2130 5917 1227 -5566 -3471 382 383 -568 -245 497 687 -107 -1509 -855
366h55M445P15m644j962L427K147k796j104L613j412m927J510N683k435n449J933
$$ -855 3590 4305 -339 -2301 1126 3273 477 -627 2986 1574 -3353 -1843 3840 1405 -4044 -2111
382b111N168l317o718M347P908k183r170m86P982M155n740m600K633O459n06o801
$$ -2111 3057 -260 -6978 -2631 5277 3094 -6076 -6562 1420 5575 -165 -4765 -2132 4327 3821 -2980
398b980j546Q236M341p037p814M287R555r63r186j441N750K581l514k640R27J699
$$ -2980 -4526 3710 8051 1014 -6800 -2513 7042 6079 -3107 -4548 1202 3783 269 -2371 -1444 255
414B55R02r45l734j209N396M239m480p657K087R800J170q810l366P686N389o143
$$ 255 1157 212 -3522 -4731 665 4904 424 -7233 -5146 4654 5824 -2986 -6352 1334 6723 580
430E80n750M562O549k149n971p06N003J256k280p66p94q47M37K805L50m657j772
$$ 580 -5170 -608 5941 3792 -2179 -2885 2118 3374 1094 328 -466 -1313 -876 1929 2279 -2378 -4150
447d150M660K542m937l244L621M721j774m633j023L297M178Q69n338m865M909
$$ -4150 510 3052 -1885 -5129 -1508 3213 1439 -3194 -4217 -920 3258 4127 -1211 -6076 -1167
462a167Q875j095j2706j666J4271N603j4259j0266J2482J3818q857j6020L447
$$ -1167 7708 6613 -6093 -7759 6512 12115 -2144 -12410 72 13890 5033 -10987 -7540
475g540J4512J542j1257n475N216O763M77n304o913L269J1213J211j3649o955
$$ -7540 6972 8514 -2743 -8218 -3002 3761 4238 -1066 -7979 -4710 6503 7714 -5935 -12890
489a2890J4144J3776j1562j8202P514K0092j123j9871k802J7184O528j3740q338
$$ -12890 1254 15030 3468 -14734 -7220 12872 11749 -8122 -10924 6260 12788 -952 -9290
502i290Q413Q758m071p285n5L181J566J070j309n531m62P913L049r972m925J0187
$$ -9290 -877 7881 3810 -3475 -3530 -349 1217 2287 978 -4553 -5015 2898 5947 -4025 -8950 1237
518A237O616r373p637Q756Q250p581o792P955N101q800l148J0783K915j3174l246
$$ 1237 7853 -1520 -9157 -401 7849 268 -6524 1431 6532 -2268 -5416 5367 8282 -4892 -8138
533h138J4684L989j5404m966J3743O414j2442p221Q931O634n009m854O37J002
$$ -8138 6546 10535 -4869 -9835 3908 10322 -2120 -9341 -410 6224 1215 -3639 -3002 -2000
547b000K137L959k930r248K398J3979l90j5885l324J7100Q535j6336j1815J3135
$$ -2000 137 4096 1166 -8082 -5684 8295 7905 -7980 -11304 5796 14331 -2005 -13820 -685
561f85J4653q256j5078K764J3745J607j0614m355N781N039j396m945k645J824
$$ -685 13968 5712 -9366 -6602 7143 8750 -1864 -6219 -438 4601 3205 -1740 -4385 -2561
575b561N369K469p147p405O329J1434l404j4654O98J6179K344j5781m481J4749
$$ -2561 2808 5277 -1870 -9275 -2946 8488 5084 -9570 -8872 7307 9651 -6130 -10611 4138
589D138O383j2972o144J1319N237r210l086P579J461p939P01P511j905p927K445
$$ 4138 10521 -2451 -8595 2724 7961 -1249 -4335 3244 4705 -3234 -2533 4978 3073 -4854 -2409
604b409O767k605n827J818M362j713k625J907n32j911K907L425m839m937O088
$$ -2409 4358 1753 -4074 -2256 2106 393 -2232 -325 -857 -2768 139 3564 -1275 -6212 -124
619a24O933n089q257L503R482j397q587j151P344L498n240m718J608N261J225
$$ -124 6809 1720 -6537 -3034 6448 5051 -3536 -4687 2657 6155 915 -3803 -2195 3066 4291
634D291m545l930K316M749M69n116l280L257N585r19o975k807P612O456o557r253
$$ 4291 -254 -4184 -1868 2881 3350 -1766 -5046 -1789 3796 2877 -4098 -6905 707 7163 606 -8647
650h647M820J1802k385j1781m31J1684K592r685m021P439M419n106l255J815K356
$$ -8647 -3827 7975 5590 -6191 -6622 5062 7654 -2031 -6052 1387 5806 700 -2555 -740 1616
665A616K67j271j770r56K057K523k517l260J633L216j227k786N27K486l62j156
$$ 1616 1883 612 -1158 -2114 -57 2466 -51 -3311 -1678 1538 311 -2475 -1948 538 176 -980
681i80O58j10q71J812J318j730j957K371K478k221k354J868K429j422k665R58
$$ -980 -322 -432 -1303 509 1827 97 -1860 511 2989 768 -1586 282 2711 1289 -1376 -418
697d18K154p71j580O1N37K52m78o68J52P27p0j081k21J578o7j574N23K070r70
$$ -418 1736 965 -615 -554 -17 235 -243 -911 -759 -32 -102 -1183 -1404 174 107 -1467 -944 1126 156
716A56j265O68K005o35k255J423J960r57j885R63J982j280j868N94J418n5j742
$$ 156 -1109 -441 1564 929 -1326 97 2057 1100 -785 178 2160 880 -988 -394 1024 969 -773
733g73q1Q19M34m21j076k04J466M13j758q47J971J319j598j783J799J807j005
$$ -773 -854 -35 399 -22 -1098 -1302 164 577 -1181 -2028 -57 1262 -336 -2119 -320 1487 482
750D82j525R10J465l78j146L79R47k55l93M5l11L9K00J97k05j018J75N09j41m12
$$ 482 -1043 -133 1332 954 -192 187 1134 879 486 531 220 259 459 656 451 -567 -392 117 -24 -436
770d36j22k96N27L26o84l22L59J090m78p58N78J108m30r13M35P62M7p94M24K23
$$ -436 -558 -854 -327 -1 -685 -1007 -648 442 -36 -794 -216 892 462 -451 -16 746 793 -1 423 646
790F46m84L35K65m00o00J27P74l50j091K94O50k09o15l15L62L24J01k32l81M66
$$ 646 162 497 762 362 -238 -111 663 313 -778 -484 166 -43 -658 -973 -611 -287 -186 -418 -799 -333
810c33P21Q3j199k9J551L86j606m5J430K25j051k96P54M35l39q15p5M78O70m90
$$ -333 388 471 -728 -757 794 1180 -426 -471 959 1184 133 -163 591 1026 687 -128 -203 275 945 455
830D55j397RJ176K95j705l46J473P23j544q46J278J069l53r17K16O77j30K96j40
$$ 455 -942 -933 243 538 -1167 -1513 -40 683 -861 -1707 -429 640 287 -630 -414 263 133 429 289
849B89n05N45J199n89j300N14J167m23j373L22J007k99j038L03k41K14K14J86
$$ 289 -216 329 1528 939 -361 153 1320 897 -476 -154 853 554 -484 -181 -422 -208 6 192
867A92r55o45J439P22j542n63R68J034r58n98J156R7k49N51J49r21p0J393J61
$$ 192 -763 -1408 31 753 -789 -1352 -384 650 -308 -906 250 347 98 649 798 -123 -193 1200 1361
886A361j749m07J841O89j944j008J388P82j278K37j77k71J07R30q95j279P50K213
$$ 1361 -388 -795 1046 1735 -209 -1217 171 953 -325 -88 -265 -536 -429 501 -394 -1673 -923 1290
904A290r39k306N10K705k63j593j69Q21R15L5p30q82N96J669M9k810l3L036k9
$$ 1290 351 -1955 -1445 1260 997 -596 -765 56 971 1006 276 -606 -10 1659 1708 -1102 -1135 1901 1872
923A872k675n98K518l5k056L58J307j534m13J801M72k855m42L611K07l561j22
$$ 1872 -803 -1401 1117 1082 -974 -616 691 -843 -1256 545 1017 -1838 -2280 1331 1538 -2023 -2145
940b145L449P7k613K83K368j137q63J300Q59k210l14K984Ql467l00L600M77l208
$$ -2145 1304 1381 -1232 -949 1419 282 -581 719 1578 -632 -946 2038 2046 -1421 -1721 1879 2356 -852
958h52j190K573J283j721j528M7J275J148q03k024n0K781N33k465q68J745J650
$$ -852 -2042 531 1814 93 -1435 -1388 -113 1035 232 -1792 -1842 939 1472 -993 -1861 -116 1534
975A534q19q51j005N24K411N46l098j988L776L588m323m514M150M847m082m791
$$ 1534 715 -136 -1141 -617 1794 2340 -758 -2746 1030 4618 295 -4219 -69 4778 696 -4095
991d095L296M270l188k948K445J366k891M09L114j895l177K852M014l715m182
$$ -4095 -799 3471 283 -2665 -220 1146 -1745 -1336 1778 -117 -3294 -442 3572 -143 -4325
1006d325M295M378m132l880M230L252l736k140L284J284l484k68L099q45k765
$$ -4325 -30 4348 216 -3664 566 3818 82 -2058 1226 2510 -974 -1242 1857 1012 -1753
1021a753R34K917j504k555O61K217o66j434J6P99M21j90m31q10R27J184p40q57
$$ -1753 -819 2098 594 -1961 -1300 917 251 -1183 -1167 -368 53 -137 -568 -1378 -451 733 -7 -864
1039h64P66M88k24K68K36j115n50K928P39m363o62M735J236n447j866N658K047
$$ -864 -98 390 166 434 670 -445 -995 1933 2672 -1691 -2353 2382 3618 -1829 -3695 1963 4010
1056D010n917j615N092R36m516J77L381j349k711K760J931m131o71M570Q38n502
$$ 4010 -1907 -3522 1570 2506 -2010 -1833 1548 199 -2512 248 2179 -1952 -2623 1947 2785 -2717
1072b717m00O278K09n901j7N534l55m521Q75L370j262k694J992Q81k161k88K309
$$ -2717 -3117 3161 3370 -2531 -2548 2986 2631 -1890 -1015 2355 1093 -1601 391 1272 -889 -1177 1132
1089A132m09k540P75K500j512j777J170J222q36p42J242j32q80O56P80j084j96
$$ 1132 723 -1817 -1042 1458 -54 -1831 -661 561 -275 -1017 225 93 -787 -131 649 -435 -631
1106f31J822n05j452J084J351j857j650K879J128l162j026L891O4l883L13L346
$$ -631 1191 686 -766 318 1669 -188 -1838 1041 2169 -993 -2019 1872 1936 -1947 -1634 1712
1122A712m80l704J195K929j810j855J986J280k923k0L381q21l273J575L398k022
$$ 1712 1232 -2472 -1277 1652 -158 -2013 -27 1253 -1670 -1690 1691 870 -2403 -828 2570 548
1138E48l003K251K741k668k033K916J543l029l38K473k51k498J113K052j929j512
$$ 548 -2455 -204 2537 -131 -2164 752 2295 -734 -1072 1401 1150 -1348 -235 1817 -112 -1624
1154a624J926J061k849o17K938K39k648N05K204r44j817J193J566k031k0J775
$$ -1624 302 1363 -1486 -2103 835 1074 -1574 -1069 1135 191 -1626 -433 1133 -898 -918 857
1170H57K1k012Q77J844j539j491K298R98k290q89K609K97k832M61K283r27j976
$$ 857 878 -1134 -257 1587 48 -1443 855 1853 -437 -1326 1283 1580 -1252 -791 1492 565 -1411
1187a411Q13J581j530r45J910N09k331P79J777j229j957J987J589j845j484K824
$$ -1411 -598 983 -547 -1492 418 927 -1404 -625 1152 -77 -2034 -47 1542 -303 -1787 1037
1203A037N56k091l37K211l7k330R62J920j582j684J776J537k317j170K192N05
$$ 1037 1593 -498 -835 1376 1339 -991 -29 1891 309 -1375 401 1938 -379 -1549 643 1148
1219A148k341J70K237j114j588J418J031j684m44J610L11k099N85J777n26j702
$$ 1148 -1193 -1023 1214 100 -1488 -70 961 -723 -1167 443 754 -1345 -760 1017 491 -1211
1235a211Q48J979j407j174J508P22j718k45J684j31j943R01J311r10j632J520
$$ -1211 -363 1616 209 -965 543 1265 -453 -698 986 855 -1088 -187 1124 214 -1418 102
1251A02J075j878n76J753K8j664M15J601j198j119J482Q10j523l58J804m1j430
$$ 102 1177 -701 -1277 476 504 -1160 -745 856 -342 -1461 21 831 -692 -1050 754 713 -717
1268g17L61J808p74j419R41J068j213q15J403M12j484n29J878m16j518M43J184
$$ -717 -356 1452 678 -741 200 1268 55 -760 643 1055 -429 -958 920 504 -1014 -571 613
1285F13q16j018J310M70j340k75J610j83j551P63J376q56j159J425J008j549o64
$$ 613 -203 -1221 89 559 -781 -1056 554 371 -1180 -417 959 103 -1056 369 1377 -172 -836
1302h36J538L08j541N32P47k66j367Q37J249j382n34J066M97j439l36J084J50
$$ -836 702 1010 -531 1 748 482 -885 -48 1201 -181 -715 351 848 -591 -927 157 307
1319C07j283L33Q90m26o58P77O57q69m05J157r1q06M38M78m17n70R82J76q28k52
$$ 307 -976 -643 247 -179 -837 -60 597 -272 -677 480 389 -417 21 499 82 -488 494 670 -158 -410
1339d10R27K20j335M25P20n05m28L18M25o48m60P71Mj025L69J232n35q67Q25N50
$$ -410 517 737 -598 -173 547 42 -386 -68 357 -291 -751 20 24 -1001 -632 600 65 -802 23 573
1359E73p37n74J271J15q83j00R81J64r57M31M99k91p66M45J96k52m39J96M76k27
$$ 573 -164 -738 533 648 -235 -335 646 810 -147 284 783 492 -274 171 367 115 -324 -128 348 121
1379A21m07L79m04q2K43j27J54k88L59K04k86o8J16M3j8p8M93k99j04L57k42j5
$$ 121 -286 93 -311 -393 -150 -277 -123 -411 -52 152 -134 -202 -86 -43 -61 -139 354 55 -49 308 66 51
1401E1J73P70q71m57N88M56m12p78O89M61p85k18O1J80j87m3K73J40r03O23L97
$$ 51 224 994 123 -334 254 710 298 -480 209 670 -115 -333 -272 -92 -279 -322 -49 91 -812 -189 208
1422B08m16m04M15L51o4m67M18P51o35l15M32L14k93q0k72O12m49j37K50o7k11
$$ 208 -208 -612 -197 154 90 -377 41 792 157 -158 274 588 295 215 -57 555 106 -31 219 152 -59
1443e9m90N13K35n31j92K72L22k42k99J99M63l56k00J99L96k01l32K17L10j31
$$ -59 -549 -36 199 -332 -524 -252 70 -172 -471 -272 191 -165 -365 -166 230 29 -303 -86 224 93
1463I3j2M48l04n70K72M65K72p24k93O06J81o61k47P54P5n19l44M44K54o46k03
$$ 93 81 529 225 -345 -73 392 664 -60 -353 253 434 -227 -474 280 355 -164 -508 -64 190 -456 -659
1484f59O12L85p43n0P80k27n05J55J102n40j076M29J436p35r35M09Q40m18p04
$$ -659 -47 338 -405 -455 325 98 -407 -252 850 310 -766 -337 1099 364 -571 -162 678 260 -444
1503d44K21J018q19p93Q90L24o25l28Q59j71q65J05J034K7r06L6R39j51n91J7
$$ -444 -223 795 -24 -817 73 397 -228 -556 303 132 -733 -628 406 433 -473 -437 502 351 -240 -223
1523b23O14m22q6N0N01O1o71K13L97j30m47L14L06j66o45PN67o2o56L4Q69l00
$$ -223 391 -31 -117 -67 434 495 -176 37 434 304 -143 171 477 311 -334 -327 240 178 -478 -444 425 125
1545A25p02R5O57j25m64rM51j14o30M85O65n47m04O67L32n97k25M91O70p03m41
$$ 125 -577 -482 175 50 -414 -423 28 -86 -716 -231 434 -113 -517 150 482 -115 -340 151 821 118 -323
1566c23L82O69p82o07J232k76n94j73R27l53o05L53K79j62o49N91L35m78k16K40
$$ -323 59 728 -54 -661 571 295 -299 -472 455 102 -503 -150 129 -33 -682 -91 244 -234 -450 -210
1586b10L52j85k26K79M45n58p1O35N4n10j09L83r6m25L47q8o7r7j31K08K6j87
$$ -210 142 -43 -269 10 455 -103 -174 461 515 5 -104 279 183 -242 105 17 -50 -147 -278 -70 -44 -231
1608b31p9n3L25j51l00K99K61j86j97K45K80l64j98M75K99n53j41O83j89m13K7
$$ -231 -310 -363 -38 -189 -489 -190 71 -115 -312 -67 213 -151 -349 126 425 -128 -269 414 225 -188 -161
1629a61O40J33o88o7N29k13l41J15K13k42p04O69J96l52j45N22J40o62K31K38
$$ -161 479 612 -76 -143 386 173 -168 -53 160 -82 -786 -117 79 -273 -418 104 244 -418 -187 51
1649E1j00k73K3M82o2N8l6jJ36k57K96n1q7o9K47r6j94k82L88m70J63K43m40%
$$ 51 -49 -322 -299 183 121 179 143 142 278 21 317 266 179 110 357 261 67 -215 173 -297 -134 109 -331 -331
1673c31K99j2l41M32k29j06q5L29J45j4n00M14J49J4l06L45K39n98j43O72r4m17
$$ -331 -32 -44 -385 47 -182 -288 -373 -44 101 87 -413 1 150 164 -142 203 442 -156 -299 373 279 -138
1695a38J58L78m42j38M4J85qk34K65K51m62j27J58K35l69L8K91j17o0K5J22j59
$$ -138 20 398 -44 -182 -138 47 39 -195 70 321 -141 -268 -110 125 -244 -206 85 -32 -92 -67 55 -104
1717a04J5J84qq3L5M19j17o0k34P8J1j62J05j1j48O2oj89p9L98J37m13n0M27l50
$$ -104 -89 95 87 4 39 458 341 281 47 125 136 -26 79 68 -80 -18 -24 -213 -292 106 243 -170 -220 207 -143
1742a43j39J46K59j66j65K58r0k93p4L20Q4K95l09K37J42k95k36J93J34j77J6
$$ -143 -282 -136 123 -43 -208 50 -40 -333 -407 -87 -3 292 -17 220 362 67 -169 24 158 -19 -3
1763cm6L19o26K96m2qK35k80l7l3q0Q7M20m18K68k36M7j96M14J02j71L16k63L7
$$ -3 -49 270 -356 -60 -102 -110 125 -155 -192 -225 -305 -218 202 -216 52 -184 -137 -333 81 183 12 328 65 102
1787A02j31J74k76J62J69J07j88nl33N14k73m4p6J85o13L26K01j64j39L16j60
$$ 102 -29 145 -131 31 200 307 119 114 -219 295 22 -22 -98 87 -526 -200 1 -163 -302 14 -146
1808a46J34k13r6M29J7j72K0J39L0l07L52l8M5k39R5L18j32m04J83J76j78o5J20
$$ -146 -12 -225 -321 108 125 -47 -27 112 142 -165 187 149 194 -45 50 368 236 -168 15 191 13 -52 68
1831F8J21j51j24o1Q0k22j17L78j77jJ75J62j40j26l2L62j27q9p7N8L16p2m03
$$ 68 189 38 -86 -147 -67 -289 -406 -28 -205 -206 -31 131 -9 -135 -167 195 68 -21 -98 -40 276 204 -199
1854a99K17J80l5j43J07j08L3k24J01K17j89J39j14LK6m64N37j09r2nN19k83r1
$$ -199 18 198 163 20 127 19 52 -172 -71 146 -43 96 -18 -15 11 -453 84 -25 -117 -122 397 114 23
1877B3j38J91J9m65L96J12j64j83K54J65O4l66R5k9L56o41L59l2j24k28L42j06
$$ 23 -115 76 95 -370 26 138 -26 -209 45 210 274 -92 3 -26 330 -311 48 16 -108 -336 6 -100
1899a00M7k70L72n4l2k27M68J98n30k40K65L43l33Q6K15q0j50j04K42K42m98R1
$$ -100 -53 -323 49 -5 -37 -264 204 402 -128 -368 -103 240 -93 -7 208 128 -22 -126 116 358 -140 -49
1921d9J93J27l18j26M16l7l20%P0L82o10J42J45j58J35m28K74M19o48M10n7p1
$$ -49 144 271 -47 -173 243 206 -114 -114 -44 338 -272 -130 15 -143 -8 -436 -162 257 -391 19 -38 -109
1943a09j0p3M70J25k74j89j17M43m27L3N58l86k06R6L5K9m00J47K88j6k36K39
$$ -109 -119 -192 278 403 129 -60 -177 266 -161 -128 430 44 -162 -66 -31 -2 -402 -255 33 17 -219 20
1965B0ln9j79j14M59k32jJ12L17k89r5L09j10Qj86J60j13k7n8j8L73l40pM02o0
$$ 20 17 -42 -221 -335 124 -108 -109 3 320 31 -64 245 135 143 -43 117 4 -23 -81 -99 274 -66 -73 329 269
1990B69k21n81O70R4q4l73L35m8j65k81K80R8m47M00Q7K3j01n3K96J56p14J98
$$ 269 48 -533 137 231 147 -226 109 61 -104 -385 -105 -7 -454 -54 33 56 -45 -98 198 354 -360 -162
2012a62M45l6l25K22J9j42k36j8N37m73J12K09K1j04k02K94j00l26m21L78M59
$$ -162 283 247 -78 144 163 21 -215 -233 304 -169 -57 152 173 69 -133 161 61 -265 -686 -308 151
2033A51j76m6J63J79m62L6L64k30K13ll81Q9L37R0j66p9j11K82k25KK24k39J81
$$ 151 -25 -71 92 271 -191 -155 209 -21 192 189 -192 -103 234 324 158 79 -32 250 25 27 251 12 193
2056A93J4m58J94k1K55m33l3L89m1l26J79J27R5n0k91K45K7j44K20J94k54j61
$$ 193 207 -251 -57 -78 177 -256 -289 100 59 -267 -88 39 134 84 -207 38 65 -79 141 335 81 -80
2078h0J56m5k11K67K15R0n99L50r6J29r1l58J81J85j69k9L03l91L4K14j66K3J74
$$ -80 76 31 -180 87 302 392 -207 143 47 176 85 -273 -92 93 -76 -105 198 -193 -159 55 -111 -88 86
2101H6oj83l7J74j71J35Q7mk8j65L25J7j37j48K75O4l67K46L7j6o12N09K28m14
$$ 86 80 -103 -140 34 -137 -2 85 81 53 -112 213 230 93 -55 220 284 -83 163 200 184 -428 81 309 -105
2125a05k75L84J47j69k80M60l85J5PL89p0m75J97M95j16l17K19M2M3k44J92P9
$$ -105 -380 4 151 -18 -298 162 -223 -208 -201 188 118 -357 -160 335 219 -98 121 163 206 -38 154 233
2147B33l26n5O34k33k19J08K40p25K53J68o4k22K42L9k99J20N6k00J00L44o1m4
$$ 233 -93 -148 486 253 34 142 382 -343 -90 78 14 -208 34 73 -226 -106 -50 -250 -150 194 133 89
2169H9l60J94L68l86k64M78K19k18n29Q04j43l39L6L92k24m86K97K40l96L06k1
$$ 89 -271 -77 291 -95 -359 119 338 120 -409 395 252 -87 -51 341 117 -369 -72 168 -228 78 57
2190E7J94p35K28K87O9l63p0N97k79j60K63K38k47J15k63M57m46L04o9R5m94R0
$$ 57 251 -484 -256 31 100 -263 -333 264 -15 -175 88 326 79 194 -69 388 -58 246 177 272 -222 -132
2212a32L93m06JK04p3k93k3M18k93j60K71K65o22L95J55k17M8r3N45l55j52R2
$$ -132 261 -145 -144 60 -13 -306 -329 89 -204 -364 -93 172 -450 -55 100 -117 -69 -162 383 28 -124 -32
2234c2L86m05K36k6j75Q3k5K56k32j88r5L78J5k12L4j23j14K95n4k09n6K03K40
$$ -32 354 -51 185 159 -16 67 42 298 66 -122 -217 161 176 -36 -2 -125 -239 56 2 -207 -263 -60 180
2257A80j91j76K01O9j51k2J66J37l23K1M36k31j66J98N5m22P4N02n1k35j1J09
$$ 180 -11 -187 14 83 -68 -90 76 213 -110 -89 347 116 -50 148 203 -219 -145 357 306 71 60 169
2279A69j61j77K13P7m94K14K80k92k6l4R8K24m81M40N4m16l3M45M27p55J60J35
$$ 169 8 -169 44 121 -373 -159 121 -171 -197 -231 -133 91 -390 50 104 -312 -345 100 527 -228 -68 67
2301F7k2k57M90k13l40M2O20k34j45k23L43l2j74O9J38J00m48o5M75l48m0J39
$$ 67 45 -212 278 65 -275 -233 387 153 8 -215 128 96 -78 -9 129 229 -219 -284 191 -157 -197 -58
2323e8J79q7q1L11m22o1M08jK6k31J61n9k22K20o0J15M3q3k0j7l25K30J82m05
$$ -58 121 34 -47 264 -158 -219 189 188 214 -17 144 85 -137 83 23 138 181 98 78 61 -264 -34 148 -257
2347b57R8L74k25k3N9J75l17p9K07q7L4m95P03l45L23p8J51l4l41K45L02n44L9
$$ -257 -159 215 -10 -33 26 201 -116 -195 12 -75 -41 -536 167 -178 145 67 218 184 -157 88 390 -154 -115
2370a15K33K39k57k02K96k22j38J81J20j03k68J75O6j96J05o8K37Qk65K04J02
$$ -115 118 357 100 -102 194 -28 -166 15 135 32 -236 -61 5 -191 -86 -154 83 91 -174 30 132
2391A32r3Q0N9j63j37rJ26j16J37L30n25J18L82l32J51j12K63o6l25K82j82j85
$$ 132 39 119 178 15 -122 -131 -5 -121 16 346 -179 -61 321 -11 140 28 291 225 -100 182 0 -185
2413a85J34J27j09l9l46M06k5j89Q5p2L24l25LJ77Q0K6K2n3lk7r7L57l33mOJ60
$$ -185 -51 76 -33 -72 -418 -12 -37 -226 -141 -213 111 -214 -211 -34 46 72 94 41 38 11 -86 271 -62 -66 -60 100
2439A00j32q7J38J69k26R3k3j61J15J06j92JJ51o8k63K30K03n3l22K61k7J6j45
$$ 100 -32 -119 19 188 -38 55 32 -129 -14 92 -100 -99 52 -16 -279 -49 154 101 -221 40 13 29 -116
2462a16O2J86n8j14J4K8O4m5j46J9J58Q6J24l07j5J81o9j94J45J99r1l49P3L05
$$ -116 -54 132 74 -40 -26 2 66 21 -125 -106 52 138 262 -45 -60 121 52 -142 3 202 111 -238 -165 140
2486A40j17k78J99k0Oj50K3L55j59J11K1j13R5M5J31l18J70p4J26J21k38l11J91
$$ 140 23 -255 -56 -76 -70 -220 -197 158 -1 110 131 18 113 158 289 -29 141 67 193 314 76 -235 -44
2509d4J91k37k91K35k4O6J58j31R8l04L62mQ5j00%O5k9l35J65l2k2K85J17r2j21
$$ -44 147 -90 -381 -146 -170 -104 54 -77 21 -283 79 75 160 60 60 125 96 -239 -74 -106 -128 157 274 182 61
2534F1k10K60J53k07j16K50l44L05J9j10k80L39j23j28M0M9K5j92J85l8L76j7
$$ 61 -149 111 264 57 -59 191 -153 152 171 61 -219 120 -3 -131 -91 -42 -17 -209 -24 -62 314 297
2556B97n32M43k37J02jK03m08K94n1j0q6K1J99j76m5q2J02n8j25J47O5q9K2ln4
$$ 297 -235 208 -29 73 72 275 -133 161 110 100 14 35 234 58 13 -69 33 -25 -150 -3 62 -27 -5 -8 -62
2581f2N6Q6j28j14%L01j06j12J28R0l3%j46MN8K4J33j8n8j37N6L3J09j76q6K86
$$ -62 -6 80 -48 -162 -162 139 33 -79 49 139 106 106 -40 -36 22 46 179 161 103 -34 22 55 164 -12 -98 188
2607A88m50L55n0j78J59R4p3j88LJ43R4p3J03o8K23l70J07R3l0j54K76n9p4k80
$$ 188 -262 93 43 -135 24 118 45 -143 -140 3 97 24 127 59 282 -88 19 112 82 -72 204 145 71 -209
2631b09J54J41jl13K22L0O7K7l96K30q8L79k44m79L48J05j5J12j45r4RJ20K80
$$ -209 -55 86 85 -228 -6 24 91 118 -278 -48 -136 243 -1 -480 -132 -27 -42 70 -75 -169 -160 -40 240
2654B40q1j45j14L05p0K32l23K09l58J30K03j85j9K8l4RJ39k65n5K6M9oJ26o0
$$ 240 159 14 -100 205 135 367 44 253 -105 25 228 43 24 52 18 27 166 -99 -154 -128 -79 -85 41 -19
2678a9o5J86k9m15%J19N12l65P2j34J82R2k41L25j20m03N23j95Q2N7j30K06k55
$$ -19 -84 102 73 -342 -342 -223 289 -76 -4 -138 44 136 -105 220 100 -303 220 25 107 164 34 240 -15
2701a5J93k05M8K39k03j11k60J92M6K62k6p1k06o7K27p1q1l7L17l11L99k10M1
$$ -15 178 -27 21 260 57 -54 -314 -122 -76 186 160 89 -117 -184 43 -28 -109 -146 171 -140 259 49 90
2724I0j45j46M09p4j65r9K60L4m61J43K25L19m30J2J22q3m46L29M1K39J9k56K30
$$ 90 -55 -201 208 134 -31 -130 130 164 -297 -154 71 390 -40 -28 94 11 -435 -106 -65 174 193 -63 167
2747A67k1l47M32j67J03l46K31K26r7J4j04j73MK68J61L6l60k4O2j34K41k49k80
$$ 167 146 -201 231 64 167 -179 52 278 181 195 91 -82 -78 190 351 387 27 3 65 -69 172 -77 -357
2770c57M87N5l45Q1R2O0l0J13k21O0J97k08k18K68j39J04L90l00k42j67L16K36
$$ -357 130 185 -160 -79 13 73 43 156 -65 -5 192 -16 -234 34 -105 -1 389 89 -153 -320 -4 232
2792B32m90M40J70l17k16K19J08l61k2N72k34j25k38K50l1K5p1K72j58j11K2j7
$$ 232 -258 182 352 35 -181 38 146 -215 -237 335 101 -24 -262 -12 -43 -18 -89 183 25 -86 -64 -81
2814h1K31r1j5j21N9j08K19m03K12K49j4j52K9L03k35j89K01Q0O2k21J3l33M25
$$ -81 150 59 44 -77 -18 -126 93 -310 -98 151 137 -15 14 317 82 -107 94 174 236 15 28 -305 120
2837A20j21K8j77J4K25j29j70J78J70j26RL8jk32K0J8J17R1j99Q3L21k76L5R0
$$ 120 -1 27 -150 -136 89 -40 -210 -32 138 12 21 59 58 -174 -154 -136 -19 72 -127 -44 277 1 36 126
2861A26k0m28L71J32j37n1j01k1M46l18J42k4L2j47j36L47j17o4pL3j73J54j33
$$ 126 106 -322 49 181 44 -7 -108 -129 317 -1 141 117 149 2 -134 213 96 32 25 58 -115 39 -94
2884i4K58n2Rk84K02j16o4J35j77J93l6Q8L4l83J89J26J07j10m45M27K3k5l33
$$ -94 164 112 121 -163 39 -77 -141 -6 -183 10 -26 62 96 -287 -98 28 135 25 -420 7 30 5 -328
2907c28O17M0j95m95L74L56l24o8P6P6l04Q1L10k39Q4J14j67p4j38J00J71k72
$$ -328 289 329 134 -361 13 369 45 -23 53 129 -175 -94 216 -23 61 175 8 -66 -204 -104 67 -205
2929b05k3J19L71k62l74J92J17J61k12J05J10L5k66J67O1l5k67M16p4l06J07K26
$$ -205 -228 -109 262 0 -374 -182 -65 96 -116 -11 99 134 -132 35 96 61 -206 210 136 -170 -63 163
2951A63j08M0nL2O3k04J09j62P8J24m1j23p4r7J94L48l98k9J7J16k61M23k31J79
$$ 163 55 95 90 122 185 -19 90 -72 6 130 89 -34 -108 -205 -11 337 -61 -90 -73 43 -218 205 -26 153
2975A53k38Q4L2P9k5j91J13N3j08q1K65n5K8j71J44J58j46l53J53K51k38J41j03
$$ 153 -85 -1 31 110 85 -106 7 60 -48 -129 136 81 109 -62 82 240 94 -259 -106 145 -93 48 -55
2998e5j40j05K29J40k5k37J3K24j75J31k00J63p0J70n4J10j05m2J9J52k25M1J
$$ -55 -195 -300 -71 69 44 -193 -180 44 -131 0 -200 -37 -107 63 9 119 14 -28 -9 143 -82 -41 -40
3021d0k23J97j21J38K9j51L00n6k05l3R7J37j05l0L1n8L29m38J5J07M9R5O6k07
$$ -40 -263 -66 -187 -49 -20 -171 129 73 -132 -165 -68 69 -36 -66 -35 -93 236 -202 -187 -80 -31 64 130 -77
3045g7o9J44k09K01J28k81J73j63L08q4j62m9L56q2k9j85j0p1P9J18J12O2L4m62
$$ -77 -146 -2 -211 -10 118 -163 10 -153 155 71 -91 -140 216 134 105 -80 -90 -161 -82 36 148 210 244 -218
3069b18K7L19k10J89n9Lq8J2m7j10J83R0j08j53K02J61q4j45J53k34J53j08J78
$$ -218 -191 128 -82 107 48 51 -37 -25 -72 -182 1 91 -17 -170 32 193 109 -36 117 -117 36 -72 106
3092A06k90K48n6J92l38j74L79j82oK5K54L7j71j06J92j99J40Pl3Pl4mL56k05
$$ 106 -184 64 8 200 -138 -312 67 -115 -121 -96 158 195 24 -82 110 -89 51 58 25 32 -2 -6 350 145
3116A45p8NLj94P7O8j73J06J63k92J6O3L3L06l15j32J86P8Q4k62K31m5j43J52
$$ 145 67 72 75 -119 -42 26 -147 -41 122 -170 -154 -91 -58 248 -67 -199 -13 65 149 -113 118 73 -70 82
3140H2j12NN5K35j97p4j9K00O1k1l58J46R7j90K77r4k51J9J64j88N2J09Jn6J11
$$ 82 -30 -25 30 265 68 -6 -25 175 236 215 -143 3 100 -90 187 93 -158 -139 25 -163 -111 -2 -1 -57 54
3165E4j92K5j45r9N31rk20R1k2J21J24j32K6k69N3J02m4l5p0K88m82O26m64l1
$$ 54 -138 -113 -258 -357 174 165 -55 36 14 135 259 127 153 -116 -63 39 -5 -40 -110 178 -304 322 -142 -173
3189a73M06l05J98k28J24j17K84j92M7qL21m59R4Q3j8k39K97Pj48K0J49q2j71
$$ -173 233 -72 126 -102 22 -95 189 -3 44 36 357 -102 -8 75 57 -182 115 122 -26 -6 143 61 -110
3212a10J53j25K70j77J46j35%o6k1J63r7o3K44k89j2j03K22J33j53j04K76n8p7
$$ -110 43 -82 188 11 157 22 22 -44 -65 98 1 -62 182 -107 -119 -222 0 133 -20 -124 152 94 17
3235A7L87m82J88jN0j44K1m0K1k2n1o5K14K5k22J67r0O1q4q4j72K55r9J40R4k22
$$ 17 404 -78 110 109 159 15 36 -4 17 -5 -56 -121 93 118 -104 63 -27 34 -50 -134 -306 -51 -150 -10 84 -138
3261a38L8K00j18n07L42j15K29J02j79K5J87j34J36M8k28L90k11j05J39J04j29
$$ -138 -100 100 -18 -525 -183 -298 -69 33 -146 -121 66 -68 68 116 -112 278 67 -38 101 205 76
3282G6k44L3K16j54J29k31L26r2j61J69J61k83J12M4j86K73j88o5J67j3k9K01
$$ 76 -168 -135 81 -73 56 -175 151 59 -102 67 228 -55 57 101 -85 188 0 -65 102 89 60 261
3304B61m65K64J60Jm81L6Q9K76k26J69j5j52K1O7m1J9j98L88j81Pp2N3J78k11
$$ 261 -204 60 220 221 -260 -224 -135 141 -85 84 69 -83 -62 5 -36 -17 -215 173 -8 -1 -73 -20 158 -53
3328e3J11j73J4Q0L24m60L34k38j0j44J56J04J17qk28K18k95j09K25J57j09L19
$$ -53 58 -115 -101 -21 303 -157 177 -61 -71 -215 -59 45 162 154 -74 144 -151 -260 -35 122 13 332
3350C32k66R9l52K07j56J41k12J67J53j76q4L2K08l33M83j3j14p3J50j57mM8J82
$$ 332 66 165 -187 20 -136 5 -207 -40 113 -63 -147 -115 93 -240 243 230 116 43 193 36 32 80 262
3373B62nl38J51O5k92J90j44Q6j04J01J8%j37L9j11J30O5K42m9l98K50j13L30
$$ 262 257 -81 70 135 -157 33 -111 -25 -129 -28 -10 -10 -147 -108 -219 -89 -24 218 169 -229 21 -92 238
3396B38k75K00J34l01j31L08j69K7L27j37j2k24J01l8j67J48p7J96j94K79m5j98
$$ 238 -37 163 297 -4 -135 173 4 31 358 221 209 -15 86 48 -119 29 -48 148 -46 233 188 -10
3418a0J60l48J49n0J37j90K42p0k5Q2k38L1J35J24j73P6k5r8K09J6j92L21j57
$$ -10 150 -198 -49 -99 38 -152 90 20 -5 77 -161 -130 5 129 -44 32 7 -91 118 134 -58 263 106
3441A06j63J94l4k9k21R9K18r4l2J54l10K42j95k48K25k1j68L68N3l5j90r2L83
$$ 106 -57 137 103 74 -147 -48 170 76 44 198 -112 130 -65 -313 -88 -109 -277 91 144 109 -81 -173 210
3464B10l00J13j96kM80j59j64k11K36k4J33l3j40j48M51J76o32l8K17q9L7J45
$$ 210 -90 23 -173 -175 305 146 -18 -229 7 -17 116 83 -57 -205 246 422 -210 -248 -31 -120 -83 62
3486F2N3N0j38J3j4j87J39N7j02K95k21oN9N7k38J17r9k8J42Q8k64J87P6j7j04
$$ 62 115 165 27 40 26 -161 -22 35 -67 228 7 1 60 117 -121 -4 -103 -131 11 99 -165 22 98 81 -23
3511b3rl9J8J65J37l22J93j48R6k4j37K57r2k04j50L48j35Qk5L55k96J2J80Q3
$$ -23 -32 -71 -53 112 249 -73 120 -28 68 44 -93 164 72 -132 -282 66 -69 -61 -86 269 -27 -15 165 248
3535B48J5j75k08K62m6M9K1k21K48l81L93j99J55j58K2J70k33l00K09N5PL13m05
$$ 248 263 88 -120 142 96 145 166 -55 193 -188 205 6 161 3 25 195 -38 -338 -129 -74 -67 246 -159
3558a59L58k67k79L80k23K40K19m79M11k55q0K19m4j7rK88m76J97M3J19k11J04
$$ -159 199 -68 -347 33 -190 50 269 -210 201 -54 -134 85 41 24 15 303 -173 24 67 186 -25 79
3580G9j39K39k52k9K30k36j44J39K24j47M0o0OO6L4o0k05NK16k59O07l70J30q5
$$ 79 -60 179 -73 -102 128 -108 -252 -113 111 -36 4 -56 -50 16 50 -10 -215 -210 6 -253 354 -16 114 29
3604B9J55k70qJ10j3k7j12J33J47k59J82j45L4J63P2nJ9m48L25m4j94J70k99K41
$$ 29 184 -86 -94 16 3 -24 -136 -3 144 -115 67 -78 -44 119 191 186 205 -243 82 38 -156 14 -285 -44
3628d4J86Lm13L66m38M58Lp7P1j36j37L73k3r8m6j43J39j10j64J40J01J19k51
$$ -44 142 145 -268 98 -340 118 121 44 115 -21 -158 215 192 94 48 -95 44 -66 -230 -90 11 130 -121
3651a21J24n4p6L17J91o14O4K64k08q7K39p7K79m11J02k56L48J15m51L65p6j34
$$ -121 3 -51 -127 190 381 -233 -169 95 -113 -200 39 -38 241 -170 -68 -324 24 139 -312 53 -23 -157
3673a57L60j41k97K20k07K05J53k35l2J06r1K21r7q8M39k40N7l1K0j67K62r1j64
$$ -157 203 62 -235 -15 -222 -17 136 -99 -131 -25 -116 105 8 -80 359 119 176 145 165 -2 260 169 5
3696EK2J39J36m37R5J60o5j92O6k7m3P1QO3k1k00K16k27K98om03M16p6J36k08
$$ 5 27 166 302 -135 -40 120 55 -137 -71 -98 -141 -70 -62 1 -20 -220 -4 -231 67 61 -342 74 -2 134 -74
3721g4ML81j67p0j24K75l81P7J42j07K12j27Q1O0l01J00L3l2j27P3N5O8j96M8
$$ -74 -70 311 144 74 -50 225 -156 -79 63 -44 168 41 122 182 -119 -19 14 -18 -145 -72 -17 51 -145 -97
3745i7M2j60J12P8J41n06M87Mm40M40J10k19J56jl19L31j08j50O3P2l7J44l59
$$ -97 -55 -215 -103 -25 116 -390 97 101 -339 101 211 -8 148 147 -172 159 51 -99 -36 36 -1 143 -216
3768b16RP9N3l2M5K14k36L78k79J34k71J00r8j1JK96J25m11K89l54K2J40J13N6
$$ -216 -207 -128 -75 -107 -62 152 -84 294 15 149 -122 -22 -120 -131 -130 166 291 -120 169 -185 -163 -23 90 146
3792A46k58K28n9j0j56k7j31R4N8j9P7q5J52pj17l05J73K73j8q8N1N5M3j55J99
$$ 146 -112 116 57 47 -109 -136 -267 -173 -115 -134 -57 -142 10 3 -114 -419 -246 27 9 -79 -28 27 70 -85 114
3817A14k0O4n10N9K85l9J34j12K35k46j09J79J59q9j14K4j34JK93m24L33j09O
$$ 114 94 158 -352 -293 -8 -47 87 -25 210 -36 -145 34 193 104 -10 14 -120 -119 174 -250 83 -26 -20
3840b0o3k9P2j96J43P0J96m04K69m8Jj45L00l06K52J2l01K14J3N0j99K61j68L9
$$ -20 -83 -112 -40 -236 -93 -23 173 -231 38 -10 -9 -154 146 -160 92 104 -197 17 30 80 -119 142 -26 13
3864A3k97J71m2R2l8K91j32k20J73n2L0L52n75M9j4L08j47j72L14jl21K52n7J10
$$ 13 -284 -113 -155 -63 -101 190 58 -162 11 -41 -11 341 -234 -185 -199 109 -38 -210 104 103 -218 34 -23 87
3888H7n9J59l03QK36k52m3O1N05m32j57J08j2j61L44o9j09J17mJ65m30L70l4o
$$ 87 28 187 -116 -108 128 -124 -167 -106 399 -33 -190 -82 -94 -255 89 20 -89 28 24 189 -241 129 95 89
3912H9j67j03K46j5o0j42L90k42N8j43QK54l42J28J81k63J89J6L7m1k20J74j80
$$ 89 -78 -181 65 50 -10 -152 238 -4 54 -89 -81 173 -169 -41 140 -123 66 82 119 78 -142 32 -148
3935a48J8J73j10L2k5J06k00P5R8P2j94J73l1L6O1K3j16k9m6J24j19N5O2l3m0
$$ -148 -130 43 -67 -35 -60 46 -154 -79 19 91 -103 70 39 75 136 159 43 14 -32 92 -27 28 90 57 17
3960A7l6j86P3M7k6o6K54J62p0p2k5o8Ml80K39J1K03o1l6J0j0o3K47l57J48L49
$$ 17 -19 -205 -132 -85 -111 -177 77 239 169 97 72 4 8 -372 -133 -122 81 20 -16 -6 -16 -79 168 -189 -41 308
3986C08j99J68m64J51R5j03L1J21j38J61o3k8J18l10j0J75k33J82J17j29l1m3
$$ 308 109 277 -187 -36 59 -44 -13 108 -30 131 68 40 158 -152 -162 13 -220 -38 79 -50 -81 -124
4008a24M41l35J23J34q0N1l40m6K01J35k76K84j61k92N79k98j29J16Rm9M99l18
$$ -124 317 -18 105 239 159 210 -130 -176 25 160 -116 168 7 -285 294 -4 -133 -17 -8 -57 442 124
4030A24o8j22J58m64M53l52K65j42M8J37j88J74k5j04j75K41l3j6L09k64J70K6
$$ 124 56 -66 92 -372 81 -271 -6 -148 -100 37 -151 23 -2 -106 -281 -40 -73 -89 220 -44 126 152
4052A52k48K14l5k54J94Q7j72K22m1J54n98K80K19k85J10J63om8j49j3R6j79O1
$$ 152 -96 118 83 -171 23 110 -62 160 119 273 -325 -45 174 -111 -1 162 156 108 -41 -54 42 -137 -76
4075g6K22o5n0K2K5O6l30L62j60J94q4k31K93j47M1j30n4J81q1k88L04J23R6p0
$$ -76 146 81 31 53 78 144 -186 176 16 210 126 -105 188 41 82 -48 -102 79 -2 -290 14 137 233 163
4099A63k15J04p0L9M1j99O3K55K3k32J24j90O4J13k07L2J01mK33j47r8M68l08
$$ 163 -52 52 -18 21 62 -137 -74 181 204 -28 96 -94 -30 83 -124 -92 9 5 238 91 -7 461 153
4122A53k32N6k0k0K76k96l1J37o3k59L07J20l09K12n7L67n83J78K00k86JL11l28
$$ 153 -79 -23 -43 -63 213 -83 -114 23 -40 -299 8 128 -181 31 -26 341 -242 -64 136 -150 -149 162 -166
4145a66K76k06L49k88q2M9K1O9k86J44j96J70M7L9J90L3k49j24m3J94j47K86j55
$$ -166 110 -96 253 -35 -117 -68 -47 22 -264 -120 -316 -146 -99 -60 130 163 -86 -210 -253 -59 -206 80 -75
4168g5J85Oj61J32r9Q7j62J59j30K7J44k38J82j79j25L38k17q3J13P8j4J70k17
$$ -75 110 116 -45 87 -12 75 -87 72 -58 -31 113 -125 57 -122 -247 91 -126 -209 -96 -18 -32 138 -79
4191g9r4J34j34J45o8o9J14j36R0J17j9J33K0n8k57oL44l52L74J3k87J91j59k1
$$ -79 -173 -39 -173 -28 -96 -165 -51 -187 -97 20 1 134 154 96 -161 -167 177 -175 199 212 -75 116 -43 -64
4215f4K6N4K6k00m9J71L12m39RJ45K7J20k28J00j04n6K35j54l4K18L1n5j83j19
$$ -64 -38 16 42 -158 -207 -36 276 -163 -154 -9 18 138 -90 10 -94 -150 85 -69 -103 115 146 91 -92 -211
4239b11Q7K52J12l65J38K8k40K19K29l04K37K35n51L22k48J19k40K90nk41M7m9
$$ -211 -124 128 240 -125 13 41 -199 20 249 -55 182 417 -134 188 -60 59 -181 109 104 -137 -90 -139
4261a39K04J91k35k18J27O1j74K51o7n1l4J82k18K19m2O7J24m6j01p6J10n8J01
$$ -139 65 256 21 -197 -70 -9 -183 68 1 -50 -84 98 -120 99 57 124 248 202 101 25 135 77 178
4284A78j78J16k10l0l3K73j95N3n8J67J75k17J80j59j0m32O61j64j48L33l91L87
$$ 178 0 116 -94 -124 -157 116 -79 -26 -84 83 258 41 221 62 52 -380 281 117 -31 302 -89 298
4306B98k66J88o9j12j37J38O3j41M6j07o5J3J95J0o6j74J87k3J95l19K5N2k32
$$ 298 32 220 151 39 -98 40 103 -38 8 -99 -164 -151 44 54 -12 -186 1 -22 173 -146 -121 -69 -301
4329c01K90j63P3M9K7K66j83J12nl4kj62J08p1m0JK07j89j08j2M8k1J25J42l58
$$ -301 -11 -174 -101 -52 -25 241 58 170 165 131 129 -33 75 4 -36 -35 172 -17 -125 -137 -89 -110 15 157 -201
4354b01J98j40J25J77l19J25P6L2j39Qj49l3l0J88m4J04J14o4j70K08q1J50o3
$$ -201 -3 -143 -18 159 -160 -35 41 73 -66 -58 -207 -240 -270 -82 -126 -22 92 28 -142 66 -15 135 72
4377G2n7l6J79q5j69M01j98j71K89j75l9P5k71L9K92k53K98l39j14L26lj9M3k60
$$ 72 15 -21 158 73 -96 305 107 -64 225 50 11 86 -185 -146 146 -107 191 -148 -262 64 61 42 85 -175
4401a75J61q7j67R8L69K3k32J34o1j64K99j60J48j93j47L8M3j1j26K85j09R3L6
$$ -175 -14 -101 -268 -170 199 222 -10 124 63 -101 198 38 186 -7 -154 -116 -73 -84 -210 75 -34 59 95
4424I5j10j14K9L7J23r0j98K24M9j61l6M1j14M71j68k9k13kM53m75J76K35j72
$$ 95 -15 -129 -100 -63 60 -30 -228 -4 45 -116 -152 -111 -225 246 78 49 -164 -166 287 -188 -12 223 51
4447E1n3J2k0P2m0Q2k00Q9k12K57N2R5n61M74J85m21K02j27J09K3J30j08j64J09
$$ 51 -2 10 -10 62 22 104 -96 -7 -219 38 90 185 -376 98 283 -138 64 -63 46 69 199 91 -73 36
4471C6M2mrm1L1r8qJ42k31n1M5L57k45O9N6k20J21j01L39k13R4l98N8J00o2K53
$$ 36 78 74 65 24 55 -43 -51 91 -140 -191 -146 211 -34 35 91 -129 -8 -109 230 17 111 -287 -229 -129 -191 62
4497F2qk09l8L02q6j14M53n49L36jk15K01l6j09K98k47J11k54l0L08j67r0o6m9
$$ 62 54 -155 -193 109 23 -91 362 -187 149 148 -67 134 98 -11 287 40 151 -103 -133 175 8 -82 -148 -197
4521a97J74j86L41r5l1k7l5K45k95L32k00J24j9j16r0J15q5l8L4M68j03m23K45
$$ -197 -23 -209 132 37 6 -21 -56 189 -106 226 26 150 131 15 -75 40 -45 -83 -49 419 316 -107 138
4544A38j46M2m4j2j20L33l54O7L90l26m3q3L23R5k47k15L5K87j23j9M7M00m45
$$ 138 -8 34 -10 -22 -142 191 -163 -96 294 -32 -75 -158 165 260 13 -202 -167 120 -3 -22 25 425 -20
4567b0j20r9R9N4K84j78n8L22k2l67Q4o6K63p6J3K4o4j03K5j2j7R0O9j42K4l9
$$ -20 -140 -239 -140 -86 198 20 -38 284 262 -105 -21 -87 176 100 113 137 73 -30 -5 -17 -34 56 125 -17 7 -32
4593c2k00M41k77J81N1m03M30l30J76L11l51m2p4L55l38j04L08j23jr3J84N7k0
$$ -32 -232 209 -68 113 164 -239 191 -139 37 348 -3 -45 -119 236 -102 -206 102 -21 -22 -115 69 126 106
4616A06k72J53L76m22J19J44l68q3M02k33J27j44l7J0J87j31K93j06k4k49L45
$$ 106 -166 -13 363 -59 60 204 -164 -247 155 -78 49 -95 -132 -122 65 -66 227 121 97 -152 193
4637A93l52K03L7k20J21Q5Q0j08J32k1j74L8p9M7Q6j40P8l03K3K73K16j93J49
$$ 193 -159 44 81 -139 -18 67 147 39 171 150 -24 14 -65 -18 68 -72 6 -297 -274 -1 215 22 171
4660A71j69lJ8J02j21J72l05K0j76M76j11O3N4k34n3l3m1K90l11L9L24k10J69
$$ 171 2 -1 17 119 -2 170 -135 -115 -291 185 74 137 191 -43 -96 -129 -170 120 -191 -152 172 -38 131
4683A31M5l04l6QJ09J72j27L20m49J63o3K1l4j95K06J45k27L51l12j25J01J03
$$ 131 176 -128 -164 -156 -47 125 -2 318 -131 32 -31 -10 -44 -239 -33 112 -115 236 -76 -201 -100 3
4705Cp8K33k33K33n63O58k78k49K98J12j52R0n9k19N18n53J42P0Q0K41n87N47
$$ 3 -75 158 -75 158 -405 253 -25 -274 24 136 -16 74 15 -204 314 -239 -97 -27 53 294 -293 254
4727B54m98K73q8K18l11J21K23m47L77r7r4l0JJ28k37K6K31j85K1K05j79o4J22
$$ 254 -244 29 -59 159 -152 -31 192 -255 122 25 -69 -99 -98 30 -207 -181 50 -135 -114 91 -88 -152 -30
4750c0j97J81k14L87k5r3oJ71k14J37r3K1j0nJ25j96k7J38k39M31m00J94K99k84
$$ -30 -227 -46 -260 127 102 9 3 174 -40 97 4 25 15 10 135 -61 -88 50 -189 242 -158 36 335 51
4774E1k85J35L08l71J29J11N9k14J05k17R1K70l33N8J77k8j8r9K57m8k19K1q2
$$ 51 -234 -99 209 -162 -33 78 137 -77 28 -189 -98 172 -161 -103 74 46 28 -71 186 138 -81 -60 -142
4797a42K25j4k95J50k01K73k30J62K10m5K7m67K21L7J8q7L6J27J58k25J3J96j43
$$ -142 83 69 -226 -76 -277 -4 -234 -72 138 93 120 -347 -126 -89 -71 -158 -122 5 163 -62 -49 147 4
4820DJ83r3o9J53m16K98j58L2L05k81K28j63R9k17J63j69J97j11q7J99J73m30
$$ 4 187 94 25 178 -238 60 -98 -66 239 -42 186 23 122 -95 68 -101 96 -15 -102 97 270 -160
4842a60L13k39J01k14n2L19n2K53m84J79m4J09k94J70Mk34L45j12O5J50k09J78
$$ -160 153 -86 15 -199 -251 68 16 269 -215 -36 -80 29 -265 -95 -91 -325 20 -92 -27 123 -86 92
4864I2Lk30m1O5J80q9J1m5krJ60k38L27m0j41k2j33O2K84j92N0J34l51O9M6K20
$$ 92 95 -135 -176 -111 69 -20 -9 -54 -56 -65 95 -143 184 144 3 -19 -152 -90 194 2 52 186 -165 -96 -50 170
4890A70k57J81j67L1K0O7Qj38J10J45j74Q8j55J06J26k71n3J39O1j41J80kj30
$$ 170 -87 94 -73 -42 -22 45 53 -85 25 170 -4 84 -71 35 161 -110 -163 -24 37 -104 76 74 -56
4913e6l1n1J47P5k90j4K89j85m7K64k80K55n6j11K10n8J32j53j14m15O14j46Q7
$$ -56 -87 -138 9 84 -206 -220 69 -116 -163 101 -179 76 20 -91 119 61 193 40 -74 -489 125 -21 66
4936F6k02K4J26o7O6K00j02j69Q4j65L4l4K57o7j2k76j1L13L4m21K14J16j66J67
$$ 66 -136 -112 14 -53 13 213 111 -58 26 -139 -105 -139 118 51 39 -237 -248 65 99 -322 -108 8 -158 9
4960IJ27j04L2M5n16N00J65n44Q5K8K39j82K4M0q0J91j79J10M0K04n0l5K1p9j34
$$ 9 136 32 64 109 -407 93 258 -286 -201 -173 66 -116 -92 -52 -132 59 -120 -10 30 234 184 149 170 91 -43
4985d3M44n13K92k15K09m71K36K23r7P1m37M97j67p6k3L19k85j09K88j32J59j00
$$ -43 401 -112 180 -35 174 -297 -61 162 65 136 -301 196 29 -47 -70 249 -36 -145 143 11 170 70
5007G0j74K06k83K1L31j04k81J63j45K70N1j50J96k02N1q6k4J43J52k63l8K20
$$ 70 -104 102 -181 -160 171 67 -214 -51 -196 74 125 -25 171 -31 20 -66 -90 53 205 -58 -96 124
5029A24k03K0J48j25k75K30J38p8o7P6j6k56P8N2j78N48j83J04P3rl66J22R1q8
$$ 124 -79 -59 89 -36 -311 -81 57 -21 -88 -12 -28 -284 -206 -154 -332 216 33 137 210 201 -165 -43 48 -40
5053d0j9L6J38p3k00q4K18o7J67j16J7k8J04J22m28K37l26K88L9K7j66J38K41
$$ -40 -59 -23 115 42 -158 -242 -24 -91 76 -40 -23 -51 53 175 -253 -16 -342 -54 -15 12 -154 -16 225
5076B25j90j74M2J41j74J54J11r0l02L24j29n2K6j45M05qj99oj47M3R2J05k16
$$ 225 35 -139 -97 44 -130 24 135 45 -257 67 -62 -114 -88 -233 172 164 -35 -41 -188 -145 -53 52 -164
5099a64R5K41j45j33j43M23q6N9l28k3K76j05J35j52R6J50m54K67K6j32J27j52
$$ -164 -69 172 27 -106 -249 174 88 147 -181 -204 72 -33 102 -50 46 196 -258 9 35 -97 30 -122
5121a22K53r6K07m38J86l6J82R2k05J64j94k10K3J61j63K95j46k06K62j99L04
$$ -122 131 35 242 -196 -10 -46 136 228 23 187 -7 -217 -194 -33 -196 99 -47 -253 9 -190 114
5142A14j15J02j08J07r1p8J3q4K2j62K82K91l19j76K96p0j90L48l42L69j46l24
$$ 114 -1 101 -7 100 9 -69 -56 -140 -118 -280 2 293 -26 -202 94 24 -166 182 -160 209 63 -261
5164b61L44j62N1J45l20L76k58K77k07J29j7%j33k8J26k19J84J59j24k32J51P9
$$ -261 83 -79 -28 117 -203 173 -85 192 -15 114 97 97 -36 -64 62 -157 27 186 62 -170 -19 60
5186F0k39J71j57L95j36J10p3k60J45K6p1J05k47K26l6m2P3N3k2J71j24j58P0
$$ 60 -179 -8 -165 230 94 204 131 -129 16 42 -29 76 -171 55 19 -23 50 103 81 252 128 -30 40
5209D0k22K51j9j27j7j13P1P2M61m51L63n09K76j72K99k69j13L20M3j60k50J6
$$ 40 -182 69 50 -77 -94 -207 -136 -64 397 -54 309 -200 76 -96 203 -66 -179 141 184 24 -226 -210
5231b10L87k70j32L90p1j61m3J80q2J23k02j67K92J98p7L7j35P1k00L04m26J78
$$ -210 177 -93 -225 165 94 -67 -110 70 -12 111 -91 -258 34 232 155 192 57 128 -72 232 -194 -16
5253a6n7J23N5k8j79o5Q9K58m8k37J09k20m4K30n0r6K24J04j10Mr2J34nk15Mj96
$$ -16 -73 50 105 77 -102 -167 -78 180 132 -105 4 -216 -260 -30 -80 -176 48 152 42 46 -46 88 83 -132 -128 -324
5279c24L29j46J68K11j85J63j54J5l25J69J44L8l14K62j54J44K9j04k5j42L64
$$ -324 5 -141 27 238 53 216 62 77 -248 -79 65 103 -211 51 -103 41 70 -34 -59 -201 163
5300A63l2l8j22K85l20L14j69L8n1j38J82p4J37p2j26J38j70Q7j13R4J71j99K68
$$ 163 131 93 -29 256 -64 250 81 119 68 -70 112 38 175 103 -23 115 -55 32 -81 13 184 -15 253
5323B53l01J22j88Q6m8j09k9M48j17k8P7k50r8K62l7j94K41k48K09j45Q3J94k87
$$ 253 -48 74 -114 -28 -76 -185 -214 234 117 89 166 -84 -182 80 43 -151 90 -158 51 -94 -11 183 -104
5346a04K69k34k0J25r9P9j1K67j14j15j39K01Q1n1j08PJ06O9k38K35j68j64J98
$$ -104 165 -69 -89 36 -63 16 5 272 158 43 -96 105 186 135 27 34 140 209 -29 206 38 -126 72
5369G2N7k19J67m4j40%J79J53J3k72N1L6j11N9j82R0p1K77j59M0o6J3p7o0K50
$$ 72 129 -90 77 33 -107 -107 72 225 238 -34 17 53 -58 1 -181 -91 -162 115 -44 -4 -70 -57 -134 -194 56
5394E6q4L5j34K7K7j33K45p6J9J14o5qL9m1l6q3J08j5J64j51R4k45J42o2j29L25
$$ 56 -28 7 -127 -100 -73 -206 39 -37 -18 96 31 23 62 21 -15 -98 10 -5 159 8 102 -143 -1 -63 -192 133
5420A33k62J01K72k90K02rq7r4J69Rj93j71K96j83K9J69k8J1Q5q1j3j28qP1K40
$$ 133 -129 -28 244 -46 156 147 60 -34 135 144 -49 -220 76 -107 -78 91 63 74 159 78 65 -63 -71 0 240
5445B40k80no0J22j12Q8J61r3O7l7p4j54R1l39M44K5O4j47K85m86K16M0n8kq9
$$ 240 -40 -45 -105 17 -95 -7 154 61 128 91 17 -137 -46 -385 59 84 148 1 286 -200 16 56 -2 -4 -93
5470i3K22k39k04J93K93l52k18K57j68M01k30J21O0k28K64R0k4j76J17j87J61
$$ -93 129 -110 -314 -121 172 -180 -398 -141 -309 92 -138 -17 43 -185 79 169 145 -31 86 -101 60
5491F0j73l32K74M7J14j40K53k02R4J06n8m6l9j76J60p3J44k9o1j42L90j92q3
$$ 60 -113 -445 -171 -124 -10 -150 103 -99 -5 101 43 -3 -42 -218 -58 -131 13 -16 -77 -219 171 -21 -104
5514a04K29K18m33J48N5o5o6rJ38m0l4R1p2l46L74k6Nk27J14k05N1K22k35O4J33
$$ -104 125 343 -90 58 113 48 -18 -27 111 71 37 128 56 -290 84 58 63 -164 -50 -255 -204 18 -217 -153 -20
5539b0j1M9Nq6K9Q2k91P1L6q0J51K05n0n4R1j23J42j83jM2j45K34k35J86nK09
$$ -20 -31 18 23 -63 -34 48 -243 -172 -136 -216 -65 140 90 36 127 4 146 -37 -38 4 -141 93 -142 44 39 248
5565B48m41K27m4qj94J95j98K03j71K07j43o6J66J39L2j07KK0Rj47j0N1J11j2
$$ 248 -193 34 -10 -18 -212 -17 -215 -12 -183 24 -119 -185 -19 120 152 45 47 67 76 -71 -81 -30 81 69
5589F9P5l83J66j42L25l56k6R9J49m7N3J19o6j6J85o2j48m6j7l65L90m6J91J39
$$ 69 144 -239 -73 -215 110 -246 -272 -173 -24 -71 -18 101 35 19 204 142 -6 -52 -69 -434 -44 -90 101 240
5613B40k35L3J25l18J64J08j81J19J03j65J26j26J63j70J25l62L70Pj47j12R0
$$ 240 5 38 163 -155 9 117 -64 55 158 -7 119 -7 156 -14 111 -251 119 126 -21 -133 -43
5634d3L64p14M34J26m15M45j85k7J6j38J05kJ85j68p4J91J29k4j23r0K71j59l7
$$ -43 321 -393 41 167 -248 197 12 -15 1 -137 -32 -34 151 -17 -91 100 229 205 82 -8 263 104 67
5657F7j80K29J04j12k7n5Lp7j13K93K1k62P8K04o0J51k01j85O3O2J37l8o6K8j27
$$ 67 -113 116 220 108 81 26 29 -48 -161 132 153 -109 -31 173 113 264 63 -122 -59 3 140 102 36 64 -63
5682f3J75j39j8R3P4N6k77n6J32J77n15M51j7L8q2k29R4NO3j33J6K42j18o9j66
$$ -63 112 -27 -45 48 122 178 -99 -155 -23 154 -361 90 73 111 29 -200 -106 -101 -38 -171 -155 87 -31 -100 -266
5707b66M20j05j56J79j67J29j04K4K90n6m23K94lJ18O6j17k58q5J20J19J53k45
$$ -266 154 49 -107 72 -95 34 -70 -46 244 188 -235 59 56 174 240 123 -135 -220 -100 19 172 -73
5729g3K7O6L1J82Kj63k76K64N4k3j98L89j39r0o6Q4m5k39K17j21L73o3k03N7k41
$$ -73 -46 20 51 233 235 72 -204 60 114 91 -107 282 143 53 -13 71 26 -213 4 -117 256 193 -10 47 -194
5754a94N4Rj5J53l05N42l39J64k25J30k24J91R7j37K25j03K3r7K71l57J46n8J97
$$ -194 -140 -131 -146 7 -298 244 -95 69 -156 -26 -250 -59 38 -99 126 23 46 -51 220 -137 9 -49 148
5777A48l9j81J41j33O1J2L9j79K09j45J64q1J30r5K9j47q0q3j7L77O8j88r2K8
$$ 148 109 -72 69 -64 -3 9 48 -131 78 -67 97 16 146 51 80 -67 -147 -230 -247 130 198 10 -82 -54
5801e4M2Lj43J01M3J9J00J6k06J90r3k15P3J05j14K25P0k13k24K45J22M2j68j13
$$ -54 -12 -9 -152 -51 -8 11 111 127 -79 111 18 -197 -124 -19 -133 92 162 -51 -275 -30 92 134 -34 -147
5825a47K27l6P1r2J21l85J84J20J20L4J65j11m89L9K89o8j95L54k90j04J54k53
$$ -147 80 44 115 23 144 -241 -57 63 183 217 382 271 -218 -179 110 42 -153 201 -89 -193 -39 -292
5847b92J94J00l3j9L89k96Kj46J11J04j7j07q4Q7J7J07k14M13m91M54j27j50J64
$$ -292 -98 2 -31 -50 339 43 45 -101 10 114 97 -10 -94 -7 10 117 -97 316 -175 279 152 2 166
5870A66kq0rj42K76k07K47j39j93J31j16j03J56J82n69M02nl9K3J67l54L01N6
$$ 166 164 84 75 -67 209 2 249 110 -83 48 -68 -171 -15 167 -402 0 -5 -44 -21 146 -208 93 149
5893A49J02l44L80j58j24L6k45J84n7K1L6o8O0J65j5J6K2r9O1l9o2J99k6k16K02
$$ 149 251 -93 287 129 5 41 -204 -20 -77 -56 -20 -88 -28 137 122 138 160 61 122 83 21 220 194 -22 180
5918A80k70K74k79L45l42j3J73j60J16M8n4k00q2L48k9r6J87o2q7j55K73J00k84
$$ 180 -90 184 -95 250 -92 -105 68 -92 24 72 18 -182 -264 84 55 -41 146 84 -3 -158 115 215 -69
5941f9k1K29K2j12l02L82r7K4P4J3Kj26l3m1J27l20L41K6j10j22m2K57j09j63
$$ -69 -90 139 161 49 -253 129 32 56 130 143 145 19 -14 -55 72 -248 93 119 9 -113 -155 102 -7 -170
5965a70L51m17M75j49m66M94k14P2nO4J13k42K85q8k02O2jK88k55j4L3m8K76L4
$$ -170 181 -236 239 90 -376 118 -96 -24 -29 35 148 -94 191 103 -99 -37 -38 250 -5 -19 14 -34 242 276
5989B76j80J15ol90J16J07K03k28k69M52j0p3k2n5m1J73l10M17m64L89m21J16
$$ 276 96 211 205 -185 -69 38 241 13 -256 196 186 113 91 36 -5 168 -142 275 -189 200 -221 -105
6011a05J26K5L4r4J59l66K28j08p2J41j3M7O5P0j96M24m19L2j7L4n6M4J25j67
$$ -105 21 46 80 -14 145 -221 7 -101 -173 -32 -45 2 67 137 -59 365 -54 -22 -39 -5 -61 -17 108 -59
6035e9qNJ01J12Q5l06L3j53L48k87J40m1o2J47R0j11l3M5j59N9j24K03j48O8j64
$$ -59 -67 -62 39 151 236 -70 -37 -190 158 -129 11 -30 -92 55 145 34 1 46 -113 -54 -178 25 -123 -55 -219
$$ [...]
8191A23
##END NTUPLES=NMR FID
##END=
