##TITLE=1H_Pr 5007-T
 CDCl3
 8 sc, 
 17.03.2022
##JCAMPDX= 6.0         $$ Bruker NMR JCAMP-DX V2.0
##DATA TYPE= NMR FID
##DATA CLASS= NTUPLES
##ORIGIN= UXNMR, Bruker Analytische Messtechnik GmbH
##OWNER= root
$$ XWIN-NMR		Version 3.5
$$ Fri Mar 18 13:16:01 2022 Russian Standard Time (UT+4h)  she@DPX200
##.OBSERVE FREQUENCY= 200.131346
##.OBSERVE NUCLEUS= ^1H
##.DELAY= (6, 6)
##.ACQUISITION MODE= SIMULTANEOUS
##.ACQUISITION SCHEME= undefined
##.AVERAGES= 8
##.DIGITISER RES= 18
##SPECTROMETER/DATA SYSTEM= spect
##.PULSE SEQUENCE= zg30
##.SOLVENT NAME= CDCl3
##.SHIFT REFERENCE= (INTERNAL, CDCl3, 0, 15.7039)
##AUDIT TRAIL= $$ (NUMBER, WHEN, WHO, WHERE, WHAT)
$$ ##TITLE= Audit trail, XWIN-NMR		Version 3.5
$$ ##JCAMPDX= 5.01
$$ ##ORIGIN= Bruker BioSpin GmbH
$$ ##OWNER= she
$$ F:/spectra/data/she/nmr/H-F/1/audita.txt
$$ ##AUDIT TRAIL=  $$ (NUMBER, WHEN, WHO, WHERE, WHAT)
(   1,<2022-03-18 13:14:44.51 +0400>,<she>,<DPX200>,
      <created by zg, POWCHK disabled, PULCHK disabled
       configuration hash MD5:
       00 E9 B6 7A A2 85 ED C7 34 08 36 98 17 FE 4E 26
       data hash MD5: 16K
       90 70 EF D0 64 72 48 5B 66 9F 7E B7 AE 37 24 E3>)
$$ ##END=
$$ 
$$ hash MD5
$$ C4 F8 39 A1 56 A4 E8 04 2B 7C B9 4E 11 D6 F9 1F
##$RELAX= 
##$RELAX= 
##$RELAX= 
##$RELAX= 
##$RELAX= 
##$RELAX= 
$$ Bruker specific parameters
$$ --------------------------
##$DU= <F:/spectra>
##$EXPNO= 1
##$NAME= <H-F>
##$PROCNO= 1
##$TYPE= <nmr>
##$USER= <she>
##$AMP= (0..31)
100 100 100 100 100 100 100 100 100 100 100 100 100 100 100 100 100 100 
100 100 100 100 100 100 100 100 100 100 100 100 100 100 
##$AQSEQ= 0
##$AQ_mod= 1
##$AUNM= <au_zg>
##$AUTOPOS= <>
##$BF1= 200.13
##$BF2= 200.13
##$BF3= 200.13
##$BF4= 200.13
##$BF5= 200.13
##$BF6= 200.13
##$BF7= 200.13
##$BF8= 200.13
##$BYTORDA= 1
##$CFDGTYP= 0
##$CFRGTYP= 5
##$CHEMSTR= <none>
##$CNST= (0..31)
1 1 145 1 1 1 1 1 1 1 1 1 1 1 1 1 1 1 1 1 1 1 1 1 1 1 1 1 1 1 1 1 
##$CPDPRG= <>
##$CPDPRG1= <>
##$CPDPRG2= <>
##$CPDPRG3= <>
##$CPDPRG4= <mlev>
##$CPDPRG5= <mlev>
##$CPDPRG6= <mlev>
##$CPDPRG7= <mlev>
##$CPDPRG8= <mlev>
##$CPDPRGB= <>
##$CPDPRGT= <>
##$D= (0..31)
0 1.2 0 0 0 0 0 0 0 0.06 0 0.03 0 0 0 0 0.0002 0 0 0 0 0 0 0 0 0 0 0 0 
0 0 0 
##$DATE= 1647594883
##$DBL= (0..7)
120 120 120 120 120 120 120 120 
##$DBP= (0..7)
150 150 150 150 150 150 150 150 
##$DBP07= 0
##$DBPNAM0= <>
##$DBPNAM1= <>
##$DBPNAM2= <>
##$DBPNAM3= <>
##$DBPNAM4= <>
##$DBPNAM5= <>
##$DBPNAM6= <>
##$DBPNAM7= <>
##$DBPOAL= (0..7)
0.5 0.5 0.5 0.5 0.5 0.5 0.5 0.5 
##$DBPOFFS= (0..7)
0 0 0 0 0 0 0 0 
##$DE= 6
##$DECBNUC= <off>
##$DECIM= 32
##$DECNUC= <off>
##$DECSTAT= 4
##$DIGMOD= 1
##$DIGTYP= 9
##$DL= (0..7)
0 120 120 120 120 120 120 120 
##$DP= (0..7)
150 150 150 150 150 150 150 150 
##$DP07= 0
##$DPNAME0= <>
##$DPNAME1= <>
##$DPNAME2= <>
##$DPNAME3= <>
##$DPNAME4= <>
##$DPNAME5= <>
##$DPNAME6= <>
##$DPNAME7= <>
##$DPOAL= (0..7)
0.5 0.5 0.5 0.5 0.5 0.5 0.5 0.5 
##$DPOFFS= (0..7)
0 0 0 0 0 0 0 0 
##$DQDMODE= 0
##$DR= 18
##$DS= 0
##$DSLIST= <SSSSSSSSSSSSSSS>
$$ [...]
##$SUBNAM2= <"">
##$SUBNAM3= <"">
##$SUBNAM4= <"">
##$SUBNAM5= <"">
##$SUBNAM6= <"">
##$SUBNAM7= <"">
##$SUBNAM8= <"">
##$SUBNAM9= <"">
##$SW= 18.0517287032376
##$SWIBOX= (0..15)
0 0 2 0 0 0 0 0 0 0 0 0 0 0 0 0 
##$SW_h= 3612.71676300578
##$TD= 16384
##$TD0= 1
##$TE= 0
##$TE2= 300
##$TE3= 300
##$TEG= 300
##$TL= (0..7)
0 120 120 120 120 120 120 120 
##$TP= (0..7)
150 150 150 150 150 150 150 150 
##$TP07= 0
##$TPNAME0= <>
##$TPNAME1= <>
##$TPNAME2= <>
##$TPNAME3= <>
##$TPNAME4= <>
##$TPNAME5= <>
##$TPNAME6= <>
##$TPNAME7= <>
##$TPOAL= (0..7)
0.5 0.5 0.5 0.5 0.5 0.5 0.5 0.5 
##$TPOFFS= (0..7)
0 0 0 0 0 0 0 0 
##$TUNHIN= 0
##$TUNHOUT= 0
##$TUNXOUT= 0
##$USERA1= <user>
##$USERA2= <user>
##$USERA3= <user>
##$USERA4= <user>
##$USERA5= <user>
##$V9= 5
##$VALIST= <valist>
##$VCLIST= <CCCCCCCCCCCCCCC>
##$VD= 0
##$VDLIST= <DDDDDDDDDDDDDDD>
##$VPLIST= <PPPPPPPPPPPPPPP>
##$VTLIST= <TTTTTTTTTTTTTTT>
##$WBST= 1024
##$WBSW= 4
##$XGAIN= (0..3)
0 0 0 0 
##$XL= 0
##$YL= 0
##$YMAX_a= 485339
##$YMIN_a= -581007
##$ZGOPTNS= <>
##$ZL1= 120
##$ZL2= 120
##$ZL3= 120
##$ZL4= 120
##$ABSF1= 10
##$ABSF2= 0
##$ABSG= 5
##$ABSL= 3
##$ALPHA= 0
##$AQORDER= 0
##$ASSFAC= 0
##$ASSFACI= 0
##$ASSFACX= 0
##$ASSWID= 0
##$AUNMP= <proc_1d>
##$AZFE= 0.1
##$AZFW= 0.1
##$BCFW= 1
##$BC_mod= 2
##$BYTORDP= 1
##$COROFFS= 0
##$CY= 11.3945322036743
##$DATMOD= 1
##$DC= 2
##$DFILT= <>
##$DTYPP= 0
##$F1P= 2.36226072786647
##$F2P= -0.459571619588291
##$FCOR= 0.5
##$FTSIZE= 0
##$FT_mod= 4
##$GAMMA= 1
##$GB= 0.15
##$INTBC= 1
##$INTSCL= 1
##$ISEN= 128
##$LB= 0.24
##$LEV0= 0
##$LPBIN= 0
##$MAXI= 10000
##$MC2= 0
##$MEAN= 0
##$ME_mod= 0
##$MI= 1.114404
##$NCOEF= 0
##$NC_proc= 0
##$NLEV= 6
##$NOISF1= 3.799351
##$NOISF2= 2.8
##$NSP= 1
##$NTH_PI= 0
##$NZP= 0
##$OFFSET= 15.70392
##$PC= 1
##$PHC0= -17307.66
##$PHC1= 10.40078
##$PH_mod= 1
##$PKNL= yes
##$PPARMOD= 0
##$PSCAL= 0
##$PSIGN= 0
##$REVERSE= no
##$SF= 200.130013532006
##$SI= 16384
##$SIGF1= 3
##$SIGF2= 2
##$SINO= 400
##$SIOLD= 16384
##$SREGLST= <1H.CDCl3>
##$SSB= 0
##$STSI= 0
##$STSR= 0
##$SW_p= 3612.71676300578
##$SYMM= 0
##$S_DEV= 0
##$TDeff= 0
##$TDoff= 0
##$TI= <>
##$TILT= no
##$TM1= 0
##$TM2= 0
##$TOPLEV= 0
##$USERP1= <user>
##$USERP2= <user>
##$USERP3= <user>
##$USERP4= <user>
##$USERP5= <user>
##$WDW= 1
##$XDIM= 8192
##$YMAX_p= 0
##$YMIN_p= 0
$$ End of Bruker specific parameters
$$ ---------------------------------
##NTUPLES= NMR FID
##VAR_NAME=  TIME,          FID/REAL,        FID/IMAG
##SYMBOL=    X,             R,               I
##VAR_TYPE=  INDEPENDENT,   DEPENDENT,       DEPENDENT
##VAR_FORM=  AFFN,          ASDF,            ASDF
##VAR_DIM=   8192,          8192,            8192
##UNITS=     SECONDS,       ARBITRARY UNITS, ARBITRARY UNITS
##FACTOR=    0.0002768,     1,               1
##FIRST=     0,             0,               0
##LAST=      2.2672688,     0,               0
##MIN=       0,             -581007,         0
##MAX=       2.2672688,     485339,          0
$$ Real data points
##PAGE= N=1
##DATA TABLE= (X++(R..R)), XYDATA
0@%%%%%%%QqQj6J6k4L2m0M8n6P2q8J12j36J60j92K27k67L12l67M29m94N67o48
31c45P39q41R54j081J220j370J537j722J922k141K380k643K931l243L585l960
47b078M368m814N304n842O435p093P822q633R549j0586J1768j3131J4726j6623
61h828J8921k1775K5427l0288L7120m7494O5308j04101L35266k64122n34671O35845
73A06608L36503k91226m27930K44269J57524o6881L1597p7174j66209N0282K77478
84A74841P691m21089L9836K96029L7637k28610p7032J62748k4324L462O2275j33941
96a00477n7628J17395J74523j83047j85548K15261J08866j17286j02896R8374
106c2463O4308j07207Q5696J4546j18336L5597J49842j0468k48060R9227K73473
$$ plain form
0 0 0 0 0 0 0 0 0 8 0 8 -8 8 -16 16 -24 24 -32 40 -48 64 -72 88 -104 123 -144 168 -199 230 -264 303 -345
31 -345 394 -447 507 -574 646 -724 813 -909 1013 -1128 1252 -1391 1540 -1703 1882 -2078
47 -2078 2290 -2524 2780 -3062 3373 -3720 4102 -4531 5018 -5568 6200 -6931 7795 -8828
61 -8828 10093 -11682 13745 -16543 20577 -26917 38391 -65710 269556 5434 -529237 106608
73 106608 443111 151885 -276045 -31776 125748 58867 90464 13290 -152919 -102637 174841
84 174841 182532 -238557 -198721 97308 134945 -93665 -170697 -7949 -32273 -28811 33464 -100477
96 -100477 -158105 -40710 133813 -49234 -234782 -19521 89345 -27941 -130837 -32463
106 -32463 31845 -75362 10334 24880 -93456 -57859 91983 81515 -166545 -67318 206155
117B06155j45664k33817J18206K91215j51935k68165J91278J79630j21189j56811
127i1097J21797J09219j51309J6691R5367n3135q6812N7239J25627j24486q3118
138f4017R9956L0515l8869m4092L7927l4604k3295J11089m3816j18435R606J43165
150F5130J0969j83514J7568J15184K413o6320k6606N1804l1829K4159M9772p9815
162e1085l3786O1948P6076q2284p2221J10903J1954p1006M951Q1372k1210j19626
174a04014Q9984J07874q4595j05152N8902J41974o6936r6390M0968N0853J8259
185E1727l4690l022k1329L056Q6800k6202p7361l221Q2565K8471r6048l76M2780
198C3150k154o146m243L174n1119K6802O8900n2683o4348J5693Q4503j7081q6409
$$ plain form
117 206155 60491 -173326 -55120 236095 84160 -184005 7273 186903 65714 -91097
127 -91097 30700 139919 -11390 5301 100668 47533 -39279 17960 143587 19101 -64017
138 -64017 35939 66454 27585 -16507 21420 -13184 -36479 74610 30794 -87641 -78035 65130
150 65130 76099 -107415 -89847 25337 27750 -38570 -65176 -13372 -45201 -21042 28730 -51085
162 -51085 -84871 -22923 53153 -29131 -101352 9551 21505 -49501 -44550 36822 15612 -104014
174 -104014 -14030 93844 9249 -95903 -37001 104973 38037 -58353 -17385 33468 51727
185 51727 17037 14015 -7314 -4258 82542 56340 -21021 -24242 58323 86794 -9254 -9630 33150
198 33150 30996 24850 20607 23781 -27338 -536 68364 15681 -48667 -32974 51529 34448 -51961
211e1961J9658L4564J1977k3604k0393M307o759M9751r846o6425J0028N9797K2598
224C3692q7496j3946Q4727K477n0223k2558N2937J3476m0779J3853K216J262M122
237f240Q349j8l1818L2810K1443k6963r124J3234K7816k6419l921K8976j8866
250I259n115J3416K1354k5614k9151M9179J0389l2863j8823K4419K6595l5292
262G753m870R036k775N687o088M43k2317J0982K6620k8056j5674Q473K4341j3806
276b51k9487K6701K848j3796l707J1047O682k8418J4280J7605j6151q939L851
289a7735K0717j4693r007J5628p239K598J273N110p884q063K7614p123j6133N132
303i805J6253O690k6796J1276J7304r279l395J109J4475j0634l623J6497q312
$$ plain form
211 -51961 -32303 2261 14238 -9366 -29759 -25452 -32211 17540 7694 -58731 -48703 11094 33692
224 33692 -53804 -67750 16977 19454 -30769 -53327 -390 13086 -27693 -13840 -11624 -10362 -6240
237 -6240 2109 2091 -29727 3083 24526 -2437 -11561 1673 29489 3070 -851 28125 9259
250 9259 4144 17560 38914 13300 -15851 33328 43717 10854 -7969 16450 43045 7753
262 7753 2883 11919 9144 14831 8743 9186 -13131 -2149 24471 -3585 -19259 -10786 13555 -251
276 -251 -29738 -3037 -189 -13985 -17692 -6645 37 -28381 -14101 3504 -12647 -21586 -17735
289 -17735 2982 -11711 -20718 -5090 -12329 -9731 -8458 -3348 -11232 -19295 8319 1196 -14937 -9805
303 -9805 6448 13138 -13658 -2382 14922 5643 2248 3357 17832 7198 3575 20072 11760
316A1760k707J65R821k887j3318J4264l393n900J516K019K99j5201J2249N699
330A4386j7065j349M974J0546j5869q368J5329l875k701o377M640L012q339Q634
344b422o224l597O514J776r57j3391J1556Q469j1862k637K292J1667p666o519
358a3001R123l434L696j406J166o2m889J3307k826n761J984L437Q593q666J542
373B803L621k253O860k034P63o668L162J2914q832o335o97R068L437j2422J206
388D593j353L454K909o501k095n923Q365M446r590l115k541R016J278p409k100
403f566m229J0282L127o994o424j584J5447j406j0307l484L861J0752n448m358
417g331k415n4J1416k621o056n330O799J2121r895n462L783P985L70r447O559
$$ plain form
316 11760 9053 9218 19039 16152 2834 17098 13705 7805 9321 11340 11639 -3562 8687 14386
330 14386 -2679 -4028 946 11492 -4377 -12745 2584 -1291 -3992 -10369 -5729 -2717 -11056 -2422
344 -2422 -8646 -12243 -5729 -3953 -4910 -18301 -6745 1724 -10138 -12775 -10483 1184 -6482 -13001
358 -13001 -3878 -7312 -3616 -5022 -3856 -3918 -8807 4500 1674 -4087 -2103 1334 9927 1261 2803
373 2803 6424 4171 11031 8997 9760 3092 6254 19168 10336 4001 3304 12372 15809 3387 4593
388 4593 3240 6694 9603 3102 1007 -4916 3449 7895 -1695 -4810 -7351 1665 2943 -4466 -6566
403 -6566 -10795 -513 2614 -4380 -10804 -12388 3059 1653 -8654 -12138 -8277 2475 -2973 -7331
417 -7331 -9746 -9800 1616 -1005 -7061 -12391 -5592 6529 -3366 -8828 -5045 2940 3310 -6137 422
432D22L940k224j456J660P796n950k434M139K048J779n403K765j119j857O479
447A0585j683l231q117M170J3498o379j3272o338J6521J2576j8170j4885N294
460i431K0609J121k0478o049P727J4116L65j3844q985K563K1195M678k2213j6117
474b4743J4742L0042j0521l1493o31K6227J3839k2216j5377J0211J1805M990q644
487a769p716l208Q841J7895o596k1585l474K6028J5979k5109j8231J5868K4728
500B1651o599k4309L825J5808L416r845m626P325k590q14M160o31n519n346R917
515E823L470j0359l214N562M456p942j919Q557l685q090J159J3332r98j7724Q26
530a0746J5608N616j5678r079J3161O900n294o475O53K225j562P748L82j3617
$$ plain form
432 422 4362 2138 682 2342 10138 4188 1754 5893 7941 9720 4317 7082 5963 4106 10585
447 10585 8902 5671 -2446 1724 15222 8843 -4429 -10767 5754 18330 160 -14725 -9431
460 -9431 11178 12299 -8179 -14228 -6501 7615 7980 -5864 -14849 -12286 8909 13587 -8626 -24743
474 -24743 -10001 20041 9520 -21973 -22604 3623 17462 -4754 -20131 -9920 1885 6875 -1769
487 -1769 -9485 -12693 -3852 14043 7447 -14138 -17612 8416 24395 -714 -18945 -3077 21651
500 21651 15052 -9257 -5432 10376 13792 3947 -679 6646 4056 3242 7402 6771 1252 -4094 5823
515 5823 9293 -1066 -4280 1282 5738 -2204 -4123 4434 749 -7341 -6182 7150 6152 -11572 -10746
530 -10746 4862 10478 -5200 -14279 -1118 5782 488 -5987 -5334 -3109 -4671 3077 3459 -10158
544a0158m517J5379J4246j7922j9579J4416K2562m799k5284J361K0943L974j1856
557a234o804Q363L854j424K540k442l683K01Q552L718j1160l801O113P176k730
572G239q475P24L179J852k46k867j898k975N176M786m579p644q84J0692L428r016
588a508p562N026J0187k730p580M8J373L069J501P64o957o595J0857R872p904
603A861j6627L886J9558j15j7205o228J3139J0163q134q213L57P103N220k964
617A801n230l015O964O883m422n567l45O844K846k952k568l016M705N225k675
632E478o391j574Q056J998o740l465K969M116k851k394j41L36K105m95k428j667
648c088L518K638o003j384O321J891o458m329R122L296p857l868M879N875m222
$$ plain form
544 -10158 -14675 704 14950 -2972 -22551 -8135 14427 9628 -15656 -14295 6648 10622 -1234
557 -1234 -8038 325 4179 2755 5295 2853 -830 -629 7923 11641 481 -3320 2793 9969 7239
572 7239 -1236 -512 2667 4519 4273 1406 -492 -3467 1709 6495 1916 -5728 -6612 4080 7508 -1508
588 -1508 -9070 -4044 6143 3413 -4167 -4119 -2746 323 1824 2588 -4369 -10964 -107 9765 1861
603 1861 -14766 -10880 8678 8563 -8642 -14870 -1731 8432 298 -7915 -7558 -455 4765 1801
617 1801 -3429 -6444 520 7403 2981 -2586 -2931 3913 6759 3807 1239 -1777 2928 8153 5478
632 5478 -913 -2487 5569 7567 827 -2638 331 4447 1596 -798 -939 -603 1502 1007 -1421 -3088
648 -3088 430 3068 -2935 -4319 2002 3893 -2565 -6894 2228 5524 -2333 -6201 -1322 4553 331
663C31m794J403K408J894j545l356j339L448L828m104l551K390L711n60l144J964
679a016j08n48L070J248l012l373N812M767n939l153L875M237k583l944K588R36
695B857m13L51j326j242L20K944k424l013K126K845k708l909L671L401m847k311
711c678L818L093l876l172M230J325k132r78M01J221m91Q33j325j820K276J127
727H52j774k259K292J473k886o56K387Q0k650N27M044k195k817J818L407q39l528
744b724K081K613r89l88J44J99N37J146k93k852J504L162j288l598O57L791j252
761B450l587Q42K041m94k543J481N01j639L41J033N4k186Q37K007j336o73L70
778e01O89M0j2L94j513j40K374j10k685p47L272M60l258r88J857J535k047j203
$$ plain form
663 331 -4463 -3060 -652 1242 -303 -3659 -4998 -1550 2278 -1826 -5377 -2987 724 164 -2980 -1016
679 -1016 -1124 -1672 1398 2646 -366 -3739 2073 6840 901 -2252 1623 5860 3277 -667 1921 2857
695 2857 2444 2795 1469 227 547 3491 1067 -1946 180 3025 317 -3592 79 3480 -1367 -3678
711 -3678 140 3233 -643 -3815 415 1740 -392 -1370 -969 252 -239 594 -731 -2551 -275 852
727 852 -922 -3181 -889 584 -2302 -2958 -571 -491 -3141 -2614 1430 -765 -3582 -1764 1643 804 -2724
744 -2724 -643 1970 981 593 737 936 1473 2619 2326 -526 978 4140 2852 -746 -89 3702 2450
761 2450 -1137 -295 1746 1252 -1291 190 691 -948 -607 426 480 -1706 -869 1138 -198 -871 -501
778 -501 188 228 216 610 -903 -1043 1331 1221 -1464 -2211 1061 1521 -1737 -2725 -868 667 -1380 -2583
796b583J247K31J44j63l40J3L94J321p35o45J489O45p57k10J242o2j135J426Q63
815B385j012j552J928J178k024j395J093J411j081j337J69M69L29m58r38L4M57
832c44J221q50j905J206J976m95k016K37J885m51l80r0L46j08n2N96p49p59K74
851d58L62L22j147n32J07O33N73j299l46J80J174K22j154P2O35M50M58l91N4n57
871f42R63J309q24j014N55J936l7j408p59L00J509Q6j320j815M03K625k95k468
889h96r75J419K222j251j932J13R67J503m59j937n08J638K090j096k586O89K693
906A694K4k004m20Q36M71m8l35o26q26J012J125j305j374L34J243K46j511j10
924a574O99K02J99p97R43M77l24l88N52J370o30j446Q36J983l18k394L57J452
$$ plain form
796 -2583 -1336 -1105 -961 -1124 -1464 -1451 -1057 264 -471 -1116 373 1018 261 51 1293 1231 96 1522 2385
815 2385 1373 -179 1749 2927 903 -492 601 2012 931 -406 -237 232 561 103 -835 -801 -344
832 -344 877 27 -1878 -672 1304 809 -1207 -970 915 464 84 -6 340 232 180 776 27 -732 -458
851 -458 -96 226 -921 -1453 -1346 -713 -140 -1439 -1785 -1605 -431 -209 -1363 -1291 -656 -206 252 -139 -85 -642
871 -642 321 1630 806 -208 347 2283 2246 838 79 379 1888 1974 654 -1161 -758 1867 1572 -896
889 -896 -1871 -452 1770 519 -1413 -1300 -333 1170 711 -1226 -1734 -96 1994 898 -1688 -999 1694
906 1694 1718 -286 -706 130 601 553 218 -408 -1234 -222 903 -402 -1776 -1442 -199 47 -1464 -1574
924 -1574 -875 -673 -474 -1271 -328 149 -175 -563 -11 1359 729 -717 119 2102 1784 -610 -253 1199
942A199R03j679k56M15p39Q06J028j685k411J506L226j126l778J25L616P20k777
959i07j211J728J465k58m13r51l01J172J908r88k796J59L059O85k368k052J365
976g04J592J86j876j343R80J400j4j323o38O44N22O13L84j815q39K604J666j549
994D90k655J312L234m62k163k49J284M93k04K57j227j394K251J444j731k939J077
1011a182L407o28l390j76K139N87p83r37k54M55J430L28j593j037J867J470j145
1028E58j400L46J363J82o95m41l61P89M81q79j145P60J092j090j046N57J125o28
1046d32j022M69J319n96p06L41K77M57L91n47r32R60J657l15j869K7K066L66j612
1065B99n73N72Q20M32o80j939m5K218P59k321k097K335K023j388k244O72J344
$$ plain form
942 1199 2102 423 167 582 -157 649 1677 -8 -2419 -913 2313 1187 -2591 -2466 1150 1870 -907
959 -907 -2118 -390 1075 817 404 -547 -848 324 2232 1244 -1552 -1393 1666 2351 -17 -2069 -704
976 -704 888 1074 -802 -2145 -1165 235 221 -1102 -1740 -1096 -574 39 423 -1392 -2231 373 2039 490
994 490 -2165 -853 2381 1919 -244 -493 791 1284 1080 1337 110 -1284 967 2411 680 -2259 -1182
1011 -1182 2225 1597 -1793 -1969 170 757 -26 -963 -1217 -762 668 996 -597 -1634 233 1703 558
1028 558 -842 -496 867 1049 354 -87 -448 341 822 -57 -1202 -442 650 -440 -1486 -929 196 -432
1046 -432 -1454 -985 334 -262 -968 -627 -350 107 498 -49 -981 -21 1636 1321 -548 -521 1545 1911 299
1065 299 -274 298 1118 1550 870 -1069 -1114 1104 1863 -458 -2555 -220 1803 415 -1829 -1157 187
1082A87K98m51o24l99N27K040m53j948q32K887J473l022j421J896J786j185j598
1099h39K95P08q3J69o39j272R13J334m21j339k04J156O92j443R3M80J21O89m00
1118A0l73J18Q26O61j329k75J510j06o65j82N96J27r87K34L79n98K6K72k70j163
1138a189R53Q11p12j172J022J028q34r56P54R10l83q99J153j90o32N60P22o09
1156C37p00Q62N40r71l60L96J68p18K16J90j97n14N18L82q97j61N80L68r36N07
1176c90L40q2l10L63M85k03j37L49l1j25oK92K40m44M52j09q39J31L94k49n57
1197d36J71L97m15l14N31J86q48N4J042m38p02M36R79l54m47K14N37m97k41J266
1217A121m82p88O35K96n18o92M98N4p6p39P05m1l06j74M29k81k86K16J35k41j77
$$ plain form
1082 187 485 34 -590 -989 -462 1578 1125 -823 -1655 1232 2705 -317 -1738 158 1944 759 -839
1099 -839 -544 164 81 250 -389 -1661 -748 586 165 -1174 -1378 -222 470 -973 -880 -400 -279 410 10
1118 10 -363 -245 581 1242 -87 -362 1148 1042 377 195 791 918 -69 165 544 -54 -28 244 -26 -1189
1138 -1189 -236 575 -137 -1309 -287 741 -93 -1049 -295 615 232 -667 486 296 -336 224 946 337
1156 337 -363 499 1039 68 -292 104 272 -446 -230 -40 -237 -751 -233 149 -748 -909 -329 39 -897 -390
1176 -390 -50 -132 -442 -79 406 203 66 415 384 259 253 545 785 341 793 684 -155 -24 370 121 -436
1197 -436 -265 132 -283 -597 -66 120 -728 -674 368 -70 -772 -336 643 289 -158 56 593 96 -145 1121
1217 1121 639 -149 486 782 264 -428 70 124 48 -691 14 -27 -333 -507 -78 -359 -645 -429 -294 -535 -712
1238g12M42K23n2J63kj69L52J52l3k18L12M03l50k93J1L90l66k89K69k16l36K23
1260i6K38m80j95M19J25l27q4K06J50l9M8L83m23j19L08J75q6l70M76K76k56l7
1282B92j22k4j6J6l8k60L6J69j31k15j49R6j17L9n7J29l38M57j47r2J78M32j82
1305d4K39qP4R2K58o8L9l08J61j5j66l99L95K89m53l09L54J50o22Rl2K40j54j7
1329b95J68j71k5K54j14Q7LM47p0r4LK45Q7k40k59L33l03M50n59K57j86N0r7n81
1353f10J31M72l51l42J10J07K90m07M62k0k14K58L13N8m01L93L66n3p21N56K05
1374F02j50j99n20N06k24M23l69l89L8K20R1m91j45K56K35j51k74K02K01%J07
1395c1m20K36N84jk29l49O27R4j40j06j88l3J68k38N72n33k52J89J62j57o03K25
$$ plain form
1238 -712 -270 -47 -99 64 62 -107 245 397 364 146 458 861 511 218 229 619 253 -36 233 17 -319 -96
1260 -96 142 -338 -533 -114 11 -316 -400 -194 -44 -83 -35 348 -75 -194 114 289 203 -167 309 585 329 292
1282 292 170 146 130 146 108 -152 -116 53 -78 -293 -442 -346 -463 -424 -481 -352 -690 -233 -380 -472 -294 138 -44
1305 -44 195 187 261 353 611 543 582 274 435 420 254 -145 250 539 86 -223 131 281 -341 -332 -364 -124 -278 -295
1329 -295 -127 -298 -323 -69 -183 -96 -93 354 284 190 193 438 525 285 26 359 56 506 -53 204 18 68 -29 -610
1353 -610 -479 -7 -358 -700 -590 -483 -193 -600 -138 -158 -372 -114 199 257 -144 249 615 562 -159 397 602
1374 602 452 253 -267 239 15 438 69 -320 -282 -62 29 -462 -607 -351 -116 -267 -541 -339 -138 -138 -31
1395 -31 -451 -215 369 368 139 -210 417 511 371 265 77 44 212 -26 546 13 -239 -50 112 -45 -648 -423
1417d23L56k42j04p3L37j88J99J15j24RK54J04j9o5j05R6J15O7k28L67J9k95o7
1440A05K6M9L9k71J32l1n8j97j2N2Oj38K01k86KJ75J24p3m9M22M15o48m14O36
1464B07M57k49l68J46J82q3j73n9k53K45P6p0k54m20K29O50n75p29O33O15l91
1485a84k43k97N98L58M1k42j99K58L03O8j67m80J97N39k07k98k17P65l45k15n57
1506e24N12j02J59n20J70Q6j92J67n6j43J13K08K36r2m71M37O34m90k73K46M18
1527E23O5o04K08L92j63n78M70n1j60j24J3P6l39oL92j75m66l35N68L24l81n1
1549d02J58L39j23L2J72K2j30m0J33L46m60K82Q9n12K4K97O4l32l57M20J00k24
1571a02l44J61J05Q4n3o1N1J09m54K75J92j48J61K26J58l34M9L19L65m58l86O18
$$ plain form
1417 -423 -67 -309 -413 -486 -149 -337 -138 -23 -147 -138 116 220 201 136 31 127 242 309 81 448 467 172 105
1440 105 131 180 219 -52 80 49 -9 -206 -218 -166 -160 -298 -97 -383 -381 -206 -82 -155 -204 218 633 -15 -429 207
1464 207 664 415 47 193 375 292 119 60 -193 52 128 58 -196 -616 -387 263 -312 -1041 -408 207 -184
1485 -184 -427 -724 -126 232 273 31 -168 90 393 461 294 -186 11 550 343 45 -172 593 248 33 -524
1506 -524 -12 -114 45 -475 -305 -219 -411 -244 -300 -443 -330 -122 114 22 -449 -12 622 132 -141 105 523
1527 523 588 -16 192 584 421 -157 313 262 102 -22 -9 67 -272 -278 114 -61 -527 -862 -294 30 -351 -402
1549 -402 -244 95 -28 4 176 198 68 28 161 507 47 329 418 -94 -70 227 291 -41 -398 22 122 -102
1571 -102 -446 -285 -180 -96 -149 -210 -159 -50 -504 -229 -37 -185 -24 202 360 26 75 394 759 301 -85 533
1593E33k05m26p2M88j19p09K10J41j50l2p6J87J41l38K86J33m13Q0K08N1J0Q0
1615HK04j38j21L58P2j07j06K5J27L7k35O6O0l32K12k93k18L18l17o5O1K22Q6
1638g6l14KL09j05K4J85jO8k69N54l67J60o4N67l65k82J21L55k44j51Mj27k43
1661b59j3K13M0l86J48L22k98l59M06R5j71K65n44O60k63L04N4j52L5J58m4J39
1683C50k66J98q9k59O4J79N0k76Q1O9l64K48J53l20j28J35J1P9K4o2J0j32K16
1706b9K28M1j10N4K6J33k51K30p7rJ9l17J76j05K5J47j71M0j23O5j19j51J60j24
1730b42J73J74l92nP3J38k65K74J06o6L53k07j29O10m44J87N4j68n3M6k34O2j61
1753a16j17K66l66K70qk4j11j28J34J35k77J57j4P8J30k42J96k0L97M5l20L39
$$ plain form
1593 533 328 -98 -170 318 199 -510 -300 -159 -309 -341 -417 -230 -89 -427 -141 -8 -421 -341 -133 -82 -72 8
1615 8 212 74 -47 311 383 276 170 195 322 359 124 190 250 -82 130 -163 -381 -63 -380 -445 -384 -162 -76
1638 -76 -390 -388 -79 -184 -160 25 24 92 -177 377 10 170 106 673 308 26 147 502 258 107 111 -16 -259
1661 -259 -272 -59 -19 -405 -257 65 -233 -592 -186 -91 -262 3 -541 119 -144 160 214 62 97 255 211 350
1683 350 84 282 193 -66 -2 177 227 -49 32 101 -263 -15 138 -182 -310 -175 -164 -85 -61 -123 -113 -245 -29
1706 -29 199 240 130 184 210 343 92 322 245 236 255 -62 114 9 34 181 10 50 -73 -8 -127 -278 -118 -242
1730 -242 -69 105 -287 -292 -219 -81 -346 -72 34 -32 321 114 -15 595 151 338 392 224 171 217 -17 45 -116
1753 -116 -233 33 -333 -63 -71 -95 -206 -334 -200 -65 -342 -185 -199 -121 9 -233 -37 -57 340 385 65 404
1775D04l24K94o6Jl2N8k1j32j98J97j48j33L2j17J59k80J67l24J86K47m25M02
1797e3n8K56k78J8K40r5M2nK30O6l03kM23k74k48K68j69r2K1p8J68o2m97K06J90
1822h6j72n4J14n5Q1K59l21Q9K07j80J97j58J09Q7j10J6J79K40j90k93K01j19
1844D1J15j16j0m6p2r9L96j62l75M21l62O6J73p2J65m27L42N5J8j42J46p8K50
1867B27J05l53P1PJ39K09l66j35L05k85J05j30M1J92j86J00l38R9k16L20k41R2
1889b38j60M44l45K9M29p1j64K00j7l2L6k6J86l12L03j55R5j98J05J83q9k77P8
1912DJ7k48M6K03k74k38R4O15m12p4K21o2L39k06K8q4J68J44j63J50m4K0j47k22
1936a25J32n7p5K41j00j67LK49j15l36J20P0J54j72o3N9L3J5j76J12J91r6M6L15
$$ plain form
1775 404 80 374 308 309 277 335 314 182 -16 181 33 -100 -68 -185 -26 -306 -139 -463 -277 -30 -455 -53
1797 -53 -111 145 -133 -115 125 30 72 67 297 363 60 58 481 207 -41 227 58 -34 -13 -91 77 15 -482 -276 -86
1822 -86 -258 -312 -198 -253 -172 87 -234 -145 62 -118 79 -79 30 117 7 23 202 442 252 -41 160 41
1844 41 156 40 30 -16 -88 -187 209 47 -328 93 -269 -203 -30 -102 63 -364 -22 33 51 -91 55 -23 227
1867 227 332 -21 50 57 196 405 39 -96 209 -76 29 -101 -60 132 -54 46 -292 -193 -409 -89 -330 -238
1889 -238 -398 46 -299 -270 159 88 -76 124 107 75 111 85 271 -41 262 107 202 4 109 292 203 -74 4
1912 4 21 -227 -181 22 -252 -490 -396 219 -193 -267 -46 -108 231 25 53 -31 137 281 118 268 224 244 97 -125
1936 -125 7 -50 -125 116 16 -151 -148 101 -14 -350 -230 -160 -6 -178 -241 -182 -149 -134 -310 -198 -7 -103 -57 258
1960B58k36l6N2M13q4j75j34K09k99j6J55J00j6m12K0J58K65n65K0L30j99N2r
1983a49k3j68kN67k25j10K49r6K59o4m29N81k07l0l29K41kL3j21N1l0j54M5j64
2007b77K70n88L41J36m0j11J10J54j6r7p4O0L18l1j18O09l80k67K91L0k6j85J06
2030B15j98j70K37j77M34o74J60K90k05k12k26L96J50lk44L84j79j05j71M17l88
2051b69L53Or0L55m10L46n7j0m18J88J63M3k22R1j84oK60r6k64j02M0J69n5J08
2075f1r3J57J33m36K90n3O9J08k74J50K93j92j15L12J47M6l55p8J27l45J61J87
2097A78j85j30Rj04K07m21N6M81m25L1K61K3j82K29o7K41l50K45J04K9j96J8Q9
2120A41N1m20N36q2k00J27j18j41O7k59L33j79k14K62k77J46J89m4M4r1K01j9
$$ plain form
1960 258 22 -14 38 451 367 192 58 267 -32 -48 107 207 191 -221 -201 -43 222 -343 -323 7 -192 -140 -149
1983 -149 -172 -340 -342 225 0 -110 139 43 302 238 -191 390 183 153 -176 65 63 96 -25 26 -4 -158 -113 -277
2007 -277 -7 -595 -254 -118 -158 -269 -159 -5 -21 -118 -192 -132 186 155 37 646 266 -1 290 320 294 109 215
2030 215 17 -153 84 -93 341 -333 -173 117 -88 -300 -526 -130 20 17 -227 157 -22 -127 -298 119 -269
2051 -269 84 90 0 355 -55 291 234 224 -194 -6 157 200 -22 69 -115 -121 139 43 -221 -323 -283 -114 -169 -61
2075 -61 -154 3 136 -300 -10 -63 6 114 -160 -10 283 91 -24 288 435 481 126 48 175 -170 -9 178
2097 178 -7 -137 -128 -232 -25 -446 -390 91 -334 -303 -42 -19 -201 28 -39 202 -148 97 201 230 34 52 141
2120 141 192 -228 308 226 26 153 35 -106 -39 -298 35 -144 -358 -96 -373 -227 -38 -82 -38 -129 72 53
2142E3L4o6P7m5j6L40k24r4Q5K49m14j1j27L33j48j49J0J65O2m08J56J23l6l8
2166h9O5K5k2p9R6j4p1K96K30l23j38j20M46k63K13j12J88j87R3j12n5j28J28
2189F7j00j93j47K75k98J66l86O77j7k38O6l0L1J81J03k28P1j4K02j43j33K79
2211A91J3p2p8J43j24J19j71J00m7k00J44Q2l46K97L2p9j66j44J22J71k8m1J48
2234F6k16nL76k43J60K1J3k03L06R9m65M17q0j89j19N2J36q9j1j66K61k1m78M01
2258B3r1m1R9O8L8l34K66p5Q6j6j26K60j11j05K02K63l52K87k3j20k99J91k8j79
2282a17L6L35k94J3j25J03kl20QK40j15j25N88j39j7J38J7j85l7J56P4o6j91K31
2306B06j64q5Q9L26j75j45j26j2J51n6j05Q3Kj97K97l07o2K64K20k76j6L63l45
$$ plain form
2142 53 87 21 98 53 37 377 153 59 144 393 -21 -32 -159 174 26 -123 -113 52 114 -294 -138 -15 -51 -89
2166 -89 -24 1 -21 -100 -4 -18 -89 207 437 114 -24 -144 302 39 252 140 328 141 234 122 67 -61 67
2189 67 -33 -226 -373 -98 -396 -230 -616 61 44 -194 -128 -158 -127 54 157 -71 0 -14 188 45 -88 191
2211 191 204 132 54 197 73 192 21 121 74 -126 18 100 -246 51 83 4 -162 -306 -184 -13 -41 -82 66
2234 66 -150 -155 221 -22 138 159 172 -31 275 374 -91 326 246 57 -62 -10 126 37 26 -140 121 100 -378 23
2258 23 -68 -109 -10 58 96 -238 28 -47 39 23 -103 157 46 -59 143 406 54 341 318 198 -101 90 62 -117
2282 -117 -81 254 -40 -27 -152 -49 -51 -371 -363 -123 -238 -363 225 86 69 207 224 39 2 158 232 166 -25 206
2306 206 42 -43 46 372 197 52 -74 -86 65 9 -96 -13 -11 -208 89 -218 -280 -16 204 -72 -88 275 -70
2329g0J32m1J09J97k28K10j04O6l39L3J54m1L85m62N5n50L60O4L9J77k63j13j2
2352b42n6J11r7M1J71J08j44O5K52q2q3k0q2J63j63N1J08J16k18J49k23R7J29
2375A51r0K8L2k95k0O1J3K1l0J32J75l58J6j2K11m1J18Rm0M0N8K20l71Qj15J96
2401A17K27m70J20O0P5j72k0L2j74J54j59J34Q3j48j96L41P6j51k23J83K33k48
2423a26J96J40j11K42n12L71J67j73k23K67O3l88J89J39j86m76L67o5K14k26J20
2444a1L4j43j93J32L41j17Q7l15M2L6J97%o8o9L63j70j1J17m40L86j35k6O5l04
2468b02J28K16J3n01L77k71J12J18O0k20J98J19k14QP5J69M3k70Q0p6J92l10L25
2491A69J77k19j1m7L17l77o4K7J52q5m08K28R6o3o9J51J58l54J01K00k14P5K47
$$ plain form
2329 -70 62 21 130 327 99 309 205 271 -68 -35 119 78 463 1 56 -494 -134 -70 -31 146 -117 -230 -242
2352 -242 -298 -187 -284 -243 -72 36 -108 -43 209 127 44 24 -58 105 -58 -7 101 217 -1 148 -75 22 151
2375 151 61 89 121 -174 -194 -133 -120 -99 -129 3 178 -180 -164 -176 35 -6 112 121 81 121 179 399 28 36 -79 117
2401 117 344 -126 -6 54 129 -43 -63 -31 -205 -51 -210 -76 7 -141 -337 4 80 -71 -294 -111 122 -126
2423 -126 70 210 99 341 -171 200 367 194 -29 238 301 -87 102 241 55 -421 -54 -119 95 -131 -11
2444 -11 23 -120 -313 -181 160 43 130 -185 -143 -107 90 90 22 -47 316 146 135 252 -188 198 63 37 102 -202
2468 -202 -74 142 155 -346 31 -240 -128 -10 50 -170 28 147 -67 -59 16 185 228 -42 38 -38 154 -156 169
2491 169 346 127 116 69 386 9 -55 -28 124 39 -369 -141 -45 -108 -177 -26 132 -222 -121 79 -135 -60 187
2514A87n2r6k16Q6L02k57K70o5p0J90k24K11l20M8j76j78L68j32M8J29j06K05
2536A52l02J32J33l05Q7j25K38K7q3J76Lk2J05nj1j56J25o5m2j58J39N4N8r3k4
2561C8J95j85j05j13p2J56l3l08K14K43r2K2O4o2jl5K42k12J36p7J56N6k9o7k78
2586a47M8J82l01J23L74j92k19J78j04j04P9j7N7j69J57O7k25N4M1J09j96R2K28
2609A15o1l64K35L36O6m77K78j48J04l4o3K73k46j37J51k19P0K26N6j82k51M46
2631A74j39rp4K8j08p1R5Q3K43k96K82K9j21K9K8J50k56O6l0j27J13j52J74N0
2655A61o2m6O3k37K17j49R0l7r1J7M9J20L7k90J72k4l09L94P1Q5R4L7k76M8j57
2680b3p6K39N2l84J38k9J29k66j4J26R7m9L07l28j06KJ53j10j31K31r8KK32J89
$$ plain form
2514 187 135 39 -177 -91 211 -46 224 159 89 279 55 266 -54 -6 -182 -360 8 -124 -76 53 -53 152
2536 152 -150 -18 115 -190 -103 -228 10 37 -46 130 133 111 216 211 200 44 169 104 62 -96 43 97 155 62 38
2561 38 233 48 -57 -170 -242 -86 -119 -427 -213 30 -62 -40 24 -38 -39 -74 168 -44 92 15 171 227 198 131 -147
2586 -147 -99 83 -218 -95 279 87 -132 46 -58 -162 -83 -100 -43 -212 -55 12 -213 -159 -118 -9 -205 -113 115
2609 115 54 -310 -75 261 327 -150 128 -20 84 50 -13 260 14 -123 28 -191 -121 105 161 -21 -272 174
2631 174 35 26 -48 -20 -128 -199 -104 -21 222 -74 208 237 116 145 173 323 67 133 103 -24 89 -63 111 161
2655 161 99 53 116 -121 96 -53 37 0 -91 -74 -25 95 132 -158 14 -10 -319 75 146 231 325 362 86 134 -23
2680 -23 -99 140 192 -192 -54 -83 46 -220 -234 -108 -11 -60 247 -81 -187 -185 -32 -142 -273 -42 -140 -138 94 283
2704B83l95J00K28m7m3k83J94Q2j29k14L88k70J13j90L31j35k84J88O4j2p2L7
2726f6N2q2K6L01j88l8P0L1P2k62L22q6Lj53J18j93J92M0n2j26J3J96m34j66M62
2751E2j74L0k33K23j9M0m1L3P8j46J55j03J04J03k7j14qJ00J83q0P8j48N6J14
2775B56l86J70j17J96j01L0o2j68K15K0q5k29R6K30R0k60n6K25o0j00K94M4k32
2798A0J64k61L08l95K37K99j90j15L1r1R4J80j14j96p9O5R3M3j01J54j35m8k12
2821b59R2J93N5p1L3J92j51R2j22j9j72K46J88l83J97k70P4J16J76l92L2K10K3
2844H0j23pm3Q2J06l61J93P7k85L44K83m65J63K54j0n05L84l7mj90M0J87P0k7
2868B06j52K49j97k3j11Q6j33j26K1M02l49NL1rK7j36K21O8k83L73j47r4N2P3
$$ plain form
2704 283 -112 -12 216 169 126 -157 37 119 -10 -224 164 -106 7 -183 148 13 -271 -83 -19 -31 -103 -66
2726 -66 -14 -96 -70 231 43 5 75 106 178 -84 238 152 155 2 120 -73 119 159 107 -19 -6 190 -244 -410 52
2751 52 -122 -92 -325 -102 -121 -81 -122 -89 -11 -157 -2 -105 -1 102 75 -39 -47 53 236 156 234 86 142 256
2775 256 -130 40 -77 119 18 48 -14 -182 33 53 -32 -261 -165 65 155 -105 -161 64 4 -96 198 242 10
2798 10 174 -87 221 -174 63 362 172 57 88 -3 91 271 157 -39 -118 -53 40 83 -18 136 1 -47 -259
2821 -259 -167 26 81 10 43 235 84 176 54 35 -137 109 297 -86 111 -159 -85 31 207 -185 -153 57 80
2844 80 -43 -50 -93 -11 95 -266 -73 4 -281 63 346 -119 44 298 288 -217 167 130 126 -64 -24 163 233 206
2868 206 54 303 106 83 -28 58 -75 -201 -180 222 -127 -122 -91 -100 -73 -209 12 80 -203 170 23 -71 -19 54
2892E4J44j56J33j31m60M25J27k43J02J23j58P6k05J65o7Pr5j0m6J80O6N2O5l02
2916a54J46K69mj68L8m3J90j91R1J61m25M5j44k0K80J5j5m7p9N1k64K33k80J24
2940a91K76J5j44r6Q4J80j10m4J22n8L1j9P1j84L16l00K40j67k0p9J92jm46N52
2964B20q9l81K76j22J09k37M01k97lR1j8J27j47J92k20K51l62J08K1L7R5o3K22
2987B11k53K58k40J76k27R8nj13L56l15L9n3k1OK0J54k70Nj16K82k33J32K21K13
3011C25l77J81j83P4K69l41Mj4N3L8L3mJ21l89J28k3J39k34K48m1k3l4l5O9K54
3036B38j42l49L55q1Q5j02J57M7q1j44J98j78J55P8l1K24m07q2J28j2n0k87J09
3059a72L4O8j3m2P2j56K72k85n3K76o8j24J65o8QK32l35K34noo6J83k53J20M1
$$ plain form
2892 54 198 42 175 44 -416 9 136 -107 -5 118 -40 36 -169 -4 -71 -64 -159 -169 -215 -35 31 83 148 -154
2916 -154 -8 261 257 89 127 84 274 83 174 335 -90 -45 -189 -209 71 86 71 24 -55 -4 -268 -35 -315 -191
2940 -191 85 100 -44 -140 -56 124 14 -30 92 34 65 46 117 -67 249 -51 189 22 2 -77 115 114 -332 220
2964 220 131 -250 26 -96 13 -224 177 -120 -123 -32 -50 77 -70 122 -98 153 -209 -101 -80 -43 52 -11 211
2987 211 -42 216 -24 152 -75 23 18 -95 261 -54 -15 -68 -89 -83 -63 91 -179 -174 -290 -8 -241 -109 112 325
3011 325 -52 129 -54 20 289 -52 -48 -62 -9 29 62 58 179 -210 -82 -105 34 -200 48 7 -16 -50 -85 -16 238
3036 238 96 -253 102 21 106 4 161 208 127 -17 181 3 158 236 205 429 22 -60 68 56 6 -281 -172
3059 -172 -138 -70 -83 -125 -53 -209 63 -222 -275 1 -67 -191 -26 -94 -86 146 -189 45 40 34 -32 151 -102 18 59
3084E9o6n8J07j47Q5k2p6J41l4o4r8J99j41K59Q2k56L4j54J77k8M4J4R7k01o5
3109a12J57o4rL3mL15m12O4K13K7l59J32K07l51M0K62k82QMJ4L60j00j33p7J32
3134F5n1M8o8j38J23J73j33n7J48l23K42N7l0j0k56M30l78L7M8J7M3k74K35J38
3158H6M7m3j62j58L13J8j94J13l48N22l2l0P4k9k47K09J25j20o5q5k23L91p4p5
3182A3j9J58j52J6k8j16J79r7r4R4J18o3j98j63M09j18N9M5j17M6R0J4J68J1j78
3207G7j59K67j71J69j99J9J24p3j37K52k61j41M50k2j35j21K51j65j03K1n3K18
3229A08q9K8J90r3nq1Q3j62j16K07J53j60J92l88K68j52O7j17J78j06j07p8O5
3252a15k5K1q0L6L31j85J28L2r1j12K21j70K7k43L79j78p7K20j11J38j68k19M86
$$ plain form
3084 59 -7 -65 42 -105 -20 -42 -118 23 -11 -75 -173 26 -115 144 226 -30 4 -150 27 -1 43 57 154 -47 -112
3109 -112 45 -19 -28 5 1 316 -96 -32 181 208 -151 -19 188 -163 -123 139 -143 -135 -131 -117 243 143 10 -67 65
3134 65 14 62 -6 -144 -21 152 19 -38 110 -213 29 86 56 46 -210 220 -158 -121 -73 -56 -13 -287 -52 86
3158 86 133 90 -72 -230 83 101 -93 20 -328 194 162 132 206 177 -70 139 264 144 79 -6 -229 162 88 13
3182 13 -6 152 0 16 -12 -128 51 -46 -140 -46 72 9 -189 -352 57 -61 -2 43 -74 -28 62 76 244 255 77
3207 77 -82 185 14 183 -16 3 127 54 -83 169 -92 -233 217 195 60 -61 190 25 -78 -57 -110 108
3229 108 19 47 237 144 139 58 141 -21 -137 70 223 63 255 -133 135 -17 50 -67 111 5 -102 -180 -115
3252 -115 -140 -119 -199 -163 168 -17 111 143 52 -60 161 -9 18 -225 154 -24 -101 119 8 146 -22 -241 245
3275B45l06K67m96K74K17l58O3j10J53j61J67p1K22j95J99j07kP3L16j56O5k12
3297H7J64n01K49L2j29L77l28l4O1Q1%J8q9o4J41k37N8Mj55J32Q4J04j06K7l5
3322e9K87k42N3J63l30J79j73K53k44k1K20j35J03O2k10M9p1K10n48K69J34m8
3344i9K25r8l5q2P6K9J5j12K88j78J30m8J15l63M9R5j4j52J25P4o1j46J01P9j0
3369Ck67K94k07JM2o0L97m46L38j36RK3J89o4j0L8J60m98l1L52j96J3K01l4j90
3394g9K34q8N3r2q5J09q6mn8O2j14M3K01j70Pj25O3J68R0k06L02j24j12K11j38
3419F2N5l41L28k02L60k92J73p2k37r6j3Q6L75l70O8J01j8j24J73K2j35nQJ3L44
3444B63m00J92J10j16R9K4j50J02k36K49j82k8J56l8p3k9K23r1Pn9j52J33K4Q4
$$ plain form
3275 245 -61 206 -290 -16 201 -157 -94 -204 -51 -212 -45 -116 106 -89 110 3 1 74 390 234 299 87
3297 87 251 -250 -1 31 -98 279 -49 -83 -22 59 59 77 -12 -76 65 -172 -114 -110 -265 -133 -49 55 -51 -24 -59
3322 -59 228 -14 39 202 -128 51 -122 131 -113 -134 86 -49 54 116 -94 -45 -116 94 -454 -185 -51 -99
3344 -99 126 28 -7 -89 -13 16 31 -81 207 29 159 111 226 -137 -88 7 -7 -159 -34 40 -21 -167 -66 13 3
3369 3 -264 30 -177 -176 -134 -194 203 -243 95 -41 -32 -9 180 116 106 144 304 -194 -225 127 -69 -56 145 111 -79
3394 -79 155 67 120 28 -57 52 -34 -38 -96 -34 -148 -105 96 -74 -67 -192 -129 39 129 -77 225 101 -11 200 62
3419 62 117 -224 104 -98 262 -30 143 71 -166 -262 -275 -189 186 -184 -116 -15 -33 -157 16 38 -97 -102 -94 -81 263
3444 263 -137 55 165 49 148 172 22 124 -112 137 -45 -73 83 45 -28 -57 166 75 82 23 -129 4 28 112
3468A12l93K42Jk60J46J2Q4M3J61pj91j23K16k1K71l46K36k0j18m9j14m6K29l3
3492C2J50l49J24J8j38Ql9K03q8q3J36J26j81J82m1nq3N7j39K61j72R1p2J86j13
3517G1J1R3LJ9j86r7Q4j18l8J91J68J5k93K83%j79j62j6M9K59r3p4J57k93K30
3542H4l3M3j0j56rJ03P5l38J72J85L8m74K34QK7r8K85l86L4j4k5J23J18K14l00
3567a00K32L7j64J65M8j17j31j11R0K10k95n9K63M8k53j42M33l60M14l0l01K50
3589A27J03l93L1Q2j5J35Q6J7j65p0K03m1p4j03J38k58L06j50J26J11o9k94K10
3612D3j07j82K37j83K14m25L46J03j16N8Q1k56J24M3L1k48K68Q8l08L73k92P2
3634c6J93l2j90p8J3O6K87ok04r5J46j92L29j67k45j43L61j47K42l87J82Rr2L16
$$ plain form
3468 112 -281 -39 -38 -298 -152 -140 -56 -13 148 141 -50 -173 43 22 293 -53 183 163 45 -4 -118 -164 65 32
3492 32 182 -167 -43 -25 -163 -155 -194 9 -79 -162 -26 100 -81 101 60 55 -28 29 -110 151 -21 70 -2 184 71
3517 71 82 175 178 197 11 -86 -2 -120 -158 33 201 216 -77 206 206 27 -135 -151 -102 157 64 -10 147 -146 84
3542 84 51 94 84 -72 -81 22 97 -241 -69 116 154 -320 -86 -78 -51 -149 136 -250 -216 -230 -255 -132 -14 200 -100
3567 -100 132 169 5 170 218 101 -30 -141 -51 159 -136 -195 68 116 -137 -279 154 -206 208 178 -123 127
3589 127 230 -163 -132 -50 -65 70 156 173 8 -62 141 100 26 -77 61 -197 109 -41 85 196 127 -167 43
3612 43 -64 -246 -9 -192 22 -403 -57 46 -70 -12 69 -187 -63 -20 11 -237 31 119 -189 184 -108 -36
3634 -36 157 125 -65 -143 -130 -64 223 217 13 -82 64 -128 201 34 -211 -354 7 -140 102 -285 -103 -94 -186 130
3658A30j75pJ80j09K06j00k80K73J90j97l08L64k14K03k04L5J65k13m2j45J68
3679h0J08Q1q2M6l56R8R3o2J53J04j68J28J32j48K85k35k55J77k9K95j3k49l4
3702a1P5O9j16o7n4K23m5k63J63j77J62P3j20K09l23J33jJ02j4q5J72L4k47L11
3726B03r6k15K61l74K73J60r8k63K43k81K27q2J54k48K05o6k31J28L4Jq0j74M02
3749H3Q6j25j36R1J12k54JL25j40o1K66m0k01J33k19j04N00j68K8j51J3q0R4j1
3773D2m8k8K47k03k58K58J66j62k9K33l73N29m15P4N8j02q8K31l75NK18pJ28M7
3797A48p9j88m7N12m04L9o9j03N0J42nK05j80j23J83l42J57O7k99M65P2j02j41
3820d2j4n9J90j7n9j54K32j25J43J10l14K03l01L92k55L19m01K58k05o8J88o2
$$ plain form
3658 130 -45 -52 128 19 225 125 -155 118 308 111 -197 167 -47 156 -48 -13 152 -61 -103 -248 -80
3679 -80 28 109 27 73 -283 -185 -92 -154 -1 103 -65 63 195 47 332 97 -158 19 -10 285 272 23 -11
3702 -11 64 133 17 -50 -104 119 74 -189 -26 -203 -41 32 -88 121 -202 -69 -70 32 18 -67 105 139 -108 203
3726 203 107 -108 153 -221 52 212 114 -149 94 -187 40 -42 112 -136 69 3 -228 -100 -66 -65 -145 -319 83
3749 83 169 44 -92 -1 111 -143 -142 183 43 -18 248 208 7 140 -79 -183 317 149 177 26 39 -41 53 42
3773 42 -6 -34 213 10 -248 10 176 14 -15 218 -155 374 -41 33 91 -11 -99 132 -243 -238 -20 -27 101 148
3797 148 69 -119 -166 346 -58 -19 -88 -191 -141 1 -4 201 21 -102 81 -261 -104 -37 -336 129 201 99 -42
3820 -42 -56 -115 75 58 -1 -155 77 -48 95 205 -109 94 -207 185 -70 249 -152 106 -99 -167 21 -41
3842d1n6RK48m6j1o4j33j3K38j88oJ53J21k58K54q5l6N5j20k17L51k19J50j34
3866d8l1j40l4J99k76J64P4j23M37j20k58n8K44J54k26J83K0J03j4j17k37J00
3888dJ68j69o9j03K61l4J8p8J99k31j11J12J97l0k81K76r1p9L8Jn4j1J79k23K71
3913A52R8q4k43N9n7K36j76j1j46J01J46r7m3M69n32J95j56J46j12J77Q8k53K14
3936A71j66J65k30L6J6L16k40J90k63m7K02O0k27J7j43L58l45J23O2N8J38l24
3958g3K46k69j60K16q8J44j32K18j75j6P9lk7J49k1r0L04l34J1K14K0r8J16j21
3982A10p2k87M82m06M9j6l9O8l3r9P9J36j2r1K4K88l40M4K08P7j25j17o9J08J80
4007A47k79K99l20J99j59J50J05j45K39n45L35q2Q1J5j76J23p6O2oj42J00J40
$$ plain form
3842 -41 -97 -88 160 114 103 39 -94 -107 131 -57 -63 90 211 -47 207 122 86 141 21 -196 155 -64 86 -48
3866 -48 -79 -219 -253 -54 -330 -166 -92 -215 222 102 -156 -214 30 184 -42 141 161 264 250 133 -104 -4
3888 -4 164 -5 -74 -177 84 50 68 -10 189 -42 -153 -41 156 126 -155 121 30 -49 -11 -10 -64 -75 104 -119 152
3913 152 250 166 -77 -18 -75 161 -15 -26 -172 -71 75 -22 -65 404 -128 67 -89 57 -55 122 210 -43 171
3936 171 5 170 -60 -24 -8 308 68 258 -5 -52 150 210 -17 0 -143 215 -130 -7 55 113 251 -73
3958 -73 173 -96 -256 -40 -128 16 -116 102 -73 -89 -10 -13 -40 109 88 -2 302 -32 -21 193 213 115 231 110
3982 110 38 -249 233 -173 -124 -140 -179 -111 -144 -243 -164 -28 -40 -131 -107 181 -159 -115 93 170 45 -72 -141 -33 147
4007 147 -132 167 -153 46 -113 37 142 -3 236 -309 26 -56 25 40 -136 -13 -89 -27 -33 -175 -75 65
4029F5r4R7m3P5j60K12Q3J3k06j46L24K6j53j03j83L45k8l2j24L02j73j84K75
4052A88k84j8R1j3n4J22m9J74k70q0J67l24K61K79j73J39k84R8O9m0j49K26n2
4075B4o3J19MJ20k31k09L98k49K75k25j19O6l6O6m5Q3N5m1J15k9j20K52p2j15
4099B3Q5j24O8o1p9J68j62K01k50N01l00j23J49k32L26l76K95l60L07J38Nl2k26
4122e9R6K13m23K83r5m5QJ21J5j29j69J93P1j06J39J09k88J86j83%J5n7j02J4
4146a93N49m30l87J34J81N0O7o0P2O1P6j06j28l8K67l4J5JK3j55K14m4j84np0
4171a24L0K42K6J1k85L6m3J33j56J45j8l7J46p0Kj91J65k2L09k88Q4P5m49P3M42
4196B36j21k15O4qj76M73m18N9l5J45P9l6jk27k3K28l49K94J28p6k21Q9J04Q4
$$ plain form
4029 65 -29 68 25 100 -60 152 235 248 42 -104 220 246 93 -10 -193 152 124 92 -32 270 97 -87 188
4052 188 -96 -114 -23 -36 -90 32 -17 157 -113 -193 -26 -350 -89 190 17 156 -128 -30 39 -1 -150 76 24
4075 24 -39 80 84 204 -27 -236 162 -87 188 -37 -156 -90 -126 -60 -105 -22 33 -8 107 78 -42 210 138 23
4099 23 108 -16 52 -9 -88 80 -82 119 -131 370 70 -53 96 -136 190 -186 109 -251 56 194 199 167 -59
4122 -59 37 250 -173 110 15 -30 -22 99 114 -15 -184 9 80 -26 113 222 -66 120 -63 -63 -48 -105 -207 -193
4146 -193 356 -74 -461 -327 -146 -96 -29 -89 -17 44 120 14 -114 -152 115 81 96 97 120 -35 179 135 -49 -54 -124
4171 -124 -94 148 174 185 -100 -64 -107 26 -130 15 -3 -40 106 36 38 -153 12 -10 299 11 95 170 -279 -206 236
4196 236 115 -100 -36 -44 -220 253 -165 -106 -141 4 83 47 46 -181 -204 24 -325 -31 97 21 -200 -111 -7 77
4220G7J29k74L0J19k15j3O2L11k82k9K03k6l2m5j00K39j21o1Q3l1j94J30j29P40
4244E71m63q6n0O0J75k81J4O3J81k10j31J0L21j26j03p4J18l7L34m8k77J83l44
4267b00J37K69j51p1J92j1k15j35j45K08J2L47k67m6J06M6mJ84k24k05L73o3k56
4290a19J32j43L57k82L18k27k82K12J75j67K25k61l63N33k47J18L8O1kR3k06O6
4312B9j32J86J68l76N3K03m05J07K86j65J38O2j31r6K45j37N1p7p4J3R8L5o8J1
4336B4k19J44J60kl29K76k09M1J93l5n3l1k0lJ08j00r8K12K2j28P7j45K16J2k88
4361a75L64l20j05M8J04K06M3K9k97L48m80K56R1j45j53J75RJ36j19J07N8q0j99
4384i9K9J90m0Kk30K78ml25K07N5r5R9k04p5J83j32P3J02q3J26J4j32J22J19m21
$$ plain form
4220 77 206 -68 -38 81 -134 -147 -85 226 -56 -85 118 92 60 15 -85 154 33 -28 55 24 -170 -40 -169 571
4244 571 108 22 -28 32 207 -74 -60 3 184 -26 -157 -147 174 48 -55 -129 -11 -48 286 238 -39 144 -200
4267 -200 -63 206 55 -16 176 165 -50 -185 -330 -122 -110 237 -30 -76 30 76 72 256 32 -173 200 137 -119
4290 -119 13 -130 227 -55 263 36 -246 -34 141 -26 199 -62 -425 108 -139 -21 17 78 76 169 -37 29
4312 29 -103 83 251 -125 -72 131 -274 -167 119 -46 92 154 23 -73 172 35 86 9 -65 -52 46 81 13 24
4336 24 -195 -51 109 107 -222 54 -155 -114 79 44 -9 -40 -60 -63 45 -55 -153 59 81 -47 30 -115 101 113 -175
4361 -175 189 -131 -236 -188 -84 122 165 194 -103 245 -235 21 112 -33 -186 -11 -2 134 15 122 180 100 -99
4384 -99 -70 120 80 82 -148 130 126 -199 8 63 -32 67 -137 -212 -29 -161 -88 14 -69 57 71 -61 61 180 -241
4409b41P9J74j68J63P0k53J07O2j62L50j19r9n7m6J48j30j17J65Q0L0%m4j3J15
4433I4p2J6j55K02M3p9j00K75j87J59j35j49M8K09j32k4Q5j68K5q3nP1J13k3j25
4458i7J75k06J14p1J18J23l06j09O3K21jn4N9j17P7rM3l0Q5J04k08K4Lp5J1K94
4484B31j97J03j71L9J96j74l63J29L93j19j47OK91l16K07J1p4j23n1k8K20j04
4506d1J28N8l1J79m13N0P7M3m8K27j95rjP4O0o3l65J03J84M9k8Ll6n7P9j24K2
4533g5L65l66p1L55L2q6k35J82j89R8l8n7j40L22l16K75j70j25qJ57O9j02rQ7
4557d5P9o6J75J29o4k24j7m8QO0R4p4J29J6P8l39J38J56l8j55O0k8N8k0j49M5
4583d2j67K27K4r3OL6K58n4k56j30J29L5o1j21J35K1K31k75J36O3j68L0K62n7
$$ plain form
4409 -241 -162 12 -156 7 77 -176 -69 -7 -169 181 62 -37 -94 -140 8 -122 -239 -74 6 36 36 -8 -21 94
4433 94 22 38 -117 85 128 49 -51 224 37 196 61 -88 -40 169 37 13 98 -70 -45 -128 -133 -62 51 28 -97
4458 -97 78 -128 -14 -85 33 156 -150 -259 -196 25 24 -30 29 -88 -11 -20 23 -7 78 182 -26 -2 1 -74 -63 231
4484 231 34 137 -34 5 201 27 -336 -207 186 67 -80 -74 217 -99 108 119 45 -78 -129 -157 63 -41
4506 -41 87 145 114 293 -120 -70 7 50 2 229 34 25 24 98 158 95 -270 -167 17 66 38 41 5 -52 27 -97 -75
4533 -75 290 -76 -147 208 240 154 -81 101 -88 10 -28 -85 -225 97 -219 56 -114 -239 -247 -90 -21 -123 -132 -45
4557 -45 34 -32 143 272 208 -16 -33 -81 -73 -13 81 7 136 152 230 -109 29 185 147 -8 52 24 82 62 -87 -42
4583 -42 -209 18 42 -51 -45 -9 249 195 -61 -191 -62 -27 -88 -209 -74 -53 178 -97 39 102 -66 -36 226 169
4607A69k72J07Ml24L21J32k85J63R9k9j30J39q8m4j19J02Q6q1L6J6qJ15J12j7
4631B04j6r6O0k98R5o4J78r2J71k35J03j83J61J25l4k88K45P4k02K06j91R0k6
4654a3R7k69K16L1M85o34NJ63R4j66r8n9K38k18J06Q1j42k48L81k88L04n9n0r0
4678a33J97k2j27K28j09P7j24J31M3k38j97L78m1j87O2jj15M15j20%K4j9k53K7
4702a04L8j9j33K02J03j67j02K61M5Q4p9r7K07o12K46jr2R6j20K59J95r0k26j16
4726b22K97j24K1M4k04J42P1R8k41l2K33j30NK00k08J7m5J7O7Q2j29o7L15r3j96
4751h2o1J59j38Q3Q0k22J19J40k53K59m6J3k0l33J49Q0pJ52k00K37K50m52J31
4774C8J50M8k22j48oJ89l5Q8Rk29K41N1k05K49l87M53l61J81j14J59r0J23l20
$$ plain form
4607 169 -103 4 8 -316 5 137 -148 15 114 85 -45 94 6 -38 -157 -55 31 -50 -14 2 -6 109 221 204
4631 204 188 92 152 -146 -51 -115 63 -29 142 -93 10 -173 -12 113 79 -209 36 110 -92 114 -77 13 -13
4654 -13 84 -185 31 62 547 -87 -82 81 175 9 -89 -148 90 -128 -22 59 -83 -331 50 -238 66 7 -43 -133
4678 -133 64 42 -85 143 34 111 -13 118 161 -77 -274 104 63 -124 -62 -63 -178 237 117 117 141 122 -131 -104
4702 -104 -66 -85 -218 -16 87 -80 -182 79 124 208 129 32 239 -373 -127 -128 -220 -124 -244 15 210 120 -106 -222
4726 -222 75 -49 -28 16 -188 -46 25 123 -118 -150 83 -47 -42 158 -50 -33 -78 -61 6 88 -41 -108 207 114 -82
4751 -82 -143 16 -122 -39 41 -181 -62 78 -175 84 38 51 31 -302 -153 -73 -80 72 -128 109 359 -93 38
4774 38 188 236 14 -134 -140 49 14 102 111 -118 123 174 -31 218 -169 284 -77 104 -10 149 59 182 -138
4797a38K14Q6l05K88j20K44l28K4J20J1o5mJ3p2R2Qp2J43n8j55K03q6lm06J39
4822b27L53k53J68l33J87K19m00K11K69k67m8K91k14K01J7l74J52J15l9L1j9R4
4844A34J43l38P6j63J9Q7l04K99q5K8J22J10j7k59nR1Oo6K04k15J67J49l83J64
4868c6J19J9J36k89K3p4K37L1j82Q6j47J45m3k31K72j02k70M89j58K3l02K39o0
4891g5j27Q0q2K09j74J76k48K35K3K23j71R6k11K13j48Rk56j2J58P2O9K57m06
4914i0K27n4j55K29R4l24nJ59j64J9j70K05rrK5Q6j79L31j59P9j35l5n6L08l90
4939a72l0K10k7J24j81K84l67K19k30J76j3q9m2k3O3J47o5J07j62n1J39LO1j92
4963a11P6L6J03j13K83q9q6l67M85l30Q4J65r9J87j70j89K11j92k5J06q3J65m22
$$ plain form
4797 -138 76 162 -143 145 25 269 -59 -35 85 96 31 27 40 -32 60 68 -4 139 81 -74 129 43 40 -366 -227
4822 -227 126 -127 41 -292 -105 114 -286 -75 194 -73 -121 170 -44 157 174 -200 -48 67 28 59 40 134
4844 134 277 -61 15 -148 -129 -42 -346 -47 -132 -104 18 128 111 -148 -153 -62 -56 -122 82 -133 34 183 -200 -36
4868 -36 83 102 238 -51 -28 -102 135 166 -16 70 -77 68 25 -206 66 -36 -306 183 25 48 -254 -15 -75
4891 -75 -202 -122 -204 5 -169 7 -241 -6 17 240 69 165 -46 167 19 28 -228 -240 -82 -10 59 316 -90
4914 -90 137 83 -72 157 251 -73 -78 81 -83 -64 -234 -29 -38 -47 -22 64 -115 216 57 136 1 -34 -90 218 -172
4939 -172 -202 8 -19 105 -76 208 -159 60 -170 6 -7 -96 -138 -161 -98 49 -16 91 -71 -122 17 20 81 -111
4963 -111 -35 1 104 -9 274 185 99 -268 217 -113 -29 136 37 224 54 -135 76 -116 -141 -35 -118 47 -375
4986c75L17j13j9K40J8J84j45pj06M3k53K85k6J33j10qk86K85l2L88p73L97K62
5009B99m47j4q4M56kl84K18j26K60n2k42j04J78J16q8J35j58J87L1k38L92k70
5031F3Q0k38J77k25P9Pj3K30Mj18r0Q8m5p2Q8k11J72K53k62o6J57J5K4l9K8j65
5057g9J70O0j58l4m8J01J24P0k90K4Rj37J52N6K8k52K42mk9N3J67l41O6lj6P9
5083A0r8J31J31l27L01k09Kp0K22rm6N2p7k33J15K39J2N0J5k94J47k7j76J77K00
5108B38k06J22j11j08O9o8m1J24k0J00Pl00K84J7k03j00J91J23j67J65j25j68
5130a77J76K31j57k66j6J55n3J89j36L2k03J91j81K34n2j16J70l00K88J13j58
5151c6lN9K7J15l10K99o2r6j4m7M2K36j10J89l13K6j4J61J4k72J79rk63K51K3
$$ plain form
4986 -375 -58 -171 -190 50 68 252 107 100 -6 37 -216 69 43 176 66 58 -228 57 25 413 -360 37 299
5009 299 -148 -162 -246 210 208 -176 42 -84 176 124 -118 -222 -44 72 -16 119 -39 148 179 -59 333 63
5031 63 143 -95 82 -143 -64 -57 -70 160 164 46 -44 44 -1 -73 15 -196 -24 229 -33 -99 58 73 97 58 86 -79
5057 -79 91 151 -7 -41 -89 12 136 206 -84 -60 -51 -188 -36 20 48 -204 38 34 5 58 225 -116 -50 -53 -69 10
5083 10 -88 43 174 -153 148 -61 -59 -129 93 84 38 90 13 -220 -105 134 146 196 211 -83 64 37 -139 38 238
5108 238 32 154 43 -65 4 -64 -105 19 -1 99 106 -194 90 107 -96 -196 -5 118 -49 116 -9 -177
5130 -177 -1 230 73 -193 -209 -54 -107 82 -54 -22 -225 -34 -215 19 -33 -149 21 -279 9 122 -36
5151 -36 -39 20 47 162 -148 151 89 -7 -21 -68 -26 210 100 289 -24 2 -12 149 163 -109 70 61 -202 49 72
5176G2O1q7J11q7P0n9l26K48Q0n2r7j13J50on7N4k7K86l74J90q7j29K65m20K06
5201a28K05j11J54j67j05N0K0j0Q6j21L35l07L98k19l9j39L59j90j79J54M4j79
5223h9R3k6j28N1J20J48l72l0n8K74j78J55K59l22k00M33k38J44m8O1m1J1j91
5246a72K42J29k00o9j51M87k37K8o1l6M3K57l19J05Q4O7k26J37j67r4M41q0l10
5269a02J17K34l05J39k88P5N6P2m4K09k91K29k90L54k1%k34J5L26j81j29j04K43
5292H0p3R5k39K35j00K8N0j67J50p1J01L2j56K19j09k8j09J87J55j4l1k05J6M3
5316H9p7L4k04K84j54k53L03Q4q5l56K22J80j35O5J25j32l4jk86M96k79L05o7
5339A24jl68M88p0k9m0k73K29j21j0j81K77K27k30j61J35p7O0K4k4K05k17L44
$$ plain form
5176 72 133 46 157 70 140 81 -245 3 83 31 -66 -179 -29 -35 -92 -38 -65 221 -153 37 -50 -179 86 -334 -128
5201 -128 77 -34 120 -47 -152 -102 -82 -92 -6 -127 208 -99 299 80 41 -98 261 71 -108 46 90 -89
5223 -89 4 -22 -150 -99 21 169 -203 -233 -291 -17 -195 -40 219 -103 -303 130 -108 36 -12 49 8 19 -172
5246 -172 70 199 -1 -70 -221 266 29 57 -4 -40 3 260 -59 46 130 197 -29 108 -59 -153 288 208 -102
5269 -102 15 249 -56 83 -205 -130 -74 -2 -46 163 -128 101 -189 165 144 144 -90 -75 251 70 -59 -163 80
5292 80 7 102 -137 98 -2 26 76 -91 59 -12 89 121 -35 184 75 47 -62 125 280 266 235 30 46 89
5316 89 12 46 -158 126 -28 -281 22 106 21 -335 -113 67 -68 -3 122 -10 -44 -45 -331 165 -114 191 124
5339 124 123 -245 243 173 144 104 -169 60 -61 -71 -252 25 252 22 -139 -4 -81 -21 3 -21 184 -33 311
5362C11k63L05l50L6L8l07Q4K52j06J9q7j06K25j64J94O9k71J57P4k23r3K22J78
5385A94l40J44jK01ln27L01M5k35K22J18j25J65k20J66j5q7J41J22l31oK36j01
5408F4k08o8K72j06p9j2j0q5M14m31M66k13J01o4j23j15L16k57N6j39K86J08j02
5431G1j6r9J36j06K39k06j08J2K21R6k63N7l4j68oP9L01j71q0n6pK68k82J70k93
5456b45N10j43k40J01r5J25K47j88o1q2j59K16Q0k0J19k99J05j08P8K47j25j08
5478d5m0K62l58J37j3rp2LJ49L3j81rK15K23l04J26jj86M1J5l8l1P6k1N2j13j7
5505a06J53l3j23j01L66j34j77J63Q2O2Q7P0k69m6N3j5j09j9K15K83m04l0OJ64
5529A38k19l9O15l86j58J17l4L1j36J87j54O7Po6K80m57L58J12m06m3K11J65k36
$$ plain form
5362 311 48 353 3 39 77 -230 -146 106 0 19 -68 -174 51 -113 81 150 -121 36 110 -113 -206 16 194
5385 194 -146 -2 -3 198 195 -332 -31 14 -221 1 119 -6 159 -61 105 90 3 144 266 -65 -71 165 64
5408 64 -144 -212 60 -46 -125 -137 -147 -232 182 -249 217 4 105 41 -82 -197 119 -138 -82 -221 65 173 71
5431 71 55 -44 92 -14 225 19 -89 -77 144 240 -23 34 0 -168 -174 -95 206 35 -45 -101 -108 160 -122 48 -245
5456 -245 265 122 -118 -17 -112 13 260 72 11 -71 -230 -14 66 46 165 -134 -29 -137 -59 188 63 -45
5478 -45 -85 177 -181 -44 -57 -66 -138 -135 14 47 -134 -143 72 295 -9 117 116 -70 -29 -14 -52 -83 -7 -28 24 -89 -106
5505 -106 47 14 -109 -210 156 22 -155 8 90 152 239 309 40 -6 47 32 -77 -96 119 402 -2 -32 -26 138
5529 138 -81 -120 495 109 -49 68 34 65 -71 116 -38 29 36 -30 250 -207 151 263 -143 -186 25 190 -46
5552d6j16J59J54j10j9J3k62Q5K62j74J17j38k0L30j4l68J02q8prJ47j96K24J45
5576A71k87P4J51J42k35k8O9L2Pj0j56Q2k73L60M2j90K73l00J38O9J67m22J05
5599a9J49k3K7j08O7k23K24q1j28L03J1r8J22k53k72N18l15K43L9j78j7o3R5J62
5623A82o4n8p3P3k12L12j58j80J50L3L5l1N3j57J13q6qK39j12o2Rk38l7K31J1
5648c5M9P4j77J20q8K9J09k55j2P5J47j18r7J35J72l66K90J2J88Jl55J69q5r7
5672a15R0l4O2J35Q6j3n21K42N5L9j48%M34k70o5K31k18J87m7j15R3k76L01l13
5696a80j35K64kJ21J59k15plK22m41Q4M74l50J1j99M43j27m7j37NP2K1J21l59
5720b05K70k8j83K84j90K48l57M28k14j22L10k72J17p5K09k04l42N51p7J03l45
$$ plain form
5552 -46 -162 -3 151 41 22 35 -227 -142 120 -54 63 -75 -95 235 221 -147 -45 -133 -140 -149 -2 -198 26 171
5576 171 -116 -42 109 251 16 -12 57 89 96 86 -70 12 -261 99 141 -49 224 -76 62 131 298 -124 -19
5599 -19 130 107 134 26 93 -130 94 13 -115 188 199 101 223 -30 -302 216 -99 144 183 5 -12 -75 20 182
5623 182 118 60 -13 60 -152 160 2 -178 -28 5 40 9 62 -95 18 -68 -76 163 51 -11 -2 -240 -277 -46 -35
5648 -35 14 88 -89 31 -57 -28 81 -174 -186 -111 36 -82 -179 -44 128 -238 52 64 252 253 -102 67 -18 -115
5672 -115 -25 -59 3 138 224 211 -310 -68 -13 26 -122 -122 312 42 -23 208 -10 177 130 15 108 -168 133 -180
5696 -180 -315 -51 -53 68 227 12 5 2 224 -217 -133 341 -9 2 -197 246 119 72 -65 -60 12 33 154 -205
5720 -205 65 37 -146 138 -52 196 -161 267 53 -69 241 -31 86 11 220 16 -326 225 148 251 -94
5741i4J13k9J55L1k22j15JJ97j34J72r7k5n5N4Q3k04L08j07L1o7rJ51k42L21j41
5766G6k36J67K00l46K70j00r1M3R9k00J2L13m8m5r6j38m6J37R7l38K73n1K0O2
5790C4m54L51M18l18j53J7K83k41j8M95k59o5O2p5R5j97Rl5N5O0J25j32j3j03
5814e9J14j10J94j7l65J44j1K97m54J90J23n9Jp0N8J58Ql7q3j16J55k07J05k9
5838g0Kj06K55k32j11J82p7J71M8ok12k64O92k72k56J91J04q0Q2k4l6M9q7O0j55
5863a52n4J62J76j7k04K07j22k49L45p4JP6k2m0j00K0K17k45J00L0j86N0k8J96
5887H7l4j53K64q3j54L16j77j36K14j49j36K02l7k71J65O5J4J08r1n4K58k16j91
5910a89J10K86p6Q0p8k28K07k18J80l49K44J11j18J63p0j14L2J44l85K55k44L17
$$ plain form
5741 -94 19 -10 145 176 -46 -161 -160 37 -97 75 -22 -47 -102 -48 35 -169 139 32 63 -4 -13 138 -104 217 76
5766 76 -160 7 207 -139 131 31 -60 -17 82 -118 -106 207 159 114 18 -120 -166 -29 68 -270 3 -48 -28 34
5790 34 -420 -69 349 31 -122 -105 178 -63 -81 414 155 90 152 77 172 -25 -16 -51 4 64 189 57 44 -59
5814 -59 55 -55 139 122 -243 -99 -110 187 -267 -77 46 -13 -12 -82 -24 134 142 105 22 -94 61 -146 -41 -70
5838 -70 -68 -174 81 -151 -262 -80 -157 14 62 56 -156 -420 272 0 -256 -65 39 -41 41 17 -19 30 -57 3 -152
5863 -152 -206 -44 132 115 -89 118 -4 -253 92 18 19 95 73 33 -67 -47 170 -75 25 55 -131 -81 -109 87
5887 87 53 -100 164 81 -73 243 66 -70 144 -5 -141 61 24 -247 -82 -17 -3 105 14 -40 218 2 -189
5910 -189 -79 207 131 211 133 -95 112 -106 74 -275 -31 80 -38 125 55 -59 -27 117 -268 -13 -257 60
5932F0j64M0J17J97l87R7l8J09m9P4J3l39m0P8O5K49j5L5j05j2K25q6j3o4Q0J6
5958A43n3k36Q2n6M0j22K89J54l19J44R5l35L2K15k25O3K12j41J76j06k46K56
5980F2M1J34Rj85L2j54J20k21M1K75J54n63K29j35J41k16M56k84QJ66L5k9L0l65
6004b19K72j75J85j63K24k77J68J65k07R8j08j97K69mJ06k9Rj63J75m5Q7j79M5
6027C7j27K94k6k89o4J58J25j22Q1l64J32J62O7o9K8o4N2m3K8m0K00k26n0jN0
6052g1J47j72j46K44J79j70M7J77j11l49L24j76j62n1L08rL75m64J93j97N9J07
6074H2J3Q6j20K33l78K5n2j79K24K30r8p9J12k41N8j7J82K47m77J61p9J85j58
6097d0K40j87J6l8O7P1J75l89J3l9K51j69Q6J6J40q3k03J03j64L9m7J96q0l1p0
$$ plain form
5932 60 -104 -64 53 250 -137 -40 -78 31 -18 56 69 -270 -310 -232 -167 82 67 102 -3 -15 210 124 111 47 127 143
5958 143 90 -146 -64 -120 -80 -202 87 241 -78 66 161 -174 -142 73 -152 -89 123 -18 158 52 -194 62
5980 62 103 237 246 61 93 -61 59 -162 -121 154 308 -255 -26 -161 -20 -236 220 -64 -56 110 145 116 146 -219
6004 -219 53 -122 63 -100 124 -153 15 180 -27 71 -37 -234 35 31 137 108 117 -46 129 84 171 -8 37
6027 37 -90 204 178 -111 -175 -17 108 -14 67 -297 -165 -3 64 -5 23 -41 11 -32 -4 -44 156 -70 -120 -121 -71
6052 -71 76 -96 -242 2 181 11 58 235 124 -225 99 -77 -239 -290 18 9 384 -80 113 -84 -25 82
6074 82 95 181 61 294 -84 -59 -111 -290 -66 164 66 -13 99 -142 -84 -101 81 328 -149 12 -67 118 -40
6097 -40 200 13 29 -9 58 129 304 -85 -72 -111 140 -29 57 73 213 130 -73 30 -134 -95 -142 54 -26 -57 -127
6122a27Q8j11K51j04j30ll1NR8r3M48k68oj57J50Q0jj69J86j40M8J19k58K52j28
6147aK43l23J54k49K75K9k55J09m8L3Q3J56j66K49j74j67J10j96K98l86O8J48
6169a0k5N6J20m01J85l5L63k58L0M9j4q8j68J66K7L0j25L8K39l6k17J63j09J85
6193A65k40M5j1J8p3J1jJ86Q5m2j78J3JKj17L63q5j34j74K22l3l34L17K13k62
6218d3j14K36j00r2L20k65K82j97J34j32J6J18k61J47k60L98%KQ0j00k88K97l56
6241a78L21l33L25j24Q1k81J84J16j25M7k1K31k44J6j34J36j63L17n9m3j72K58
6263A55k64KK10N0j79q1K01k27L06k11k23K43j71L79K5k51K0j81K71Q0k88R5J04
6286F5j21n2J62j18m4J54mr4m6K9k8J8R2O1Q4l15j06K22J15j58k4O7Q3K9j01J87
$$ plain form
6122 -127 -39 -150 101 -3 -133 -136 -167 -162 -64 -157 291 23 17 -140 10 90 89 -80 106 -34 14 133 -125 127 -1
6147 -1 242 -81 73 -176 99 128 -127 -18 -66 -33 50 206 40 289 115 -52 58 -138 160 -226 -158 -10
6169 -10 -35 21 141 -260 -75 -110 253 -5 25 74 60 -28 -196 -30 -3 27 -98 -60 179 143 -74 89 -20 165
6193 165 -75 -30 -41 -23 -96 -85 -86 100 185 143 -35 -22 -21 -19 -136 227 142 8 -166 56 23 -311 6 219 -43
6218 -43 -157 79 -21 -113 207 -58 224 27 161 29 45 163 -98 49 -211 187 187 189 269 169 -119 178 -178
6241 -178 143 -190 135 11 92 -189 -5 111 -14 33 12 243 -1 15 -119 17 -146 171 112 69 -103 155
6263 155 -109 -107 103 153 -26 -107 94 -133 173 -38 -261 -18 -189 190 215 -36 -16 -197 74 154 -134 -39 65
6286 65 -56 -108 54 -64 -108 46 42 -52 -98 -69 -97 -79 13 74 158 -157 -263 -41 74 -84 -108 -41 42 71 -30 157
6312A57r7J38k40J37j15K63l56J09P4j15K29k41j52L37j87P0%j23l0J52o4J6K26
6335A88K8j28j30OJJ96l53L75l8q1k7l5k5K54m4j35J17j39j13oJ43q2J7M5N5j03
6361a4k28M01k59m5J02PP3j6p2j2nJ27r1Q1P3q3j6k01J51nQO3O6l36K54j06j21
6388b04m8L08j11J4O5J35k32O0j03J73jp6J18p8j66K56j85N4J60j31J83j61R5
6411A25j84J08k34L11L0j5k93J47J65k52J41r0K1k23K41L9L84r0k52J65j26p7
6433D1l34M44R3l25J22K05l11l9N7N7q5j10L16J15k81O9K52m50K58R9j26J33j92
6456HM5j75K23k10K97k20P8p8J62l59O9L46m04J83K8J66k73lO1j4J29L6K25l51
6480c1k42M05L0r4J19j75j61M6J09J4j74K34J5l69N20l81K18j47m4j6K2p3K33
$$ plain form
6312 157 60 198 -42 95 -20 243 -113 -4 70 -45 184 -57 -209 128 -59 11 11 -112 -142 10 -54 -38 188
6335 188 216 88 -42 -36 -35 161 -192 183 145 64 37 2 -23 231 187 52 169 30 -83 -89 54 -28 -11 34 89 -14
6361 -14 -242 159 -100 -145 -43 -36 37 21 -51 -63 -68 59 -32 49 122 39 23 -178 -27 -32 -24 39 105 -231 23 -83 -204
6388 -204 -252 56 -55 -41 24 159 -73 -13 -116 57 56 -20 98 20 -146 110 -75 -21 139 8 191 30 125
6411 125 -59 49 -185 126 156 141 -152 -5 160 -92 49 -41 -20 -243 -2 37 421 331 79 244 118 41
6433 41 -293 151 244 -81 41 246 -65 -104 -47 10 -75 -185 131 246 -35 34 286 -164 94 193 67 200 8
6456 8 53 -122 101 -109 188 -32 46 -32 130 -229 -160 186 -218 -35 -7 159 -114 -117 -56 -70 59 95 320 -31
6480 -31 -273 132 162 68 187 12 -149 -103 6 20 -154 80 95 -274 246 -135 83 -64 -108 -124 -102 -175 58
6503E8O0k56J14j9R9l1LJ75N1l43K05k93K75K9j11l8P3j19J0j43J48J06j18j10
6527a75P2J22k9K14m44M06l66J66J58J02j78j36p1J84n9k03L44k32L52k31pj3
6549b4m9O7n2K07lj34j63J27L08l58J80k6o1j19K35L8j39J21j54j96J96J8j38
6572a19L30k42pJ90k8n6j63k2J52Jj53L91l42lM1N5r1R5j31K17j00J0j39p3J92
6597EPjq1K67k73k36N00j78j6R3M1l30M42j03k17L65j35n4l72L16j52KJ92j40
6621e8N3J75j2j81K34j82p6p9J37R6j60j20K72j3M2q4Q8k26M8L67k48L2p0o6O
6646b5l5k02J94M8N4j26j4M0J25j65K9K0j84N51m33K00j83j02M7L16k19m8P7R0
6670E5q6%JJ6J02N5l36K48M4k08J89P9j29j08O6J49l69L45j59n5K28l06L16j05
$$ plain form
6503 58 118 -138 -24 -43 56 25 28 203 254 -89 116 -177 98 127 16 -22 51 -68 -58 -201 -53 53 -65 -175
6527 -175 -103 19 -10 204 -240 166 -200 -34 124 226 48 -88 -159 25 -34 -237 107 -125 227 -4 -11 -24
6549 -24 -73 -6 -58 149 146 12 -151 -24 284 -74 106 80 19 -100 135 173 34 155 1 -195 1 19 -119
6572 -119 211 -31 -38 152 124 68 -95 -117 35 36 -117 274 -68 -71 -30 25 -66 29 -102 115 15 25 -114 -187 5
6597 5 12 11 -70 197 -76 -312 188 10 -6 87 128 -202 240 137 -80 285 150 96 -276 40 -112 -110 82 -58
6621 -58 -5 170 158 -23 211 29 -47 -126 11 107 -53 -173 99 86 128 44 132 -94 -46 321 73 105 35 -31 -25
6646 -25 -60 -262 -68 -20 34 -92 -106 -66 59 -106 -77 -57 -241 310 -123 77 -106 -208 -161 155 -64 -112 -35 55
6670 55 -31 -31 -30 -14 88 143 -193 55 99 -109 80 159 30 -78 -12 137 -232 113 -46 -101 127 -179 137 32
6694C2j97L49k47K02R8l21L1LL6K2J1K81m00L23j41K5j21m0J51k10J13k0Pr2L13
6719B08k17J17j87J94j76L04l13J14k48jJ22%L11j82n9pK05n6l24K33j26o5J16
6742c7n4m2J27Q0m7L6J5J74n5j42j6j10q7K99j16l14L07j21j2J69j77K10k00O2
6766e1r1K4M8j17L89k76R2j97M24l5m2k16K57l65M08j73k41J77Lr0J11j74J35
6789@J90j0m37N04m43J24K87j70p1J59j65J9j66r3K99k6j44L35j78KJ78o1j33
6812@p9j48K71J17k32J70k31K88k61K54j82Kk6J10lJ05j26L41l30j88Q9O5l4o1
6836h9J50k89O1L57j83j76J7K37j86L9j16J76K1l3k3OK6n9J08N8m02K67L3K1J04
6861A25k43J77Q2l01N56m89L3J6nL49n07K85L8l01K26o3k48M04l57L36q3j7J26
$$ plain form
6694 32 -165 184 -63 139 237 -84 -53 -50 -14 8 19 300 -100 223 82 107 -14 -54 97 -113 0 -20 -13 -105 208
6719 208 -9 108 -79 115 -61 243 -70 44 -204 -205 -83 -83 228 46 -13 -20 185 129 -195 38 -88 -153 -37
6742 -37 -91 -133 -6 74 27 63 78 252 197 55 39 -71 -158 141 25 -289 18 -103 -115 54 -123 87 -113 -51
6766 -51 -142 -118 -70 -187 202 -74 18 -179 245 210 168 -48 209 -156 252 79 -162 15 18 -72 39 -135 0
6789 0 190 180 -257 247 -196 -72 215 45 -26 133 -32 -13 -179 -272 27 1 -143 192 14 16 194 133 0
6812 0 -79 -227 44 161 -71 99 -132 156 -105 149 -33 -31 -57 53 50 155 29 370 40 -148 -59 6 -28 -89
6836 -89 61 -228 -167 190 7 -169 -152 85 -101 -62 -178 -2 19 -14 -37 -31 -5 -64 44 102 -300 -33 0 21 125
6861 125 -118 59 141 -160 396 -93 -60 -44 -49 300 -207 78 116 -185 41 -22 -270 134 -223 113 30 13 139
6884A39n4m3k20L39l5N7j86l05N08k13j66J32O4L0j32K22j14p2K80k15R2k60P1
6907h1J64q4M9j57K37o3J1l9m14L73j31K28m9P7j29Q7n9j18J16L21l82p5j96K00
6931a14M12j46j50k21K63j2R8j22K5J52k00M1k0p4R4K3K3k08Q9o8N9N2l01M32
6955A27l50K73R9k34L4r5N4m9N6L8J20j63j01Q1J55Np2q3P0j0R2O7J19k16j96
6980a79K42L8k38N4R3L9J86j91J1Jj53J87M9j82Lk1l3J93k4J28k33K71j20k23
7004a02L2q6K64k8l3mK2k7K25m19R5J10j69M6J62mj04P2j5O2j95n5K96J4l34K98
7030A23k45P3J77l33K18mJ72k17N1M0KM4l2Qj85P6J89j44Oj18J6R6k7p8J09L3
7056E0k81J41N8M8n6qL8j21o2k3J25J60j81O6q1J98m03J88K61m65L34j57J84J15
$$ plain form
6884 139 85 42 -178 161 126 183 -3 -308 200 -13 -179 -47 17 47 -85 137 23 -49 231 16 108 -152 -81
6907 -81 83 -1 48 -109 128 65 76 37 -377 -4 -135 93 44 121 -8 79 20 -98 18 339 -43 -118 -314 -114
6931 -114 298 152 2 -219 44 32 130 8 33 185 -15 26 6 -68 26 49 72 -136 -47 -115 -56 -4 -305 127
6955 127 -223 50 149 -85 -51 -146 -92 -141 -85 -47 73 -90 -191 -110 45 50 -22 -105 -35 -45 47 114 233 17 -179
6980 -179 63 101 -137 -83 10 49 235 44 55 56 -97 90 139 -43 -40 -61 -94 99 75 203 -30 241 121 -102
7004 -102 -70 -156 108 80 47 43 65 38 263 -156 -61 49 -120 -74 88 84 -20 52 37 99 -96 -151 145 159 -175 123
7030 123 -122 -49 128 -205 13 9 181 -36 15 55 57 101 69 77 -108 -32 157 13 19 -99 -83 13 -14 -92 17 50
7056 50 -231 -90 -32 16 -40 -48 -10 -131 -193 -216 -91 69 -112 -46 -127 71 -332 -144 117 -348 -14 -171 13 128
7080A28k26R4O9j9jJ65j78j13k9kP4O6J16j97q6p1K34q9j8J83J26j64m6pj3j94
7106a98J58J58j62M7j93J10J42K0o8N4j73L9N2Ol2J77k00j15J08J71l36K66j49
7129a18J77n8J23k66N5mJ36n7j4K27k97K63k71j03J62K74j52k9Q5k7k47n8M7K32
7153H0j09kR6j5O3j27j74J76J13k19J28j63J63K45l42Q5J58l7J9r1K06k18l4K17
7177B18l86J25N4J49k88J65j03K70k12m9J42n5j61L09j10q5K14l05J17K08j64
7198E3j00o0K3NJ26o4jq9L5J84k04J05r0k11L38O6k4j26K10R4j80K51l37j90J35
7223e1p3J26K00Jm4k37J34P4k09k1K36k48L6J14m5M6l03L3L69l9k44M9J01j42
7247a37N7r2M54m11k1Q4rJ10q4L15j52j26r8J68K1p1o8L3j63L68k68L26k74Pj71
$$ plain form
7080 128 -98 -4 65 46 45 210 32 -81 -110 -112 -38 28 144 -53 -139 -210 24 -65 -83 100 226 62 16 9 -4 -198
7106 -198 -40 118 -44 3 -190 -80 62 82 14 68 -105 -66 -14 -8 -40 137 -63 -178 -70 101 -235 31 -118
7129 -118 59 1 124 -142 -87 -91 45 -12 -26 201 -96 167 -104 -207 -45 229 77 48 133 106 -141 -199 -152 80
7153 80 -29 -31 65 50 113 -14 -188 -12 101 -118 10 -153 10 255 -87 -2 156 119 138 47 253 35 1 218
7177 218 -168 -43 11 160 -128 37 -66 204 -8 -57 85 30 -131 178 68 -17 197 -108 9 217 53
7198 53 -47 -107 -84 -79 47 -17 -18 -107 -72 112 -92 13 -77 -288 50 116 92 -34 176 270 90 341 4 -186 -51
7223 -51 -124 2 202 203 159 -78 56 130 -79 -100 136 -112 -76 38 -7 39 -264 -231 138 99 -145 -96 5 -137
7247 -137 -80 -172 282 -129 -150 -66 -75 35 -49 266 114 -12 -110 58 79 8 -60 -27 -190 178 -90 236 -38 -31 -202
7272b02J94Q0k94M24o6Q4r7j72p1l9J41r7J78N2OO6j88m1J9o5K78j41k6n2N7q7
7298e9Pj04J99Nk33P4N5J36j46J07O2k19K3K46j41j09J98m8k6J06n1J47l31Q0
7322b2j8Q5J65k48J4J07p0q3K55j02r2k16K64l8m3O8m6j17K19K2k26lM75l70K26
7347B06J03k70m6j11K14m5j1j43K42k27R1k05J42J12j50r0K2K50J6o6j35o6O8
7370i9k3R2KJ85j58K36o7l41K93K5k23J01o5p3Q7J96o7k52L2N8K17j09R6j0l82
7395b49L13j04N7o5J01o4K46j94j45J03m2P4N8Oj38K7j31K01j85K01m4j17L20
7418B29l56kM59l81Qk17K07K26l05M4J9J30l6j32J70k3j54K21K3m16L36n7mJ58
7442A47k14R9N3j64J98k37n2R8K81j93j34K36j91J82k20K57l9q2j22m0M7J23o4
$$ plain form
7272 -202 -8 72 -222 202 136 220 123 -49 -120 -159 -18 -115 63 115 121 187 -1 -42 -23 -88 190 49 23 -29 28 -59
7298 -59 -52 -156 43 48 -185 -111 -56 80 -66 41 103 -116 -93 153 12 -97 101 53 27 133 82 229 -102 -22
7322 -22 -40 45 210 -38 -24 83 13 -70 185 83 -9 -225 39 1 -42 26 -20 -137 82 104 -122 -125 350 -20 206
7347 206 309 39 -7 -118 96 51 40 -103 139 -88 3 -202 -60 52 -98 -188 -166 84 100 34 -101 -167 -99
7370 -99 -122 -30 -28 157 -1 235 168 -173 120 145 -78 23 -42 -115 -28 168 101 -151 -119 -61 156 47 143 133 -249
7395 -249 64 -40 17 -48 53 -11 235 41 -104 -1 -43 31 89 95 -43 -16 -147 54 -131 70 26 -91 229
7418 229 -127 -129 330 -51 -43 -260 -53 173 -132 -88 -69 61 25 -107 63 40 -114 107 130 -286 50 -7 -11 147
7442 147 -67 32 85 -79 119 -118 -170 -72 209 16 -118 118 -73 109 -111 146 107 25 -97 -137 -90 33 -31
7465c1R0N1l0k01J6K04n2R1j77n4K98q3k29J75K3j86P5l6n5r0L27k09j50L23R0
7490A80r4j41pj62K58Q0j47P9k23M75k68k3j53m9J28J91k25o4L91k45j14K70q5
7513E2J62j92K6J2l91M15o7k13OL77k35l4l4J23M8l39J74N5R5l0m7J26p0j3j46
7538a40J29L05j24j53j31N5J39o6k4K95m10J84l4k23m2J82J11j3k11J97n9L15
7560B82k33j47K50n5k54J41K08l84J84m9M7J96pj85K12k20J78k92K14q0l8l6J70
7583A02q0k24L47j64J03o4j69L04k53k5L14m36M13j26j25r1j62K78mJ97j01r9
7605f5K81k61kQ8O7o6P1j52K0J64j3k96K82q6j18K75l78K84k61K18J76l43k7J11
7629c1J69k74NN0K75m14L49l16K40jl4j23L3O2p0L69k88l7r0J82q4K7j22J24m9
$$ plain form
7465 -31 59 110 80 -121 -105 99 47 138 -39 -93 205 122 -107 68 91 -95 -20 -56 -111 -201 126 -83 -233 90 180
7490 180 86 -55 -62 -224 34 114 -33 46 -177 298 30 7 -146 -195 -67 124 -101 -165 226 -19 -133 137 52
7513 52 214 22 48 60 -331 84 17 -196 -190 187 -48 -82 -116 7 55 -284 -110 -55 40 10 -37 89 19 6 -140
7538 -140 -11 294 170 17 -114 -59 80 14 -10 285 -125 59 25 -198 -240 -58 53 40 -171 26 -33 282
7560 282 49 -98 152 97 -157 -16 192 -192 -8 -57 -10 186 179 -6 206 -14 164 -128 86 6 -32 -68 102
7583 102 22 -202 145 -19 84 20 -149 155 -98 -123 191 -245 168 42 -83 -174 -336 -58 -62 135 34 -65
7605 -65 216 -45 -47 41 108 42 113 -39 -19 145 132 -164 118 32 -86 189 -189 95 -166 52 228 -115 -142 -31
7629 -31 138 -136 -131 -81 194 -220 129 -187 53 52 18 -105 -72 -10 -80 289 1 -36 -126 56 -28 -1 -123 1 -48
7654d8p7J63o4j41K12N5j15K14l86K41M3l7O0N9j48k43J23k79M01oP7k58K31k73
7678a96J21l6P4K22k81j2J55k9m5j08o3PP9j02K91J38l57L00k79L10l15N7K28
7701A59r9j22j06K07R7k2j84j35oK15J4m9nj79K22P1m7j04J71r7k04K21j04n6
7725a42J63Nj68L05m04J34J69k31K31Mj64J14j91K08k54L51j93P1j1k4J35j62
7747e4K29m51K89N4k36J95K9q5K36k26J11m4k77K36J05M9l67J94l7R3k37J69J4
7770a1P5j34K29o3j65K17r0R9j56q1P7j87J52Q6l1k13L0J79L8K9l18N64l40o6
7794h0J27k5L5J36l24L0J65j5K09j35j22o8O6j98L09k58L07l33N1J05J14k8M8
7817A16j7J06l10K59K3n1L8o0k10K42j04k02K27k09M1lJ52R8k4Q1k70k55K10P8
$$ plain form
7654 -48 -125 38 -26 -167 45 100 -15 199 -187 54 97 60 120 179 31 -212 -89 -368 33 27 104 -154 77 -196
7678 -196 -75 -111 -37 185 -96 -108 47 18 -27 -135 -198 -191 -112 -214 77 215 -142 158 -121 189 -126 -69 159
7701 159 60 -62 -168 39 136 114 -70 -205 -211 4 18 -31 -36 -215 7 78 31 -73 98 1 -203 18 -86 -142
7725 -142 21 26 -142 163 -241 -107 62 -169 62 66 -98 16 -175 33 -221 130 -63 8 -3 -27 108 -54
7747 -54 175 -276 13 67 -169 26 55 -30 206 -20 91 47 -230 6 111 160 -207 -13 -50 43 -194 -25 -11
7770 -11 64 -70 159 96 -69 148 58 157 1 -80 -3 -190 -38 48 17 -196 -166 13 51 80 -238 326 -14 -80
7794 -80 47 22 57 193 -131 -101 64 49 258 123 1 -67 -1 -199 110 -148 159 -174 -123 -18 96 68 116
7817 116 99 205 -105 154 177 126 164 104 -106 136 32 -170 57 -152 -111 -114 38 136 112 193 -77 -332 -122 -44
7841d4M5k46K76j44J70o6J48j32j8k23L64j82p2K38l08M70k97k31M8L20r3J91
7863B14k64P9r5j12J28J00q9k34M23j11j12Q8j78J94k77L87l9m6j07k17J09M11
7885B52m18l3L12k26J60Nn9j4o4o5J29Lj9K8Q3j5n6j57M72l59l5O1N8J50k22k6
7911e5J06J67j40r4J96Jl05J48o6K12o6p5j42J99j05j70L55k13j8N9m1k11K32
7934b6K3j26J92j81J66oL5k15p4O0L26q8l18L06j33%J94O6k94k23L88n8j4r0K01
7959A11J3j9k12P4N8k32L62j00K8j36J94k37P6J83J9K1M8l4l88L31o0Q2k50o5
7983a33K86k54p9K57k40J85jj1j09J50J55j33k44K24J0N5n8o3Q2k87J84K4j9K77
8007B58k32o9J01k9L7k58J00L34q8k97J47n3k3Q0Pj35J94oM1K1p6j80L33k06N4
$$ plain form
7841 -44 1 -245 31 -113 57 -9 139 7 -11 -234 130 -52 -124 114 -194 276 -21 -252 -204 116 23 214
7863 214 -50 29 -66 -178 -50 50 -39 -273 150 39 -73 15 -163 31 -246 141 102 56 -51 -268 -159 252
7885 252 -166 -199 113 -113 47 52 -7 -21 -85 -150 -21 -18 -37 -9 74 59 3 -154 318 -41 -76 -15 43 193 -29 -55
7911 -55 51 218 78 -16 180 181 -124 24 -42 170 104 29 -113 86 -19 -189 166 -47 -65 -6 -47 -258 -26
7934 -26 -3 -129 63 -118 48 42 77 -138 -212 -152 174 86 -232 74 -59 -59 135 201 -93 -316 72 14 0 -90 111
7959 111 124 105 -107 -33 25 -207 155 55 83 -53 141 -96 -20 163 182 203 251 217 -171 160 100 182 -68 -133
7983 -133 153 -101 -180 77 -163 22 21 10 -99 51 206 73 -171 53 63 118 60 -3 79 -208 -24 0 -19 258
8007 258 26 -43 58 29 66 -192 -92 242 154 -143 4 -49 -72 8 15 -120 74 68 109 130 54 -126 207 1 55
8032E5k7j92K52j24q0j39N09k24j57J93kq5K79k20N1j02j97J79L24j34j17J7k64
8055b05K76k01R6K34j07P7k2j94K24k43Q7Q4l17K41l0l0Q1k84K28j8m1OL6lr4
8080a19n3L29j36j30k1P1l4J22K79m45K07m3o4P8o2M9O5p4j49J62l16L71j89M02
8104C00k54J4k8K9k32J21J60m8pJ10k62M5K26l03K69k14n1N27j64k43j1l6J36
8127H4j44J94j39L4r9k7k7J84O1j92K7k1J29k11K41l57O1J27J32M5p4k31J37M
8151f2L2Q9K21k53n0o5L4J61j65j39J35Jk06r5N62m99K09J30M7k02q5L15J97j84
8175A28k09J45j91M23j69j15R7k6l25K50j41j27J94jj59J97
$$ plain form
8032 55 28 -164 88 -36 -116 -255 254 30 -127 66 64 -21 258 38 89 -13 -210 -31 293 159 42 59 -205
8055 -205 71 -130 -34 200 93 170 148 -46 178 -65 22 106 -211 30 0 -30 51 -233 -5 -23 -64 -58 -22 -25 -119
8080 -119 -172 157 21 -109 -130 -59 -93 29 308 -137 70 27 -37 41 -21 28 93 19 -130 32 -284 87 -102 300
8104 300 46 60 32 61 -171 -50 110 62 55 165 -97 -52 174 -129 140 -74 -125 402 238 -5 -16 -52 84
8127 84 -60 134 -5 29 -70 -97 -124 60 121 -71 -44 -65 64 -147 94 -263 -202 -75 57 102 28 -203 -66 -62
8151 -62 -30 59 280 27 -23 -88 -54 107 -58 -197 -62 -61 -267 -362 200 -299 -90 40 87 -115 -200 115 312 128
8175 128 -81 64 -127 296 127 12 109 83 -242 8 -133 -260 -66 -67 -226 -29
8191b9
$$ Imaginary data points
##PAGE= N=2
##DATA TABLE= (X++(I..I)), XYDATA
0@%%%%%%%%%%KkQj6J6j6K4l2L2m0M8n6P0q2R6j11J29j50J72j98K27k57K92l32
34a76L74m20M71n27N88o58P34q15R02r98J105j221J348j486J636j803J986k189
52a149K414k663K944l260L620m032M514n089N775o619P690r095J1030j3876J8492
67A0696k7223M9346k06179m07647N89074M77272m96428m04075L13075K15435n9276
78E4070j41056K4241r7973K3234L00460r4364l14175J2010L32730O9685l42165
89a73303L060J70635K2917k8321k0892m543r7420J40816J54818k07797j13050
100a53080J53937J80323j51959j48158J72784L1387o2675Q329L4487m9282m7036
111c0943J83663m3477k13048R3999K07169p3178k90725J34732K89266j87456k32006
$$ plain form
0 0 0 0 0 0 0 0 0 0 0 0 2 0 8 -8 8 -8 16 -16 16 -24 24 -32 38 -44 52 -59 70 -80 92 -106 121 -136 156 -176
34 -176 198 -222 249 -278 310 -348 386 -429 473 -525 580 -641 707 -779 857 -946 1040 -1149
52 -1149 1265 -1398 1546 -1714 1906 -2126 2388 -2701 3074 -3545 4145 -4950 6080 -7796 10696
67 10696 -16527 32819 -173360 -581007 8067 485339 -11089 -415164 -102089 113346 54070
78 54070 -86986 -62745 -160718 -137484 162976 68612 -245563 -233553 99177 168862 -173303
89 -173303 -170243 392 23309 -5012 -25904 -30447 -127867 12949 167767 -40030 -153080
100 -153080 857 181180 29221 -118937 53847 85234 22559 30888 65375 16093 -30943
111 -30943 152720 109243 -103805 -9806 197363 124185 -166540 -31808 257458 70002 -162004
122a62004J28270K40278j47929k10689J68294Q4314j10478n0740R5229L261j41077
133a03271R3195Q9663j08094p3803O8051R8447r7315l9483O0268l4982J2874L9889
145E439o92j04650l446J75391l7052j43732M517J31242L2010j29481J5249N1975
157c230j0808J9632O164j7569n8485P4914Q0459j03520l8444P4109N4853p7039
169A036k9953J11525m2311q2458N9773R4427n8824j39909R6377J17374p6409r7260
181d6612K0867J01333k6601m8191M543k3988L2039L2625j1542p5655j3521J09805
193E5102r925q0438j4085N1408K5617n2455J5276k038l5509L4967L2731j9949
205G02p9351L0940R2039m1531o3110J588O5272P596n0096Q273n705J8416K8754
$$ plain form
122 -162004 -33734 206544 58615 -152074 16220 100534 -9944 -60684 34545 37806 -103271
133 -103271 -10076 79587 -28507 -102310 -34259 64188 -33127 -72610 -12342 -47324 -34450 5439
145 5439 4747 -99903 -103349 72042 34990 -108742 -104225 27017 59027 -70454 -55205 -3230
157 -3230 -14038 5594 11758 -5811 -64296 10618 91077 -12443 -50887 23222 78075 1036
169 1036 -28917 82608 40297 -42161 17612 112039 53215 -86694 9683 127057 50648 -46612
181 -46612 -25745 75588 48987 796 5339 -18649 13390 46015 34473 -41182 -54703 55102
193 55102 45177 -35261 -49346 2062 27679 -24776 -9500 -11538 -47047 -12080 20651 702
205 702 -78649 -47709 44330 2799 -60311 -58723 6549 14145 -35951 -27678 -33383 -14967 13787
218A3787j6538l4637j0457Q1164O161q2820L108O6407K9406p4873j4345O8989
230C5352j743k4616j2322K4612M758j6856K4989j9362j2928K0714J2126j1168
242B3556l5265L1118J6718l0627l99P375O615k4399J0751K5304l9613r130K6512
255H516J9725l3997l1834M6415Q073k5702j2300Q450J7290j8494P313m032j8004
268b8581K0071P397p582k7041J4054L2841k7629j2895J2257J6857j1254j6315
280b7820K8261n111j4123R707J3137J114k5587J9436J7170j5948l3K527J2723
293A5453q892O17J3175j7866O201J1511l66j4403o251K9041r145j9231O244J1163
307A7251J786k2390J0227R321j3986J617Q97N717j3412n23J5650j4320k158L007
$$ plain form
218 13787 -2751 -37388 -47845 33319 39480 -43340 -40232 26175 55581 -19292 -33637 35352
230 35352 33609 8993 -3329 21283 26041 9185 34174 14812 1884 22598 34724 23556
242 23556 -11709 19409 36127 5500 5101 12476 19091 -5308 5443 30747 -8866 -17996 8516
255 8516 28241 -5756 -37590 8825 16898 -8804 -21104 -12654 4636 -13858 -6545 -10577 -28581
268 -28581 -8510 -1113 -8695 -35736 -21682 11159 -16470 -29365 -17108 -251 -11505 -27820
280 -27820 441 -4670 -18793 -9086 4051 5165 -20422 -986 16184 236 203 2730 15453
293 15453 6561 7178 20353 2487 8688 20199 19833 5430 -821 28220 19075 -156 6088 17251
307 17251 19037 -3353 6874 16195 2209 3826 4723 10440 -2972 -3495 12155 -2165 -4323 -1316
321a316L507l974r294J4602r162p063R436O66m156j4023J5245P118j7638m19N839
336a0632Q926j0758n398J2319m931K675o74K57J186k389J3379q701n526J1559
350A292M309q30j2602J1713R926j0212K35O24P495l107k656O505q266M098L475
365A1999j291l862o502J2437k379o227J01j850O373n608K533j983q374R068J847
380F282k056j0341j19J4179n850n689l679K910O322n382O75o931j11Q464j594
395b920k861r824N840Q107l784j591p954N618O642K59k129j0925Q578J0444j198
410B302p148o671J3698N322m007l478l537R079L539L63o535o168J2563L984n491
425G815q713L212J2058p452m931J083M384k7q685O484J827m829k047j79P520n302
$$ plain form
321 -1316 2191 -1783 -11077 3525 -5637 -12700 -3264 -2598 -6754 -20777 -5532 1586 -16052 -16471 -10632
336 -10632 -1706 -12464 -17862 -5543 -10474 -7799 -8473 -8216 -7030 -9419 3960 -4741 -10267 1292
350 1292 5601 4771 -7831 3882 13808 3596 3831 4455 11950 8843 6187 12692 4426 8524 11999
365 11999 10708 6846 344 12781 10402 4175 4276 2426 8799 3191 5724 3741 -4633 4435 6282
380 6282 4226 -6115 -6234 7945 2095 -3594 -7273 -4363 1959 -3423 -2748 -9679 -9790 -1326 -2920
395 -2920 -5781 -15605 -9765 -1658 -5442 -7033 -14987 -9369 -2727 -2468 -4597 -15522 -6944 3500 2302
410 2302 -4846 -11517 2181 7503 3496 18 -3519 5560 9099 9462 2927 -3241 9322 13306 7815
425 7815 -898 2314 14372 6920 1989 3072 7456 7429 -1256 5228 7055 2226 179 0 7520 2218
441B218l200K289k276L113j230K375m860p118R035N334k695j4830k087J8900M219
456I187j4271j7054J1523K0696o702j6828p315J5397J2686p735r745q288J1296
469g153J6720j719j7495j4038K2759K4001j4732k7141J634L3565O861k5221j2227
482a4186J3107J8420m940j0538m879r03J2956P654p542j9696j082K8165N853k4091
496a702j8153J8992K5468j5287k2118L495J9630K467j6334j342O582J214k171
509G41r3K780p734j203Q269J878p589p192R517L408q558p87M321J752r549J355
525h684J3097m363j3094j59J7265M356j8502m126J3166R407p724q482O153K546
539H56J248L255n59q310m406J7031R205j7894j4942J3838K3441j0947k4837M019
$$ plain form
441 2218 -982 1307 -969 2144 914 3289 -1571 -8689 346 5680 2985 -11845 -13932 4968 9187
456 9187 -5084 -22138 -10615 10081 3379 -13449 -20764 -5367 7319 -416 -10161 -18449 -7153
469 -7153 9567 7848 -9647 -23685 -926 23075 8343 -18798 -17164 16401 23262 -1959 -14186
482 -14186 -1079 17341 12401 1863 -3016 -3919 9037 16691 9149 -10547 -11629 16536 22389 -1702
496 -1702 -19855 -863 24605 9318 -12800 -9305 10325 12792 -3542 -4884 1698 2912 741
509 741 648 3428 -4306 -5509 2760 4638 -2951 -10143 -626 2782 -5776 -6563 -2242 -490 -10039 -8684
525 -8684 4413 50 -13044 -13203 4062 8418 -10084 -14210 -1044 8363 639 -7843 -1690 856
539 856 2104 5359 4800 -3510 -7916 9115 18320 426 -14516 -678 22763 11816 -13021 -9002
553i002K1086M218j8802n536J0859L424k155l032P6l153M97Q375o34q665m013
568f457Q042P225o732o496R20N342J877l595j112l072M17M500J260k811q873K485
584g080R787P40q571p386Q224R021m714p324o66O498J937k86M97n774j476Q349
600A776R200q704j4443Q160J7291j429j8145m343J7274O573r519r834K971R451
614F279P36l576o431j088P715L501m245p846J937P496M88l294m313P54L918L258
630E289k049p403J366P351Q25o338m226N914K862l374k556m92K371j11p57j184
646b512k423M228Q12m432j520M528L075o945k161P925K905o960m334Q141M694
661E021n131l467J834M731M12j945j772j054M799J493l503l145K157M914k599
$$ plain form
553 -9002 12084 16302 -2500 -8036 2823 6247 4092 1060 1136 -2017 -1520 6855 6221 -2444 -6457
568 -6457 1585 8810 2078 -4418 -3498 1844 3721 126 -986 -4058 -3641 859 2119 -692 -9565 -7080
584 -7080 2707 3447 -5124 -12510 -4286 4735 21 -7303 -7969 -1471 466 180 677 -5097 -6573 1776
600 1776 10976 2272 -12171 -4011 13280 11851 -6294 -10637 6637 13210 3691 -6143 -3172 6279
614 6279 7015 3439 -2992 -4080 3635 7136 2891 -4955 -3018 4478 4966 1672 -2641 -1887 2031 5289
630 5289 3240 -4163 -2797 4554 5379 -959 -5185 729 3591 217 -2339 -2831 -460 -571 -1328 -2512
646 -2512 -4935 -707 105 -4327 -5847 -1319 1756 -5189 -7350 575 3480 -3480 -7814 327 5021
661 5021 -110 -3577 -1743 2988 3400 1455 -317 -1371 3428 4921 1418 -1727 430 5344 2745
676B745l101J036O68k94L89J541l563k534N515K727n204m069M853M552m500k768
692b007J770K701o53j462L82j427J367J638k489k151R88L688k641m407M120K437
708A854l824l403M031L147m959k242L695K493k666k085K497O59oQ07j231o7J264
725c6K470k144k012L198J319j989r63K149J004l658J077K933j566l304J192L731
741C401k016l406J582K599j031k007P74M20J99J057q39j556P12K890m17m454J629
758d63L601j208l266K61L494j586k176J090N75j325n91J396n80k126R26J448m30
775i60j971O74J404q30M79j01l86L77J733P95l331M27L854J44k650j320L307J291
793B936k742l23P60J104n63o59k9k59N48L87j198n90R04Q28j419k18J196j83n07
$$ plain form
676 2745 -356 680 1348 1054 1443 2984 -579 -3113 2402 5129 -75 -4144 709 5261 761 -2007
692 -2007 -237 2464 1811 349 731 -696 671 2309 -180 -2331 -1343 2345 -296 -4703 -583 1854
708 1854 -1970 -5373 -1342 1805 -3154 -5396 -1701 792 -1874 -3959 -1462 -803 -809 -2 -1233 -1300 -36
725 -36 2434 290 -1722 1476 2795 806 -157 1992 2996 -662 415 3348 1782 -1522 -330 3401
741 3401 1385 -2021 -439 2160 1129 -878 -104 316 515 1572 733 -823 -111 2779 2362 -2092 -463
758 -463 3138 1930 -1336 -1075 2419 833 -1343 -253 322 -1003 -1594 -198 -778 -2904 -1978 -530 -960
775 -960 -2931 -2257 -853 -1683 -1204 -1305 -1691 -1314 419 1214 -2117 -1690 2164 2308 -342 -1662 1645 2936
793 2936 194 -129 631 1735 1172 513 484 225 773 1160 -38 -628 276 1104 -315 -533 663 480 -27
812b7J30R48n18j424J893R35j207j434J180J809j668j112L58Q00K05q21o49j72
830g74M25O26j265j710J132J645q04j691L31J237J63j060K59J107m97N45M65k87
848a53j56Q0J464l20p40l8L62P66J51r03n95M23J148q78q88j24R79K43r66o1k42
869d48O8P45M55m34j608Q27K113m03j300o96Q32J627l86j138r60Q87K026k88k676
888g57q23K322J246j684k215O8J986M23j115j715l30J936J253j453k135Q93K761
905F61L86k467P9J115J087m60j03l56k63R74Q26p42j125O46J383l40j395k73P96
924D29M45q70m39M71L17m75n32P75J23k92j102M92K208o42k000L66K204K09j479
943B08n83R87J35J0P51j167j733J101L042j757l389J20L897Q6l662r52K326J193
$$ plain form
812 -27 103 1051 533 -891 1002 1937 730 -704 476 2285 617 -495 -137 663 868 47 -602 -774
830 -774 -349 277 -988 -2698 -1566 79 -725 -2416 -2085 -848 -685 -1745 -1486 -379 -876 -331 134 -153
848 -153 -309 -229 1235 915 175 137 499 1265 1416 513 -82 341 1489 611 -277 -401 578 821 -145 -206 -448
869 -448 -380 365 820 386 -1222 -395 1718 1315 15 -681 151 1778 1392 254 -706 181 2207 1919 -757
888 -757 -1580 742 1988 304 -1911 -1843 143 566 -549 -2264 -2594 -658 595 -858 -2993 -2100 661
905 661 1047 -1420 -1341 -226 861 401 298 -58 -321 653 1479 737 -388 258 1641 1301 -94 -367 429
924 429 874 4 -435 36 353 -122 -654 121 244 -48 -1150 -658 1550 908 -1092 -726 1478 1687 208
943 208 -375 612 747 757 1508 341 -1392 -291 2751 994 -2395 -2275 1622 1708 -1954 -2906 -580 613
961F13j063j225J08l31J470J401j113k337Q20L212M63k573j121J816K187o71k051
978c95n33J406J383o29j606k72Q94N95k05l72j255o25K443J046k331k215J733
995i38K972j077k476N9J977O86p53j18n16o13J795J923k422k702K113L238j219
1012A929l572K52K755k21j260r79k90R22M99J14j787p24K031J315j641j208N47
1029a318J762J5p55n32L89N78Q35o77j061R42J481j074j060N40J161o16j379R43
1047A74O84o30j003N30M09k41J89q57l79R24R92n62j941O52K155K04j619q56J625
1066D50Q10j9o93r56J30J821N91k534j670K587J965k001k370O09K276l50j444
1083g98n09j43O92J107n05j767k90K864R04k581j555K556J887j246j665P01J052
$$ plain form
961 613 -450 -1675 -1567 -1898 -428 973 -140 -2477 -1657 1555 2018 -555 -1676 140 2327 1656 -395
978 -395 -928 478 1861 1232 -374 -646 248 843 638 266 -989 -1614 829 1875 -456 -2671 -938
995 -938 2034 957 -1519 -1460 517 1203 450 332 -184 -797 998 2921 499 -2203 -90 3148 1929
1012 1929 -1643 -1391 1364 1143 -117 -1096 -1386 -464 35 149 -1638 -2362 -331 984 -657 -1865 -1318
1029 -1318 444 459 -296 -828 -439 139 974 297 -764 178 1659 585 -475 65 1226 610 -769 174
1047 174 858 228 -775 -245 164 -77 112 -745 -1124 -200 792 230 -1711 -1059 1096 1300 -319 -1175 450
1066 450 1260 1241 548 -408 -278 1543 2134 -400 -2070 517 2482 481 -1889 -1280 996 646 -798
1083 -798 -1307 -1450 -758 349 -156 -1923 -2213 651 1555 -1026 -2581 -25 1862 616 -1049 -348 704
1100G04Q6j25l63n15L97R95m97j428K42J443L3j384m12N75K90j55m47j76R8M01
1120b38K79n16k55J282Kq79j37J016L20o25l38Q29j26k41M31o06l91M23O81o76
1140B35j172Q24R42j183q57P73P36p95m25N99J69n66K21O83n67n10Q89P05n09
1159A92o29P67M48r70J20M57J30l03K8M08o65m21R18j98n98n4L53K65q73K40O52
1180B67m92m09O18n9j38K68J91K00m49L20M01p29J4N57l9m29L21J63k57k75L21
1201C65J07r36K62O11n51o93J67Q13m97k76L65p0m21M04L24k30l12L70P96m49
1221A49n48O40Q09o25l90J27N67l56j78L99n31k50N94k52j98l97L92m5j90j6k15
1242e14J24J53J49j48q9J78L98j42n11N96M89o48L17J06R3j65k02K97k61j90L3
$$ plain form
1100 704 790 665 302 -213 184 1179 682 -746 -504 939 972 -412 -824 -249 41 -114 -561 -737 -639 -238
1120 -238 41 -475 -730 552 554 -325 -462 554 874 249 -89 740 614 373 804 198 -193 230 911 235
1140 235 -937 -113 829 -354 -1211 -438 298 -497 -922 -323 -154 -720 -499 184 -383 -893 -4 701 192
1159 192 -437 330 778 -192 -72 385 515 212 240 648 -17 -438 480 282 -316 -370 -17 248 -625 -385 267
1180 267 -225 -634 -16 -75 -213 55 246 446 -3 317 718 -11 3 560 521 92 413 576 319 44 365
1201 365 472 -464 -202 409 -142 -835 -668 145 -352 -628 -263 -333 -754 -350 -26 -256 -568 -198 598 149
1221 149 -399 241 1050 425 35 162 729 373 195 594 63 -187 407 155 -43 -440 -48 -93 -283 -299 -514
1242 -514 -390 -237 -88 -236 -325 -147 251 109 -402 194 683 35 352 458 551 386 184 481 220 30 63
1263F3K08l06k36K82j24j89j57K51l73k64N96q9n21M30K3M89n03L65J22P4m8J77
1285B70O9m5k4M67k82l71P3L0L02k97j33j58K55k1p3m97j23L31p0j09K6J20N8
1308b02p7K10J11k72R1M24R2l21L10N26k74p55P84M8l10l62K1K15n01n3K92j0
1330a3l60%K89l99R9j52J77k43L02J57J80k0k55L95J29k71j21M88k06N0K83m84
1352B5K96K43k34m17O0L08j81k32q5J21k73K08j47Kk52L39N94o40l90M48N96j37
1374B52n78M83K7K64k41K4o7O0K68Kk17l48K04J08P2o35J29p1J46N4n80q8M73
1397b59L11n61k35M94K88l67Q7K71rm8M3J98L7k06N36l3m06l94L39M74k47o29
1419c16J29M34m35m1K11l01J6k89L73j41k0L25o3K07l36j94P47j17j48J66K72
$$ plain form
1263 63 271 -35 -271 11 -113 -302 -459 -208 -581 -845 -249 -338 -859 -429 -406 83 -420 -55 67 141 93 270
1285 270 339 294 270 737 455 84 157 187 489 192 59 -99 156 135 62 -435 -558 -227 -297 -406 -380 -260 -202
1308 -202 -279 -69 42 -230 -139 285 377 56 366 892 618 -137 647 695 385 23 44 259 -242 -295 -3 -13
1330 -13 -373 -373 -84 -483 -384 -536 -359 -602 -300 -143 37 17 -238 157 286 15 -106 382 176 226 509 25
1352 25 321 564 330 -87 -27 281 100 -132 -217 -96 -369 -161 -308 -306 -558 -219 375 -265 -655 -207 389 252
1374 252 -326 157 184 448 207 231 164 224 492 494 277 -71 133 241 313 -322 -193 -264 -118 -64 -644 -732 -259
1397 -259 52 -509 -744 -250 38 -329 -242 29 20 -28 15 213 250 44 580 547 141 -253 86 560 313 -316
1419 -316 -187 247 -188 -229 -18 -319 -303 -592 -219 -360 -380 -55 -118 89 -247 -441 306 189 41 207 479
1440D79m0k92k8L31K18m33j49L0K62k35k73K07j29j48K1J85m51r0K44K78l56m84
1462h53N82L96l51LJ23L40j3j06k6M7K65l89L29j88k23J69L98k92o22L54L93k10
1484A26p21M9N69J04j87k04j83q0L50m7k7l37L48Q48l13l70L9M34K38m26k93K68
1506A85L74j22n35K57k6j65Jn5r2j52K04Q8k01m08J08N64k02k07O2M94n12N7O1
1529b22L63P7l62K33K35M9j27J57K4k60k04K86N3n35J30L30m4n76j71M04K79m42
1551c23q3L26Nm8r8J15K21l49J77J15J74j31K46L95m60l66M19J62n6n00J47K22
1573C10j65n0l60J11J47k74p4L01l91o2J62K65l89K3K65L48m69jM65j5j80j48
1595a81K54J12j31J31O06n77l78K87M17j94m33J93J44m19%jR5k0k94L05l4m42
$$ plain form
1440 479 439 147 119 450 668 235 86 116 378 143 -130 77 -52 -200 -179 6 -445 -535 -291 -13 -369 -853
1462 -853 -271 125 -226 -223 -100 240 227 121 95 142 407 18 347 159 -64 105 503 211 -411 -57 336 126
1484 126 -595 -546 23 127 -60 -264 -447 -527 -177 -224 -251 -588 -240 608 295 -75 -36 398 636 210 -83 185
1506 185 559 437 -98 159 133 -32 -31 -86 -178 -330 -126 -38 -239 -647 -539 25 -177 -384 -322 172 -340 -283 -222
1529 -222 141 218 -144 89 324 373 246 403 427 167 -37 249 302 -233 -103 227 183 -393 -564 -160 119 -323
1551 -323 -406 -80 -75 -123 -221 -106 115 -234 -57 58 232 101 347 742 282 -84 335 497 441 -59 88 310
1573 310 145 95 -265 -154 -7 -281 -355 -54 -445 -507 -345 -80 -469 -446 -181 167 -302 -303 162 147 -33 -181
1595 -181 73 185 54 185 791 214 -164 123 540 346 -87 106 250 -169 -169 -170 -75 -95 -389 -84 -118 -560
1617e60L52J29k97J33M2K97Kn2K97Q9j46j58m4K45j47j17m2J28K61k16m09R1K00
1640G8j80j89O8J69j65j96K21n1j96J91L46j06j02n1K18Jq1M37j59J55l08K29
1662C29j76k2K21j8j89j40j27O3N0k49p2J33j18J07K54k36N9J61q2l0k92J39L81
1685A46k36L19j96k08L85J31k01j41K75R0j20l19L05L1k22j26J1j0m69L07LJ67
1707g8p0j10J64j82jK68J60j35m8K19m26L17o3L96j41N8p2j06P7l27L88q5k16
1730a3l4k4p2j19K08K29o21r8O52m24O1J52p7K4n5K10J10j50K24r2j29O8J92k2
1754B00Op1m0L03m39N9K89k60j13l13L27j46q9N1J37p2j54J12M7O1Q6q8J37K89
1778C19j64l4kK7m4O5j53L10j68j47K6j53L78r2j57q3L06o32N18l24n4j63K5K43
$$ plain form
1617 -560 -208 -79 -376 -243 -201 96 98 46 343 432 286 128 84 329 182 65 23 151 412 196 -213 -122 78
1640 78 -102 -291 -223 -54 -219 -415 -194 -245 -441 -250 96 -10 -112 -163 55 56 -25 412 253 408 100 329
1662 329 153 131 352 334 145 5 -122 -59 -9 -258 -330 -197 -315 -208 46 -190 -131 30 -52 -82 -374 -235 146
1685 146 -90 229 33 -175 210 341 140 -1 274 364 244 -75 230 261 39 -87 -76 -86 -555 -248 -245 -78
1707 -78 -148 -258 -94 -276 -277 -9 151 16 -32 187 -239 78 15 411 270 328 256 150 227 -100 288 203 -13
1730 -13 -47 -71 -143 -262 -54 175 -446 -544 108 -316 -255 -103 -180 -156 -211 -1 109 -41 183 91 -38 30 222 200
1754 200 206 135 95 398 -41 18 307 47 -66 -379 -52 -198 -287 -236 -99 -171 -325 -213 -166 -105 -19 -107 30 319
1778 319 155 121 119 146 102 167 14 324 156 9 35 -118 260 168 11 -72 234 -398 120 -204 -258 -421 -396 -153
1802a53J6nQ4r5j31L82k70K15l8K60P9K4k56K98j83j41M6K25m32J0K68o6j85k96
1826c44K80N3j65L4R1k7m92M15n1k42L53J16j31J31K79j47k15L2J59K64j31k68
1848fl3J65R9j16J11l02j86L59Q2l94j74K29Q1k46J69r9R2R0q2J79j94n5K32o9
1872f8K9K20J75J4m62L33p4K05j94N4k40j31R7J83l89j33K46J47k31K4J99l3j61
1895a90k0L4J52j03J9L06l05J86J20J66j53j13Q2j4j87N9J77j09N5n4J58m91J53
1918g2K03k06j44j48L61l6j65M3K53p8j77K4R6n7o6J87J83j12r0J16j99L16j51
1941H1O0P5K9m07K35J12L8q9j42n4L73n81K27J44k48q7l29O36R2m24K47L9L26
1964C53k64r9N53o08j15L87K14j17k35m6M06l89n8P4K3j27j21l5K80l56j06L42
$$ plain form
1802 -153 -137 -142 -58 -153 -284 98 -172 43 5 265 344 368 112 410 227 86 132 357 -75 -65 203 137 -48 -344
1826 -344 -64 -11 -176 -142 -51 -78 -570 -155 -206 -448 -95 21 -110 21 300 153 -62 -30 129 393 262 -6
1848 -6 -39 126 225 109 220 -82 -268 91 173 -221 -395 -166 -85 -331 -162 -261 -169 -79 -161 18 -176 -231 1 -68
1872 -68 -39 181 356 370 -92 241 167 372 178 232 -8 -139 -42 141 -248 -381 -135 12 -219 -195 4 -29 -190
1895 -190 -210 -176 -24 -127 -108 198 -107 79 199 365 212 99 181 167 -20 39 216 107 162 108 266 -225 -72
1918 -72 131 -75 -219 -367 -6 -42 -207 -164 89 11 -166 -142 -46 -103 -169 18 201 89 -1 115 -84 232 81
1941 81 141 216 245 -162 73 185 223 134 -8 -62 311 -270 -43 101 -147 -234 -563 73 165 -259 -12 27 353
1964 353 89 -10 543 -65 -180 207 421 304 69 23 429 40 -18 56 79 -48 -169 -204 76 -280 -386 -44
1986d4j21j10L13k38%K00l75L14L94m96J09N5L8K29l75K66P5J3k91K90q0r5k62
2009a91J79J77o91L93J00k09Q5rk0P1j46J46J19K1o9n1J18j4l15L51L96l64o5
2032A2O47k52j28l97M27j47j39N6m1J28k90J06nl09j10J99K6r7L7K17K13l71J27
2055i1J92p8l9N3j63L18q4q0J59J60q3k3o2j52J98j22o9o8q2r1K12k8kj93K97
2080G9k27m7N8j04J07K17j20j01J51Q0j20M7L32l7k99nL10k57oJ06J64k86j39
2103i7K33l44m1J69M01m65j49P9K36j63o6K89k54J85Q2J08k57J86j75J96L1p9
2125A05o4J38k86J40J23m65L12K9P9o3J62k20l25J73j51J43j12j70O35m23j51
2146c91L06j11J77l41K52K07k1O3J76j91j5J47m9L8j99N9P7k14j04K66q9j13k13
$$ plain form
1986 -44 -165 -275 38 -200 -200 0 -375 -61 333 -163 -54 1 39 268 -107 159 234 247 -44 246 166 71 -191
2009 -191 -12 165 -526 -133 -33 -242 -157 -166 -186 -115 -261 -115 4 25 -44 -95 23 9 -306 45 441 77 12
2032 12 659 407 279 -118 309 162 23 79 38 166 -124 -18 -23 -332 -442 -243 -217 -314 -277 -60 153 -218 -91
2055 -91 101 23 -16 37 -126 192 108 28 187 347 264 241 179 27 225 103 34 -34 -116 -207 5 -23 -25 -218 79
2080 79 -148 -195 -137 -241 -134 83 -37 -138 13 93 -27 20 352 315 16 11 321 64 58 164 328 42 -97
2103 -97 136 -208 -249 -80 321 -144 -293 -214 22 -141 -207 82 -172 13 95 203 -54 132 -43 153 184 105
2125 105 41 179 -107 33 156 -309 3 32 111 48 210 -10 -335 -162 -313 -170 -282 -452 183 -240 -391
2146 -391 -85 -196 -19 -360 -108 99 78 141 317 126 111 258 209 247 48 107 184 -30 -134 132 43 -70 -283
2169b83M04j66j27K0j1j83R0K38k03P5N6N0r4l1K41j23J26J54nQ3l66k0M75l52
2193D8r0J23j43P5j34L05q0l66J25K17m04k3K55J86j14j82K9L06M4n6j74J21j12
2216d4J74J74l16Q9l5K26k54plK65p3k53j36K57l73J25J67l76K12J25k00oK49
2239a3J7k21O6K72J8k4j03K49j45j15N1L39l14j40K49Q2j91K3R5j92K2J2m5k08
2263b16J71L5L8k44J04N4K6j41J45Nm4J56J97P4l84J47J51j94k9J34m3jJ65m5
2287B61k82J17m52J65J32j1l0k5q3j0N3o0P7R6j95K65j6J42j02O9k1N3Qk7j2N9
2313A71n8j15K13k85LJ03J34l56J29j2J78j50j47PJ97j54j73K81k41L9J12L9j5
2336a00K09K03O3l82R4O6j22J90j18K83l75R6PL5j26k3Nj55K02j36o0k5j58M63
$$ plain form
2169 -283 121 -45 -172 -152 -163 -346 -256 -18 -221 -146 -90 -40 -134 -165 76 -47 79 233 228 311 -55 -75 400 48
2193 48 -42 81 -62 13 -121 184 104 -262 -137 80 -324 -347 -92 94 -20 -202 -173 133 177 121 -53 68 -44
2216 -44 130 304 -12 77 42 268 14 7 4 269 196 -57 -193 64 -309 -184 -17 -393 -181 -56 -256 -262 -13
2239 -13 4 -217 -151 121 139 115 12 261 116 1 52 391 77 -63 186 268 77 100 195 3 25 37 -8 -216
2263 -216 -45 -10 28 -216 -112 -58 -32 -173 -28 -23 -67 89 286 360 -24 123 274 80 51 185 142 141 306 261
2287 261 -21 96 -356 -191 -59 -70 -100 -125 -208 -218 -165 -225 -148 -52 -247 18 2 144 42 111 90 143 151 124 112 171
2313 171 113 -2 211 -74 -71 32 166 -190 -61 -73 105 -45 -192 -185 12 -142 -315 -34 -275 -236 -124 -85 -100
2336 -100 109 312 375 -7 87 153 31 221 103 386 11 107 114 149 23 0 5 -150 52 -84 -144 -169 -327 136
2360A36j35j8q4j25l2M13j45K0j3o4Q2J56k88L31q0K23j15l41J65k4pm7j23k8
2384a43M4r5J28p2J07k71L11j48J42j54k0K66r5q4R9J79J24m12J36J1p3j46L50
2407A84M1l65K92l02K78j11l9l3kP2j46J20r2J18p6j7K69l23O4n2R1K6j87K85
2431I5O8l7l1j39L19j63l3l4J90r4J64l74R2p1j54J62R4j63J22j60k57J47J49
2454a08m7N8O6j75K24l8j61J20L97m03l6J81k3j62N03k37k28K79j53J24j5p3k83
2477a90K38j71k2J6K02p0k4Nj18J24l3r6N2J85Pj90L26r2o9p8J98k7n7j26m2R8
2503D6m4m5J73k19M9K08m2k50J40J08j79M0L8k34m8L12n6J19r7l3l16L36J59J56
2527C21l14K26RR5k40p8j2J94M2o1k73J11k30L51k34L4p2O7L14m89l8J56L1O0
$$ plain form
2360 136 1 -17 -101 -226 -258 155 10 30 17 -47 35 191 -97 234 154 377 262 -79 86 62 55 8 -115 -143
2384 -143 -99 -194 -66 -138 -31 -302 9 -139 3 -151 -171 95 0 -84 15 194 318 -94 42 53 -20 -166 184
2407 184 225 -140 152 -150 128 17 -22 -55 -57 15 -131 -11 -103 15 -61 -78 191 -132 -68 -120 -29 -3 -190 95
2431 95 163 126 95 -44 275 112 79 45 235 141 305 -69 23 -48 -202 -40 54 -109 13 -147 -404 -257 -108
2454 -108 -155 -97 -31 -206 18 -20 -181 -61 336 -67 -103 78 55 -107 396 159 -69 210 57 181 166 93 -190
2477 -190 48 -123 -145 -129 73 3 -21 -16 -134 -10 -43 -139 -87 98 105 -85 241 149 80 2 200 173 116 -10 -52 46
2503 46 2 -43 130 -89 -40 168 126 -124 16 124 -55 -15 23 -211 -259 53 -3 116 19 -14 -330 6 165 321
2527 321 7 233 242 337 97 19 7 201 243 182 -91 20 -210 141 -93 -59 -131 -64 250 -239 -277 -121 -90 -30
2551c0k94K75J63r3K6K6%k15J49oj61J28k33M73M1l26K5N0k55L10l55R6K02j99
2575b03M6J17n5k2J8j61M6K79k51K15J25k38J84p1M3j38K06m7q6J74j07pk03J92
2599E6R0j12N0k14o0K83k21Q0n7J23j55m2j12L62r9K04Q2l51J4j7K40j92O4j43
2623a27K58k37J85j12M83n51O3K53k22K3J51k02K2j42O6l9R4q6l05L82K84l41
2645a00p8k6K32m8m9L8J21N4m8O1K19l33M4P7j51j90L10l79K10p3P9J36j35j80
2669b09N4M8R0P6k08K97k16n4J93q1rK33j48j23J83P6r3j69L8K65j42j87N5p9
2693a10j37P8O2K2K0J2J18k53l9J30J7j29J59m4J52l30L28K03l56J11K41o8m3
2716A44K2J2k64J35Q8k86K39J38j64rk63J16k35L43o5p0N0L4k22J62o5K41o9J55
$$ plain form
2551 -30 -324 -49 114 21 47 73 73 -142 7 1 -160 -32 -265 208 249 -77 -52 -2 -257 53 -302 -206 -4 -203
2575 -203 -157 -40 -95 -117 -99 -260 -214 65 -186 29 154 -84 100 29 72 -66 140 93 7 181 74 67 -136 56
2599 56 146 34 84 -130 -190 93 -128 -48 -105 18 -137 -179 -291 71 -28 176 258 -93 -79 -96 144 -48 16 -127
2623 -127 131 -106 79 -33 450 -101 -38 215 -7 16 167 -35 -13 -155 -89 -128 -34 -120 -425 -43 241 -100
2645 -100 -178 -204 28 -20 -69 -31 90 144 96 157 376 43 87 164 13 -177 133 -246 -36 -109 -30 106 -29 -209
2669 -209 -155 -107 -17 59 -149 148 -68 -122 71 -10 -19 214 66 -57 126 202 109 -60 -22 243 101 -86 -31 -110
2693 -110 -247 -169 -107 -85 -65 -53 65 -188 -227 -97 -80 -209 -50 -94 58 -272 56 259 -97 14 255 187 144
2716 144 166 178 -86 49 137 -149 90 228 64 55 -208 -92 -327 16 -49 -119 -69 -35 -257 -95 -160 81 12 167
2740A67l53J55J78o4J83k62K54j93j1J31%J75m00k7J18k21M2J61pl19K88L7Q2
2763A14k62L08j16l4k7R2j44K32k36m3K86l5j3o1OJ92m21O8K5P7p4j13J77r3J39
2788D4r9j50q8J61Q5j10Q1J92j60J51k64R7P9j09K17j89P1J35j46M26l97K02j1
2811B18j46J62j03j92LJ63k87J21qj4j09pJ55k0J59k16n8p7M19l18j51N32k61
2834c5L18j94J5j15J67j47N9j95L82l34M9P2L5j6k31J90K3Rm9J4J24k70q1K66
2858E6j56j45K55J21p4j96J92j81L4K81j52K47k59J57L2n5r0l3K01j12k48Mj93
2881c14J08J63J48j79o1o0N4J88n8pM8K5M6j50J35o5l4P2J86m06J96J00l8l4j95
2906a32J95m0J5k90J32L3J36j16J09m6J00k07K49J74n62K06R8Q2j03j10k6K9L38
$$ plain form
2740 167 -186 -31 147 83 266 4 258 65 54 185 185 360 -40 -67 51 -170 -128 33 26 -293 -5 32 114
2763 114 -148 160 44 10 -17 75 -69 163 -73 -116 170 135 122 61 67 259 -162 -94 -69 8 -66 -179 -2 -95 44
2788 44 -55 -205 -293 -132 -47 -157 -76 116 -44 107 -157 -60 19 -90 127 -62 9 144 -2 424 27 229 218
2811 218 72 234 131 -61 -58 105 -182 -61 -69 -83 -192 -199 -44 -64 95 -121 -179 -256 163 -155 -306 226 -35
2834 -35 283 89 104 -11 156 9 68 -127 255 -79 -30 42 77 61 -170 20 43 52 3 17 141 -129 -210 56
2858 56 -100 -245 10 131 57 -139 53 -128 -94 187 35 282 23 180 212 157 67 34 235 123 -125 -121 -314
2881 -314 -206 -43 105 -74 -135 -195 -141 47 -11 -18 30 55 101 -49 86 21 -13 59 245 -161 35 135 97 63 -132
2906 -132 63 23 38 -252 -120 -87 49 -67 42 -4 96 -111 138 312 -250 -44 54 136 33 -77 -103 -74 264
2929B64k60O4nPq7P8L0q7J40l5j48K01j88r6J50P4k77J46J29j91J60j31J42q5
2953eL4m2M3N3j8k66M55k47M1K30j60N6l91K57J07j13J75l49J85q0oJMl23J85
2978a74m6J16r2j03L01q0K27k77K40k69J86J17P0j7k29M1j8J26k0k50K90j24P6
3001I1ml51M37k47M3k10M29l69j44O60n02j54J41K50j05K3M8N3r0Ojj06K42n3
3025H7RJ50l7k86pl3J53j62N3L4J8k18q7L98j44j07Q5J36j17j92P9L63k39P2O0
3050F8j01K47l10K41K26m49K4p9M09m29K59J4k7q6j1J84k22O8j14K96j89%j21
3073a02J75r4J31j13o7l8J36r3R9%J48j51L4k72K01K92k14j8KO0L4o3j69K48j08
3098E8j29J22j30p7Q2n6N7k8j40M00j28r9J94k05J35nj14Q9R7j15L8R3J59l22
$$ plain form
2929 264 4 68 63 70 -17 61 91 4 144 109 -39 162 -26 -122 28 102 -175 -29 100 -91 69 -62 80 -5
2953 -5 29 -13 30 83 65 -201 254 7 48 278 118 174 -217 40 147 34 209 -140 45 -35 -41 -40 -36 -359 -174
2978 -174 -220 -104 -196 -299 2 -78 149 -128 112 -157 29 146 216 199 -30 11 -7 119 99 -151 139 15 91
3001 91 87 -264 173 -74 -31 -241 188 -181 -325 335 -167 -321 -180 70 -35 -12 36 89 -1 5 4 -102 140 87
3025 87 96 246 209 -77 -84 -117 36 -126 -73 -39 -21 -239 -326 72 -72 -179 -94 42 -75 -267 -188 175 -64 8 68
3050 68 -33 214 -96 145 371 -78 -54 -133 276 -153 106 120 93 7 -4 180 -42 26 -88 208 19 19 -102
3073 -102 73 -21 110 -3 -70 -108 28 -65 34 34 182 31 65 -207 -6 286 72 54 56 116 150 87 -82 166 58
3098 58 -71 51 -79 -156 -74 -130 -73 -101 -241 159 31 -68 126 -79 56 51 -63 26 123 8 46 139 298 -24
3122b4J38k86L33j60q5NN2r5p6K95k32K61j30k4K9J89l36K37k67K58RJ00l43J0
3146a42J41j90K14P4n6Q5J91k76p6K94K27n41J31j60P9j28pL80k85j37L95k61
3168d8M5j46M40l12J8J09k76O2J29LNJ91j69l5L9j07K4M2J86l47J18j21J80Ql17
3193b79K65j47J43k20K68P6k09J68l59K81K4j36M50m90K66OR6j45K0J51k99J92
3215A22Pn1K2J43j91J10k77j48K00R3k33J70j93K11J85l33J78j45J21j01J89m1
3237C8l6O3k5r7R1M6K64k29O3m7j1k7p4J20j5m8j35K7Nk37K74l8l00K69m6j0J39
3264B4k68M89k13j89r4L72j49j0J31R9l53K42j25J6R9j20J81j38p5J94p3j77O8
3287f9J31k31J58Qj19P6j2J15k11K30k26J16L7J0O2k12L26j75j47M4J68L4Q0k9
$$ plain form
3122 -24 114 -172 161 1 -84 -79 -27 -122 -198 97 -135 126 -4 -28 1 190 -146 91 -176 82 91 191 -152 -142
3146 -142 -1 -191 23 97 41 126 317 41 -35 259 486 -55 76 -84 -5 -133 -140 240 -45 -182 213 -48
3168 -48 -3 -149 291 -21 -3 106 -170 -108 21 24 29 220 51 16 55 -52 -28 14 200 -147 -29 -150 30 38 -279
3193 -279 -14 -161 -18 -238 30 106 -103 65 -294 -13 11 -125 325 -165 101 107 203 58 78 229 -70 122
3215 122 129 78 100 243 52 162 -115 -263 -63 30 -203 -33 -226 -15 170 -163 15 -130 -9 -110 79 38
3237 38 2 65 40 -57 34 80 344 115 178 131 120 93 19 139 124 76 -59 -32 -27 -264 10 -28 -328 -59 -105 -115 24
3264 24 -244 245 32 -157 -251 121 -28 -38 93 192 -161 81 -44 -28 71 -49 132 -6 -81 113 40 -137 -69
3287 -69 62 -169 -11 -3 -122 -46 -58 57 -154 76 -150 -34 3 13 75 -137 189 14 -133 -89 79 113 193 164
3311A64k77J12Q1l22Q6M6OJ77k04K54p3M5j05r0J23P0K4k65L03r9j17J81k8n0
3335D2P9J19l47k86O78m02P5K7J85l27K39k61K52J10k39p8Q4j04K05j95K08m8
3357A6l7j14L0K5K65l25L16q9jk58N36l77J54j21j42J64l2J24j42N2m2o7O1k29
3381b33J21j23M24k06j76K73J56k37j2j34K29k49J66q9Q9K32m39K94m81N31L0
3402A66j41k7k19K93j54J67p4j57L23k46J19j70j00R2j16L69K0j52J00q5j49J75
3424C4P0P3L0j38K3j09k6k6K5J52m4k4J70k91%j52M21m17J37r7K93qn7k67L21
3449I3j41P6j68L0J33L04k14n4r1L20m36Q5j29L29k16J8P2J74j93j65j36K28J11
3472C0N6j72k8L73j34j41J51k31J93j42R0j57J02J76j86N8q2J34Q6o5R2l47K09
$$ plain form
3311 164 -113 -1 80 -242 -156 -110 -104 73 -131 123 50 95 -10 -100 23 93 117 -148 155 56 -61 120 92 42
3335 42 121 240 -107 -393 285 -117 -42 -15 170 -157 82 -179 73 183 -56 -134 -50 -154 51 -144 64 16
3357 16 -21 -135 -105 -80 185 -140 176 87 86 -172 364 -13 141 20 -122 42 10 134 -8 44 2 -65 -4 -233
3381 -233 -112 -235 189 -17 -193 80 236 -1 -13 -147 82 -167 -1 -90 -1 231 -208 86 -395 136 166
3402 166 25 -2 -221 72 -82 85 11 -146 177 -69 50 -120 -220 -128 -244 125 145 -7 93 8 -141 34
3424 34 104 177 207 69 92 -17 -43 -69 -44 108 64 40 210 -81 -81 -233 188 -229 -92 -189 104 96 39 -228 93
3449 93 -48 28 -140 -110 23 327 113 59 -32 288 -148 -63 -192 137 -79 -61 11 185 -8 -173 -309 -81 30
3472 30 86 -86 -114 259 125 -16 135 -96 97 -45 45 -112 -10 166 -20 38 -44 90 176 111 203 -144 65
3495F5J20j51o4O5l77J87R6l9NnL1j24K6J39j3q6p3J44J28j41P8o0l6j12K80R1
3521A74k27j00L15k30J44r0J36j02N1j04pJ5k37K08j38O6J91k15O1n7K28L8k04
3544h4oK13j12J7J38l54K80n9k05J68O2n7q7J66j34l7K29k16R2Qm4J91j9j55j56
3569a61j23J67lk0K18ok53K85k94K87l48L17R2q6J21k54K14k53M5k16L88j52J03
3592F8j25MJ81m54J96K50m57M43p8J95k75j3Q5%R2j98P0j24K28q5j53J33lJ8R9
3617I7j31j91J76pJ35K8O6p5q0n4j63n9N2L83l25J48L7Ql11K40j51J54lo9N0k
3643d7q1J10P7m3J0J05j96K14n3j87K40k58J32k28J77n6r4R4P1j60J50M5Q1j58
3667e5L9j03J72r1Nr6m3L53Q3j32l39J95N8k11J22j96O2K26r4k29K19J98j79J45
$$ plain form
3495 65 185 34 -30 35 -342 -155 -59 -98 -93 -98 -67 -191 -165 -26 -39 -125 -198 -54 74 -67 11 -49 -85 -197 83 174
3521 174 -53 -153 162 -68 76 -14 122 20 71 -33 -40 -25 -262 -54 -192 -126 65 -150 -89 -146 82 120 -84
3544 -84 -90 123 11 28 166 -188 92 33 -172 -4 58 1 -86 80 -54 -91 138 -78 14 22 -22 169 150 -5 -161
3569 -161 -284 -117 -120 -140 78 72 -181 104 -190 97 -251 66 158 72 193 -61 153 -100 -55 -271 117 -35 68
3592 68 -57 -53 128 -326 -130 120 -337 106 28 223 -52 -65 20 20 112 -86 -16 -140 88 3 -150 -17 -20 -2 97
3617 97 -34 -225 -49 -56 79 107 173 98 18 -36 -199 -258 -206 177 -148 0 37 45 -266 -26 -177 -23 -26 -95 -45 -47
3643 -47 -128 -18 59 16 26 131 -65 149 96 -91 149 -109 23 -205 -28 -84 -178 -84 -13 -173 -23 22 103 -55
3667 -55 -16 -119 53 -38 -33 -129 -172 181 264 132 -207 -12 46 -165 -43 -239 -177 49 -45 -274 -55 143 -36 109
3691A09l05J10M9j5J57r4k54K16j6J48L0j22k71L58k39L8L24k8k74K77p7j34M7
3714C4j77J52Kl6R5j01j22q4R3J53q5QqJ77Qj28K0j2O9Qj23J47J33l07R3o6J46
$$ plain form
3691 109 -196 -86 -37 -52 105 11 -243 -27 -43 105 135 13 -258 100 -139 -101 223 195 -79 198 121 -13 34
3714 34 -143 9 11 -25 70 -31 -153 -237 -144 9 -76 -68 -76 101 109 -19 1 -11 58 66 -57 90 223 -84 9 -57 89
$$ [...]
8191f1
##END NTUPLES=NMR FID
##END=
