##TITLE=1H_Pr 5007-2
 CDCl3
 8 sc, 
 21.10.2022
##JCAMPDX= 6.0         $$ Bruker NMR JCAMP-DX V2.0
##DATA TYPE= NMR FID
##DATA CLASS= NTUPLES
##ORIGIN= UXNMR, Bruker Analytische Messtechnik GmbH
##OWNER= root
$$ XWIN-NMR		Version 3.5
$$ Fri Oct 21 15:47:45 2022 Russian Standard Time (UT+4h)  she@DPX200
##.OBSERVE FREQUENCY= 200.1313499994
##.OBSERVE NUCLEUS= ^1H
##.DELAY= (6, 6)
##.ACQUISITION MODE= SIMULTANEOUS
##.ACQUISITION SCHEME= undefined
##.AVERAGES= 8
##.DIGITISER RES= 18
##SPECTROMETER/DATA SYSTEM= spect
##.PULSE SEQUENCE= zg30
##.SOLVENT NAME= CDCl3
##.SHIFT REFERENCE= (INTERNAL, CDCl3, 0, 15.7039)
##AUDIT TRAIL= $$ (NUMBER, WHEN, WHO, WHERE, WHAT)
$$ ##TITLE= Audit trail, XWIN-NMR		Version 3.5
$$ ##JCAMPDX= 5.01
$$ ##ORIGIN= Bruker BioSpin GmbH
$$ ##OWNER= she
$$ F:/spectra/data/she/nmr/H-F/1/audita.txt
$$ ##AUDIT TRAIL=  $$ (NUMBER, WHEN, WHO, WHERE, WHAT)
(   1,<2022-10-21 15:46:49.46 +0400>,<she>,<DPX200>,
      <created by zg, POWCHK disabled, PULCHK disabled
       configuration hash MD5:
       00 E9 B6 7A A2 85 ED C7 34 08 36 98 17 FE 4E 26
       data hash MD5: 16K
       04 12 CB CB 86 04 3F 5F D5 37 56 2B E7 4D 36 09>)
$$ ##END=
$$ 
$$ hash MD5
$$ FC F9 ED 84 30 3C CE EE 89 61 AD 2D 3E 70 6F A1
##$RELAX= 
##$RELAX= 
##$RELAX= 
##$RELAX= 
##$RELAX= 
##$RELAX= 
$$ Bruker specific parameters
$$ --------------------------
##$DU= <F:/spectra>
##$EXPNO= 1
##$NAME= <H-F>
##$PROCNO= 1
##$TYPE= <nmr>
##$USER= <she>
##$AMP= (0..31)
100 100 100 100 100 100 100 100 100 100 100 100 100 100 100 100 100 100 
100 100 100 100 100 100 100 100 100 100 100 100 100 100 
##$AQSEQ= 0
##$AQ_mod= 1
##$AUNM= <au_zg>
##$AUTOPOS= <>
##$BF1= 200.13
##$BF2= 200.13
##$BF3= 200.13
##$BF4= 200.13
##$BF5= 200.13
##$BF6= 200.13
##$BF7= 200.13
##$BF8= 200.13
##$BYTORDA= 1
##$CFDGTYP= 0
##$CFRGTYP= 5
##$CHEMSTR= <none>
##$CNST= (0..31)
1 1 145 1 1 1 1 1 1 1 1 1 1 1 1 1 1 1 1 1 1 1 1 1 1 1 1 1 1 1 1 1 
##$CPDPRG= <>
##$CPDPRG1= <>
##$CPDPRG2= <>
##$CPDPRG3= <>
##$CPDPRG4= <mlev>
##$CPDPRG5= <mlev>
##$CPDPRG6= <mlev>
##$CPDPRG7= <mlev>
##$CPDPRG8= <mlev>
##$CPDPRGB= <>
##$CPDPRGT= <>
##$D= (0..31)
0 1.2 0 0 0 0 0 0 0 0.06 0 0.03 0 0 0 0 0.0002 0 0 0 0 0 0 0 0 0 0 0 0 
0 0 0 
##$DATE= 1666352808
##$DBL= (0..7)
120 120 120 120 120 120 120 120 
##$DBP= (0..7)
150 150 150 150 150 150 150 150 
##$DBP07= 0
##$DBPNAM0= <>
##$DBPNAM1= <>
##$DBPNAM2= <>
##$DBPNAM3= <>
##$DBPNAM4= <>
##$DBPNAM5= <>
##$DBPNAM6= <>
##$DBPNAM7= <>
##$DBPOAL= (0..7)
0.5 0.5 0.5 0.5 0.5 0.5 0.5 0.5 
##$DBPOFFS= (0..7)
0 0 0 0 0 0 0 0 
##$DE= 6
##$DECBNUC= <off>
##$DECIM= 32
##$DECNUC= <off>
##$DECSTAT= 4
##$DIGMOD= 1
##$DIGTYP= 9
##$DL= (0..7)
0 120 120 120 120 120 120 120 
##$DP= (0..7)
150 150 150 150 150 150 150 150 
##$DP07= 0
##$DPNAME0= <>
##$DPNAME1= <>
##$DPNAME2= <>
##$DPNAME3= <>
##$DPNAME4= <>
##$DPNAME5= <>
##$DPNAME6= <>
##$DPNAME7= <>
##$DPOAL= (0..7)
0.5 0.5 0.5 0.5 0.5 0.5 0.5 0.5 
##$DPOFFS= (0..7)
0 0 0 0 0 0 0 0 
##$DQDMODE= 0
##$DR= 18
##$DS= 0
##$DSLIST= <SSSSSSSSSSSSSSS>
$$ [...]
##$SUBNAM2= <"">
##$SUBNAM3= <"">
##$SUBNAM4= <"">
##$SUBNAM5= <"">
##$SUBNAM6= <"">
##$SUBNAM7= <"">
##$SUBNAM8= <"">
##$SUBNAM9= <"">
##$SW= 18.0517283424941
##$SWIBOX= (0..15)
0 0 2 0 0 0 0 0 0 0 0 0 0 0 0 0 
##$SW_h= 3612.71676300578
##$TD= 16384
##$TD0= 1
##$TE= 0
##$TE2= 300
##$TE3= 300
##$TEG= 300
##$TL= (0..7)
0 120 120 120 120 120 120 120 
##$TP= (0..7)
150 150 150 150 150 150 150 150 
##$TP07= 0
##$TPNAME0= <>
##$TPNAME1= <>
##$TPNAME2= <>
##$TPNAME3= <>
##$TPNAME4= <>
##$TPNAME5= <>
##$TPNAME6= <>
##$TPNAME7= <>
##$TPOAL= (0..7)
0.5 0.5 0.5 0.5 0.5 0.5 0.5 0.5 
##$TPOFFS= (0..7)
0 0 0 0 0 0 0 0 
##$TUNHIN= 0
##$TUNHOUT= 0
##$TUNXOUT= 0
##$USERA1= <user>
##$USERA2= <user>
##$USERA3= <user>
##$USERA4= <user>
##$USERA5= <user>
##$V9= 5
##$VALIST= <valist>
##$VCLIST= <CCCCCCCCCCCCCCC>
##$VD= 0
##$VDLIST= <DDDDDDDDDDDDDDD>
##$VPLIST= <PPPPPPPPPPPPPPP>
##$VTLIST= <TTTTTTTTTTTTTTT>
##$WBST= 1024
##$WBSW= 4
##$XGAIN= (0..3)
0 0 0 0 
##$XL= 0
##$YL= 0
##$YMAX_a= 213852
##$YMIN_a= -266368
##$ZGOPTNS= <>
##$ZL1= 120
##$ZL2= 120
##$ZL3= 120
##$ZL4= 120
##$ABSF1= 10
##$ABSF2= 0
##$ABSG= 5
##$ABSL= 3
##$ALPHA= 0
##$AQORDER= 0
##$ASSFAC= 0
##$ASSFACI= 0
##$ASSFACX= 0
##$ASSWID= 0
##$AUNMP= <proc_1d>
##$AZFE= 0.1
##$AZFW= 0.1
##$BCFW= 1
##$BC_mod= 2
##$BYTORDP= 1
##$COROFFS= 0
##$CY= 11.3945322036743
##$DATMOD= 1
##$DC= 2
##$DFILT= <>
##$DTYPP= 0
##$F1P= 2.36226072786647
##$F2P= -0.459571619588291
##$FCOR= 0.5
##$FTSIZE= 0
##$FT_mod= 4
##$GAMMA= 1
##$GB= 0.15
##$INTBC= 1
##$INTSCL= 1
##$ISEN= 128
##$LB= 0.24
##$LEV0= 0
##$LPBIN= 0
##$MAXI= 10000
##$MC2= 0
##$MEAN= 0
##$ME_mod= 0
##$MI= 1.114404
##$NCOEF= 0
##$NC_proc= 0
##$NLEV= 6
##$NOISF1= 3.799351
##$NOISF2= 2.8
##$NSP= 1
##$NTH_PI= 0
##$NZP= 0
##$OFFSET= 15.70392
##$PC= 1
##$PHC0= -18040.9
##$PHC1= 20.8007
##$PH_mod= 1
##$PKNL= yes
##$PPARMOD= 0
##$PSCAL= 0
##$PSIGN= 0
##$REVERSE= no
##$SF= 200.130013532006
##$SI= 16384
##$SIGF1= 3
##$SIGF2= 2
##$SINO= 400
##$SIOLD= 16384
##$SREGLST= <1H.CDCl3>
##$SSB= 0
##$STSI= 0
##$STSR= 0
##$SW_p= 3612.71676300578
##$SYMM= 0
##$S_DEV= 0
##$TDeff= 0
##$TDoff= 0
##$TI= <>
##$TILT= no
##$TM1= 0
##$TM2= 0
##$TOPLEV= 0
##$USERP1= <user>
##$USERP2= <user>
##$USERP3= <user>
##$USERP4= <user>
##$USERP5= <user>
##$WDW= 1
##$XDIM= 8192
##$YMAX_p= 0
##$YMIN_p= 0
$$ End of Bruker specific parameters
$$ ---------------------------------
##NTUPLES= NMR FID
##VAR_NAME=  TIME,          FID/REAL,        FID/IMAG
##SYMBOL=    X,             R,               I
##VAR_TYPE=  INDEPENDENT,   DEPENDENT,       DEPENDENT
##VAR_FORM=  AFFN,          ASDF,            ASDF
##VAR_DIM=   8192,          8192,            8192
##UNITS=     SECONDS,       ARBITRARY UNITS, ARBITRARY UNITS
##FACTOR=    0.0002768,     1,               1
##FIRST=     0,             0,               0
##LAST=      2.2672688,     0,               0
##MIN=       0,             -266368,         0
##MAX=       2.2672688,     213852,          0
$$ Real data points
##PAGE= N=1
##DATA TABLE= (X++(R..R)), XYDATA
$$ [...]
1869A8K68k63j41K84J95l09R7L68m4m31J82L76j68n65n1O94l24m50L2N61o12j89
1891d72N25J9m09n20N42L30m40j17N94J96p01L95N27m14l30L78L58k0n34K47L48
1912E02j8l88N9K36k24l13O3K74j70m30L55j07J19l80L1N30j57n41J99L23o1j20
1934b18k37O84P6j55m65N93pl73J04O18k76m06j12N73n9o64M47M15l97m91K92
1955e8mk95j27L98J56k13l97L62K07k74j51O65j38j79N6M25m1k76M5%M68l43j69
1978A17j0M4l11k4L39k72j53j61N42j18Lm20J72J69q8j82K51J81k28k13O04j6
2000B26n23K46K21O2j77j5O09l69r3j4J37n7m83K20M71k43o46M42J60n55l73O72
2022h2O6l70j0L61Rl55KN99j69l16l3N54k5k89n2N30k79j09J21N05l82J0k62J43
$$ plain form
1869 18 286 23 -118 166 361 52 149 517 473 42 224 600 432 -133 -184 510 186 -264 -232 329 -283 -472
1891 -472 53 72 -337 -857 -315 15 -425 -542 52 248 -453 -58 469 55 -275 103 461 441 -93 154 502
1912 502 484 96 155 391 167 -146 -83 191 21 -409 -54 -161 -42 -422 -391 139 -18 -559 -360 -37 -98 -218
1934 -218 -455 229 305 150 -315 278 271 -102 2 620 344 -62 -174 399 340 -324 123 538 141 -350 -58
1955 -58 -62 -357 -484 -86 70 -143 -540 -178 29 -245 -396 269 131 -48 8 433 392 116 161 161 629 286 117
1978 117 107 151 -160 -184 155 -117 -270 -431 111 -7 -4 -424 -252 -83 -171 -353 -102 79 -149 -362 242 226
2000 226 -297 -51 170 232 55 40 649 280 187 173 310 253 -230 -10 461 218 -428 14 174 -381 -754 -82
2022 -82 -16 -386 -396 -35 -26 -381 -379 220 51 -265 -298 256 231 -58 -110 420 141 32 153 658 276 286 24 167
2046A67n9j96J25o0o4Q7q4j29R0M2j65J00k73L53J46k44K38l5j71J60L01p5m10
2069a56L72R1m08J7N42j23k44p8L82j72n01J50M90n28k22M23J42m88k07O13j53
2090e8l49k54R64O5l70j21L23Jl39L10J15m9r8J19j5k62K08K12k16l38J63K00
2112B11m02M0j28J35k30K25J48l64n5K90J13k4k58N46k80j94N2N01j79l59K92
2133H0N51o20l2L39J56o28J62M13j89m79J29P93p31j34M5L11m57k18P08j68p84
2154g53N75L7J59n69L03M88l66l2J06L35l89K3K83J49l08K01j60M4p9J99L06o59
2176a07k4J64M6n62M09Op0k92L27K02n88P6M67j25k60J85K32j04m91O19J93n71
2198b68J71O37j00l45j82M63j12o13M40M54n61k27N49j69l64k8L40q6m81J87M56
$$ plain form
2046 167 108 -88 37 -23 -87 0 -84 -213 -123 -81 -246 -146 -419 -66 80 -164 74 39 -132 28 329 254 -156
2069 -156 216 307 -101 -84 458 335 91 13 395 223 -278 -128 362 -166 -388 35 177 -311 -518 95 -58
2090 -58 -407 -661 303 368 -2 -123 200 201 -138 172 287 238 140 259 244 -18 190 402 186 -152 11 211
2112 211 -191 -151 -279 -144 -374 -149 -1 -365 -420 -130 -17 -41 -299 247 -33 -227 -175 326 147 -212 80
2133 80 631 11 -21 318 474 -154 8 421 232 -247 -118 675 -56 -190 -145 166 -291 -509 199 31 -753
2154 -753 -178 -141 18 -551 -248 240 -126 -158 -52 283 -106 -83 200 349 41 242 82 126 47 246 552 -107
2176 -107 -131 33 79 -483 -74 -68 -138 -430 -103 99 -489 -413 54 -71 -331 -146 86 -18 -509 110 303 -268
2198 -268 -97 540 440 95 -87 376 264 -349 91 545 -16 -243 306 137 -227 -255 85 -1 -482 -295 161
2219A61n90R7N32k39j55O3K16m8j62O9M37k26j13J47N8j93j83L27K50m09l2P4
2241H1J5k01K92J69o86J95R0m6l86K41M27l66j19J35M77m84l29N64J56l46j03
2262b24N91k4k95k70O55l17k44J12K01j34k51K99J8k17j34L47j80l20J61K99j51
2283g8k67K07M1j64J61K36j70j27K64K35k2m37L06m8k04K34M8n2o0J09K53m44
2305B1m99N02K74o95Q5M04q9m69M55J61m11k45P45j72l58k10M91L29l70j4N34
2326D69k68j34O3O8p3j91K47J93l98o7K71m7k76K09K0j61r9J60j28j04J37J95
2348H6l1l22K15L31j43n26Q67l49k15J00L91l51R2m8K01n2k33J42M33p85O6M91
2370C60Jn97M5L53m04j75M34j62j43j91K53M61p24R2K58K51j01j68L39M1k34J20
$$ plain form
2219 161 -429 -332 200 -39 -194 -131 85 37 -125 -56 381 155 42 189 247 54 -129 198 448 39 7 81
2241 81 96 -105 187 356 -330 -135 -45 -91 -477 -236 191 -175 -294 -159 318 -166 -495 69 225 -121 -224
2262 -224 367 343 48 -222 433 116 -128 -16 185 51 -200 99 117 -100 -234 113 -67 -387 -226 73 -78
2283 -78 -345 -138 -97 -261 -100 136 -34 -161 103 338 316 -121 185 137 -67 167 215 163 103 212 465 21
2305 21 -478 24 298 -397 -312 92 3 -466 -11 150 -261 -506 239 67 -291 -501 -10 319 -51 -65 469
2326 469 201 67 130 198 125 -66 181 374 -24 -91 180 133 -143 66 86 -75 -174 -14 -142 -246 -109 86
2348 86 55 -267 -52 279 136 -390 477 128 -87 13 404 53 145 97 298 246 13 155 588 -197 -131 360
2370 360 361 -236 -191 162 -242 -417 17 -145 -288 -479 -226 235 -489 -397 -139 112 11 -157 182 223 -11 109
2392A09Q3j60q1m3L12k68K64pk04K05m38K0K49j14J45j84q1N8J69k64m7J79q5
2415a83k9n8L85r1k65N00k86J05j79J72J61p8pN4K95k52k66J78M5m05J48J67j17
2438fk43J8L00q0l78L54m3j00j88M33k7l20M28j20k3J07J51J72j76m09L47R2k04
2461H5j42K65kj06p1m9o4L03l41N0J87l1j72m7K29k27K36n47K60K67r0o5J47K2
2485I7k31L32j39O8j63J21J88j56K9k5K80n48K72O3n6l96L03Qj05J62l67J51Q7
2508b5k97j0L59k99J81R3rp7P4J05M3o5j31L21k3k12J78k11J40J5J9m01J82J24
2532G4k00J63q8n4k28J28j09o7J78%J47N6k17p6K05P5n9N5L8r8J29rJ64r8p8j39
2558a08L46j80j90K67P4j46j67M3r0K6j27K00k66M07k78K54j80R7M0q9k82N3O51
$$ plain form
2392 109 192 32 -49 -92 220 -48 216 209 5 210 -228 -208 41 -73 72 -112 -193 -135 34 -230 -277 -98 -183
2415 -183 -212 -270 115 24 -241 259 -27 78 -101 71 232 154 147 201 496 244 -22 156 201 -204 -56 111 -6
2438 -6 -249 -231 69 -11 -389 -35 -78 -178 -366 67 40 -280 148 28 5 112 263 435 259 -150 197 289 85
2461 85 -57 208 206 100 29 -20 -84 219 -122 -72 115 84 -88 -135 94 -133 103 -444 -184 83 -7 -72 75 97
2485 97 -134 198 59 127 -36 85 273 117 146 121 401 -147 125 188 132 -264 39 47 -58 104 -263 -112 -25
2508 -25 -322 -332 27 -272 -91 2 -7 -84 -10 95 138 73 -58 263 240 28 206 -5 135 150 169 -232 -50 74
2532 74 -126 37 -51 -105 -333 -205 -314 -381 -203 -203 -56 0 -217 -293 -88 -13 -72 -17 21 -77 52 43 207 109 31 -108
2558 -108 238 58 -132 135 209 63 -104 -61 -151 -125 -252 -52 -318 89 -189 65 -115 -18 22 -67 -349 -296 355
2581C55l65N9Q7J32l02Q2J18Q4k09QM62k02p7m32K54j33q0j30K28k20K44o2N5
2604d4k25L79q5j21j50K61k5R6j14L0J18j35J37N4J43j03j45O7l57K94J78k42
2626A1oJ17j66O8p4R8P7pl69K2L48j63J14j79P3j39J52n4R2J1pk1n5n7L29j02
2652A13K35k43q2lR4j45J25k41M00m03K2K71p1j19j8K36m16R9l9j95K46j32L05
2675C9l19J30J54J80j35P9k45J64J66j50J44R9k28K2L13m07j30J24J64l91K0J30
2697g7R9j1j51l1K94k04j2J27p8O1l73L20m0K60k06J35l5p8J47rl22M28j97J43
2721A90j80l1L1J6O8L8k03J09j53J30q3k08K73j94M8k6j49J89l2K77Q0k62%M00
2745C28m12R3k2k10L34j32K20o9j11pk66N56k24l38J14L30l34p4L11jj07j80N0
$$ plain form
2581 355 -10 49 136 268 -34 48 166 250 41 49 511 309 232 -200 54 -79 -159 -289 -61 -281 -37 -99 -44
2604 -44 -269 110 25 -96 -246 15 -10 86 -28 2 120 -15 122 176 319 216 71 138 -219 75 253 11
2626 11 5 122 -44 24 -50 48 125 118 -251 -229 119 -44 70 -109 -36 -175 -23 -77 15 26 19 -2 -57 -114 215 113
2652 113 348 105 23 20 114 -31 94 -147 253 -150 -128 143 72 -47 -65 171 -245 -146 -185 -380 -134 -266 39
2675 39 -280 -150 4 184 49 128 -117 47 213 63 207 306 78 100 413 6 -124 0 164 -227 -207 -77
2697 -77 22 11 -140 -171 123 -81 -93 34 -44 17 -356 -36 -76 184 -22 113 78 0 147 138 -184 244 47 190
2721 190 10 -21 10 26 94 132 -71 38 -115 15 -68 -276 -3 -197 -149 -175 -324 -135 -167 110 190 -72 -72 328
2745 328 -84 9 -13 -223 111 -21 199 130 19 12 -254 302 78 -260 -146 184 -150 -224 87 86 -21 -201 -151
2768a51K65j21J24k40k2j18K45K39l59RP0K70K5%N6j55m6n6l8q7L91l96L4J81
2792A20j86j47K98r0J12j57l0p4n6J59o5J05N4J07j63K45k58O1M0J45n6k12P5
2815B7K64m2k98j47M62k41p3R7J17j95j20J66Q6j83R0j37k00R6J14j31k5L38l50
2838b85K07J45p6kJ64j34p6J58j35L10k32K4kK37l16K41k22rJ51k14MJ05k71R7
2862a31J41J30L8n05K12J62j40p1J68K43j79j79K89p4j00k8m0J45J91k43Q7k03
2884h7n6L31m0l52J34j29K38r9oQj78L00k03J82r5n0k1j0J93j31j45L19j13Q6
2908G6p8J54R9n0j5k54L0N3j22K76j20q2o7j23K50j78Q6K24k43j8m8J70jP8l79
2933b82L70K4l85J56J17K01k24r2R9M3n0j49P3K95l13K75Q4j32m21L41j18L0j32
$$ plain form
2768 -151 114 -7 117 -123 -145 -263 -18 221 -138 -129 -59 211 236 236 292 137 91 35 -3 -90 301 -95 -61 120
2792 120 -66 -213 85 -5 107 -50 -80 -154 -210 -51 -116 -11 43 150 -13 232 -26 35 75 220 164 -48 27
2815 27 291 249 -49 -196 266 25 -48 49 166 -29 -149 17 103 -80 10 -127 -327 -231 -117 -248 -273 65 -285
2838 -285 -78 67 -9 -11 153 19 -57 101 -34 276 44 68 66 303 -13 228 6 -3 148 -66 -62 43 -228 -131
2862 -131 10 140 178 -327 -115 47 -93 -164 4 247 68 -111 178 104 4 -24 -64 81 272 29 116 -87
2884 -87 -143 188 148 -204 -70 -199 39 -60 -66 -58 -236 64 -139 43 -52 -102 -123 -133 60 -71 -216 103 -10 76
2908 76 -2 152 251 201 186 -68 -38 15 -107 169 49 -33 -100 -223 27 -151 -65 159 -84 -102 -150 20 19 97 -282
2933 -282 88 112 -273 -117 0 201 -23 -115 -16 27 -23 -172 -99 196 -117 158 242 110 -311 30 -88 -58 -190
2956a90J30K50o85N15m2M0j15j47K70L4k21n7P1J62Nk23K17o5j4J08Q6p3J4j5
2980E5k26M37k72J22n7J21k64Q8n9rm8n2J26qk0P3j36K26k15K5j6j1P7j18K44
3005H3k7P5k1L2l35P8J27K28j03j14j0j91J85j75J02J69o8k50K5L04k25j16J80
3028d7K7q2J82j24J09KO5j8N0M9k96J47j6Qk62M25l0r2N1k76R8J2L1m06J83J9
3054a91J36k03L52k8j72n5J26p2P0l19N04k16k5K16J1J8K7k49J93LR4k18j37L89
3078B54n36L23j28J27K41k47j70p0J87n7O5Lj06P3q2K53l59M35j21J00k8j86m5
3101g4J12Jj76K9J81k0K09l11k2j39J85J74q7k52o7J55J69j2j77O8N7j11J0j66
3125b64M6J11L25K05m35m7oK42J02l19j47K62J7J07o0J36k89J31k73M04Nj12k89
$$ plain form
2956 -190 -60 190 -495 20 -22 18 -97 -244 26 60 -161 -218 -147 15 20 -203 14 -51 -65 43 129 56 70 55
2980 55 -171 266 -6 116 59 180 -84 4 -55 -64 -112 -164 -38 -46 -66 7 -129 97 -118 -93 -109 -120 -43 -161 83
3005 83 56 131 110 142 -193 -115 12 240 137 23 13 -178 7 -168 -66 103 35 -215 -190 114 -111 -227 -47
3028 -47 -20 -102 80 -44 65 67 132 114 164 213 -83 64 48 56 -206 219 189 97 148 -128 -30 -18 13 -393 -210 -191
3054 -191 -55 -258 94 66 -106 -161 -35 -107 -37 -356 148 -68 -93 123 134 152 179 -70 123 126 220 2 -135 254
3078 254 -282 41 -87 40 281 34 -136 -206 -19 -76 -11 -8 -114 -41 -123 130 -229 206 85 185 157 -29 -74
3101 -74 38 39 -137 -108 73 53 262 -49 -71 -210 -25 149 62 -190 -257 -102 67 55 -122 -54 3 -108 -98 -264
3125 -264 -218 -107 218 423 -12 -59 -65 177 279 -40 -187 75 92 199 139 275 -14 117 -156 248 253 141 -148
3148a48n7J92j77J26K30k72q2K47r5k30K51K0j0k00K34j16RJ48O4n2m60M81M5
3171A48j52M28m02L0q5j74R6K4L31l41J50k74J4mK89m8J65k25P4j51J15k44M42
3194B06k23j09J94l6P9j16j94J38J48M6j18K19l58K34j4l7R7j50N2k02J46j21
3216a19o5k9M0PP4J60M4j26j15j70M19j06j29J74K0O6O1l68J52j3Rj01K38j85
3240f2l4oK27r6j50J31qj00r8J67Lm2K17k23K10j24j60J57kK31l09j21J43J88
3264A39M4q1j15K84l24J46R1k99L04l25J03R8M1O2k64J27O7k13j45R1L48m48J81
3287h8J07l14L84M8j51J98j28j11j8k25K39J94q8j11K26k04lj63M78k61nj65K14
3310E3K7p3L75m15J45m25N1L37j2k50J02J34j23K98j91Oj28K24m1p1j02J53J37
$$ plain form
3148 -148 -205 -13 -190 -64 166 -106 -188 59 -36 -266 -15 5 -5 -205 29 -87 -78 70 134 82 -378 103 148
3171 148 -4 424 22 52 -33 -207 -111 -87 244 -97 53 -221 -207 -211 78 30 195 -30 44 -107 8 -236 206
3194 206 -17 -126 68 32 111 -5 -199 -61 87 133 15 234 -124 110 96 59 156 6 58 -144 2 -119
3216 -119 -184 -213 -173 -166 -92 68 112 -14 -129 -299 120 14 -115 59 79 145 206 -162 -10 -23 -14 -115 123 -62
3240 -62 -96 -102 125 29 -121 10 2 -98 -196 -29 -26 -68 149 -74 136 12 -148 9 7 238 -71 -192 -49 139
3264 139 183 102 -13 271 -53 93 184 -115 189 -136 -33 65 106 168 -96 31 98 -115 -260 -169 179 -269 -88
3287 -88 19 -295 89 137 -14 184 56 -55 -73 -298 -59 135 47 -64 162 -42 -45 -208 270 9 4 -161 53
3310 53 80 7 382 -33 112 -313 -262 75 63 -187 -85 49 -74 224 33 39 -89 135 94 23 -79 74 211
3333B11m11R4J64j41P4o5J30j06Q3j05j37K01j57K91k7q9p5J95j35j32K41k63
3355a59J73M9r6K95n59L06K45k68J51l12J97m8r9Q4j05K24j17K23j71J3n3Q7j43
3378h3K89j29K16j81k44J27J53k81J80o4j06J10J38n6r6pO0k8Nj91J57K6l9k01
3402b45K03q2k9L75j87K47k50j38j01J99n5K48j17j01K34k61L4q3l4K48j16j55
3424a66M12l11j32K9L53j3m3J13k45o9P7K06j14k04J42J16j66l15K55J79j49N2
3446Go2o9j33M29j31r8K1q5J94J41r7O5l31L96m27P4K4M40j38k66L0k80M31j0
3470A25n1j67NJ70L3k23J7n4K26n4J9k59J52o0Q2j70M6J97N7N5l00J31J13p2J94
3495B12k52N6r5K66Lm27J18N0j44J68J2J88j43p3P1J17k80J96r7j97L05j27NL6
$$ plain form
3333 211 -200 -106 58 -83 -9 -74 56 -50 33 -72 -209 -8 -165 126 99 10 -65 130 -5 -137 104 -159
3355 -159 14 63 -33 262 -297 9 254 -14 137 -175 22 -26 -125 -41 -146 78 -39 184 13 26 -27 60 -83
3378 -83 206 77 293 112 -132 -5 148 -133 47 -17 -123 -13 125 69 -27 -34 26 -2 3 -188 -31 -5 -44 -245
3402 -245 -42 -124 -153 222 35 282 32 -106 -207 -8 -63 185 68 -33 201 -60 -26 -109 -143 105 -11 -166
3424 -166 246 -65 -197 -168 185 172 129 242 -3 -72 5 211 97 -107 35 151 -15 -330 -75 104 -45 7
3446 7 -55 -124 -257 172 41 -57 -36 -121 73 214 117 182 -149 247 -180 -106 -82 358 220 -46 -16 -296 135 125
3470 125 74 -93 -88 82 115 -108 -91 -145 81 27 46 -213 -61 -121 -39 -209 -163 34 91 146 -154 -23 90 18 212
3495 212 -40 16 -79 187 190 -237 -119 -69 -213 -45 -33 155 12 -61 10 127 -153 43 -54 -251 54 -73 -68 -32
3519c2k5N7J26n0M4j5j96J80j81J24j77J31J44j61j24O0M31l76j08QR6J19P0k48
3543a03K08j18qj92L55k43M39j04l19J74j21K60k27P7j68L0J34j4j04R4P0l54
3565b34K47O6j79j71M5O9l4J58J62o7j20O3j50m6K42N1J43l68K49j87l3K78l0
3588A54l21K93O3n6j69K84k10J16k23J28p9m5K82j43j22r0L8j39J52J18r6q4K0
3611a29K6J41n2j99K71j18L1J55j36J60J05j51L7j73j10m8J48K96m24M03m12R4
3633h5K30j23P7l42K66k62j26J95M9M8j20Q0J21J71j10j02M4Q3l7P4p5O6j10M
3657A6l5J85k54K51n7j38J80m5k40L46l49J39l6M3q4K6p7J54rj22L1J5k3PP4p6
3683g8L92k51p6K92l38k0J82p8Q2m8j53J81Rj76N6jn1J80j45j35L25j17o1J45
$$ plain form
3519 -32 -57 0 126 76 120 105 -91 89 -92 32 -145 -14 130 -31 -155 -95 336 -40 -148 -140 -44 75 145 -103
3543 -103 105 -13 -21 -213 142 -101 338 234 -85 89 -32 228 1 78 -90 -60 74 60 -44 50 120 -234
3565 -234 13 79 -100 -271 -226 -157 -191 -33 129 62 -58 5 -145 -191 51 102 245 -123 126 -61 -94 184 154
3588 154 -167 126 189 133 -36 248 38 154 -69 59 -20 -65 217 74 -48 -138 -100 -239 -87 31 -65 -149 -129
3611 -129 -103 38 -14 -213 58 -60 -29 126 -10 150 255 104 141 -32 -142 -190 -42 254 -170 233 -179 -85
3633 -85 145 22 99 -243 23 -239 -365 -170 -121 -73 -193 -113 8 179 69 -33 11 94 57 131 56 122 12 16
3657 16 -19 166 -88 163 106 -32 148 103 -137 209 -140 -1 -37 6 -78 -52 -129 25 16 -106 -75 -60 -83 -76 -2 -78
3683 -78 314 63 -13 279 -59 -79 103 25 107 59 -94 87 96 -80 -24 -25 -76 104 -41 -176 149 32 -29 116
3707A16j85L9J22j40k1J4K4J08k70L59j04q7j10oJ20M6l0Q1j64n0N5J25o2l8J65
3732A07j89J41K35l97R3k8l06M54q7rj29R6j2J11R2m9k21K48j42n7K43k31J38
3755A01k24p7O5m2M80k06K25m80J95m0Qk35J71j74R1J02p0%j96L72N3lj28k6J39
3780A01j29j99K75R6j63L7J0j48P6k2K13r0m6K4k88K77K07l89J05M37k93P7j60
3803HJ39L7m2m30K83N2K1k04K89M8k0j05j25o7p5K7K75m6O9j21L5j43R9J60l05
3828a41j23L18m7j06J32j45p2K92j48R6k26J8J65p3J75p0pJ70m01jL39j27N9k07
3852a30J20K38l60k3Q7K00P0j80k00K87q4JR3k18M9O4%k5J8j79j20J67J74n5J04
3877I8j01p2J55N2N7l69j5K77j55J87j87J39q1R0j93k8J30n9m2M8N7Q3j05J85
$$ plain form
3707 116 -69 -30 92 -48 -69 -55 -31 77 -193 166 62 -25 -135 -141 -21 25 -5 76 -88 -138 -83 42 -20 -58 107
3732 107 -82 59 294 -103 -10 -38 -344 110 23 14 -115 -19 -31 80 172 123 -98 150 8 -49 194 -37 101
3755 101 -123 -200 -135 -177 303 97 322 -158 37 -3 5 -230 -59 -233 -142 -40 -110 -110 -306 66 119 116 -12 -38 101
3780 101 -28 -227 48 144 -19 18 28 -120 -44 -66 147 57 11 35 -253 24 231 -158 -53 384 91 168 8
3803 8 147 184 142 -288 -5 47 68 -136 153 201 181 76 -49 -116 -191 -164 111 65 134 13 48 -95 4 164 -141
3828 -141 -264 54 7 -99 33 -112 -184 108 -40 56 -170 -152 13 -60 115 45 38 208 -193 -194 145 18 77 -130
3852 -130 -10 228 -132 -155 -68 132 202 22 -178 109 25 26 119 -99 -50 14 14 -11 7 -172 -292 -125 49 -6 98
3877 98 -3 -75 80 132 189 -180 -195 82 -73 114 -73 66 -15 75 -118 -146 -16 -75 -117 -69 -12 71 -34 151
3901A51j63j78J90P0k02J44j62j82K39q4N1L82k96j07Q8RJ47j65P7p6J55j63J80
3924A05j33k88L37o9J86L2o5l02M63l30L5J60k51J59j50K6N0O9M7lj68K13j88
3947f5J4l4R8J19o9k15m8R5j75L32M9j72k0K9L4k34QK65r3r1K68p0n7m6J19J43
3973A84k75K23qk47K74N0k66OK4N1j80J31J29Km4n2p2J29L3k89J44k0NO8j03j5
3999a18J22J53l65J66M2J39k47J71R8L8k17m5J42j48O6O1K7Kn9L9j85K69j56j12
4023a17Q2M5M3kk22P5J08j25Q6j78J10P3j72j8L46q1j56K48p9l56J48L76r5k15
4047g6P7O1Kq4J25k27K29k69K67o0k01L48k05MkO3j02K4n1J9K00j87OK94r9k91
4073a35K42j49P2n8Q1p6j3J25K2k0k73M33j73M0L7p7j61Rk7M3K37k66J12j48m4
$$ plain form
3901 151 -12 -190 0 70 -132 12 -150 -332 -93 -177 -126 256 -40 -147 -59 -50 97 -68 9 -67 88 -75 105
3924 105 -28 -316 21 -48 138 170 105 -197 266 -64 -29 131 -120 39 -111 -85 -35 34 81 78 -90 123 -65
3947 -65 -51 -85 13 132 63 -152 -200 -105 -280 52 101 -71 -91 -62 -28 -262 -254 11 -82 -173 95 25 -32 -78 41 184
3973 184 -91 132 124 -123 151 201 -65 -59 -35 16 -164 -33 96 98 54 2 -70 59 92 -197 -53 -73 -68 0 -103 -118
3999 -118 4 157 -208 -42 0 139 -108 63 161 199 -18 -63 79 -69 -3 58 85 87 28 67 -118 151 -5 -117
4023 -117 -35 10 53 51 -171 -96 12 -113 -27 -205 -95 -22 -194 -212 134 53 -103 145 66 -290 -142 234 139 -76
4047 -76 1 62 64 -20 105 -122 107 -162 105 45 -156 192 -13 -9 -11 52 -50 -26 -77 -58 142 -45 -39 255 156 -135
4073 -135 107 -42 30 -28 53 -23 -36 89 111 91 -182 251 78 118 155 78 -83 -74 -101 -58 179 -87 25 -123 -167
4098a67J90M3l8Q7j3k61K64o9L2J00k88J55j43K05p7J74m2l48K47p7K53l12K0
4121f5K21J78l00N2J41k50n5J95l08R2Q0R0J9j02j9J13J41q1j6N6l25K34K1J01
4145B13J83l64m0K32l97P7O7l7J13m44O08j32N4k80K58J57l21O5j09J05j21K01
4167H8j22l2j7K8Q1J10l13M7J05N3J42k11j64M65l41o4P2K9j77L3K12j80K38l24
4191b42L04n5k26K19JP1Pj29J93j12M5j07q0P3j92K91j55km4K73k90J77r0J55
4215H5j48Q1K9j45J89r8m3q4J42L4k93J20M58l78K39j61o9j83M54k41J80k11M9
4238FP2n0r8J10l2L24n8k32J02j66K70k62j03pJ25j93M3J68R5j46M3J8P1k56J76
4263B0j31R2O3n2n7l7L63l75L68k33k1m3j57J11p6p9L74k78J50l11K47L6K79j81
$$ plain form
4098 -167 23 66 28 115 102 -159 105 36 68 168 -120 35 -108 97 20 194 152 -196 51 -26 227 -85 -65
4121 -65 156 334 34 86 227 -23 -78 117 -191 -99 -19 71 90 -12 -31 82 223 142 126 182 -143 91 112 213
4145 213 396 32 -8 224 -173 -96 -29 -66 47 -397 211 79 133 -147 111 268 -53 12 -97 8 -113 88
4167 88 -34 -66 -83 -55 26 136 -177 -130 -25 28 170 -41 -205 260 -81 -145 -73 -44 -221 -188 24 -156 82 -242
4191 -242 62 7 -219 0 1 72 79 -50 143 31 76 -31 -111 -38 -230 61 -94 -96 -140 133 -157 20 -70 85
4215 85 -63 18 47 -98 91 -7 -50 -134 8 42 -251 -131 327 -51 188 27 -42 -225 229 -12 168 -43 6
4238 6 78 28 -70 40 8 332 274 42 144 -22 248 -14 -117 -124 1 -192 -149 19 114 -32 11 29 100 -156 20
4263 20 -111 -19 44 -8 -65 -102 261 -114 254 21 0 -43 -200 -89 -165 -244 130 -148 2 -309 -62 -26 253 72
4287G2k65J54p4J12Mj40K9J60l4kK09m96K73p9K3J17j5j9j33J72j17K07j64j20
4311a26K84k36l1Q6L8L0n4n2K56k55jL05k64j24K56k60K94N3k9k0k40J44nj49
4335a00lJ16o0M6oJ45j79J22n9j58R6J22j17J4J83j92L9k7M6q9j26K02k94L28
4359D9j31J45J61l99J36K56k79m8K62k30p4K00J70j32k68K87q0R5Q2o21L81J64
4381A26k63L00k94K36j03m4j32R9J24K21l11n0J2Q8o0j5J22m0j37J29J32j30J29
4404A39j40N2N8j47J27j53MK36j75j07L17k16K34k17J8l25J05J87J39l18J91M8
4426E7r4l0R8J13k14J5J80o7k05L29l21j34L00ql6LK18k98J9j45L71k01K15j13
4450E2K87j58k93K8J1J31j29N7r6l0q8L79k22J50Q3j13M6n7j22J84k85L24k60
$$ plain form
4287 72 -193 -39 -113 -1 3 -137 -108 52 18 16 225 -271 2 -77 -54 63 48 29 -104 68 -49 158 -6 -126
4311 -126 158 -78 -109 -23 15 45 -9 -61 195 -60 -61 244 -20 -144 112 -148 146 199 170 150 -90 54 49 -100
4335 -100 -103 13 -47 -1 -7 138 -41 81 22 -136 -40 82 -35 -21 162 -30 9 -18 28 -61 -187 15 -279 49
4359 49 -82 63 224 -175 -39 217 -62 -110 152 -78 -152 48 218 86 -182 105 25 120 202 -419 -38 126
4381 126 -137 163 -131 105 2 -42 -174 -75 49 270 -41 -91 -79 9 -51 -66 56 16 -121 8 140 10 139
4404 139 -1 51 109 -38 89 -64 -60 176 1 -106 211 -5 229 12 30 -295 -190 -3 136 -182 9 57
4426 57 -37 -67 31 144 -70 -55 125 58 -147 182 -139 -273 27 19 -17 -14 204 -94 -75 -220 151 -50 165 52
4450 52 339 181 -112 -84 -73 58 -71 -14 -110 -140 -228 151 -71 79 162 49 95 38 -84 100 -185 139 -121
4473a21J72K6K5R1j19j70L1j68M22k98M0qJ58l0k32J58K28j79j88O4j06K00L7
4496C3q4J15o9Q0j66P1Q5j50j62K80l8o3l7J03J21m75M36k3j83J93M3q0J05k15
4520h0j88K74Oj43O8K44m6j28L79m19L8M4k17J91l2P7M8J03k64N3J58k75M7n8
4544a20K53k55R9J59k87o4J41K1m8K44J43m13J14j13K32k9K1p6o4Q3k51J60k62
4567c12K63qp3L25k37J2K72j32j06j28J20J10K8k14k8o8M38k60J18j52J90m18
4589b60K86m6J59r5q4j02R8J18k96K23j38K36P5j91P0L79m34j35L44n56K13M37
4611C01k75J24o7K9r2l58L42j03J2J16J32j26l9R6oj94J7n6K40k74K71l49J31
4634a28K77J46l36R3J9k11J1J82j48j24K11p9K05R9j58kmk73J97Q5j3K18j97J11
$$ plain form
4473 -121 51 77 102 193 74 -96 -65 -233 189 -109 -69 -77 81 51 -181 -23 205 26 -162 -98 -204 -4 33
4496 33 -51 64 -5 75 -91 -20 65 -85 -247 33 -5 -68 -105 -2 119 -356 80 57 -126 67 110 30 135 -80
4520 -80 -268 6 12 -131 -63 181 135 7 386 -33 5 49 -168 23 -9 68 116 219 -45 8 166 -109 -62 -120
4544 -120 133 -122 -23 136 -151 -215 -74 -53 -101 143 286 -127 -13 -126 106 77 98 22 -42 41 -210 -50 -312
4567 -312 -49 -57 -130 195 -42 -30 242 110 4 -124 -4 106 134 -80 -108 -176 262 2 120 -32 158 -260
4589 -260 26 -20 139 44 -40 -142 -44 74 -222 1 -137 99 174 -17 53 432 -2 -137 207 -349 -136 301
4611 301 26 150 83 112 20 -338 4 -99 -87 29 161 35 -4 92 86 -108 -91 -147 93 -181 90 -259 -128
4634 -128 149 295 -41 52 71 -140 -129 53 -95 -219 -8 -87 118 217 59 57 53 -220 -23 62 49 267 70 181
4658A81q6l04K99j05j12K65k47J00M3J31j32j18J2R3L4j20L8k84M83k04j12k8
4680a73L18j45l6Q3j15k8J74r1K4k85K67J07q2M7l60K93r8n9J12K80j35k15K69
4703A52k16nK47k24M6j39m6J67n4L9P7o7J87j84Q7R7l76K90K80l71L2j0k9K59
4727B39k62O3j38J3q0P9J62k7k24K49R2k76N7j29L04k10L17m07J77j37k2J3j10
4750b57M21l75J76%K53Q0l38j07r5L53j69J73k04J38k60K86j07N0K06m33M63k03
4772E1l54L25m5r9J47jJ9k36K96j80J92p8P8m15J74rJ82Q6r9J02j1m0r9Q2k10
4797a42K41j09j10j82K71l20L01J18j1K8K5j63jj39K81j27J43k72L0J13j59J91
4819Gk03K38k2p6l8j05K73KJj60J00R7j28l24K20K1J32j12K59l3j8k71L59p9j56
$$ plain form
4658 181 95 -209 90 -15 -127 138 -109 -9 34 165 33 -85 -73 20 54 -66 -28 -312 171 -33 -145 -173
4680 -173 145 0 -36 47 -68 -96 78 -13 11 -274 -7 100 18 65 -295 -2 -100 -159 -47 233 98 -117 152
4703 152 -64 -69 178 -46 0 -139 -185 -18 -72 -33 44 -23 164 -20 67 164 -212 78 358 -13 19 9 -20 239
4727 239 -23 40 -98 -85 -165 -86 76 49 -175 74 166 -110 -53 -182 122 -88 229 -178 -1 -138 -160 -147 -257
4750 -257 164 -211 -35 -35 218 298 -40 -147 -242 111 -58 115 -89 49 -211 75 -32 18 224 -209 254 51
4772 51 -303 22 -23 -122 25 24 43 -193 103 -77 115 37 115 -300 -126 -135 47 133 34 136 125 85 -14 68 -142
4797 -142 99 -10 -120 -302 -31 -351 -50 68 57 85 110 -53 -54 -193 88 -39 104 -168 -138 -25 -184 7
4819 7 -196 42 20 -56 -94 -199 74 76 77 -83 17 114 -14 -338 -118 -97 35 -77 182 149 131 -140 219 140 -16
4844a6J5O3j0o4O2n5Q6j67J26l2L9j06q1L17k79k5L19k49j12K88p7l4q6N9NqM8
4871B6j67J52j41K74m06K48k14K05J6K2j12K94Kj38P1j48p0p8L33j91J20n2R9
4894A45k05P1L10k98k59K48l2Jk0R2M5K3j96j87J61L02K05l29K8j64Q5r8K05q7
4918D6qL2J5j67J61l00L85m0m12J72j80M13L5P7l10l3K20k06K16k50J92j41J08
4941B5Q5l63M3L81Jk82O2J54j8k00J26l0P0m2j7k0M0n1J74j29m6N2Rl9j02K4L17
4968B24q7k34p9J40K61l51mNJ01J27R2n2j03m8mJ18j70K6J7J64r7Kl52M41J63
4993C00m19j7Q3J26pj35l8r8K93n8M3J3K08n03K92Q2j40N2q9o2K15r7M0Q4j08
5018F0r3k1P1J25j46j63J23O1j55K33J23j53q2L2j9Q8KM5N8j98n6J55k71L35%
$$ plain form
4844 -16 -1 62 52 -12 50 -5 81 -86 40 8 47 -59 -140 177 -102 -127 192 -57 -169 119 42 8 -78 -19 -14 -22 26
4871 26 -141 11 -130 144 -262 -14 -228 -23 -7 15 -97 197 199 61 132 -16 -86 -164 169 -22 98 46 145
4894 145 -60 11 321 23 -236 12 -20 -19 -39 53 98 121 -75 -262 -101 201 406 77 105 -59 26 -72 133 46
4918 46 38 70 85 -82 79 -221 164 124 -288 -116 -296 117 152 229 -81 -114 106 -100 116 -134 58 -83 25
4941 25 110 -253 -210 171 172 -110 -48 106 88 -112 14 -16 54 12 -5 -25 15 -36 138 9 -37 15 24 -15 -117 -93 224
4968 224 137 -97 -176 -36 225 -126 -130 -125 -24 103 195 143 40 -8 -12 106 -64 -38 -21 143 46 48 -304 137 300
4993 300 -119 -136 -53 73 66 -69 -107 -205 88 30 73 86 294 -209 83 165 25 77 -12 -74 141 44 84 168 60
5018 60 -33 -54 17 142 -4 -167 -44 17 -138 95 218 65 -17 15 -4 84 86 131 189 -9 -65 90 -181 154 154
5043A54m33M47l14J13j28K44K8J7k42J87J7k9P5j37K02j86J51r3J14k74L0J31
5065G4J89m84J01KO6K52q6k62K21j21J92k4m04K10J22m4O3j89M38j30l02K67p1
5088H0j83q5J03J35M4j98j34K15J05J53k37j8q7J21r9p3N6nJ44K9j66j4J28P7
5112I1K7k60J41L7j07N8j21K56k63K38j60K59k47j07K20p4J51j09j06N5nm1K85
5135B18j15m3k72L76ol67K21Rk10K15J69L4l83K38k97J43j7j41L51K7Mk53J17
5158A8J26j5j17L02l60J32m2K8j59P5J35r9q2L3J9K40j07k38J8J18J17l91L45
5181I6j11O1J62k90M1J62l7l41M12j58J7K13Jk3j26q2p3J09K1j37J58j45K0J13
5205F3J14l03Q7o5K22k17J01J80M0j57m6k95K48J93P7l35J04J48q6rk52J37J80
$$ plain form
5043 154 -279 168 -146 -33 -161 83 111 128 -114 73 90 61 136 -1 201 15 166 73 187 -87 -57 74
5065 74 263 -221 -120 -118 -52 200 114 -148 73 -48 144 120 -284 -74 48 4 67 -122 316 186 -116 151 80
5088 80 -103 -188 -85 50 94 -104 -238 -23 82 235 -2 -20 -107 14 -85 -158 -102 -107 37 66 -100 -114 14 91
5112 91 118 -142 -1 36 -71 -13 -134 122 -141 97 -63 196 -51 -158 62 -12 139 30 -76 -21 -26 -67 218
5135 218 103 60 -212 164 158 -209 12 21 -189 26 195 229 -154 84 -213 -70 -87 -228 123 150 154 -99 18
5158 18 144 129 12 314 -46 86 44 72 -87 -12 123 24 -58 -25 -6 234 127 -111 -93 25 142 -249 96
5181 96 -15 46 208 -82 -41 121 84 -257 155 -3 14 227 228 205 79 -3 -76 33 54 -83 75 -70 -50 63
5205 63 177 -126 -39 -104 118 -99 2 182 222 65 19 -276 -28 165 242 -93 11 159 73 64 -188 -51 129
5228A29l56L50o5j08j19K4K97k28J59m4l09M20q6o3q9P2k7J55M9m3j19j43P5J16
5252D7N9N4m00J43R1K2n3l0o8J81j97J34J47O5j92J00k09Q1O9r4K03l02J84k05
5276a70K99j13Ql0J59j50M0k3j07N7P5K0L1j01Mk1j54K99j65J35J89j58k48j20
5300b44K77j47k09L40j0l3N7l9j40O1K90j55j81J11j03K2m1J01n3R8j66J19l8
5323h3MJ88j12N1j76N4R0K3k2r1J22k71J10Q3no0J0M8NJ25j89L06j97m3j7P4K32
5350B59j81O6l7j89J47r0m6O9o7L9p9J01Q6p5K3j17k07K70kj07M12q9l10O5J4
5375d5J87J59l75O0r6l5J95n0q3J04p6J01l2J1J65M9n8m41N19m97K17j29J85k79
5399b44O6j05L30j68J88j19R0jP4m73M36r9L7j34J26K02m36J64Q2K5j26K83j74
$$ plain form
5228 129 -227 123 58 -50 -169 -145 152 -76 83 39 -270 150 64 1 -88 -16 -43 112 161 118 -1 -144 -69 47
5252 47 106 160 -240 -97 -6 16 -37 -67 -135 46 -151 -17 130 195 3 103 -106 -25 44 -50 153 -149 35 -170
5276 -170 129 16 24 -6 153 3 43 20 -87 -30 45 65 96 -5 -1 -22 -176 123 -42 93 282 124 -124 -244
5300 -244 33 -114 -323 17 7 -26 31 -8 -148 -87 203 48 -133 -22 -125 -103 -144 -43 -96 2 -164 -45 -83
5323 -83 -79 109 -3 48 -128 -74 16 39 17 -74 48 -223 -113 -30 -35 -95 -85 -37 -32 93 -96 210 13 -30 -47 27 259
5350 259 78 144 107 -82 65 -25 -71 -2 -69 -30 -109 -8 78 3 26 -91 -298 -28 -30 -137 275 186 -124 -59 -45
5375 -45 142 301 -74 -14 -110 -145 50 0 -83 21 -55 46 14 25 190 239 181 -260 259 -238 -21 -150 35 -244
5399 -244 -178 -283 47 -121 67 -52 38 37 111 -362 74 -25 12 -122 4 206 -230 -66 16 41 -85 198 24
5422B4j26K47k14k7R3l03O80l63k1Q2j53K8J46j38M9J50q6m6o7J88l2l53J64m5
5446a23J52k12L73n6k23K06L3j11l60K66K21k13L3q7O2J82k66P3K42j17m7l4k13
5469b19NK30j05J03J04j82Q5l01K47K15l64R3p4oJ47L5R3J32m57J98n4K45p2O0
5493A58k76K41j92l0p7L13k11J72o5n2j5p6J16k5P0j23p2J07K7O2J06k08K3Pm0
5518f0nJ37j85J00j42M16l71M30k19Rl45K58J21q6p1jK09k87n7J45J4j7J6m9K80
5543B40j17Nm5k32j03L41j49L8k8K54j73j86J24Lk52K82J3K0r5R7l32K28K24l47
5567a90L11k68J24k69J75L85j77j22K72j01j41k0JJ2o9J9n6K1L65l59L14k46P
5590a2l19L07P7j29L04l08J42j20j01K93j90o0j0j04K62q0r2R0J07j73j77K42
$$ plain form
5422 24 -102 145 -69 -96 -3 -306 374 11 -10 72 -81 -53 93 -45 4 154 68 22 -45 143 111 -242 -78 -123
5446 -123 29 -183 190 134 -89 117 150 39 -321 -55 166 -47 -14 -101 -39 143 -123 -50 192 75 28 -6 -219
5469 -219 -214 16 -89 14 118 -64 21 -280 -33 182 -182 -89 -163 -169 -22 13 106 238 -219 -21 -75 170 98 158
5493 158 -118 123 -69 -99 -176 137 -74 98 33 -19 -34 -110 6 -19 51 -72 -144 -37 -10 52 158 -50 -27 -20 -60
5518 -60 -65 72 -113 -13 -155 261 -110 320 101 110 -235 23 144 58 -13 -14 195 -92 -149 -4 10 -7 9 -40 240
5543 240 123 128 83 -149 -252 89 -60 -22 -50 204 31 -155 -31 -28 -280 2 15 35 -60 37 -295 -67 157 -190
5567 -190 121 -147 -23 -292 -117 268 91 -31 241 140 -1 -21 -20 -8 -77 -58 -114 -93 272 -87 227 -19 -12
5590 -12 -331 -24 53 -76 228 -80 62 -58 -159 134 -56 -116 -126 -230 32 -48 -140 -50 57 -116 -293 -51
5612e1N3L4j82L07j7k67m7P9j4J42q7k57L59M6j87O4K97m70M4J21J64o7J65j58
5636G1j0j20j05K32j48M77m77J51k76M5N0N3L11j82k07P3J23K8J19j85LR3k97
5659a78K39K06k32N0L6J90l46J69j50J2L4j07J95k8k63J56J94P6l87j4K51j75
5681g2q3K63q8k37L30J98j40j10J48j30K61n12L1K74l5j21p4J52l3j01Q0J30o
5704A25k97M6L8Q6l5j21j56K48L5j04p2K68J95Lj76k9K08r7j65k5k03J05N4J00
5728C1j8k8k44K62J19p2J51m00R7J11N9J37k66k97L11J66j34k4R8J9k07k9o3L63
5752A42l8K6j20O6J11j70j16j8R8L2l9Pj20o8L30k0m8j35k4Q8q8J14J64j25k10
5777a61j46K22L12j86k16K20n3j29P0m9K85j96J69k54LoQ2o7P5K79n45k1L07j7
$$ plain form
5612 -51 2 36 -146 161 144 -123 -170 -91 -105 37 -50 -307 52 98 -89 -25 272 -198 -154 -33 131 64 229 71
5636 71 61 -59 -164 68 -80 397 -80 71 -205 -160 -110 -57 254 72 -135 -62 61 89 208 23 26 119 -178
5659 -178 61 267 35 85 121 311 -35 134 -16 -4 30 -77 118 90 -173 -17 177 253 -134 -148 103 -72
5681 -72 -155 108 20 -217 113 311 171 61 209 79 340 -172 -141 133 98 -23 -97 55 22 -79 1 131 125
5704 125 -172 -126 -88 -2 -37 -158 -314 -66 -31 -135 -207 61 256 259 83 54 262 165 0 -25 -228 -123 -69 31
5728 31 13 -15 -259 3 122 50 201 -199 -102 9 68 205 -61 -358 -47 119 -15 -39 59 78 -129 -158 -221 142
5752 142 104 130 10 76 187 17 -99 -117 -19 13 -26 -19 -139 -207 123 103 55 -80 -104 -16 -104 10 174 49 -161
5777 -161 -307 -85 227 41 -175 45 -8 -137 -67 -116 169 -27 142 -112 -109 -115 -33 -100 -25 254 -291 -312 -5 -22
5801b2l63K22K07K47l64P2o3J13M8j07J49k64J38j18P0L6k68J98R0p9j42J69o6
5824i7L0K58l4k49J52J73m17l0L05R0j80Q5j2p2P4j51o4J14r2J53Mk28K33j16
5848g1M3o4J68J4K0j55J8n1k8J71j87L0K3J85k73N2J28J62l20J70J43o3j87J62
5872I0k78M28j36j75K18l30R1Q9R4j05j5Q0j80J79ml13N44l61K71N0j23q0o2K44
5896B16o2J91k56O6m17M55p1l8qk78K45J70k75J17j31k89M90J0kk45J0K48j24
5919B2n8n2j58K94m4j4pJ77Q8k87L52k50j97J25k20N35k87J0J7j40j58J66J75
5942H9n4K5j65J36m9k4L2J35o5j87j3Q0R6j84J00n8l2J37l5J38j23J94l98L52
5966A27K06m39J05p7R8j9J0ml9Q0M6lM3J0l19K20q1J07q8R4K64l04L44m53j90
$$ plain form
5801 -22 -385 -163 44 291 -73 -1 -64 49 97 -10 139 -125 13 -105 -35 1 -267 -69 21 -58 -200 -31 -97
5824 -97 -67 191 157 -92 60 233 -184 -214 91 181 1 86 74 2 76 -75 -139 -25 -117 36 40 -188 45 -71
5848 -71 -28 -92 76 90 110 -45 -27 -78 -106 65 -122 -92 -69 116 -157 -105 23 185 -135 35 178 115 -72 90
5872 90 -188 240 104 -71 147 -183 -92 -3 91 -14 -29 51 -129 50 46 -267 277 -84 187 237 114 34 -28 216
5896 216 154 345 89 155 -262 193 122 84 76 -202 43 213 -62 55 -76 -365 125 135 133 -112 -102 146 22
5919 22 -36 -88 -246 48 4 -10 -17 160 248 -39 313 63 -134 -9 -229 306 19 29 46 -94 -252 -86 89
5942 89 35 60 -105 31 -18 -42 -10 125 60 -127 -140 -60 36 -148 -48 -106 -138 -1 -36 102 -21 173 -225 127
5966 127 333 -106 -1 -78 20 1 11 7 -32 48 94 91 134 144 -175 45 -36 71 -17 77 341 37 381 -72 -262
5991b62L36o3K20l91J30J5k5J11Q4p7n6o9r8P7N0j24K02j99L05o4k6k3Q3J32l23
6016e5l7K70l01k7K46k11J86p7J2j5L03l39j65K13j19J97o1q3N3j36K6J16m3K06
6040A59j69K89j20k25Q4q6l2J00O6K7j64J62j55q6K23j43J90r1k16J93%j37P4
6063e7J88l7k65p8N38k96k0J12j77N6J46nK24p1j58j02K54k54K1R8k1j90N9L3
6087bk6O4J6r9j4m5o9K04o9J35p2L4j93J22Q6l49J89J77K3k98K60k85K31j72J20
6112c2K06L1j28Pl0p8K06k2m59J56J84j91L00k68K78q9P3j35m3M6k91L35O0j62
6136d6J17q9J37k86K43R4p8J7o5m6J45P0k26K7J08k29o0L37k02M0l2J0r5j39M50
6161B02n03J15KJ29J00j05N9L07l68O7K05m25M21j32q0j64K33J01k61j30K86J1
$$ plain form
5991 -262 74 11 231 -160 -30 -15 -40 71 155 78 22 -47 -145 -68 -18 -142 60 -139 166 102 76 53 136 268 -55
6016 -55 -92 178 -123 -150 96 -115 71 -6 6 -9 294 -45 -210 3 -116 81 20 -63 -10 -146 -120 -4 -47 159
6040 159 -10 279 159 -66 18 -68 -100 0 66 93 -71 91 -64 -150 73 -70 120 29 -187 6 6 -131 -57
6063 -57 131 94 -171 -249 289 -7 -27 85 -92 -36 110 105 329 258 100 -2 252 -2 19 117 96 -94 -35 -2
6087 -2 -28 36 52 -47 -61 -106 -175 29 -40 95 23 57 -136 -14 72 -277 -88 89 112 -186 74 -211 20 -152 -32
6112 -32 174 205 77 84 54 -24 182 160 -299 -143 41 -150 150 -118 160 71 144 9 -34 12 -279 56 116 -46
6136 -46 71 -18 119 -167 76 170 92 109 44 -2 143 213 -13 14 122 -107 -167 170 -32 8 -24 -14 -109 -248 202
6161 202 -301 -186 -184 -55 45 -60 -1 306 -62 5 210 -215 206 74 -6 -170 63 164 -97 -227 59 70
6183G0M4J10l52K81j56Mj4L14l08oR0q2k24K42J29o2J52k43j22O7K53j61k0j41
6207a35j3p0L24l9n2J2m2K5q7J28J71m7m3R8l12j89L37Qj61J58j53j22N4K98n0
6232I8p7J4M7m17K54nj07J59J35P4j34O4k10K50P7j65L1j99J17R8j87j19J38j60
6256b24M06J6m94M51j69l4m1K83k82l2j4J1K54jj08L2j02k6l2J84l5j05R2k07
6280a77J51O1O0j28j44J70%j7J23j3j55N4J45j92k50L81j61L2k8O1l8lK65j94
6304CJ74o8j33j2R8j18J90n3o2m3L10l94L19j89j37K28j38r0J17oL4K98l66j6
6328e4q5L7LK56j78l42R4J96J13j70J70R8j41M9o1J80j47L2o5J49j82Q6p6K62
6352B24n6k98J69K7j3l14M56k69n4J09M2Q1l64L13j47K02j46J09P4K1k60K89k94
$$ plain form
6183 70 114 224 -128 153 -3 1 -13 301 -7 -13 77 -5 -229 13 142 80 232 -11 -133 -66 187 26 6 -135
6207 -135 -148 -218 106 67 15 27 -15 10 -77 51 222 175 132 230 -82 -271 66 74 -87 71 -82 -204 -150 148 98
6232 98 21 35 82 -335 -81 -86 -193 -34 101 175 41 105 -105 145 222 57 88 -111 6 104 -83 -202 -64 -224
6256 -224 182 198 -296 155 -14 -48 -89 194 -88 -120 -134 -123 131 130 22 54 -48 -74 -106 78 43 -62 30 -177
6280 -177 -26 35 95 -33 -177 -7 -7 -24 99 86 -69 -15 130 -62 -312 69 -92 -60 -88 -27 -65 -68 197 3
6304 3 177 109 -24 -36 62 -56 134 81 19 -24 286 -108 211 22 -115 113 -25 -115 2 -4 30 328 -38 -54
6328 -54 -139 -102 -99 157 -21 -363 -269 -73 40 -130 40 138 -3 46 -15 165 18 50 -15 134 -48 38 -38 224
6352 224 168 -130 39 66 53 -261 195 -74 -128 -19 23 104 -260 53 -94 108 -38 71 145 166 -94 195 -99
6375i9L11k9l10L59l17P2j18K86j17j30l5L67k05M0k57J88k1k43K28L9N0P2j43
6398a2J06o1m5J53j38o1j81M03j71M59k07j22q3j4k1q3K20j06p9J40J4j49rj25
6422a72K22J88m2k9j73k2q0L32j60l08N8K88j77M5L02j25k72J16K27j10p0J53
6444A91k28o4J29k12J19Lj14K76J3Q5j81j8l7n6l9J09J12k69L00j15q5J22R4k5
6468A10j00M9j3KM1j65J50N7l5O5m1n0P8Jr3r9n7n5L14k04j45J33p9j10K63P2
6494H9l9K3p2M6k46L17l24K83o8p9J09rj07P6n9L57j63J1k41l6n9K60N2j51q2
6519a12J20J47k88K31r6j78K7J43j31j52K06l8O7L4j15K87k65O2k43K78J96l55
6541a75Q4k07K59J18j62M9o1R3n8Q6PJ29k90J74l54M63k56J02K46l2k20j5m8o5
$$ plain form
6375 -99 212 183 -127 232 -85 -13 -131 155 38 -92 -127 240 35 75 -182 6 -15 -258 -30 9 59 131 -12
6398 -12 94 33 -12 141 3 -58 -239 164 -7 452 245 123 40 26 5 -78 142 36 -43 97 111 -38 -47 -172
6422 -172 50 238 196 167 -6 -28 -108 224 64 -244 -186 102 -75 -30 272 147 -125 -9 218 108 38 191
6444 191 -37 -101 28 -184 -65 -62 -176 100 113 198 17 -1 -38 -94 -133 -24 88 -181 119 4 -81 41 135 110
6468 110 10 59 46 48 89 -76 74 131 96 161 120 70 148 149 56 -43 -100 -155 159 -45 -190 -57 -136 -246 17 89
6494 89 50 73 1 47 -199 118 -206 77 9 -70 39 30 -77 -1 -60 297 134 145 -96 -132 -191 69 121 -30 -112
6519 -112 8 155 -133 98 2 -176 -149 -6 -137 -289 -83 -121 -54 -20 -135 152 -113 -51 -294 -16 180 -175
6541 -175 -91 -298 -39 79 -83 -34 -95 -2 -60 26 33 162 -128 46 -308 155 -101 1 247 215 -5 -20 -68 -133
6565a33L29m98M76k48J26K2q1m2K24l22K65k05Q8J66j87j3J59j5n8J22j17j19
6587f1L48l69J59j12j47J45P0J29j23J01l42K38o1r2K46j35J34l02L57j39j04
6608f0K3J01o2J38l46K66RJ18k96J0K39j56j01K56n6L7j65l44N03m4p4k7K01j65
6632Ej67L20P1m31L36r5J02k22K01kj65PL46l00p9J70J3r4N7j58rJ49OL1k54K38
6658G6j55K66k10j04K6J38Kk00R7j1j22J77k8L16m54Q1jO0J31l6q3k0K60j31k69
6683a94L88j66j48K7k12J28J02j7J15L4j77K78o3J54j92k46J24R9L8j61K34j50
6705eJ31k12j37K02N9k7K63k24j40J04j38L20p8j59j00K29K9q8J54n2P4k25k44
6728b64K10q7K40j31J05l99N87j65j45J86O0k79l0j23M84k76K98m15J7K92j87
$$ plain form
6565 -133 196 -302 174 -74 52 74 -7 -49 175 -147 118 -87 1 167 -20 -33 126 111 53 175 58 -61
6587 -61 287 -82 77 -35 -182 -37 33 162 39 140 -202 36 -25 -117 129 -6 128 -174 183 44 -60
6608 -60 -37 64 2 140 -206 60 69 187 -109 -99 140 -16 -117 139 83 120 -45 -389 114 70 -4 -31 170 5
6632 5 -162 158 229 -202 134 39 141 -81 120 118 -47 -40 306 6 -73 97 110 16 73 -85 -94 55 61 92 -162 76
6658 76 -79 187 -23 -127 -101 37 39 -161 -64 -75 -197 -20 -48 268 -186 -105 -106 -46 85 49 -34 -54 206 75 -194
6683 -194 194 28 -120 -93 -305 -177 -75 -92 23 57 -120 158 95 249 57 -189 -65 34 72 -89 145 -5
6705 -5 126 -86 -223 -21 38 11 274 50 -90 14 -124 196 118 -41 -141 88 117 29 183 131 205 -20 -264
6728 -264 -54 -141 99 -32 73 -326 261 96 -49 137 197 -82 -112 -235 249 -27 271 -144 -127 165 -22
6749b2J26k50L02Nj37J23n4k12N3L6l7NJ6J97n23K35J40mJ7R2o4J2p1l47L66m6
6775d2j31R3K41mn7kj84J22m5l6n7k2J73M2l60K09J48j30n1m9n0K73k04K0k7j5
6801a45J39N5q3J63l62L61Rq3j84j77L9L90Ml31K13J68m0k12J0j27O7L16k77k1
6825a08P1J06l57K70k72M9L19k36Q7K09k7l15L69k06J32mJ43m48R2K06r4j15M6
6848h3M9K28j72J37r6LP0j45N1j38J55O0m39M49J3m42J78R4Q7l51L46j05O3q1
6872f9rj7nQ9M4K8j42M6K11Ml83L34k23J00J18j35j16K57p9J7k97J48P5K5NK74
6898C00k18k01J00N0M5J3j09L3J4j14J50K56l91J68O9m22J82k6Q8k8J72l49K07
6921a1r2K12J56k00j25M2J10j0N5l07K43K9j49NO7p4J88q6N9O8j84J39k32L76
$$ plain form
6749 -22 104 -146 156 161 24 147 93 -119 -66 -30 -67 -62 -46 151 -372 -137 3 -1 16 108 44 56 -15 -362 4 -42
6775 -42 -173 -80 161 157 100 98 -86 36 -9 -45 -102 -124 49 91 -269 -60 88 -42 -93 -142 -192 81 -123 -103 -130 -145
6801 -145 -6 49 -34 129 -233 128 137 54 -130 -307 -268 122 126 -205 8 176 136 -76 -66 -193 -126 190 -87 -108
6825 -108 -37 69 -288 -18 -290 -241 78 -158 -71 138 111 -204 165 -41 91 87 230 -218 -126 80 -14 -129 -83
6848 -83 -34 194 22 159 63 66 136 -9 42 -96 59 119 -320 129 142 -300 -122 -28 59 -292 54 -51 12 -69
6872 -69 -78 -95 -100 -11 33 61 -81 -35 176 180 -203 131 -92 8 126 -9 -125 132 53 70 -227 -79 -4 21 26 300
6898 300 82 -119 -19 31 76 89 -20 13 27 -87 63 319 -72 96 165 -257 -75 -101 -13 -41 131 -218 -11
6921 -11 -103 109 265 65 -60 -18 92 82 137 -170 73 102 -47 -42 25 -49 139 53 112 180 -4 135 -97 279
6945B79l74L33j89k40K22j5j22K79k27j70L04q0N8r5R0r6J13m5k29J38J86j01
6967A9J03M2j30J68j71j29O0j42L48pl13J07p3Q1R8p9K8J04n6K9l0j97K45j35
6991c0J33K28m96k7K38l15K79J0l3J0K65k22N1k7K6l47J29l7J1K92k82J98K13
7014B67l48p3J79o5J31K04j61p3k88K47k40K52J44j17j54J40j78nJ6L6O8N6j42
7037a04j0J13J07j83K93l26Q7m4N2K92j65k95J56K95k22l8l37L77j00J09O1J2
7059A30q3k15J51K23j28k80J35J5k5K80n4oo2M1q6j97L20j33J42k64J25k60L98
7082A67Qk86J21q9Q5J64mm8k44R2K62k45o6%J33j07oR3p8j03%J11j97J84J1L2
7108a0J20j6k99K18K8J2k69L61k36N4K46j11k0p6o9L6K22l13M8J29j46R8j10K7
$$ plain form
6945 279 -95 238 49 -191 31 16 -106 173 -54 -224 80 0 58 -37 53 -43 70 25 -204 -66 120 19
6967 19 122 164 34 202 31 -98 -38 -180 168 161 -152 -45 -118 -37 61 -18 10 114 58 87 57 -140 105 -30
6991 -30 103 331 -165 -192 46 -269 10 20 -13 -3 262 40 91 64 90 -257 -128 -165 -154 138 -144 54 267
7014 267 -81 -154 25 -40 91 295 134 61 -227 20 -220 32 176 59 -95 45 -133 -138 -122 -86 -18 38 -104
7037 -104 -114 -1 106 -77 216 -110 -23 -67 -15 277 112 -183 -27 268 46 8 -329 48 -52 57 118 130
7059 130 47 -168 -17 206 78 -202 -67 -52 -77 203 149 143 81 122 36 -161 159 26 168 -96 29 -231 167
7082 167 175 -111 10 -79 6 170 166 118 -126 -34 228 -17 -83 -83 50 -57 -63 30 -48 -151 -151 -40 -237 -53 -42 -10
7108 -10 110 94 -205 13 41 53 -216 145 -91 -37 209 98 78 2 -67 -31 191 -122 -74 55 -91 7 -103 -76
7132g6M2j27L14j11M7j08R1p9o5J10j39J76j88O2o1m7L06l00K01k68K47J30l05
7155a48K54L1k2j56l2J08Q2K6j11J1O2q2o0q9J01j47O0J63m7Pr9J77l7nMJ43j67
7182B7N3N4j41k9j08Q0M8Mn8j1K69j17l14N8K86k48L1L1o5K41j29k6q1J53J09
7207A17j93N5J42Q7j34k0j8J61pk35J87k49K86k91K24k5Q2k19Q5J67k45K4J3p9
7231h5K18k20r6J97J18j49j6J44o9J40n5n5o0p2L3r7j34K45Q0m3Lk08M09k72J88
7256A44k91J04J21r7n5M5k5K9K47m32K88O4l38L68l23J59J38j06K2K6L2j16j50
7279a46J49nL5J83k59QL3J88r9j77j2L9J7o0K6K51k33j04J03K35j46j45K59k00
7303f0J00M7k4P8o4N6k91K99k07J06j58J57L2nj98K60j96J39Kl16K86rj45K42
$$ plain form
7132 -76 -34 -161 153 42 89 -19 72 -7 -72 38 -101 75 -113 -51 -112 -159 147 -153 48 -220 27 157 -148
7155 -148 106 137 115 -41 -73 35 117 143 32 43 105 23 -37 -126 -25 -172 -112 51 4 11 -88 89 52 47 51 194 27
7182 27 80 134 -7 -36 -144 -64 -16 -12 -70 -81 188 71 -243 -185 101 -147 -116 -85 -150 91 -38 -64 -145 8 117
7207 117 -76 -21 121 208 74 54 36 197 190 -45 142 -107 179 -112 112 87 169 -50 35 202 -43 -19 -6 -85
7231 -85 133 -87 -183 14 132 -17 -33 111 42 182 127 72 12 -60 -27 -124 -258 -13 67 24 27 -181 228 -44 144
7256 144 -147 -43 78 -19 -74 -29 -54 -25 222 -210 78 142 -196 172 -151 8 146 40 62 88 120 4 -146
7279 -146 3 -2 33 216 -43 -35 -2 186 87 -90 -102 -63 -46 -106 -80 171 -62 -166 -63 172 26 -119 140 -60
7303 -60 40 87 63 141 77 133 -158 141 -66 40 -118 39 71 66 -132 128 -68 71 73 -243 43 34 -111 131
7327A31p5J83l19K16j85M5j87K02Q8o1o6J27r0PNK88k13k18J28k50N35l98l7J37
7351gk35K50J11r9r6q4QJ98m8N9J74k48j92J10O8j6J8R2j23j60J82q9L64j53O0
7376A44j4k25J19l1k1L3l59N57n1rk39J9K44k25O4o3M8k77K63P4j01M4j9j03k3
7401a51j9J80J20J26k26N3k09K54k87L23k08j78J23J52J26K7k00j3Q5j29lj64
7423b18J36j73M63k23k56L61j06O8mR5k24J42k01L26m32K85k0K5J11j27m4q0m7
7446a43R5L26k90J67o%j36r5q7j58L68p8m6J37k2RJ5k0l4m2R6K30q5j36n9J92
7472A98j59k10P5K13p5Jp8l6j3J65J45k20O5n6L1j28J14j23kL48l08M7m6J29K82
7497C59k49j35K00k44R9J71j92j7p9k0J30qK4k21Q5J09j19K0n4J07l3K90k13R1
$$ plain form
7327 131 56 239 -80 136 -49 -4 -191 11 99 38 -28 99 9 16 21 309 96 -122 6 -244 291 -107 -144 -7
7351 -7 -242 8 119 20 -76 -160 -152 46 -2 57 231 -17 -209 -99 -31 -47 -29 63 -60 -220 -38 -127 237 84 144
7376 144 130 -95 24 -7 -28 5 -354 203 152 143 -96 -77 167 -58 6 -57 -9 -286 -23 51 -50 -6 -25 -128 -151
7401 -151 -170 10 130 256 30 83 -126 128 -159 164 -44 -222 -99 53 179 206 6 -7 78 -51 -54 -218
7423 -218 -82 -255 208 -15 -271 90 -16 52 48 143 -81 61 -140 186 -246 39 19 44 155 28 -16 -96 -143
7446 -143 -48 278 -12 155 149 149 13 -82 -169 -327 41 -37 -83 54 32 41 56 36 2 -40 56 286 201 65 6 198
7472 198 39 -171 -96 117 42 43 -35 -71 -84 81 226 6 71 15 46 -82 32 -91 -93 255 -53 -6 -52 77 359
7497 359 110 -25 175 -69 30 201 9 -8 -87 -107 23 15 39 -182 -97 12 -107 -87 -141 -34 -67 223 10 101
7521A01k07K6M8R2l1q2J13K8N3k99R2K0K5k59N28m05K81l41R4J3QL77j26m3l33
7546b27L30l82M01q6j57R5J44j95m4j94J18M3J27J60k1q8j04K77k78L02k79M3
7568a5j01J53K14l77J77k05J43R2K5j31O9j82K73k90R2K53j51n0j05Q5J57K2j30
7591A8R7J35m45L47k56Pp0N9J43n0o1j5j32J9L72j10J88pm2l85N2j80M33Kk94
7616a75J25J11O4P7l81L02j76P0p0J7J05j83K29p9J4k2j85M5J85k62J85j75o0
7639b39J77J53J03l36J47K9j01K53k1k60K26k27J50j61J47N6rQ9k55K64j80q6
7661h1L2L6J97o6k45J06J46k51J87j81o0J37J9J69M7l37Q4mJ20k88K58j80K00
7684D5k27K40r4r0L55k71J93K6r6j57R8m0J20k38J84m3J65k67j1J28j3kp9o6L39
$$ plain form
7521 101 -106 -80 -32 60 29 -53 60 88 141 -158 -66 -46 -21 -280 248 -157 124 -217 -123 -110 -102 275 149 106 -227
7546 -227 103 -279 122 36 -121 -26 118 -77 -121 -315 -197 -154 -27 133 112 24 -80 197 -81 221 -58 -15
7568 -15 -116 37 251 -126 51 -154 -11 81 106 -25 44 -138 135 -155 -63 190 39 -11 -116 -31 126 148 18
7591 18 115 250 -195 152 -104 -97 -167 -108 35 -15 -76 -91 -223 -204 168 58 246 239 197 -188 -136 -316 117 119 -175
7616 -175 -50 61 125 202 -179 123 -53 17 -53 -36 69 -114 115 36 50 28 -157 -112 73 -189 -4 -179 -239
7639 -239 -62 91 194 -142 5 34 -67 186 165 -95 131 -96 54 -107 40 96 87 176 -79 185 5 -81
7661 -81 -49 -13 184 118 -127 -21 125 -126 61 -120 -180 -43 -24 145 192 -145 -61 -65 55 -233 25 -155 45
7684 45 -182 58 -36 -126 229 -42 151 177 81 -76 22 -18 102 -136 48 5 170 -97 -108 20 7 5 -74 -140 199
7709A99j4k28K94q6j36Qr3J17K6j96J3Q4N9M3j48J44k15O1N7q8J23K5p2k0%J85
7735A42j01l9k26J52Q4j55O4K54m48l6L81j16L9j29L5K4J54L75k49m09K18jL5
7758D8J14j8j21J14k1k28J1R5j85J55j9p5L57k59j45K19P0J85m15J23k33L05J35
7781B12l7k57K16o0j61J99q5q6l5J85k07K15l68K82J10m50M16Q5l86L80l1m86
7803c49N92j37L6m5l93K18J12k62J30JJ75O1k68Q7NJ78j53o8K69K5k15L3j09O7
7827a0J28j97J64l3j24n4R7J14r2L1K7j80J51j39K17k07L5J26J09k06m9R7n2L8
7851ij34K11J5j57o8j90L74J29j69k50L10j22J50j05n1K8j57L26k48j8N4K1j84
7874b44L45p8Q0j00J02m6J45K01m49N0K39j17k39J21j22J0RK73k32n4J15n5j31
$$ plain form
7709 199 185 -43 251 165 29 37 -56 61 87 -109 -96 -12 47 90 -58 86 -129 -68 -11 -99 24 49 -23 -43 -43 142
7735 142 41 2 -224 -72 12 -143 -79 175 -273 -309 72 -44 -5 -134 -99 -75 79 454 205 -204 14 13 48
7758 48 162 144 23 137 116 -112 -101 -6 -191 -36 -55 -130 227 -32 -177 42 112 297 -118 5 -228 77 212
7781 212 175 -82 134 74 -87 112 27 -59 -94 91 -116 99 -269 13 123 -327 89 174 -212 168 137 -349
7803 -349 243 106 142 97 -296 -78 34 -228 -98 -97 78 139 -129 -42 -37 141 -12 -80 189 214 -1 32 -77 -10
7827 -10 118 -79 85 52 -72 -126 -29 85 -7 24 51 -129 22 -117 100 -107 -72 54 163 -43 -92 5 -47 -9
7851 -9 -143 68 83 -74 -142 -332 42 171 2 -248 62 -60 90 -15 -66 -38 -195 131 -117 -135 -81 -60 -244
7874 -244 101 23 103 3 105 59 204 405 -44 6 245 128 -111 10 -112 -102 -93 180 -52 -106 9 -46 -177
7897a77J3K94N5j45K8r0j2OK05j21j82K12j47J5J02m13M76J92m51L21k83K38k82
7920a46m8K7J14M5r9N0M4k65K02J24l31M8J34J32Nj23K39K2p3j05n9J17k73K59
7944D0q5p2P0K67j79j42M6Q9j53O3K48k19J88k83P1Q9J76rl08J0M38l75M1k14
7968b03L29j88o2J43j65L33l24K4J70K2N6l46J77j33L15r5O6l10O4K97k65p2N5
7991a12K48k28K31j80N7p2O0j64M61n34K61m3O8k74J10J26j3k06K93j76Jk0m9
8014a55J83N5j72K85M4p3l51P8K05j63Q8J02M8l37J04J32k56L0K73p9j02J66j82
8037g7N0J58j65j5J8L7J0K03m21L20L19l57N8j07R6K5Q5m17J84r4n0J48J4o6N1
8062Gj6J03k88J70R8O2j54J15j39K1P1J35J2j95j64K19q8J91k79J80n8P6j0l5
$$ plain form
7897 -177 -164 130 185 40 68 -22 -34 -28 177 56 -126 86 -61 -46 56 -357 119 311 -140 181 -102 136 -146
7920 -146 -194 -167 -53 -8 -107 -57 -13 -278 -76 48 -283 -235 -101 31 36 -87 152 174 101 -4 -63 54 -219 40
7944 40 -45 -117 -47 220 41 -101 -55 34 -119 -56 192 -27 161 -122 -51 38 214 205 -103 -93 345 -30 11 -203
7968 -203 126 -62 -124 19 -146 187 -137 -113 57 79 135 -211 -34 -167 148 53 119 -191 -127 170 -95 -167 -112
7991 -112 136 -92 139 -41 16 -56 4 -160 301 -233 28 -15 53 -221 -111 15 2 -204 89 -87 -86 -106 -155
8014 -155 28 83 -89 196 240 167 -184 -106 99 -64 24 126 174 -163 -59 73 -183 -153 120 41 -61 105 -77
8037 -77 -27 131 -34 -49 -31 6 16 219 -202 118 437 80 138 31 127 152 237 -180 4 -90 -140 8 22 -44 7
8062 7 -9 94 -194 -24 74 136 -18 97 -42 -21 50 185 197 2 -162 57 -31 160 -119 61 3 79 69 34
8086C4j23L1K12j22N0k16J71r0n2K0j7jK54j72Q0j52K31r4j8J1J7J46l17R9j98
8111b16L74j58l05J38J79l6K16j69lJ99k49j81K43j10M1J39j30L43k08k43J22
8132a4J68Nk54J43J09r1j13j72m9K46J81k05J04o4oJ87l81K55l2M5l11K19j53
8155a83O8J61R8j14j26J63j62j5%J18k00K86j25Q0j10R1JJ90l88J27q9J94k5j74
8179a34k8M26l90K77j95K53q6j17j44R7K36k91
$$ plain form
8086 34 -89 -58 154 32 82 -134 37 -53 -105 -85 -102 -103 151 -21 59 -93 138 44 26 37 54 200 -117 -18 -216
8111 -216 158 0 -305 -167 12 -24 192 23 20 219 -30 -211 32 -78 -37 102 -28 315 107 -136 -14
8132 -14 154 159 -95 48 157 66 -47 -219 -268 -22 159 -46 58 -6 -12 175 -206 49 17 62 -249 -30 -183
8155 -183 -115 46 144 30 -96 67 -95 -110 -110 8 -192 94 -31 49 -61 30 31 221 -167 -40 -129 65 40 -134
8179 -134 -162 264 -126 151 -44 209 123 6 -138 -41 195 -96
8191i6
$$ Imaginary data points
##PAGE= N=2
##DATA TABLE= (X++(I..I)), XYDATA
0@%%%%%%%%%%%%%%Qj6J6j6J6j7K5l2L2m0M8n6O8p6Q8j04J19j35J52j70J93k17
36a14K42k72L04l37L76m21M66n14N69o29O93p63Q41r27J021j125J240j367J511
55G94j676J863k076K326k623K980l422L984m724N745p250R688j4284K5792j04981
70h7864j78504L02425J77795k04946j58020J53880R7191j10322o5467P8702L7151
81D2021j3965J089m4574p6796O8258J40412m1772j64243N977J31079L339q8438
93c7613J5661N6974k9201l8689K2729K753j0914N3738K5712j00071o0768J08642
105H953Q9900q1252q0282N2526M6768m1225j5767L8632L380k0211N857j7696l3926
118d4343M8934P2867n8435r8360M9593R0409n3535o6008P8826M8222j11310m7207
$$ plain form
0 0 0 0 0 0 0 0 0 0 0 0 0 0 0 0 8 -8 8 -8 8 -9 16 -16 16 -24 24 -32 36 -40 48 -56 63 -72 80 -90 103 -114
36 -114 128 -144 160 -177 199 -222 244 -270 299 -330 363 -400 441 -486 535 -590 650 -717 794
55 794 -882 981 -1095 1231 -1392 1588 -1834 2150 -2574 3171 -4079 5609 -8675 17117 -87864
70 -87864 -266368 36057 213852 8906 -149114 4766 101957 -8365 -73832 4870 42021
81 42021 28056 29145 -15429 -92225 -23967 116445 74673 -89570 -83593 47486 50825 -37613
93 -37613 -21952 35022 5821 -32868 -10139 -7386 -18300 35438 61150 -38921 -99689 8953
105 8953 98853 17601 -62681 -10155 36613 -4612 -20379 18253 21633 1422 7279 -10417 -44343
118 -44343 4591 77458 19023 -79337 -29744 60665 7130 -58878 19948 68170 -43140 -90347
130i0347J26926M6666j22852k8842J18991L691j24657J2250J32629n062j19689
141e0296o346Q3459N665m0630J2192J1023k9299M710K9395k2432k2961M8610K0947
154D4037p5135l2607Q1657M1229p0493l3481N4568J1183m9646Q872N2212j4934
166A7462m5241J5088K7191j9401m850L3337m289m1760M361L5871n354j8957J6448
179I906M758l1578r66L6056k055k9417J2643J7318l4068j4499N2032J6695n9874
192b3049j6072O0577N937o3456N768P2794p937p6259J015O8364P835m7320o705
205a8508K6525R81j0755L135j798o45J8317k544l8968l461N3808J3993n7294k2361
219c9575M8300J9038l9845j0489L4529K671l0186J100K0317n306n952J6436l338
$$ plain form
130 -90347 36579 83245 -39607 -68449 50542 54233 -70424 -58174 74455 69393 -50296
141 -50296 -56642 26817 32482 -8148 4044 15067 -14232 -9522 19873 -2559 -25520 23090 44037
154 44037 -31098 -63705 17952 59181 -11312 -44793 9775 20958 -28688 -19816 32396 17462
166 17462 -27779 -12691 14500 -4901 -9751 23586 19297 -22463 -18102 17769 12415 -6542 9906
179 9906 14664 -16914 -17880 18176 16121 -13296 -653 16665 -17403 -31902 20130 36825 -23049
192 -23049 -39121 21456 27393 -36063 -30295 42499 34562 -41697 -40682 27682 35517 -11803 -18508
205 -18508 8017 8998 -1757 1378 -420 -1065 17252 14708 -24260 -27721 26087 40080 -17214 -39575
219 -39575 8725 27763 -12082 -22571 11958 14629 -15557 -14457 5860 554 -5398 11038 7700
232G700k8923N080L6828K51l2428j617K3000j400j4529O323R059p240j547L789
246D346j1336m969K4663J0689l3582j9633L3205K0829k9365j6927K7007J0596
258A5523k6564p992K4667P039j6321k366P522n124j649J4440J793j6467k020J4361
272F842r89j0585P415Q763j1364q633J0464M740j0307K415J1502j0618j7162J2718
286d799K0351j2315j9192J1241J4984j2623j1547J4385J1067j1328r827O665N486
299B548k20K719j402p986R65J0941j912j0874N132J1539q674j4196Q067J4760
313A1407o734j2328M578O041o289k034Q441o1r528Q97P508k808m656O718M821
328E973q358m926P562N476m472r90K783k873k716N092L799n397k459M957r10p091
$$ plain form
232 7700 -21223 -16143 20685 20936 -11492 -13109 9891 8491 -6038 285 9344 2104 557 4346
246 4346 -6990 -11959 12704 23393 -10189 -29822 3383 24212 -5153 -22080 4927 15523
258 15523 -11041 -19033 5634 12673 -3648 -6014 1508 -3616 -5265 9175 10968 -5499 -7519 6842
272 6842 5853 -4732 2683 11446 82 -8551 1913 6653 -3654 -1239 10263 -355 -17517 -4799
286 -4799 15552 3237 -15955 -4714 10270 -2353 -13900 485 11552 224 -9603 -2938 2548
299 2548 2328 5047 3645 -4341 -3376 7565 5653 -5221 -89 11450 2776 -11420 -3353 11407
313 11407 4673 -7655 -3077 2964 -3325 -5359 3082 3021 -6507 -5610 1898 -910 -5566 1152 5973
328 5973 -2385 -7311 251 5727 1255 265 3048 175 -2541 2551 6350 953 -1506 3451 2541 -4550
344d550K257Q793k376j0037Q17P127j603m718L491K883m840k858M551K217j970
359h16M18J078k613j203N076K732m113j716L707M43m247J026M822m36m679o89
375a210J831m61N94J991k924m345J764N105j480n429J348M942j115n327K8N256
391E68L629k768n652m23O384N312m194p916K162R463J24r766j938J0082M236r611
407c08p223N854Q137j624p487l004L602M281m9n339k651M393M946l586o512K060
423d510Q208J657p955l655N905O235k497n307N91L301R66j279m87m96p7J199J043
440B842k590l538K265N196j266p661j926P324M351n433o090K651M767Q37k335
455f06k125o86L633N112k736r337P71J4153M648j6443j0351J5496J6591j2228
$$ plain form
344 -4550 -2293 6500 4124 -5913 -5096 2031 428 -4290 -799 2084 -2756 -5614 -1063 1154 -816
359 -816 -398 680 -1933 -3136 1940 4672 559 -1157 2550 2993 -1254 -228 4594 4158 -521 -1210
375 -1210 621 160 754 2745 -179 -4524 -2760 2345 865 -4564 -3216 1726 611 -4716 -4688 568
391 568 4197 1429 -4223 -4646 1738 7050 2856 -5060 -2898 6565 6689 -3077 -5015 5067 9303 -308
407 -308 -7531 -1677 6460 4836 -2651 -5655 -2053 2228 2179 -3160 -5811 -1418 3528 -58 -6570 -4510
423 -4510 3698 5355 -2600 -6255 -350 5885 3388 -1919 -1328 1973 2939 1660 1173 677 600 1799 2842
440 2842 252 -3286 -1021 4175 2909 -4752 -6678 646 4997 -436 -6526 -3875 892 1729 -606
455 -606 -2731 -3417 216 5328 2592 -6745 -5974 8179 12827 -3616 -13967 1529 18120 5892
469E892k0245O501K1396j540k0004m372J5551Q097j0079j0721K235R478M948n397
483A740j1149j041J3787Q950j3007j4683J0049J9775m807k1953k9K2188O203j8932
497b909j0251J3765J2088p438j1129K263P055P24l067k530j426R73N497k09q762
512e356l493J0414O797j0310r410R224J0238p043r718P131Q528p278p131J0269
526B862O516j1880o112J4219P221j6444r103J7529J1831j7235j4414J4139J4730
539A3859j0458j3829N324J0065j766n280q70j332J494P424M06j3220l697J7631
553E751Q853j8074j4128J7014J8845j2489k0378P320J9871j036j7112l781J2411
566C067P135o970p954j2O042M558k352p937l322P775P982o172j2311K727J5205
$$ plain form
469 5892 -14353 -7852 13544 12004 -8000 -12372 3179 11276 1197 -9524 -7289 2189 7137 1740
483 1740 -9409 -10450 3337 12287 -720 -15403 -5354 14421 9614 -12339 -12368 9820 16023 -2909
497 -2909 -13160 605 12693 5255 -5874 -3611 3444 4168 1101 -1429 -2855 -1882 3615 3406 -5356
512 -5356 -8849 1565 8362 -1948 -11358 -2134 8104 1061 -8657 -1526 7002 -276 -7407 2862
526 2862 9378 -2502 -8614 5605 12826 -3618 -12721 4808 16639 -596 -15010 -871 13859
539 13859 3401 -10428 -5104 4961 3195 -2085 -2955 -4287 -2793 4631 5037 -8183 -11880 5751
553 5751 14604 -3470 -17598 -584 18261 5772 -14606 -7286 12585 11549 -5563 -9344 3067
566 3067 10202 3232 -4722 -4734 1308 5866 3514 -4423 -7745 30 8012 1840 -10471 -7744 7461
581G461J174j6457m731J6411P796j3967r632J2445J0234j0206q365R332O811q896
595e90m954R680L476j0988k123J0996J493j1331j772R830J234q452j197N224O9
610E95k377K450j057n018K376Q715k443j1406K212J3638O9j3906k497J3352N385
625A0088r981o993N949P747j526o636l039M112N568q90p553k933O148N949m140
640A870q446L67Q995L654q180p644N443J0944j594j2368j715J2596N582j1065
654a561p774R724Q881o374q255L407O970j294m390j41J199M51J236n90l661o51
670b823M913N02n426j381M550J686l864j406K977J91j245Q05J215k040k44L387
686A797O09l650q4M113M05l610m31L236M76k791o54J623L3r53j52O4o59m9N14
$$ plain form
581 7461 8635 -7822 -12553 3858 11654 -2313 -11945 500 10734 528 -7837 1495 8306 -590
595 -590 -5544 4136 7612 -3376 -5499 5497 6990 -4341 -6113 3717 4951 -3501 -4698 526 595
610 595 -1782 668 -389 -5407 -3031 5684 3241 -8165 -5953 7685 7754 -6152 -8649 4703 10088
625 10088 107 -6886 -937 6810 5284 -1352 -4391 -279 5289 4399 -3154 -6087 61 6010 1870
640 1870 -6576 -6209 2786 6440 -1740 -9384 -3941 7003 5409 -6959 -8674 3922 9504 -1561
654 -1561 -9335 389 9270 2896 -5359 -1952 5018 3724 -666 -807 392 843 2079 1489 -2172 -2823
670 -2823 2090 2592 -2834 -4215 335 2021 -1843 -3249 -272 -81 -1326 -521 694 -1346 -1590 1797
686 1797 2406 -1244 -1328 2785 3190 -420 -851 2385 2861 70 -584 1039 1072 119 -33 31 -628 -677 -163
705a63p64o51Q82J11q83M10O49o75n54J826Q26j989m17L003O21k831n79L481N08
724B811l146l63K803P40k992o71J745L65j125r41P8M63M68r06j296K25K085j86
742A57k675J54L110M91k900l71K764J253k424o89K144Q91j070o92J031Oo56M64
760I88K40q24n06N88K45r51m14L2Q1j43R4p35j38R56O16j268j034K019J120j368
780d02j173J546J213m45j108N84Q73j82p6J53m30l41J147M8j337m40J117K85j561
799e29q45Q83Q27j076k66k41M97K86J18p23o95J604J463j633j378J561K381j497
817G37j919J523J947n83j813k5J607J48j081p43Q4P02O58j514j447J240J542j380
835c17k085P11K439p82k311P75J728L57j218Q7P61J39p6M25k89n95J201J047j622
$$ plain form
705 -163 -927 -1578 -696 -585 -1468 -1058 -409 -1084 -1638 188 1014 -975 -1392 1611 2232 -599 -1178 2303 2811
724 2811 -335 -698 2105 2845 -147 -818 927 1292 167 -774 -696 -233 235 -671 -1967 -1742 343 157
742 157 -2518 -2364 746 1237 -1663 -2034 730 1983 -441 -1130 1014 1905 835 143 1174 1180 524 988
760 988 1228 404 -102 486 731 -220 -634 -602 -521 -664 -570 -1305 -1443 -487 129 -1139 -2173 -154 966 -402
780 -402 -1575 -29 1184 739 -369 215 1088 906 830 983 553 212 1359 1407 70 -370 747 1032 -529
799 -529 -1374 -491 336 -740 -1006 -1247 -750 -464 -346 -1069 -1764 -160 1303 -330 -1708 -147 2234 737
817 737 -1182 341 2288 1705 -108 -133 1474 1622 541 -202 -118 584 1242 -272 -1719 -479 1063 -317
835 -317 -2402 -1691 748 -34 -2345 -1570 158 515 -703 -616 145 284 208 633 344 -251 950 1997 375
854C75j030J343J271j096j357M42Q49k65r84J0r7l40P85j89j450nJ948r9j702
873a591J04J667K06j086N61N71q40M22J468l55j853P76K863j389k666O43K884
890B385o07k705r2J513J00n35l93o18m89J587J011k897j618L131J903k727j934
907b985K448K256j151j950Q00J196O22J27r19j122J376J777j331k601J425K616
923B584j828k090J075J595j657r05J777l73k693J087L249k089l379K170M042k319
939B46l682K799K709k025j689K787K27k612J555L347k729m074L551M666l767n287
955c978L380M893k727m925J526L519n16k499n9J33P23J254j96l079l11L772J534
972B444l587j991L102K713j140l210q7K616K831j929m298Q08N608K95o412j107
$$ plain form
854 375 -655 688 1959 863 -494 -52 797 532 -452 -442 -539 -879 -94 -283 -1733 -1738 210 111 -1591
873 -1591 -1487 180 386 -700 -139 432 -408 14 1482 1127 -726 50 2913 1524 -1142 -499 2385
890 2385 1778 -927 -1019 494 594 59 -334 -952 -1441 146 1157 -1740 -3358 -227 1676 -1051 -2985
907 -2985 -537 1719 568 -1382 -582 614 1236 1363 444 -678 698 2475 1144 -1457 -32 2584
923 2584 756 -1334 -259 1336 -321 -1226 551 178 -2515 -1428 1821 -268 -3647 -1477 2565 246
939 246 -3436 -637 2072 47 -1642 1145 1372 -1240 315 3662 933 -3141 410 5076 1309 -3978
955 -3978 -598 4295 1568 -3357 -1831 1688 1172 -1327 -1386 -1253 -530 724 528 -2551 -2862 910 2444
972 2444 -1143 -3134 -32 2681 1541 -1669 -1756 860 3691 1762 -2536 -1728 3880 4175 -2237 -3344
988c344O127J228n673j460M790k89l596Q36L051l107k157M720J540o062j059P062
1004B607J229p248p36P962r2o969J204O140k050n180L241M602m937l286N263L464
1020E214o525l139O112K658n831k431M519J300l023r78K044o47p32J826o0k388
1036b081N05L169j42k830l70K576J442j270j810p59K987K359k738m356K838N132
1052D652k376o433J805O606k139n706J522M720k338l354K959J236l917N39N058
1067B834k198n767L644O792m423o790N453O566n189n751N377M802n341l244N381
1082B146J268n136J67M555j451m825K435M219l503m065M142K279l647j563L592
1097F13J58k977N56L047j094k147J727J681j836m61J802m35j081J315R03k058
$$ plain form
988 -3344 2783 4011 -1662 -3122 1668 1379 -2217 -1381 1670 -1437 -3594 1126 2666 -3396 -4455 2607
1004 2607 3836 -3412 -4148 3814 3722 -3247 -2043 4097 2047 -3133 108 4710 -227 -3513 1750 5214
1020 5214 -1311 -4450 1662 4320 -1511 -3942 577 1877 -1146 -2124 -80 -727 -1459 367 307 -2081
1036 -2081 -1576 1593 1451 -1379 -1749 827 2269 999 -811 -1570 1417 3776 1038 -3318 -480 4652
1052 4652 2276 -4157 -2352 4254 2115 -3591 -2069 2651 313 -3041 -82 1154 -2763 -2224 2834
1067 2834 636 -5131 -1487 5305 882 -5908 -455 6111 922 -4829 548 5350 9 -3235 2146
1082 2146 3414 -1722 -1555 3000 1549 -3276 -841 3378 -125 -4190 -48 2231 -1416 -2979 613
1097 613 771 -2206 -1650 1397 303 -1844 -117 1564 -272 -733 1069 634 -447 868 1771 -287
1113b87k84K811n64l844J156L982j759m346K100L609k771k983L047J763l453k48
1129b071L071p58l317K538L240l330l182M624L069m990j877N122J336n087j50
1144a762M788o73m475J948L186k576k734L227J545l999j146M378m08m286J023
1159a964L960j855l200K435K686l004j569L418Q70l132K78K718o56k437K146J999
1175B693k982j109L281N35l739J07L373q26l554J382K888k063k333K483J148k841
1191a557l59L072p88k921J851K155j934j906K732J507k708p45L507j89l164J211
1207b36K902j696k674K554K077l535j223L163Q40l888J63L307j032l257J646K468
1223A579k478j552K634R59k810j51L094k40l275J691K446j483k130K316J663k594
$$ plain form
1113 -287 -571 2240 1676 -2168 -1012 2970 1211 -3135 -1035 2574 -197 -3180 -133 1630 -1823 -2071
1129 -2071 1000 242 -3075 -537 2703 -627 -3809 815 3884 -1106 -2983 2139 3475 -1612 -1762
1144 -1762 3026 2353 -2122 -174 3012 436 -2298 929 2474 -1525 -2671 1707 1299 -2987 -1964
1159 -1964 1996 141 -3059 -624 2062 -942 -2511 907 1777 -1355 -1077 1641 985 -1452 694 2693
1175 2693 -289 -1398 1883 2418 -1321 -1214 2159 1333 -2221 -839 2049 -14 -2347 136 1284 -1557
1191 -1557 -1916 1156 368 -2553 -702 1453 -481 -2387 345 1852 -856 -1601 1906 1717 -1447 -236
1207 -236 2666 970 -1704 850 2927 -608 -1831 1332 2172 -1716 -1553 1754 722 -2535 -889 1579
1223 1579 -899 -2451 183 1142 -1668 -1819 1275 1035 -2240 -549 1897 414 -1716 600 2263 -331
1239c31o12K801R6k982Q81K205j377k319K144J366k203j630K460K54k297j00K310
1256F66q08j976J506J666j797j224K682N37k323J07K207J8k345Q43K212j379j654
1273a062J973J032k170o43K623l25k447M05K061j083k023J215J463j625r52J715
1289A57K59k032M28J986o95j886J487J735j864r46K151O74j941l65K090Q9k077
1306g50J059J427j405j453J949P19k180n33J730J81k071K16K088r92j555J090
1322d80J116j497m85J519N96j473n7J398j72j163O62J216j077n50J187P24j603
1339a39j8J182j33j346L63J255j192r71J152K73j321K05R96k99j353Q06J336j231
1357d35r23J264Q41j129l47J553j85j271M36J498m10j741J077J277r38j113J031
$$ plain form
1239 -331 -943 1858 1954 -1028 -147 2058 681 -1638 506 1872 -331 -1961 499 753 -1544 -1644 666
1256 666 -142 -2118 -612 1054 -743 -1967 715 1252 -1071 -964 1243 1261 -1084 -241 1971 592 -1062
1273 -1062 911 1943 -227 -870 1753 1428 -1019 -614 1447 364 -1659 -444 1019 -606 -1558 157
1289 157 416 -1616 -1188 798 103 -1783 -296 1439 -425 -1371 780 1454 -487 -852 1238 1327 -750
1306 -750 309 1736 331 -1122 827 1546 -634 -1167 563 744 -1327 -1111 977 -15 -1570 -480
1322 -480 636 -861 -1346 173 769 -704 -761 637 465 -698 -36 1180 103 -447 740 1464 -139
1339 -139 -157 1025 892 -454 -91 1164 -28 -999 153 426 -895 -690 306 7 -1346 -540 796 -435
1357 -435 -1358 -94 747 -382 -729 824 639 -632 -196 1302 892 -849 228 1505 567 -546 485
1374D85N64j220k80R43J65j182P9J067p60j047R04L19n59p94J044L09m71l53P73
1393a4K82m27M5L60L6L8M70m03m06M59N66m77o85O49K00o08k90K31J38n04l2L30
1415d2l64o85P96K60n26m10Q29P58j255l54J328J04p72N0R31R9n91j49R07m23
1435D91n70M07O00n55j019O14P77n26r16K83P58o6p67m42P48J26n69j74O14q0
1455b66j73J77N26l40k72O52L57m01n25Q06N21p69n63M57P69j94j209M38R50p57
1475A84o22J32Q41p05p09P46L48r48O5M75J29p50r6Q63M58p94j41J137L57j017
1495d7l65J116L05j081j89J331j28r97p9Q68k44j092L11P46m29j435P70J231o16
1514b4j090L61J094p51p67O90R56o62n49Q57O41q40l07J135K84j154m5R51L31
$$ plain form
1374 485 1049 -171 -451 492 657 -525 -446 621 -139 -1186 -282 37 -522 -1316 -272 37 -434 -787 -14
1393 -14 268 -159 -114 246 282 320 790 387 -19 440 1006 529 -156 493 693 85 -205 26 164 -340 -372 -42
1415 -42 -406 -1091 -295 -35 -561 -971 -142 616 -639 -993 335 439 -333 -283 648 747 156 7 914 491
1435 491 -79 328 928 373 -646 -32 745 219 -697 -414 344 278 -489 -931 -183 -57 -626 -800 -186 -266
1455 -266 -439 -262 264 -76 -348 304 661 260 -265 541 1062 293 -270 187 956 762 -447 -9 941 184
1475 184 -438 -306 535 -170 -879 -133 215 -733 -668 -193 -64 -814 -910 -47 411 -383 -524 613 970 -47
1495 -47 -412 704 1009 -72 -261 1070 942 -55 -134 734 490 -602 -291 455 26 -1409 -639 592 -24
1514 -24 -1114 -753 341 -410 -1177 -487 469 -193 -742 115 756 -84 -391 744 1028 -126 -171 780 1111
1533A111j010o89J326K32j167m57J043Mn90l49P12K3q95l7O46M4o83r0J108m74
1553a92m70M40M87M6q50K16J282l56r89L56J064k81j031L23O51k93o89L76N51
1572F41n31o98P60J49q28n97J040K25p42k02P42o8m78J03N13L42o89J02Q33P5
1592F92n11ML80Qp25M15N56k14p33P2O31m24k5M8J53n61k86K19K12j72m55K67
1614d49N86n50j01M6P96j48k04J09K66k03j74K69O36p60Q1K20J70k82l72L42J02
1635C80j25o04K75L45o39k49N25j80k88p7N93J22p22K64M09L3m77M86M51l46m81
1656c05L96N39l23k32L23K64l73Q6p1J43m48J5q3K5k02J30O5j64l55o6M69k91
1678d58p5K04k2K81l88L53m7K52N7q6J14R2N64p19P3K07J10l81J63J40l83J9J80
$$ plain form
1533 1111 101 -588 738 970 -197 -654 389 393 -197 -546 166 189 -706 -743 -97 -53 -736 -826 282 -192
1553 -192 -662 -222 265 311 -539 -323 959 603 -386 -30 1034 753 -278 45 696 403 -286 90 641
1572 641 110 -588 172 321 -507 -1104 -64 161 -581 -783 -41 -109 -587 -484 29 371 -318 -216 617 692
1592 692 181 185 565 573 -152 263 819 605 -128 -56 575 151 126 174 327 -234 -520 -301 -89 -261 -716 -449
1614 -449 137 -413 -514 -468 328 180 -24 85 351 148 -26 243 879 119 200 420 590 308 -64 278 380
1635 380 255 -349 -74 271 -368 -617 -92 -272 -560 -637 -44 78 -644 -380 29 62 -415 71 522 176 -305
1656 -305 91 630 307 75 398 662 289 375 304 447 -1 14 -69 -44 -246 -116 -51 -215 -570 -636 -167 -458
1678 -458 -533 -329 -351 -70 -458 -105 -152 100 157 71 185 277 841 122 195 402 512 131 294 434 51 70 250
1701B50j21k60k80L77J45o16J49K00K99o61l1N62j06l72L14K67O4l86N00K73k84
1722B83k17L60J26l42M2K10k28k76J03J60l49p7qK78o1l16K32k00j91J05K47j08
1744b27J5K18j53O5K02J09o8l66N96J03l47J16J78N4l70J41J67O9o91L26J39l57
1766h1l21L29j5j12q7k7J13j61j37M52o1k68K21J10O0m3j58M05K10j10j75J69
1788C13L3q4J04k13J25o3M2j36j8o7r1Oj83n0OKJ12L0qj30K12k02J54m9R8K10
1814A53l10J94Q8K5j03J29K38m0k95L99l8k49l34K87K04m80q3K58Rl61n7N21j38
1837A7l95nL14k63j84J31M23L03m48J11J95Q3k40K0N81o94L05M0L22n35N5j9K29
1860C46l39o1PR8j22l06K15N4o2j27j95M84Kl33n4L31Q8l79k7O99j24j69m2L78
$$ plain form
1701 250 129 -131 -411 -34 111 -505 -356 -156 143 -518 -549 13 -93 -465 -151 116 180 -206 294 567 283
1722 283 66 426 552 210 252 462 234 -42 61 221 -128 -205 -213 65 4 -312 -80 -280 -471 -366 -119 -227
1744 -227 -212 6 -147 -82 120 229 161 -205 391 494 147 263 441 495 125 266 433 502 -189 137 276 -81
1766 -81 -402 -73 -88 -200 -287 -314 -201 -362 -499 -47 -108 -376 -155 -45 15 -28 -186 219 429 319 144 313
1788 313 346 262 366 153 278 215 257 121 103 36 -55 -49 -232 -282 -276 -274 -162 -132 -140 -270 -58 -260 -106 -155 -57 153
1814 153 -157 37 125 150 47 176 414 374 79 478 440 191 -143 144 348 -132 -215 43 52 -309 -366 155 17
1837 17 -378 -383 -69 -332 -516 -385 38 341 -107 4 199 282 42 62 643 -51 254 294 616 81 136 117 346
1860 346 7 -54 -47 51 -71 -377 -162 -108 -170 -297 -492 -8 -6 -339 -393 -62 26 -353 -380 319 195 26 -16 362
1884C62j72j24J5N58p05R7K91M33p94j26L63Lk13l54L14J95n39Q2J60J24m94K2
1906e02L94K41o38K10M74Q8n35J87K80%o2p6K99j09j56L6J53L94n70j73J4O5l57
1929c43j68K83J09m0k89N28k94j76k7J66M81p22K34M66K6m25J76L95l06k63L83
1950A94N18n83l48L32L92m39p9O3J02k45m30M40K85n29k59N44k31k59J22M62k40
1971a88l24L17K57K68l25j38M80k68nM4L49K57p49K70M6q8q4l5J10k42Ml82L35
1994i1O7l43N5K02k19j32L04j45J18q5j38L34J96k74j53P34o8m25K01M62k99n48
2016b47O73r5p8l09J98J94l17l89M35J61l09j73J81Q6l75k13L36J25k00P0R3J62
2038Il24K79J00Q3k31L19J21Jm07J32J91m1M4k57Q9J45j66j89j10J03K4j83J28
$$ plain form
1884 362 190 66 81 639 -66 31 322 755 -39 -165 198 201 -12 -366 -52 143 -396 -314 -154 -30 -524 -502
1906 -502 -108 133 -505 -295 179 267 -268 -81 199 199 137 61 360 251 95 131 284 678 108 -65 -51 14 -343
1929 -343 -511 -228 -119 -159 -448 80 -214 -390 -417 -251 230 -492 -258 208 234 -191 -15 380 74 -189 194
1950 194 712 129 -219 113 505 66 -13 50 152 -93 -523 -83 202 -327 -586 -42 -273 -532 -410 52 -188
1971 -188 -512 -195 62 330 5 -133 347 79 74 118 467 724 -25 245 291 203 119 84 194 -48 -44 -426 -91
1994 -91 -24 -367 -312 -110 -329 -461 -157 -302 -184 -269 -407 -73 123 -151 -304 430 362 -63 138 600 301 -247
2016 -247 426 331 253 -56 142 336 19 -370 65 226 -83 -256 -75 11 -364 -577 -241 -116 -316 -246 -153 9
2038 9 -315 -36 64 147 -84 235 356 357 -50 82 273 232 276 19 108 253 87 -102 -212 -109 -85 -268 -140
2061a40J37p3l62L30k8k87M5J62K05q8k4M00k22k25K06J25K70n12J62N10l23l78
2083a10M66J09o79K32j11M06o01j21O29k55l04k4M04k33k52J56M73m07m8M01M0
2104A71j20j89M55l52J92k54M87k02K45j83M3O6l50M38k55j10K02k34k47k45K48
2125a94J65k71J57Oj06l77M42M78o47j29N95K98n40j63N69k04l81K40Q88o65l98
2146b37N37K56n60k35L85K06n29O7J01K61o31J8L70j58l35M33nj84j83O61n68
2167c30m9J06N91l16j78M84j27l0r4L39q8k35K81j0r9k22K38j92l32P4M75l66
2189h0j33R4K93n08l9J83K44n36j51O77L8m22Q8M48j28l27K61O89p15k10P52j28
2211C90l61qM53k85k90J1M29n06j56K62P4k52l54M58l6l64J23N02J6o30O12J7
$$ plain form
2061 -140 -3 -76 -438 -108 -136 -423 -378 -216 -11 -99 -123 277 55 -170 36 161 431 -81 81 591 268 -110
2083 -110 356 465 -214 18 -93 313 -288 -409 220 -35 -339 -363 41 -192 -444 -288 185 -222 -270 131 171
2104 171 51 -138 317 -35 157 -97 390 188 433 250 293 359 9 447 192 82 284 50 -197 -442 -194
2125 -194 -29 -300 -143 -137 -243 -620 -178 300 -347 -476 119 417 -123 -286 283 79 -302 -62 826 161 -237
2146 -237 300 556 -4 -239 146 352 -177 -110 -9 252 -379 -361 9 -149 -484 -51 -56 -240 -423 238 -330
2167 -330 -379 -273 318 2 -176 308 181 151 57 396 308 73 354 344 245 23 261 69 -263 -189 286 -80
2189 -80 -213 -119 174 -334 -373 -190 54 -482 -633 44 82 -340 -252 196 68 -259 2 691 -24 -234 518 390
2211 390 29 21 474 189 -101 -90 339 -167 -323 -61 13 -239 -593 -135 -171 -535 -412 90 106 -524 88 105
2233A05k19J01J11O1j41Q0J42J30n35N36N6l28k18K69R9o34J19N20j88l64K14
2254h4J02k98m15N82K05q34O13Q4J21l56J12N34l59k85N74L43l74j86K09K06n92
2275i8M3K31J62l24j39L89n05J85k2K66l35k9J00J11k73J59K51n02J16K24j58
2296a48k06K01L69o2m96L45K78k3k52J46J40l2l34M67j93l49nM53j44m23K53R7
2318H2j53k42L01J29l44P7K88m3m15J33M52j66l71L28K99l61O3LP2J86j32J47
2340C33j60k04L16j27k26q1K51j6k18l8J12j28j3J75k26l25K57O05k73j95O8J47
2362C4n4k22K66J78j50r7N38k04j56o9P2K84n90K75L22m19j88J09P9k47n2K65
2384b6j4m51K85L83l33l0j38K26M2L8K2J27j05q8M51k20k27J71N1k97M24j01k41
$$ plain form
2233 105 -114 -13 98 159 18 98 240 370 -165 371 427 99 -119 150 249 -385 -266 254 66 -298 -84
2254 -84 18 -280 -695 -113 92 -742 -129 -45 76 -280 -168 366 7 -278 296 639 265 79 288 494 -98
2275 -98 -55 176 338 14 -125 264 -241 -56 -78 188 -147 -176 -76 35 -238 -79 172 -330 -214 10 -148
2296 -148 -354 -153 216 154 -342 3 281 258 6 152 292 260 -74 393 200 -149 -154 299 155 -268 -15 82
2318 82 -71 -313 -12 117 -227 -150 138 95 -320 -187 265 99 -272 56 355 -6 57 60 132 318 186 333
2340 333 173 -31 285 158 -68 -149 102 86 -132 -170 -58 -186 -199 -24 -250 -575 -318 287 14 -181 -113 34
2362 34 -20 -242 24 202 52 -45 493 289 133 64 136 420 -170 105 427 8 -180 -71 8 -239 -291 -26
2384 -26 -40 -491 -206 177 -156 -186 -324 -98 -56 -18 4 131 26 -62 389 169 -58 113 164 -133 291 190 -51
2407e1J74K29j70k80J02M3N5k01J57J61k44k80J09K52l66Q4k5K42q6j84L52j54
2429h1K93j45JJ46k90J21K97r1k08K95j79K02l38L22r5m27J1j2K44l04q7J13K36
2452B4k11rJ72R6l09K28L54m98L6J22j2J06K74l22r4R1K07p0j13on3pRn4J50j05
2478FrJ10k62j55J19N4k67Q7L50p9j39K22J12J29m13K19j97K88k50L16J0K6l29
2501e2q7L39k70J0K81j15k58M2p8L11m29K76l9j66j4N8K48k78mL35l16O8J07J90
2525A59p8j84J20M3j88J49K48m55K55N4l9j57K19k43J27K04k57L1j84j35N0MK33
2548b4k21K19OO5k16L05%j05O9N4k00K40%R3k07K95k36l0K28j30j46j80J04K20
2572B03l7k28J28n1M1l64N1J11n3R1J05j78L5K13j93QPL53l6l95K6J20P8L1NJ47
$$ plain form
2407 -51 123 352 182 -98 4 47 102 -99 58 219 -25 -305 -196 56 -310 -226 -251 -9 -95 -279 73 -81
2429 -81 212 67 68 214 -76 45 342 251 43 338 159 361 23 345 250 -177 -166 -178 66 -238 -325 -212 24
2452 24 -187 -196 -24 72 -237 -9 345 -153 -117 5 -7 99 373 51 -43 48 255 185 72 66 13 6 15 -39 111 6
2478 6 -3 107 -155 -310 -191 -137 -404 -317 33 -46 -185 37 149 278 -135 84 -113 175 -75 241 251 277 -52
2501 -52 -139 200 -70 -60 221 106 -152 -110 -188 123 -306 -30 -69 -235 -249 -191 57 -221 -225 110 -206 -138 -31 159
2525 159 81 -103 17 60 -128 21 269 -186 69 123 84 -73 146 -97 30 234 -23 8 -176 -311 -261 -257 -24
2548 -24 -245 -26 -20 45 -171 134 134 29 98 152 -48 192 192 285 78 373 137 107 335 205 59 -121 -17 203
2572 203 166 -62 66 15 56 -308 -257 -146 -199 -108 -3 -181 -146 67 -126 -118 -111 242 206 -189 -163 -43 35 66 71 218
2598B18j20L7o0l49L98j01q6O5j08K49l51mJ86o3P2k9K3j29J8J76j72K94l20J94
2622C8k3MK19j86J37k7j11p7K39j64l9J66k49j8J38k11K58j43k1k01L61l41J17
2645a34N1j23J38J2q7p1K22n8L2j2J07K8p0q2p4J45n5J9J36k21J18q9j18L1N70
2670D15m83ok07K67J65k43N6j7l7j61N0J71K5j64L29k33kJ24n0lj89Q4L55ol56
2695a16J85J72k57J72k16J88O1o8j29M9n1p7j20J44j9m0J26k4k57K66r5L61k73
2718a8Q6O2K42l55P3j21L6L86k61j11J9L8M5j41R4Q3l57L47J9j93j90J77j26L20
2742A54n24L17N3J55l23K32k62K24M6K18j7j81j72R3N8kj4r6J3q7j1N53l73j12
2766e8Q7r5R0k01K1P2j18J64N1j37l2J76j28l1L50j98j34J78M3j30K34k9k9j63
$$ plain form
2598 218 98 135 75 -274 124 23 -63 2 -106 143 -208 -212 -26 -89 -17 -46 -23 -152 -134 42 -130 164 -156 38
2622 38 15 19 238 52 189 162 51 -26 213 49 10 176 -73 -91 47 -164 94 -49 -70 -271 90 -251 -134
2645 -134 -83 -206 -68 -56 -143 -214 8 -50 -18 -30 77 105 35 -47 -121 24 -31 -12 124 -97 21 -68 -186 -155 415
2670 415 -68 -74 -281 -14 151 -92 -36 -53 -90 -251 -201 -30 -5 -169 160 -73 -75 49 -1 -4 -193 -109 246 240 -116
2695 -116 69 241 -16 156 -60 128 189 121 -8 41 -10 -87 -207 -63 -82 -122 4 -20 -277 -11 -106 255 -18
2718 -18 68 130 372 17 90 -31 5 391 130 19 38 76 121 -20 74 157 -200 147 166 -27 -217 -40 -166 154
2742 154 -370 -53 0 155 -168 64 -198 26 72 290 273 92 -80 13 71 69 55 -41 -28 -115 -126 427 54 -58
2766 -58 29 -66 24 -177 -156 -84 -202 -38 13 -124 -156 20 -108 -139 211 13 -121 57 100 -30 204 175 146 -17
2790a7K16j50N8k01o3K80j92jO7j05K30l43qK85j17p3M41k72L7j08jK5k23P5L09
2815A49j81Q9J32m5j3j12N0N8J77m54J68N9Q5l8J24j14m6k54r1O9J45qP9j30n1
2840a53p7K58j47pK4J02k9j4l9J04K42m92M90k74J56j24n6J34q9j4j66K33k76
2863b14K85O7l27j3J47j49K90l11K11j64J02K6J73j23j19K09k95J36K87j97K5
2884D6r2K14k0k22K16k9J49m08J70J05l0l1Qm3q8J56k21R4l40K06r7p6J46Nn1
2909b33L35n9M6O4j41J61J29l94J77k40PO4o5K55k29J87J8rj71l4K03j07n2M2
2933d6K2J29j96P2K00j68k69L61j75Rm2L69l44J5J65j03M4rK3k3P1k74K52J6L6
2958A35l58K60o0N7j15K13p9l30J43P3O3o3lq8L35m38K2J94J56j16J31m7kPj16
$$ plain form
2790 -17 199 49 107 -94 -157 123 -69 -70 -3 -108 122 -221 -229 56 -61 -134 307 35 72 -36 -37 -12 -235 -160 149
2815 149 -32 57 189 144 131 19 69 127 304 -150 18 77 162 124 248 134 88 -166 -257 -188 -43 -51 28 -102 -153
2840 -153 -230 28 -119 -126 -102 0 -29 -43 -82 22 264 -228 262 -12 144 20 -36 98 9 -5 -171 62 -214
2863 -214 71 138 -189 -202 -55 -204 86 -225 -14 -178 -76 -50 123 0 -119 90 -205 -69 218 21 46
2884 46 -46 168 148 -74 142 113 262 -146 24 129 99 68 76 33 -55 101 -120 -26 -366 -160 -257 -333 -187 -182 -233
2909 -233 102 43 89 153 12 173 302 -92 85 -155 -148 -84 -149 106 -123 64 82 73 -98 -132 71 -36 -88 -46
2933 -46 -24 105 -91 -19 181 13 -256 105 -70 -61 -103 266 -78 -63 102 -1 43 34 57 34 105 -169 83 99 135
2958 135 -223 37 -23 34 -81 132 53 -277 -134 -61 2 -61 -64 -152 183 -255 -233 -39 117 1 132 85 83 90 -26
2983b6m9O6J47j7K44m04n9j05K50j33o4L79l90K43M3n8l80K12P2p3n5L03J1k62
3007a05K8p5J55l1K49q4m47J73J10j6L01j58k61N7K13l88K77j01J64M1j1j49J60
3030A02j74K4J03r9Ll8R1o7K47k29j11J05P1k13K73j53K36j14k76L17mJ01k56
3053f1J52J01l56J29J21j47P4k9j71O6j0R1P7O6p1q1k63K94J80j04j4k4J18j94
3077e6P4Q2j44J14o9K34j92j7R2O7j2j69J31j41r4Q9J04m37J36J0J15j32j20K62
3101g3J97m41J75J33NO5M7k5J17l04K01J50k97o1O3K08j76N5J6k0k09K8L63p3
3125A44k49n4J57j56J81PpR9j15J40l73J87m9R1P0n1k7K44j40j32K49m01K28k00
3149a57J69M8k66L92j83J40j00J31k65O3J71m57K72Nj3J13n7q6R9k81J62J22j37
$$ plain form
2983 -26 -75 -9 138 121 365 -39 -98 -203 47 -86 -150 229 -161 82 125 67 -313 -101 -29 -102 -157 146 157 -105
3007 -105 -77 -152 3 -28 221 137 -310 -137 -27 -43 258 100 -161 -104 109 -279 -2 -103 61 102 91 -58 102
3030 102 -72 -48 55 -44 -41 -79 12 -55 192 -37 -148 -43 28 -185 88 -65 171 57 -219 98 94 195 -61
3053 -61 91 192 -164 -35 86 -61 13 -16 -187 -121 -131 -40 37 103 32 -49 -312 -18 162 58 44 20 138 -56
3077 -56 18 100 -44 70 1 235 43 26 118 185 173 4 135 -6 -100 -11 93 -344 -208 -198 -83 -215 -335 -73
3101 -73 124 -317 -142 -9 -4 61 108 83 200 -104 97 247 -50 -111 -48 160 -16 39 55 35 -174 -146 217 144
3125 144 -105 -159 -2 -158 23 30 23 122 7 147 -226 -39 -88 3 73 22 -5 239 99 -33 216 -185 43 -157
3149 -157 12 60 -206 186 3 143 43 174 -91 -28 143 -314 -42 -37 -50 63 6 -80 19 -262 -100 22 -115
3172a15J74Rq7K27o3j53J27jj00p2j1N4n0J06J5o0j81k7L06r6k19Q0K29l66M5
3197b29K15M9j83j02K55J27j93P0Q6M0j05KJ23k35Q6l6p0Q1R6J15l97Q6J83K8
3221I2J17l88rP7M0rj35J26M9J11m7l6J47k6k64M52m96L4J12J36J80k83J34k80
3245a66K43l6j48l2R7J62l20L29K6l23L25j11l8N9m5j30j8j18L56j41p6K10j65
3268f0J44M3l96L93L1k72J23R7NK9J10m72L37l43M58k41q1O2K97k15n2j42Q3l4
3292i6Q6J31q0R0k26K7n6M0M9R0j24J76j19J30O4j12q7K06L2m15J68L48l08J15
3316A29j13j43O3L6j38m2o8K47l16K03J8K7L67k27j11J86j33o4J75n2J56l60K92
3339A32k1j33l4L73m58L9J71j21L78k03k27PJ11j13J87k2j13j64L45j83j20J87
$$ plain form
3172 -115 59 68 -19 208 145 -8 119 118 18 -54 -65 -11 -61 45 60 0 -181 -208 98 2 -217 -137 92 -274 -229
3197 -229 -14 35 -148 -250 5 132 -61 9 95 135 30 32 155 -80 6 -30 -100 -19 77 192 -205 -119 64 92
3221 92 209 -179 -188 -111 -71 -80 -215 -89 -40 71 24 -12 135 109 -155 297 -199 -165 -53 83 263 -20 114 -166
3245 -166 77 41 -107 -139 -42 120 -200 129 155 -168 157 46 8 67 22 -108 -126 -244 112 -29 -105 105 -60
3268 -60 84 127 -269 124 155 -117 6 103 108 137 247 -225 112 -231 227 -14 -95 -33 264 49 -3 -145 -62 -96
3292 -96 -10 121 41 131 -95 -68 -124 -84 -35 55 -69 107 -12 118 182 70 -17 189 221 -194 -26 322 14 129
3316 129 16 -127 -64 -28 -166 -208 -276 -29 -345 -142 -124 -97 270 43 -68 118 -15 -79 96 44 200 -160 132
3339 132 111 -22 -56 317 -141 -102 69 -52 326 123 -104 -97 14 -99 88 66 -47 -211 134 -49 -169 18
3361A8j5r2K33J3K02j71L5m77K90J34j34k32L5J99J2J70l30K15j14L27l04j22
3383a08K0N4q3L18q6k28P7n6J69m3m2j6k43K26N1o4j50L65k7k0q9JJ14j89J95
3408A46j24Q6l2nk57J73r5L50k89K4pk7j43J16J93j20RO9Q2k2k80K48K0j31r9
3433a15j01K08MK12l08M41j85m27N05j89j68J10j02L56k60Q3k11P9P2J94l6l21
3455a59P1QQ2R1o8n3q1Q7r8J33L9k3r3m6m8K69l2J43o7r9k09Q5L7o0K0J57p4j57
3483a45J44j81L11M7l30M7k5J40k45K53J31j73K12j46R0q3j61J49L1q6K63l10
3505f7K46p7k53J82J5j28L7LQ8M9j10kK3l31K54Q4J2P0r4k54K90j52J66L1k07
3530a25M1J37k54K34j23K2J27j53J37J42m7j53Q3p4q7K4R9m3nJ05R6k94L2O0j55
$$ plain form
3361 18 3 -89 144 157 359 188 223 -254 36 170 36 -196 -161 38 50 220 -110 105 -9 318 14 -108
3383 -108 -88 -34 -117 201 115 -113 -36 -92 77 34 -8 -24 -267 -41 10 -54 -204 161 134 114 25 26 140 -49 146
3408 146 22 108 76 71 -186 -13 -108 242 -47 -23 -30 -57 -200 -84 109 -11 -2 67 149 127 -153 95 115 -16 -115
3433 -115 -216 -8 -4 208 -100 341 156 -271 234 45 -123 -13 -115 241 -19 64 -147 -68 4 198 162 -159
3455 -159 -88 -80 2 93 25 -28 -109 -22 -120 13 52 29 -64 -110 -158 111 79 222 155 56 -153 -68 -31 -91 -71 86 12 -145
3483 -145 -1 -182 129 176 -154 -107 -132 8 -237 16 147 -26 186 40 130 47 -114 35 66 -20 243 -67
3505 -67 179 102 -151 31 46 -82 -45 -42 46 95 -15 -17 6 -325 -71 13 25 95 1 -253 37 -115 51 82 -125
3530 -125 -84 53 -201 33 -90 -68 59 -94 43 185 138 -15 68 -6 -93 -69 30 -13 -18 87 183 -111 -79 -19 -174
3555a74L11k29K49j24J11k67M1l2j08M99l83K7J20j45J39m29L13L4k13N03j55
3576H8j08r5n7K42p9k63L64J01l86J24K1O4J58m95K38R6k7j01NJ94mK37m51J04
3600c0J09o5J68k06K28j33P1j4r8k8P6j22p7j25L89J85n77J95J91k36JJ70j87
3623a15o9J80J24M2k91J72n5J72P1k68J36j79L0m0j18L66k82K44J32j88kk7k95
3646b60L30n6j48J71m1j49N9k0K24J61l40R6J07j24j25M88k32j59j0qN4K1%J28
3670A67j38J47j58j10J05j55L22j55Nj82O9J07J2q7mJ69l38l0L72J7n5k0Q9Q7
3694B36j31j00N3p5p5J47J14j89j3L0R8k59P8p2Q9n3j40J18J26p4k08J53j32j3
3718b92L27n5q3m1R2Q9P3Pjq1N7j10k7r1J30j38K22J5j2J94l58J37j4l13L79k14
$$ plain form
3555 -174 137 -92 157 33 144 -123 -82 -114 -222 277 -106 -79 41 -104 35 -394 -81 -47 -260 243 88
3576 88 -20 -115 -172 70 -9 -272 92 193 -193 -69 -48 16 174 -321 -83 13 -14 -115 -110 84 80 317 -134 -30
3600 -30 79 14 182 -24 204 71 142 128 30 2 78 -44 -121 -246 143 328 -249 -54 137 -99 -98 72 -115
3623 -115 -184 -4 120 162 -129 43 -12 160 231 -37 99 -80 -50 -90 -208 158 -124 120 252 64 62 35 -260
3646 -260 70 14 -134 37 -4 -153 -94 -114 110 271 -69 27 134 10 -115 373 141 -18 -28 -36 18 39 39 167
3670 167 29 176 18 -92 13 -142 180 25 30 -152 -83 24 36 -51 -55 114 -224 -254 118 135 80 60 149 236
3694 236 105 5 58 -17 -92 55 169 -20 -33 -3 95 -164 -86 -158 -69 -122 -262 -144 -18 -92 -300 -147 -279 -292
3718 -292 35 -20 -103 -144 -52 37 110 117 116 35 92 -18 -45 -136 -6 -144 78 93 81 275 -83 54 40 -273 106 -108
3744a08K9j19J7M79j95k20K73k11n2L7J42rj47K5L8qM10n04L07j50p0L0L2N7j74
3769i1J75p7J17r9L9j09j57J24j04J57J52k80L51k01k5l5J47j0j75J76J8k21K35
3792A07l36M68n4j66J6l57L51m75L36m0K8Q9K09k91L35j64o5j14J88n2m6K03k9
3815A41j46K0P3R5j40j59NQ5m9K15O2j58j53J75m7k12O1M6P7q8L1j15O1J5o1N3
3841a13J81j15k22L15p5j14Q4K03l12L15j97K53k36mj17O0J43k27K02k41l8J41
3863a14P3n0Q4k79L46j39K84k71J36J6j68j1O5m0K88l43q0K76j64J59j51N4O4
3886C5K63k77J19k20m8J54n8kM9J97k63J52q4P7k17J86l20N18n33K63P4k40K87
3909A12j79k8M54l10Q2j0J00j08J33rL9J4j70q9l2k22J9L61k00K02l0j98m6k2
$$ plain form
3744 -108 -79 -198 -181 298 103 -117 156 -55 -107 -70 72 63 -84 -59 -21 -29 381 -123 184 34 -36 -6 26 83 -91
3769 -91 84 7 124 25 64 -45 -202 -78 -182 -25 127 -153 198 -3 -28 -63 84 74 -101 75 93 -128 107
3792 107 -229 239 185 19 35 -322 29 -446 -110 -150 -122 -33 176 -115 220 56 -9 -123 65 13 -33 170 141
3815 141 -5 15 88 183 43 -116 -111 -26 -75 140 202 44 -109 66 19 -193 -132 -86 -9 -97 -66 -181 -120 -105 -166 -113
3841 -113 68 -47 -269 46 -29 -143 -59 144 -168 147 -50 203 -33 -37 -154 -94 49 -178 24 -217 -255 -114
3863 -114 -41 -91 -7 -286 60 -79 205 -66 70 86 -82 -93 -28 -68 220 -123 -203 73 -91 68 -83 -29 35
3886 35 298 21 140 -80 -128 26 -32 -34 15 212 -51 101 17 94 -123 63 -257 261 -272 -9 65 -175 112
3909 112 -67 -95 359 49 131 121 221 113 246 237 276 290 120 31 -1 -223 -204 157 -43 159 129 -69 -115 -137
3933a37K11P2J50l27N9P4k55L11k89J04j21j2J08R6J56m11J44J42p8j51J42j3
3955b5J26n9p4L4J40j84K1M5k44K18LR9r7K2l36M44J30m84nJ12K1L6N9K5m4n9
3981g6K6J91l76J63J83j47J87k94L35m58K72j6j9p3J95p6j31J85j34L27m13M64
4003C15k83p7o3P5J83p2k89o1N27m46K99J44j86J43m15K31K0j1J09l88J39n3K46
4026H7l57L46j07j0l3K40k16L46l99J87j00k04J91k30N2K88j11J17k33J45J81
4047A80k37l0q5R6J10j64K57J23l52J20K17l08K6l78L22J3L20m91N27k94J70j56
4069a4j19P7K97k50j44R7J6R0l77J51O2J17jk22j14L17M4K0J5L2j81J05J63m54
4093b73J85j09NK75j92L6j43J61J19l01K09J44l8P4k05J90o0j97J22J86k34J66
$$ plain form
3933 -137 74 146 296 -31 28 102 -153 158 -131 -27 -148 -160 -52 44 200 -211 -67 75 -3 -154 -12 -25
3955 -25 101 42 -32 2 142 -42 -21 24 -220 -2 1 100 3 25 -311 133 263 -221 -226 -114 -93 -57 2 27 -17 -76
3981 -76 -50 141 -235 -72 111 -36 151 -143 192 -266 6 -10 -29 -102 93 17 -114 71 -63 264 -149 315
4003 315 32 -45 -108 -33 150 78 -211 -272 255 -191 108 252 66 209 -206 25 45 34 143 -245 -106 -159 87
4026 87 -270 76 -31 -41 -74 166 -50 296 -103 84 -16 -220 -29 -259 -207 81 -30 87 -146 -1 180
4047 180 -57 -87 -172 -76 34 -130 127 250 -102 18 235 -73 -47 -425 -103 -90 230 -261 266 -28 142 -14
4069 -14 -133 -56 241 -9 -153 -56 -40 50 -327 -176 -114 3 2 -220 -334 -17 27 47 62 94 -87 18 181 -273
4093 -273 -88 -197 -192 83 -109 -73 -216 -55 64 -237 -28 116 78 152 -53 137 77 -120 2 188 -46 120
4115A20j48J04J02j35P0lj24k3K14k78j25M78j56j11k15J70J26q4n7L5J05l06
4137b41J51r3K6J11J55l0j10R6o9P3R2j00M0k55J42J20l16jK09J87k00J65j54
4160bj50k4J09Q7k03L13j47J49j49l3K05l59L77j53k01J06l3n5J43l2J25k90L46
4183A29k86P9J25l4J1p6J9o4p1J19K51j53P6l58K11K26n03K38l9k5J52j11O5r6
4207a15j3K7K22L9p9j0j34O4j0K7LL3O6k70R2J0k2o8R3J82m2k07J10M6j12j15
4233a83J5J57j1J34k10J22O3k08J21l6o3l4L34k84O6R6K0n8j66K15J03l35J58
4256A6J3KJ1m7n8m7p1J76L7L7J37j59k11K84j28J61k38r5L48N2l30j30J58J58
4280G6j71j14N3J16k5o2K7K43m7j69L1J23m1p9Mm2K06k46J58j91K35j06j61J84
$$ plain form
4115 120 -28 76 178 43 113 110 -14 -37 177 -101 -226 252 96 -15 -230 -60 66 -18 -75 -40 65 -241
4137 -241 -90 -183 -157 -46 109 79 -31 65 -4 69 161 61 101 -154 -12 108 -208 -209 0 187 -13 152 -2
4160 -2 -152 -176 -67 20 -183 130 -17 132 -17 -50 155 -204 173 20 -181 -75 -108 -163 -20 -52 73 -217 129
4183 129 -157 -78 47 13 24 -52 -33 -97 -168 -49 202 49 125 -233 -22 204 -299 -61 -100 -125 27 -84 -19 -115
4207 -115 -128 -101 121 160 81 71 -63 1 -9 18 21 54 120 -150 -58 -48 -70 -138 -45 137 95 -112 -2 44 -68 -183
4233 -183 -168 -11 -22 112 -98 24 87 -121 0 -36 -99 -133 201 -83 -17 79 99 41 -125 90 193 -142 16
4256 16 29 31 42 -5 -63 -110 -181 -5 32 69 206 47 -164 120 -8 153 -85 -180 168 220 -110 -240 -82 76
4280 76 -95 -209 -156 -40 -65 -127 -100 143 96 -73 -42 81 40 -39 -35 -77 129 -117 41 -150 85 -21 -182 2
4304BrOj22p9L2M16l20J94k85p8J85J42lk64J86j24L56l83K62k46J85J40r0o7
4328C6J04j62p0L2J51r4Q4p9L2n8M6J7l0q1j11L5K81j51j29K31k08J34pL4l1O6
4354G2J69m76O1JQ4J37k8l5J66r9Q3k05r8K28K06l26j08K95k32P7p7n6K99l09
4378a71K14N0o1l6j16J60p0O2RJ41l16K50m17L99o8O8j94J88p1J45k06p9k52O18
4402B47l05K05k30Q5n5k3M00m26M2M6J15Q3j22J4K8k43K29m7j8J20k38p0Q7O8
4426hj59j25M48k55P3K17k60Q3K14n45L72j17j66L28m0j47K92k77L33j83pNk7
4449D9K56k96j17m2M95l80J79k64Q9Q4j57o2J78m3O2m9J7k01K18q1K67j29M0j90
4473g7O5p5K28k45K31k62J32N3J53l32K39j70j35K22J9l10L93j32M8m7m7j98J97
$$ plain form
4304 2 -7 -1 -123 -202 -170 246 -74 120 -165 -243 -58 84 81 -183 3 -121 235 -148 114 -132 53 193 103 36
4328 36 140 -22 -92 -60 91 -3 81 2 34 -24 22 39 9 -72 -183 -148 133 -18 -147 84 -124 10 3 37 6 72
4354 72 241 -235 -174 -173 -89 48 20 -15 151 52 135 -70 -168 60 266 -60 -168 127 -105 -28 -105 -161 138 -171
4378 -171 43 93 32 -4 -120 40 -30 32 41 182 -134 116 -301 98 30 98 -96 92 21 166 -40 -119 -371 247
4402 247 -58 147 -83 2 -53 -76 324 -102 -60 -14 101 184 62 76 104 -139 90 43 25 145 -93 -163 -76 -8
4426 -8 -167 -292 156 -99 -26 191 -69 14 228 -317 55 -62 -228 100 60 -87 205 -72 261 78 71 76 49
4449 49 305 9 -108 -150 345 -35 144 -120 -31 53 -104 -166 12 -31 31 -18 -1 -202 16 -65 202 73 113 -77
4473 -77 -12 -87 141 -104 127 -135 -3 50 203 -129 110 -60 -195 27 46 -264 129 -3 45 -2 -49 -247 -50
4496e0Q4j36j20J38m8L36j35k76K26j50K00rjM0k10j62M58l67J15n0J65j43l9
4519a34J03l0p8J39J02J08q0j92j03J47n5J86o8lNO2%k22J74J71j48j08L8m0K29
4544B03l90K45k66K08J11j47j45p3K67p2O0l3o8L6L31j32k69o5J61J00J29k53
4566f2j77L15nl74M48j01J27j63k1J16k17J33Mj82L28k49j2K48j45r7j03J76M7
4589C4r8K38qr6j46J31%j72P1P8l3oK16l29Q7Q3L5j25K35j99l5O8l5K2l44K35
4615i3N0J9j3k47Q1N69m23q8n6K22Q0j18L3k50J45J64j05J57J29j82Q1l9N2j60
4639HL10j88k63J12m9J24N3n7j13J47J30j92n2J77m8l91K37J90o9J69j86R7j47
4662ak0J11l8P2m26J68L08j99o7j96M83l09MJ52RJ44k21j9N2j11J71l15R7L01
$$ plain form
4496 -50 34 -102 -222 -84 -132 204 69 -207 19 -131 69 60 59 99 -111 -273 185 -182 -67 -117 48 -95 -134
4519 -134 -31 -61 -139 0 102 210 130 -62 -165 -18 -73 113 45 42 47 109 109 -113 61 232 84 -24 14 -26 203
4544 203 -187 58 -208 0 111 -36 -181 -254 13 -59 1 -32 -100 -64 267 135 -134 -199 -38 62 191 -62
4566 -62 -239 76 71 -303 145 44 171 8 -13 103 -114 19 23 -159 169 -80 -92 156 11 -86 -189 -13 34
4589 34 -64 174 166 70 -76 55 55 -117 -46 32 -1 -7 209 -120 -33 50 85 -40 195 -4 -39 29 -6 16 -328 -93
4615 -93 -43 -24 -37 -284 -203 366 -57 -145 -201 21 101 -17 16 -234 -89 75 -30 127 256 74 155 116 168 8
4639 8 318 130 -133 -21 -70 54 107 50 -63 84 214 22 -30 147 99 -292 -55 135 66 235 49 146 -1
4662 -1 -21 90 52 124 -302 -134 174 -25 -92 -288 195 -114 -110 42 51 195 -26 -45 7 -104 67 -248 -151 150
4686A50k88K1J90K0K54k59n0j59K41l87L76O7j03k2k05K07Q5k05L4j43J8J86J76
4709B04r8p9j17K05Qj41P0j59J12K9q9K6K34l37P9PlK8j66K28j57J74l32K54k20
4734b40K91k46J91m4j48J43j51K89j37J49K24m28J09j79j06m2L32j69K11or9m8
4756a04K9M1J0N8J9K0j06R8n7k1l87N43j49j15J77j00J97j01K4k0Lj39K21r1Q4
4781A34j84m7L12j64p7R2j25P0p4M5J14j20J30j7J80j75q0Q2k72QJ7j98K56r2
4805a85L72j98j97K5K04j96K94J27l1n02L17l9K08k39q4oN3J12K03l40j8M33m43
4828a30p2J53o6J13J86l78M48k28J43j96r8j5K12k20K49j8j99j65L01j56K12m
4850G2Jl16O0J54r9M9K17p3k25K10j99L35m26L5K72k0k3j96K01j80J01J12p5J05
$$ plain form
4686 150 -138 -117 73 93 347 88 38 -121 120 -267 109 176 73 51 -154 53 138 -67 -33 -176 -158 28 204
4709 204 106 27 -90 115 123 -18 52 -107 5 34 -55 -29 205 -132 -53 -46 -49 -21 -187 41 -116 58 -274 -20 -240
4734 -240 51 -195 -4 -48 -196 -53 -204 85 -52 97 321 -107 2 -177 -283 -325 7 -162 49 43 -56 -104
4756 -104 -75 -34 -24 34 53 73 -33 65 8 -13 -400 143 -6 -121 56 -44 153 52 76 56 59 -80 141 50 134
4781 134 -50 -97 215 51 -26 66 -59 11 -63 -18 96 -24 106 89 269 94 14 96 -176 -168 -151 -349 -93 -185
4805 -185 187 -11 -208 -183 21 -175 119 246 215 -287 30 -9 199 -40 -124 -130 -77 35 238 -102 -120 313 -130
4828 -130 -202 -49 -115 -2 184 -194 254 26 169 -27 -125 -140 72 -148 101 83 -116 -281 20 -136 76 72
4850 72 73 -243 -183 -29 -128 -79 138 65 -160 50 -149 186 -240 -205 67 47 24 -172 29 -151 -50 62 -13 92
4874I2r9O4N8n9j10M8m7k9K47k6k54J35J64j00M8n1k3J7j07l7P0Oj5N3l40K62
4900c3O3k10J64Rm6j10R4l2n0R7J19Mpk29j4J13J05l7j58j21L24j37K36j52LM3
4926C8K15j23k26oO4J01P0l5j85L2J7M5k2J0Q8k85K89k07O6L21l78K25n2q7K32
4951B07j73q4m5j15M12Oq2m5K25j37j87oJ43j63j45J77l4J84j36j04J35Q3j28
4974a2K47l06j72J96j08J89O1l20K73n1q2P4j29k67M16Q3k40p3J98JP3K4rr1P6
4999E1r0L24k16oj71K61j63l6j84J75J89j35M2j0J66k17J06j19P1Opj70K41j80
5023g2J1NK24J89l30p4j50K44j03K6L1k28L80m7N8k43J19M2l45J95q2K33m7o1
5047b5J31j78j04R1J60k53L30n8Nj9n6O5k39K65j50R4q5nl55K26M3p1j82N97n5
$$ plain form
4874 92 -7 57 115 56 -54 -6 -53 -82 165 139 -115 20 184 84 132 81 58 75 -32 -69 1 7 -8 45 -295 -33
4900 -33 30 -180 -16 -7 -53 -163 -69 -101 -151 -54 65 69 62 -167 -181 -68 37 0 -158 -279 45 -92 144 -8 -5 38
4926 38 253 130 -96 -102 -38 63 133 98 -87 -55 -38 7 -15 -5 83 -202 87 -120 -54 267 -111 114 62 -25 207
4951 207 34 -50 -95 -210 202 208 126 81 306 169 -18 -24 119 -44 -189 -12 -46 138 2 -102 33 116 -12
4974 -12 235 -71 -243 -47 -155 34 95 -225 48 -3 -85 -11 -140 -407 9 92 -148 -221 -23 -22 51 75 66 -25 51
4999 51 -39 285 69 63 -108 153 -10 -46 -230 -55 134 -1 41 31 197 -20 86 -33 38 44 37 -133 108 -72
5023 -72 -61 -56 168 357 27 -47 -197 47 -56 -30 1 -227 153 106 164 -79 40 82 -263 -68 -150 83 36 -25
5047 -25 106 -72 -176 -85 75 -178 152 94 99 80 24 89 -150 115 -35 59 -26 -31 -386 -160 -117 -188 -370 227 172
5072A72l22K71j88J20j18PP4j0J59q9p8L9Q4L8n0J88l60m3L32l25j62O8K79j29
5096d3j71J49K04j49o7Q1P7j77R3J13p3K15j80q7J10q9n8k0K05k14L6j1j37J42
5120e1L30l17j75J34J27k70J28Q4j79L31j04j89L16j87J25k39j28K60K58k25j81
5141a52K87m9M7n6J78k54J68j66J01j31O8K1q7M1L8Q6p7k5J35k07Q6n5j05J60
5165E2k7Q2l17J45J11k81J98r1J5J68j41P8J05l67N92k94o8l1K03j77j7K0o0o4
5189a66J78K6j06p3J44j8Jr8mQ2M4m0L6O5O1K1j2%j74J88j23j12N8j92P9K74l11
5216a72LK17O3j26j38L28N4P1l04j91J01p0K1J48J78r7m4n9n2J48j57K9j24K03
5240C0J00K9r6L9P1j41j34P6m3j37J29K37k45R9o7L94l20J60k16K1j52J18J85
$$ plain form
5072 172 -150 121 -67 53 -65 -58 16 6 165 76 -2 37 121 159 109 297 -63 -106 226 -99 -261 -193 86 -43
5096 -43 -214 -65 139 -10 -77 4 81 -96 -3 110 37 252 72 -15 95 6 -52 -72 133 -81 -45 -56 -193 -51
5120 -51 279 -38 -213 -79 48 -222 -94 -10 -189 142 38 -151 165 -22 103 -136 -264 -4 254 29 -152
5141 -152 135 86 133 77 255 1 169 3 104 -27 41 62 -25 16 54 140 63 38 173 -34 52 -3 -108 52
5165 52 25 107 -210 -65 46 -235 -37 -128 -113 55 -86 -8 97 -270 322 28 -40 -71 132 -45 -62 -42 -102 -166
5189 -166 12 38 -68 -141 3 -15 -14 -112 -116 -34 10 -30 6 71 132 153 141 141 -33 155 32 -80 -22 -214 -135 139 -172
5216 -172 -169 48 111 -15 -153 175 229 300 -4 -195 -94 -164 -143 5 183 86 42 -17 -69 79 -78 -49 -173 30
5240 30 130 159 63 102 173 32 -102 -26 -69 -206 -77 160 -85 14 -53 341 21 181 -35 -14 -166 -48 137
5263A37j10j58L3j88K79jj73J00p5J06lk31K57J06K22l37O7R9n3J58j59j68K0
5286g2J02o0K95k72K6o4k51O5K67p4J59k41N1M2K09j68Q5l99K04o1R6p8K69L2
5310A62m07L46j17o6j2N0M0N0j63K08mj18j66R9M70j62l32J62k76L41j89R1j7
5333a0P4j27K05k36j2N0J3J6J39n6l1o3J33P1k52J44j68L49r7pk88K22k9rk1r1
5359h1P8j46L34j76k55R9pJ92Oo0M1L5M7j64k4m1J94J49m09L37r4m0j01o4L34
5384A84k31j04J95J1o5M4K09k55j61J8N1K74p4J5l34L28k12J58k49J84p1K13j66
5407c8J08j10j66K59J39k72J03P9P2j30k05kK46k12q9L92j85l3O1q7K10j96J38
5430H2q3j66J56J38j40J18M4j78L0K89j33l18R9N0N0N0q0j19%j0k8L64L6K8l55
$$ plain form
5263 137 27 -131 -98 -286 -7 -8 -181 -81 -156 -50 -53 -284 -27 79 301 -36 31 130 77 235 76 -92 -72
5286 -72 30 -30 265 -7 19 -45 -296 -231 36 -38 121 -120 -69 -27 182 14 99 -300 -96 -157 -61 -139 130 162
5310 162 -245 101 -16 -82 -94 -44 -4 46 -117 91 87 -31 -197 -98 372 210 -122 40 -236 105 -84 7 -10
5333 -10 64 -63 142 -94 -106 -56 -43 -27 112 56 25 -38 95 166 -86 58 -110 239 142 135 -153 69 40 31 10 -81
5359 -81 -3 -149 185 9 -246 -147 -154 38 44 -16 25 60 107 -57 -81 -122 72 221 -188 149 55 15 -86 -150 184
5384 184 -47 -151 44 55 -10 34 243 -12 -173 -155 -104 170 96 111 -223 105 -107 51 -198 -14 -85 128 -38
5407 -38 70 -40 -206 53 192 -80 23 102 174 44 -161 -163 83 -129 -218 174 -11 -44 17 -70 140 -56 82
5430 82 -1 -167 -11 127 -13 105 149 -29 1 290 157 -161 -62 -12 38 88 8 -111 -111 -121 -149 215 251 279 -76
5455g6J83J18m84K48KJ2q4K00O0j76K29K7n4o2j50K59j37k09K19j02r5L6J82l02
5479a56J32j4r3K40j81K27j08N8k04K75Pl5k56k5J30J3j62K12J01Qj5j94j1M3
5503hm6m7K75q7l59L36j30q7K1J50k1k52L57j12J77k46J18J38j65K38k17j02J18
5526D9l43J08L33R3l09oK03j68K37k53J27K61m07j62M69k26O1k9J93k91J10q7
5548c7j68J04Q1K01l38K43j59J83J15n24K74J83j67L4K1K5J00l14J83J52k56J21
5570E7j33K85l37K59j65M3m0J61j13l0L8k94L46o2k6O6J97k98p6J04J02rj13j97
5594b35J98j9M12l55L4p0K17r6k44J44K21k05J48j43o0j39K61J76k86m7J62k04
5616a30M1K46k61O4K04n67M47p0J83j59k37M07Nl36j71J86K66l7r9K7N5J87l54
$$ plain form
5455 -76 107 225 -259 -11 -9 3 -81 119 179 3 232 259 205 143 -7 252 115 -94 125 23 -72 -36 146 -156
5479 -156 -24 -38 -131 109 -72 155 47 105 -99 176 183 148 -108 -133 -3 10 -152 60 161 169 154 -40 -51 -8
5503 -8 -54 -101 174 87 -272 64 -66 -153 -132 18 -3 -255 102 -10 167 -79 39 177 12 250 33 -69 49
5526 49 -294 -186 147 240 -69 -75 128 -40 197 -56 71 332 -75 -237 232 6 67 38 231 -60 50 -37
5548 -37 -205 -101 -20 181 -157 86 -73 110 225 -299 -25 158 -9 25 46 71 171 -143 40 192 -64 57
5570 57 -76 209 -128 131 -34 9 -31 130 17 -13 25 -269 77 15 -11 55 252 -46 -122 -18 84 75 -38 -235
5594 -235 -37 -56 356 1 35 -35 182 86 -158 -14 207 2 150 7 -53 -192 69 245 -41 -88 74 -130
5616 -130 -89 157 -104 -40 164 -403 44 -26 157 -2 -239 168 173 -163 -334 -148 118 81 -18 9 64 251 -103
5639a03O6J11J4j56K11j3j03J62o6j55j22O8L0K73k16K8k7k66K33j4M6J79k02
5662b2O0r0K76o8O9k14P8k36J23Q1P2K9k17J77n4q4J29n6K86o20K92K1n8R8o9
5687CN8J54j85J3N1j70J59j26R3o4l52K30K01jl5Q7j05%J88j33j43N1j6N4J6P5
5713A03M2l11J30R6p8k5J9j65L03j13k9K0Kq1K37j84R8L20k58j33k9Q6j28j9L19
5738B22q8j34m4QK82k30j76r2L67n6l4n4q6J32Km40O71m34K18j6P2l34L86k8k52
5763a38K91j87P3n5j56K30K9o6K73k52l57M28j12N3R2k56p3kK88k02J66M5J21
5786B33k63J81j45N5O1n6j72r6K99j76K3j54L96k22m0K09k61Q3j23L15k71K1K28
5809A25j81n5Q8L80l89P5j46JJ77J6j80J4K7r4M0J94j62K39o4j47J84m90N70l16
$$ plain form
5639 -103 -37 74 88 -68 143 130 27 189 123 -32 -154 -86 -56 217 1 29 2 -264 -31 -45 1 180 -22
5662 -22 38 -52 224 156 225 11 89 -147 -24 57 129 158 -59 118 64 -20 109 53 339 -281 11 32 -26 72 3
5687 3 61 215 30 43 94 -76 83 -43 50 -14 -366 -136 65 64 29 116 11 11 199 66 -77 -26 -42 12 28 103
5713 103 145 -166 -36 60 -18 -43 -24 -189 114 1 -28 -8 -6 -87 150 -34 64 384 126 -7 -36 50 -78 -97 222
5738 222 134 0 -44 -36 246 16 -160 -252 115 59 25 -29 -115 17 19 -421 250 -184 34 18 90 -244 142 114 -138
5763 -138 153 -34 39 -16 -172 58 87 21 294 42 -315 113 1 54 146 -110 -183 -185 103 -99 67 112 233
5786 233 -30 151 6 61 122 66 -106 -202 97 -79 -56 -210 186 -36 -76 133 -128 -45 -168 147 -124 -103 125
5809 125 -56 -111 -23 357 -32 43 -103 -102 75 91 -89 -75 -48 -142 -102 92 -70 169 105 -42 142 -348 222 -94
5833i4%O7k14J99j19N5K54k40J38o1j40K34n3O7j9p1j3J16O1j42K5j05J4J15j09
5858c5k0J73p6r5K30j35J19l01J99P5k29j6K59k90rL65j26j64L0J03O0k8j35n3
5882i9J63R9k37K50l0L1j36J2J39j86l8Q3K24l52J28J1k3j2R7k22K2K5L7j6j2
5907d2L49j13k91K41k89K64j09JJ47o3J6k41OK02j22J27q1J23j18j99l8L78J11
5930B59m1k60j04J84j28J95j91j88J73jJ19J22n6l6k9k7J69l05L24l85N3J26J75
5953A48K7k04M0j56K63j61j38J85J3K5m0j74L34k34J42k9j75K43j29j49J96j8
5975IN1J9j91J29Q8k71K56j13k16J31j3k0J59j49J26K70l89J44q6jJ58l04K04
5998ik3J13L7j78k5K77q4n3k58J00M7J3R9j52K49n17K72K60j82R9J15J13k37j27
$$ plain form
5833 -94 -94 -27 -241 -42 -161 -106 148 -92 46 -15 -155 79 26 93 74 3 -10 106 167 25 50 -55 -41 74 -35
5858 -35 -55 118 42 -53 177 42 161 -140 59 134 -95 -111 148 -142 -151 214 88 -76 -46 57 117 89 -46 -99
5882 -99 64 163 -74 176 146 177 41 53 192 6 -32 51 275 -77 51 62 39 27 124 -98 -76 -51 -14 -30 -42
5907 -42 307 194 -97 144 -145 119 10 11 158 95 111 -130 -124 78 -44 83 2 125 7 -192 -230 148 259
5930 259 218 -42 -146 38 -90 105 -86 -274 -101 -102 17 139 83 47 18 -9 160 -145 179 -206 -153 -27 148
5953 148 175 -29 11 -145 118 -43 -181 4 17 42 2 -172 162 -72 70 41 -134 109 -20 -169 27 9
5975 9 60 79 -112 17 105 -166 90 -23 -239 -108 -121 -141 18 -131 -5 265 -124 20 -66 -67 91 -213 -9
5998 -9 -32 81 118 -60 -85 192 108 55 -203 -103 -56 -43 56 -96 153 -364 -92 168 -14 85 200 313 76 -51
6022e1o7R7k5j6j41Q9L07k35K42l13K02j78J25n7o8N8J32R1k85r4K23j1R8o6J27
6047A84r4Km8Nq3M1Q5j62J72k92M03l61J16j27J91p3k8NJ15q5o5j5O1j15K13m2
6073CJ89rk28K03k12L7l8K9j13QK46P2k02JN9k43J84P3J50l80P3l3M8r8o3K41
$$ plain form
6022 -51 -118 -21 -46 -62 -203 -114 193 -42 200 -113 89 -89 36 -21 -89 -31 101 192 -93 -187 36 25 123 57 184
6047 184 90 92 44 49 -34 7 92 -70 102 -190 213 -148 -32 -159 32 -41 -69 -64 51 -34 -99 -114 -53 -168 45 3
6073 3 192 183 -45 158 -54 -17 -55 -26 -139 -131 115 187 -15 -14 45 -198 -14 59 209 -171 -98 -131 -83 -181 -244 -3
$$ [...]
8191C8
##END NTUPLES=NMR FID
##END=
