##TITLE=1H_Pr 5007-
 CDCl3
 8 sc, 
 16.2.2023
##JCAMPDX= 6.0         $$ Bruker NMR JCAMP-DX V2.0
##DATA TYPE= NMR FID
##DATA CLASS= NTUPLES
##ORIGIN= UXNMR, Bruker Analytische Messtechnik GmbH
##OWNER= root
$$ XWIN-NMR		Version 3.5
$$ Thu Feb 16 14:43:36 2023 Russian Standard Time (UT+4h)  she@DPX200
##.OBSERVE FREQUENCY= 200.13135
##.OBSERVE NUCLEUS= ^1H
##.DELAY= (6, 6)
##.ACQUISITION MODE= SIMULTANEOUS
##.ACQUISITION SCHEME= undefined
##.AVERAGES= 8
##.DIGITISER RES= 18
##SPECTROMETER/DATA SYSTEM= spect
##.PULSE SEQUENCE= zg30
##.SOLVENT NAME= CDCl3
##.SHIFT REFERENCE= (INTERNAL, CDCl3, 0, 15.7039)
##AUDIT TRAIL= $$ (NUMBER, WHEN, WHO, WHERE, WHAT)
$$ ##TITLE= Audit trail, XWIN-NMR		Version 3.5
$$ ##JCAMPDX= 5.01
$$ ##ORIGIN= Bruker BioSpin GmbH
$$ ##OWNER= she
$$ F:/spectra/data/she/nmr/H-F/1/audita.txt
$$ ##AUDIT TRAIL=  $$ (NUMBER, WHEN, WHO, WHERE, WHAT)
(   1,<2023-02-16 14:42:29.87 +0400>,<she>,<DPX200>,
      <created by zg, POWCHK disabled, PULCHK disabled
       configuration hash MD5:
       00 E9 B6 7A A2 85 ED C7 34 08 36 98 17 FE 4E 26
       data hash MD5: 16K
       02 4D EE 59 AD C9 43 05 25 31 E9 39 D0 44 AF 1F>)
$$ ##END=
$$ 
$$ hash MD5
$$ 21 F7 D9 E6 40 97 46 79 E7 73 43 0D 34 39 10 C3
##$RELAX= 
##$RELAX= 
##$RELAX= 
##$RELAX= 
##$RELAX= 
##$RELAX= 
$$ Bruker specific parameters
$$ --------------------------
##$DU= <F:/spectra>
##$EXPNO= 1
##$NAME= <H-F>
##$PROCNO= 1
##$TYPE= <nmr>
##$USER= <she>
##$AMP= (0..31)
100 100 100 100 100 100 100 100 100 100 100 100 100 100 100 100 100 100 
100 100 100 100 100 100 100 100 100 100 100 100 100 100 
##$AQSEQ= 0
##$AQ_mod= 1
##$AUNM= <au_zg>
##$AUTOPOS= <>
##$BF1= 200.13
##$BF2= 200.13
##$BF3= 200.13
##$BF4= 200.13
##$BF5= 200.13
##$BF6= 200.13
##$BF7= 200.13
##$BF8= 200.13
##$BYTORDA= 1
##$CFDGTYP= 0
##$CFRGTYP= 5
##$CHEMSTR= <none>
##$CNST= (0..31)
1 1 145 1 1 1 1 1 1 1 1 1 1 1 1 1 1 1 1 1 1 1 1 1 1 1 1 1 1 1 1 1 
##$CPDPRG= <>
##$CPDPRG1= <>
##$CPDPRG2= <>
##$CPDPRG3= <>
##$CPDPRG4= <mlev>
##$CPDPRG5= <mlev>
##$CPDPRG6= <mlev>
##$CPDPRG7= <mlev>
##$CPDPRG8= <mlev>
##$CPDPRGB= <>
##$CPDPRGT= <>
##$D= (0..31)
0 1.2 0 0 0 0 0 0 0 0.06 0 0.03 0 0 0 0 0.0002 0 0 0 0 0 0 0 0 0 0 0 0 
0 0 0 
##$DATE= 1676544149
##$DBL= (0..7)
120 120 120 120 120 120 120 120 
##$DBP= (0..7)
150 150 150 150 150 150 150 150 
##$DBP07= 0
##$DBPNAM0= <>
##$DBPNAM1= <>
##$DBPNAM2= <>
##$DBPNAM3= <>
##$DBPNAM4= <>
##$DBPNAM5= <>
##$DBPNAM6= <>
##$DBPNAM7= <>
##$DBPOAL= (0..7)
0.5 0.5 0.5 0.5 0.5 0.5 0.5 0.5 
##$DBPOFFS= (0..7)
0 0 0 0 0 0 0 0 
##$DE= 6
##$DECBNUC= <off>
##$DECIM= 32
##$DECNUC= <off>
##$DECSTAT= 4
##$DIGMOD= 1
##$DIGTYP= 9
##$DL= (0..7)
0 120 120 120 120 120 120 120 
##$DP= (0..7)
150 150 150 150 150 150 150 150 
##$DP07= 0
##$DPNAME0= <>
##$DPNAME1= <>
##$DPNAME2= <>
##$DPNAME3= <>
##$DPNAME4= <>
##$DPNAME5= <>
##$DPNAME6= <>
##$DPNAME7= <>
##$DPOAL= (0..7)
0.5 0.5 0.5 0.5 0.5 0.5 0.5 0.5 
##$DPOFFS= (0..7)
0 0 0 0 0 0 0 0 
##$DQDMODE= 0
##$DR= 18
##$DS= 0
##$DSLIST= <SSSSSSSSSSSSSSS>
$$ [...]
##$SUBNAM2= <"">
##$SUBNAM3= <"">
##$SUBNAM4= <"">
##$SUBNAM5= <"">
##$SUBNAM6= <"">
##$SUBNAM7= <"">
##$SUBNAM8= <"">
##$SUBNAM9= <"">
##$SW= 18.05172834244
##$SWIBOX= (0..15)
0 0 2 0 0 0 0 0 0 0 0 0 0 0 0 0 
##$SW_h= 3612.71676300578
##$TD= 16384
##$TD0= 1
##$TE= 0
##$TE2= 300
##$TE3= 300
##$TEG= 300
##$TL= (0..7)
0 120 120 120 120 120 120 120 
##$TP= (0..7)
150 150 150 150 150 150 150 150 
##$TP07= 0
##$TPNAME0= <>
##$TPNAME1= <>
##$TPNAME2= <>
##$TPNAME3= <>
##$TPNAME4= <>
##$TPNAME5= <>
##$TPNAME6= <>
##$TPNAME7= <>
##$TPOAL= (0..7)
0.5 0.5 0.5 0.5 0.5 0.5 0.5 0.5 
##$TPOFFS= (0..7)
0 0 0 0 0 0 0 0 
##$TUNHIN= 0
##$TUNHOUT= 0
##$TUNXOUT= 0
##$USERA1= <user>
##$USERA2= <user>
##$USERA3= <user>
##$USERA4= <user>
##$USERA5= <user>
##$V9= 5
##$VALIST= <valist>
##$VCLIST= <CCCCCCCCCCCCCCC>
##$VD= 0
##$VDLIST= <DDDDDDDDDDDDDDD>
##$VPLIST= <PPPPPPPPPPPPPPP>
##$VTLIST= <TTTTTTTTTTTTTTT>
##$WBST= 1024
##$WBSW= 4
##$XGAIN= (0..3)
0 0 0 0 
##$XL= 0
##$YL= 0
##$YMAX_a= 744513
##$YMIN_a= -924257
##$ZGOPTNS= <>
##$ZL1= 120
##$ZL2= 120
##$ZL3= 120
##$ZL4= 120
##$ABSF1= 10
##$ABSF2= 0
##$ABSG= 5
##$ABSL= 3
##$ALPHA= 0
##$AQORDER= 0
##$ASSFAC= 0
##$ASSFACI= 0
##$ASSFACX= 0
##$ASSWID= 0
##$AUNMP= <proc_1d>
##$AZFE= 0.1
##$AZFW= 0.1
##$BCFW= 1
##$BC_mod= 2
##$BYTORDP= 1
##$COROFFS= 0
##$CY= 11.3945322036743
##$DATMOD= 1
##$DC= 2
##$DFILT= <>
##$DTYPP= 0
##$F1P= 2.36226072786647
##$F2P= -0.459571619588291
##$FCOR= 0.5
##$FTSIZE= 0
##$FT_mod= 4
##$GAMMA= 1
##$GB= 0.15
##$INTBC= 1
##$INTSCL= 1
##$ISEN= 128
##$LB= 0.24
##$LEV0= 0
##$LPBIN= 0
##$MAXI= 10000
##$MC2= 0
##$MEAN= 0
##$ME_mod= 0
##$MI= 1.114404
##$NCOEF= 0
##$NC_proc= 0
##$NLEV= 6
##$NOISF1= 3.799351
##$NOISF2= 2.8
##$NSP= 1
##$NTH_PI= 0
##$NZP= 0
##$OFFSET= 15.70392
##$PC= 1
##$PHC0= -19114.06
##$PHC1= 15.80078
##$PH_mod= 1
##$PKNL= yes
##$PPARMOD= 0
##$PSCAL= 0
##$PSIGN= 0
##$REVERSE= no
##$SF= 200.130013532006
##$SI= 16384
##$SIGF1= 3
##$SIGF2= 2
##$SINO= 400
##$SIOLD= 16384
##$SREGLST= <1H.CDCl3>
##$SSB= 0
##$STSI= 0
##$STSR= 0
##$SW_p= 3612.71676300578
##$SYMM= 0
##$S_DEV= 0
##$TDeff= 0
##$TDoff= 0
##$TI= <>
##$TILT= no
##$TM1= 0
##$TM2= 0
##$TOPLEV= 0
##$USERP1= <user>
##$USERP2= <user>
##$USERP3= <user>
##$USERP4= <user>
##$USERP5= <user>
##$WDW= 1
##$XDIM= 8192
##$YMAX_p= 0
##$YMIN_p= 0
$$ End of Bruker specific parameters
$$ ---------------------------------
##NTUPLES= NMR FID
##VAR_NAME=  TIME,          FID/REAL,        FID/IMAG
##SYMBOL=    X,             R,               I
##VAR_TYPE=  INDEPENDENT,   DEPENDENT,       DEPENDENT
##VAR_FORM=  AFFN,          ASDF,            ASDF
##VAR_DIM=   8192,          8192,            8192
##UNITS=     SECONDS,       ARBITRARY UNITS, ARBITRARY UNITS
##FACTOR=    0.0002768,     1,               1
##FIRST=     0,             0,               0
##LAST=      2.2672688,     0,               0
##MIN=       0,             -924257,         0
##MAX=       2.2672688,     744513,          0
$$ Real data points
##PAGE= N=1
##DATA TABLE= (X++(R..R)), XYDATA
0 0 0 0 0 0 0 0 0 8 -8 8 -8 16 -16 24 -32 40 -48 56 -69 80 -97 120 -140 168 -195 229 -264 305 -353 407
30 407 -465 529 -602 682 -770 868 -974 1092 -1222 1364 -1516 1686 -1871 2072 -2290 2531
46 2531 -2795 3082 -3395 3740 -4120 4540 -5004 5522 -6098 6753 -7493 8341 -9328 10488
60 10488 -11879 13580 -15714 18488 -22252 27679 -36214 51669 -88444 363167 -68358 -875420
72 -875420 95533 631407 54235 -437736 63866 308531 -16836 -208421 -45495 -26176
82 -26176 86655 228831 -10662 -425942 -181964 349254 215419 -294125 -187534 166440
92 166440 53166 -193994 -40825 143784 54569 -17382 12033 -117763 -107663 228792 292981
103 292981 -126710 -274368 96326 252391 -52125 -134062 118111 119106 -100949 -107448 375
114 375 17273 63998 96771 -109146 -258376 19561 235856 -42326 -214036 66303 140459
125 140459 -187203 -176351 231858 184600 -229754 -115945 255233 49228 -276869 40512
135 40512 393770 28012 -359703 -30524 313592 58957 -178365 8540 122498 -49964
145 -49964 -102341 28148 23987 -23158 50257 -13283 -184477 -70401 176667 76700 -181528
156 -181528 -86498 135180 6979 -155183 30528 173035 -9571 -129873 16063 90220
166 90220 -10930 12498 105231 1161 -96711 22099 99906 -4055 -41126 55050 27585
177 27585 -99674 -47521 72063 17711 -52421 -7536 -14961 -85812 -22578 89419 -283 -113635
189 -113635 10092 88437 -76617 -108714 119371 157098 -105631 -156067 112772 160451 -73797
200 -73797 -89860 111125 107584 -74962 -84447 59598 82034 9044 -21140 -53632 -51921 43999
212 43999 67920 -58027 -103737 32748 73477 -86918 -113584 66009 96536 -60768 -94110
223 -94110 22078 44933 -17448 15344 52756 -26486 -44085 55681 62857 -29431 -16346 76689
235 76689 39695 -69368 -28226 72352 42666 -27816 -27524 -12331 -16547 3872 19757 -32224
247 -32224 -53962 18978 21200 -73341 -56544 63792 57958 -70299 -75634 47797 55769 -29000
259 -29000 -10745 45987 12533 -26834 15799 47892 4958 -4219 39698 13626 -36858 -2069
271 -2069 46149 17052 -28617 -16305 69 -22663 -9815 18464 -17726 -45682 -5534 12575
283 12575 -34341 -39916 32247 38280 -47918 -48256 38164 44248 -17128 -15095 37739 27859 -20122
296 -20122 -355 37856 24064 7624 6691 -5466 -8502 16326 27715 -11406 -32844 5677 9901
309 9901 -32256 -27008 13110 6744 -35297 -32330 4696 -4271 -19637 8666 12386 -21228 -19572
322 -19572 20257 28851 -4125 -2293 28886 14202 -9418 11207 30029 16548 -633 3682 6344
335 6344 -5744 3112 14995 -6965 -19221 -5252 -4006 -19721 -17909 6139 -496 -33711 -24056
348 -24056 6878 1102 -13943 -4729 9146 -1185 -11225 9740 20406 6218 8112 14968 8074
361 8074 3070 12753 23256 10276 -3665 5655 5970 -4372 -643 4034 -1924 -13738 -15331 -7032
375 -7032 -10773 -10487 -2033 -12993 -22694 -9828 3974 -2194 -15279 -2702 17445 3280 -13142
388 -13142 919 22558 25501 4711 -8350 7179 23987 22689 1431 -11947 10045 23867
400 23867 -530 -23355 -9336 19342 8912 -29086 -29543 -604 7299 -8539 -23253 -16253 -2409
413 -2409 -1719 -4780 -10275 -7263 10393 12902 -3183 -8949 7860 28098 17219 -5982 92 18149
427 18149 19126 6479 -1825 6687 8958 -497 -1718 -3484 -6613 -3360 -1121 -5792 -20328 -22378 1523
442 1523 8570 -15223 -28821 -11226 14441 6774 -18969 -12211 12032 18832 6060 -9288 -1716
455 -1716 19846 29449 14244 -16800 -12493 34333 42843 -10645 -42753 3652 53738 9213 -58599
468 -58599 -29284 40961 29406 -44316 -56712 9950 36896 -11050 -43218 -20537 15037 18140
480 18140 -7050 -21780 -10051 21494 34066 -4866 -32841 8037 54683 27165 -34735 -23229
492 -23229 45182 44753 -20433 -34590 15566 36566 -6260 -34347 -6040 13824 -1995 -15561
504 -15561 -15712 -12193 -8974 455 2572 -18928 -23660 7600 19099 -7257 -21291 6310 28837
517 28837 3383 -14277 12166 23919 3164 -419 21301 16341 -17868 -5909 39982 19004
529 19004 -41468 -27247 39151 31850 -46470 -51113 27515 38539 -33439 -54822 2198 33513
541 33513 -5248 -33659 -11833 6567 10088 11108 -6302 -20016 6390 42403 19496 -35796
553 -35796 -15208 55140 43407 -31651 -38730 32430 54203 -12319 -46687 1648 34704 4329
565 4329 -31381 -22174 7403 8329 -9667 -21074 -20117 -1279 13395 -1384 -24304 -17873 17031
578 17031 25391 -11810 -25052 13938 37110 5502 -24040 5522 39984 11420 -20901 3867
590 3867 29543 4247 -22059 4753 27064 -10770 -33445 4847 24119 -14386 -38285 -2742
602 -2742 22235 -11436 -32445 -5187 11620 -1179 -9897 -4546 -1905 822 16285 12830 -15420
615 -15420 -7035 31381 28143 -14261 -19670 26039 38192 -8076 -27400 6470 27652 5694 -22059
628 -22059 -16502 5918 8941 -5401 -22076 -19339 4820 10808 -12683 -27453 -8556 18976 9554
641 9554 -20607 -17392 12797 25415 3802 -19262 -819 30269 20821 -10665 -11631 20313 28425
654 28425 -4263 -16724 7593 17187 -1187 -13112 -2723 2561 -8755 -8104 -831 -9486 -13523
667 -13523 -3505 694 -9198 -14690 -105 6635 -4941 -5726 3480 4794 3762 5902 7187 2997
681 2997 3256 14560 11011 -2397 3011 13958 8259 -4993 -4367 7466 3768 -8008 -5735 -2919
695 -2919 -5858 -6178 -5649 -6905 -10417 -6723 24 -6113 -10556 -1100 4013 366 -3446 -217 7105 7382
711 7382 4772 3709 3096 9844 12590 2577 -626 7104 12191 2407 -8900 805 9090 -3007 -11675
726 -11675 -5322 706 -4275 -12409 -7668 -2088 -6284 -6872 -6042 -4975 -688 -203 -1454 -1500 1956 7604
742 7604 4098 172 7466 10229 5286 3202 6352 9020 3810 1600 5925 1919 -3659 231 2271
757 2271 -2935 -9031 -6052 424 -6117 -11796 -6467 -2688 -3781 -7154 -7376 -1322 857 641 -1156 -2089
773 -2089 4873 8862 3109 1268 5892 10548 7726 807 4259 8655 4770 1911 545 -75 712 -719
789 -719 -2041 -5751 -7405 -1608 -2506 -10077 -9487 -3102 -1218 -6213 -9378 -1689 2161 -856 -1473 -964
805 -964 3137 6946 4264 2091 3557 8683 10760 2035 -476 7982 9035 1525 -3517 1259 5988
820 5988 -1669 -6958 -2964 -1927 -3849 -7101 -7975 -4850 -3964 -4352 -5803 -7693 -1416 1962 -2608 -3576
836 -3576 1886 6164 3370 -711 4741 8943 5002 4190 5487 5367 4615 4096 5015 652 -2478 2873
852 2873 1699 -5157 -5570 -2104 -1440 -6255 -8832 -4100 -4227 -5699 -3772 -4971 -5310 -1394 1457 -173
868 -173 -3125 976 7777 3908 628 4852 6927 6177 4492 4259 4249 2573 5703 5116 -3657 -3505 4264
885 4264 3035 -6709 -9682 -252 2027 -8496 -10103 -3652 -2347 -3584 -5050 -4954 -3721 -382 4224
900 4224 -281 -5398 3551 11230 4216 -1807 2886 11977 7941 -623 2865 5765 4247 3209 760
915 760 -1801 -1133 1039 356 -7115 -6878 -310 -3315 -7687 -5643 -3408 -4863 -4782 -78 -1132 -8305 -1185
932 -1185 9545 1822 -6938 1789 13148 6394 -4411 3696 12399 3982 657 5736 3388 -1243
946 -1243 2878 8203 -3734 -13004 2870 10547 -9028 -18451 -1146 9613 -6332 -18537 -3334
959 -3334 6442 -3036 -7430 -2984 411 1280 3130 3084 -2756 228 12388 9242 -3417 -882 10323
974 10323 11804 462 -4891 3576 7752 3054 -4176 -7545 528 5436 -4513 -12228 -5045 3762 -3175
989 -3175 -13044 -3663 3816 -6604 -7619 3590 3263 -7792 -2839 13255 6413 -10836 1485 18638
1003 18638 5940 -8760 3923 16393 2316 -7877 7971 9583 -8008 -4353 10810 802
1015 802 -17609 -5492 14787 -2432 -23993 -5053 13631 -2764 -19138 -5252 10165 -775
1027 -775 -9540 257 3735 -479 4187 6276 -555 -2223 9807 13269 -1935 -5995 8998 12737
1041 12737 591 -6665 -829 7547 3981 -5511 -9355 -2695 6679 -1356 -15947 -8024 6864 860
1055 860 -13582 -8521 6947 1403 -9343 366 6846 -2610 -2359 9712 7203 -6360 724 17766
1069 17766 6104 -11212 3886 17727 1124 -12284 4174 13530 -6163 -12476 6651 5391
1081 5391 -13505 -9195 7405 -139 -16480 -5954 9534 -3929 -14049 1021 7805 -3917 -6328
1094 -6328 6027 6693 -4535 1347 11838 2302 -4192 6861 11369 238 -4396 6427 8452 -2698
1108 -2698 -2866 2204 -562 -2166 -981 -3690 -7229 -2099 3045 -6568 -12321 964 5331 -7762 -9154
1123 -9154 3766 6073 -4955 -3683 7922 3968 -3309 5168 8840 -218 -880 10063 8399 -5654
1137 -5654 -832 12718 2694 -9788 188 8780 -3169 -11273 722 4825 -9276 -9430 3469
1150 3469 -889 -10679 -3414 5299 -2874 -9381 3100 7853 -5388 -4222 9538 6897 -4420 270
1164 270 11594 5136 -4699 4717 9910 -804 -2543 5359 3716 -4819 -2219 4736 -2782 -9451 396
1179 396 2333 -8085 -8028 1612 700 -8866 -4857 4986 -1324 -7116 2044 5537 -1967 -2352 7123 6372
1195 6372 -2333 1664 10037 3176 -2858 4788 7200 -734 -2609 4848 2860 -6309 -1791 4784 -4039
1210 -4039 -8614 -543 2262 -7044 -8732 1965 1369 -8642 -3916 4617 -669 -5549 1509 6565 -1093
1225 -1093 -3139 7481 6730 -2676 1332 9036 4253 -2695 2312 7491 -169 -3851 3719 2489 -5203
1240 -5203 -2879 2433 -1984 -8179 -2777 2570 -5216 -8340 878 989 -5775 -4200 2799 1339 -4553
1255 -4553 945 6142 225 -1410 6163 6045 -272 471 7096 4882 -2209 1790 5791 -548 -2723
1270 -2723 1980 1431 -4492 -3900 1648 -2206 -7994 -2173 1637 -4970 -7231 -43 1765 -4483 -4655 3168
1286 3168 2103 -3111 1439 4913 1528 -294 4352 5850 117 733 6914 3258 -2212 1616 4829
1301 4829 -409 -3866 706 2524 -4393 -5004 907 -1788 -6287 -3257 271 -2998 -6420 -679 1964
1316 1964 -3725 -3242 3617 2406 -1706 238 5604 3454 -1037 3510 6460 1498 569 4061 3426 -229
1332 -229 3 3017 271 -3478 39 706 -3932 -4196 -1097 -1627 -4884 -4222 -268 -2412 -4513 -596
1348 -596 666 -1877 -1142 1706 2111 -474 1493 4986 2090 765 3948 4387 1237 1050 3799 2896
1364 2896 -1693 202 3398 -1296 -3949 -724 803 -3051 -5766 -1228 -87 -5312 -4307 -16 -1741
1379 -1741 -3638 -1592 1550 -610 -2102 2059 3592 56 826 3856 3892 1491 1496 3952 3067 684 1944
1396 1944 1750 93 190 157 -654 -2119 -1983 -709 -3044 -3672 -1732 -2252 -3313 -2451 -1631 -1595 -2236 -309
1414 -309 927 -1304 -173 3240 2388 477 1669 4192 3575 366 2103 4143 1584 183 1841 1465
1430 1465 -579 -1682 887 117 -3871 -2921 -199 -1835 -4485 -3771 -573 -980 -4010 -2542 268 -87
1446 -87 -1027 -952 1316 1948 882 1937 2670 2084 2499 2783 2940 2136 1135 2283 2303 429 -696 -222 1133
1465 1133 -500 -3492 -2286 -415 -2219 -3815 -3365 -998 -1787 -3590 -1719 283 -1470 -1453 681 1878
1481 1878 0 -356 3168 3854 391 1348 4268 3522 596 377 3607 2758 -1128 -447 1676 -230 -2507
1498 -2507 -1850 312 -1771 -4691 -1807 92 -3119 -4201 -1686 734 -1582 -3799 347 2333 -323
1513 -323 -1032 2073 3452 1559 393 3381 3524 964 1527 3326 2053 -49 89 2235 618 -2813
1529 -2813 -1185 679 -1410 -3636 -3033 -250 -1670 -4557 -2327 -272 -1442 -2914 -1286 1229 -2
1544 -2 -1233 1248 2497 763 454 2737 3620 1429 646 3360 3460 182 204 2011 1749 -1206 -1640 866
1562 866 -170 -3163 -2192 -518 -1665 -3510 -2783 -171 -1799 -3432 -1112 599 -684 -1474 140 2065
1578 2065 1276 -4 2185 2835 1515 1434 2329 3080 1232 571 2479 1364 -266 -76 448 200 -1746
1595 -1746 -2256 -379 -1177 -3118 -2369 -1311 -1470 -2586 -2277 -400 -550 -1423 -316 583 1062 508 934 2889
1613 2889 1506 771 2429 2571 1650 1233 1453 2413 241 -503 1204 137 -1276 -1459 -869 -701 -2318
1630 -2318 -2454 -1105 -1897 -2827 -1683 -1103 -1006 -1457 -952 333 282 -132 969 1323 1634 1503 1677 2594 1697
1649 1697 1679 2003 1535 1311 416 358 1021 -502 -1158 -595 -1026 -1467 -1934 -1843 -1355 -2402 -2455 -1306 -1330 -1533
1669 -1533 -858 -347 104 -372 61 1413 1146 1210 1582 2063 2232 1457 1540 2463 1518 876 1023 800 770 -354
1689 -354 -749 -245 -1185 -1522 -1248 -1608 -1722 -2214 -2126 -845 -1546 -1768 -733 -461 -169 -464 213 1289 882
1708 882 661 1483 2029 1694 1387 1829 2408 1300 801 1298 862 326 -155 -14 -178 -1538 -1603 -823 -1404 -2438
1728 -2438 -1836 -1295 -1358 -1861 -1354 -349 -873 -624 -32 320 224 567 1319 1799 1340 1592 2143 1716 1422 1293
1748 1293 1027 1438 725 358 111 -475 -352 -1180 -1569 -787 -1593 -1980 -1482 -1725 -1438 -1531 -1388 -577 -1256 -664
1768 -664 308 415 631 449 1519 1947 1201 1335 2200 1862 1450 1023 1299 1559 136 8 552 -300 -736
1787 -736 -904 -609 -989 -1970 -1639 -1165 -1689 -2005 -1233 -1088 -983 -998 -156 191 66 404 743 1134 1532 1332
1807 1332 1388 1975 1391 1438 1624 1017 1117 465 221 120 -67 -760 -947 -918 -941 -1784 -1655 -1017 -1331 -1956 -1820
1828 -1820 -1185 -778 -1073 -824 431 175 -105 716 1512 920 692 1482 2344 862 772 2138 1634 566 430
1847 430 1036 983 -1058 -862 332 -1087 -1702 -1370 -909 -947 -2011 -1545 -608 -1281 -1268 -809 -202 -87 -323 287
1867 287 1030 574 762 1189 1248 1530 1296 1122 1563 1214 724 545 764 691 -524 -608 230 -814 -1618 -1288
1887 -1288 -822 -1198 -2184 -1376 -331 -1428 -1710 -597 135 -617 -791 659 1402 -16 214 1914 1822 645
1905 645 883 1927 1910 85 836 2196 503 -643 40 454 -438 -1637 -974 -237 -1661 -1779 -1210 -1079
1923 -1079 -1477 -1773 -859 -416 -950 -417 128 369 468 453 681 1417 1106 838 1306 1522 1120 748 806 1500 596
1944 596 -314 375 179 -486 -1419 -640 -333 -1919 -1906 -964 -788 -1651 -1631 -511 40 -1442 -491 785 45
1963 45 -266 434 1630 1262 121 1556 2186 939 435 1318 1300 486 -402 567 732 -926 -600 -54 -637
1982 -637 -1200 -1413 -886 -996 -1647 -1303 -661 -936 -997 -906 -72 232 -102 227 936 964 781 934 1396 1531 787
2003 787 856 1653 1045 698 -42 492 570 -742 -579 28 -623 -1317 -1397 -832 -714 -2132 -1556 -245 -1300 -1548
2023 -1548 -311 426 -388 -691 828 1381 58 272 1478 1609 377 612 1788 1419 158 871 1201
2040 1201 356 -211 25 401 -424 -1135 -550 -553 -1483 -1195 -902 -907 -1117 -900 -487 -609 -430 76 64 373 488
2061 488 466 767 905 916 934 895 1137 1265 685 582 1143 450 -69 -292 424 98 -1294 -675 -113 -1224 -1618
2082 -1618 -520 -502 -1120 -1605 -375 -373 -1350 -534 580 177 -350 427 1597 634 -65 1476 1644 740 808
2101 808 1358 1136 147 81 1143 71 -869 -11 -113 -645 -1187 -847 -654 -1458 -1227 -519 -1072 -923 -589 -405
2121 -405 -557 -56 457 424 -181 829 1450 520 743 1657 1102 542 720 972 987 -239 608 750 -337 -772
2141 -772 -273 -181 -1217 -1343 -76 -742 -2114 -977 -82 -969 -1005 -279 751 -673 -278 700 1042 -59
2159 -59 616 1269 1089 290 878 1453 585 145 1191 928 -128 -136 455 -246 -823 -590 -40 -867 -1418 -518
2179 -518 -914 -1328 -771 -266 -738 -943 -185 292 -435 217 849 335 210 972 1387 565 263 1444 1261 -147
2199 -147 120 1122 539 -577 -235 615 -542 -1262 -281 217 -1223 -1120 -151 -399 -1568 -1090 204 -470
2217 -470 -1332 -80 532 -1 -300 852 1218 123 239 1557 940 227 781 1188 615 48 490 406 -582
2236 -582 -354 -51 -386 -1005 -920 -446 -856 -947 -767 -445 -1514 -885 14 -394 -578 264 602 139 16 1001
2256 1001 1060 -25 680 1528 753 273 612 1246 259 -604 946 560 -598 -425 388 -385 -1450 -652 241
2275 241 -873 -1549 -307 -456 -797 -660 -101 159 -949 157 1069 194 29 780 1055 687 531 1170 1064
2294 1064 332 900 879 244 108 470 144 -540 -659 81 -330 -1159 -389 -350 -770 -1239 -226 -477 -1085 -724
2314 -724 372 -22 -686 401 790 393 86 957 1338 468 250 1116 983 12 467 818 628 -251 -419
2333 -419 326 -631 -929 -112 -368 -958 -900 -466 -479 -1445 -543 -292 -454 -624 241 241 35 151 640 621 400 1010
2355 1010 899 301 596 809 505 806 341 667 47 -346 64 -352 -1016 -553 -299 -613 -1017 -825 60 -955
2375 -955 -1338 -87 151 -602 -563 460 782 -249 32 994 688 -18 734 1145 815 327 837 1257 289
2394 289 210 385 102 -494 -475 -172 -289 -783 -566 -415 -712 -699 -603 -486 -592 -596 -514 -210 -39 374 67 127 478
2417 478 297 578 716 687 986 288 525 974 210 160 508 325 75 -274 -349 188 -963 -681 -273 -623 -1006
2438 -1006 -543 -239 -450 -769 -240 466 -143 -166 542 598 35 175 948 776 -75 518 1129 387 133 493
2458 493 780 481 -244 14 119 -266 -551 -521 -409 -430 -870 -466 -510 -614 -527 -80 -446 -446 -359 -440 212 241 227
2481 227 451 499 523 363 416 797 503 565 616 513 263 67 66 27 -245 -782 -267 -122 -533 -662 -525 -574 -775
2504 -775 -494 -199 -379 -300 -42 -92 76 -110 380 672 382 631 524 637 651 373 416 478 106 464 129 -233
2526 -233 105 -232 38 -474 -652 -482 -736 -704 -371 -624 -350 -301 -286 -58 -123 -180 54 156 197 462 402 657
2548 657 528 390 482 633 539 596 504 306 190 -9 -23 -321 -343 -291 -327 -603 -567 -531 -425 -445 -416 -328 -520 -120
2572 -120 -160 -297 108 180 484 449 703 271 405 586 842 247 262 618 574 -6 338 -360 74 -148 -285 -93
2594 -93 -566 -697 -432 -418 -467 -489 -415 -385 -564 -329 -60 -118 -216 120 221 442 604 458 511 486 534 478 593 591 129
2619 129 257 383 -130 -92 -137 -424 -479 -498 -491 -252 -373 -584 -710 -617 -368 -241 -513 48 -109 62 -6 235 522
2642 522 334 554 574 73 718 447 390 324 331 433 261 -94 -52 225 -319 -191 -231 -662 -160 -602 -471 -388 -340
2665 -340 -592 -451 -148 -67 -373 -19 348 139 236 217 596 611 167 254 444 251 230 314 393 36 -179 -123 -143
2688 -143 -213 -436 -157 -538 -384 -302 -284 -378 -672 -553 -303 -248 -158 44 31 60 -36 360 511 408 631 317 488
2711 488 668 -89 766 851 131 -13 162 157 -211 -285 -162 -202 -442 -428 -421 -496 -619 -447 -350 -311 -475 -280 -98 -39
2735 -39 -76 -53 260 319 118 468 474 710 319 296 732 50 184 275 129 -60 -126 -281 59 -264 -319 -302 -135 -431
2759 -431 -548 -362 -189 -289 -406 58 -8 -9 -30 345 318 158 363 248 323 262 463 322 611 514 593 392 378
2782 378 -258 -51 -223 -129 25 -227 -70 -254 -485 -312 -297 -329 -512 264 -63 -44 33 -74 154 214 105 223
2804 223 720 340 210 557 608 309 406 -31 273 7 -184 -91 -105 -213 -114 -46 -166 -348 -499 -273 -366 -349 40
2827 40 -150 -150 -190 -117 69 64 -171 375 386 -17 280 474 467 340 123 541 -45 -174 167 224 43 -152 33 -150
2851 -150 -465 -239 -176 -292 -90 -271 -487 -62 -30 -442 -228 9 13 -34 -172 276 48 112 218 375 643 426
2873 426 336 321 367 154 119 311 -176 -182 -132 -315 -437 -425 -119 -606 -306 -542 -339 -56 -195 -209 205 -265 -337
2896 -337 85 185 359 2 201 650 254 -56 456 345 242 56 127 317 138 -330 197 2 -295 -455
2916 -455 -221 -198 -695 -359 -265 -262 -473 -349 -5 -69 -151 -274 148 130 -223 65 393 423 308 216 285 183 132 -26
2940 -26 181 192 205 -25 210 -338 -189 -235 -25 -404 -550 -98 142 -376 -520 46 -140 -387 -168 -14 319
2961 319 23 -22 211 58 63 76 368 75 276 16 165 99 -380 -20 243 8 -24 -367 215 -109 -267 -228
2983 -228 -208 -351 -189 -271 -387 108 -134 -319 -12 55 -137 84 171 80 50 273 344 329 81 101 114 177 85 -13
3007 -13 334 11 -21 -199 -206 -278 -206 -354 -348 -461 -218 -711 -42 -241 -219 -335 128 -126 -6 -149 10 -52 272
3030 272 356 62 186 195 217 331 -80 -62 -15 -125 50 191 -560 -150 -355 -215 -119 -396 -175 -72 -105 -373 -25
3053 -25 -210 -145 -365 40 184 -147 177 239 336 259 -194 150 284 208 364 228 -271 71 -221 151 -153 -324
3075 -324 -153 -34 -184 -196 -204 -292 -133 -290 -244 -388 -221 -148 -344 -77 -84 304 210 -208 5 220 160 -111 372
3098 372 215 393 375 104 138 -88 56 169 -219 99 -154 115 -145 -163 -379 -359 -131 -207 168 -232 -166 -224
3120 -224 32 79 63 133 -28 83 161 200 247 178 319 372 -93 44 274 112 -20 198 -14 -351 -243 -133 -45
3143 -45 -424 -317 -25 -327 -166 -428 -152 -201 -62 -122 -193 -253 216 314 49 4 306 454 292 53 405 248
3165 248 143 458 -24 64 -72 -83 111 -200 -270 -42 -159 -361 -254 -81 -301 -4 -293 46 -99 -119 -11
3186 -11 115 -142 266 221 39 15 273 182 82 327 289 72 22 89 181 46 -158 -236 189 -108 -41 -170 -270
3209 -270 -226 -296 -58 -357 -174 148 -28 -28 -97 221 25 -208 296 261 168 247 214 203 214 72 17 -105 180 42
3233 42 -101 73 -173 -297 -168 -110 199 -261 -13 -207 -360 -69 -432 19 -46 -84 200 -80 44 57 -85 142
3255 142 210 283 205 363 340 134 313 286 -16 53 61 335 -45 -69 -280 -169 -183 -450 82 2 -122 -131 -96 -273 -198
3280 -198 -67 5 202 -236 64 467 5 143 15 358 -17 197 516 -7 -8 265 93 -22 58 -190 -256 -130
3302 -130 -35 11 -40 -299 -169 -155 -114 -113 91 81 -76 -226 -42 145 28 298 -282 29 92 138 298 61 49 494
3326 494 31 77 242 208 129 75 -148 -13 -229 -198 92 210 -148 -95 -4 -328 -268 137 -242 -373 201 36 131
3349 131 -20 108 158 210 273 -87 86 206 53 148 -5 -362 256 -63 72 39 219 -302 -99 -45 5 -115
3371 -115 -238 -148 -37 -135 64 -77 -104 153 -136 -196 22 -76 307 231 59 296 160 299 186 353 -45 23
3393 23 -114 -41 -208 -46 -132 -190 2 -173 -241 7 288 -128 5 -14 -329 -229 4 -23 70 -7 102 -169 73
3416 73 28 62 223 -19 327 167 58 92 277 2 15 215 -77 -161 -164 -396 -35 -140 -421 8 -150 -27 -4
3439 -4 -259 -309 -225 260 -63 1 111 162 16 195 195 276 -27 391 190 131 53 23 61 -58 -98 127 -20 120 -106
3464 -106 -28 265 -288 -102 -66 -141 -334 -56 31 -67 126 49 -129 24 228 46 152 124 236 267 37 -65 296
3487 296 92 -93 33 146 276 102 94 -118 92 -225 -107 -407 -247 70 -136 -52 -409 -188 -123 -333 174
3508 174 157 -205 23 284 451 105 82 138 244 37 47 186 237 95 15 34 192 -31 -66 -121 -319 -48 -250
3531 -250 -97 -187 -154 -346 -69 -419 52 -243 -206 -144 -168 260 -154 135 262 174 227 172 343 139 462 94 124
3554 124 -258 54 -184 -38 -11 -237 -16 -293 -55 -184 -179 -202 -51 -13 -231 103 -338 -55 -150 -5 43 -46 103
3577 103 -48 205 -83 111 58 108 150 -280 227 68 -21 -26 -161 -3 -372 58 32 -399 -342 57 -53 -99 -11
3600 -11 -37 -8 -55 10 -42 135 102 0 50 -64 -43 5 208 243 302 -19 68 202 -36 -52 184 -136 -24 75 6
3625 6 28 -321 21 -107 -112 -242 135 -23 -99 -331 -178 -277 -225 -40 129 40 211 175 232 4 254 -36 120 8
3649 8 307 169 -139 51 -133 53 30 -30 90 -80 -216 -175 -35 -388 -121 -165 42 299 -102 -58 -93 -62 -314
3672 -314 -70 73 79 35 235 -37 129 125 -1 -219 173 55 -16 219 69 290 -144 -36 -188 -316 -323 -219 82
3695 82 -98 -78 -117 79 -47 -154 -161 359 -155 128 139 -50 139 109 -35 199 13 240 228 -57 80 182 15
3718 15 -272 -175 -126 -46 35 245 -88 -327 -284 -25 18 -96 -62 -89 -158 151 186 -88 -68 19 47 130 -17 109 5
3743 5 63 -11 26 -66 -39 213 -1 -47 -293 -47 -43 100 44 -107 -10 -180 0 -125 -8 -189 -22 -328 -60 -24
3767 -24 -63 149 209 7 286 7 125 -11 89 167 24 -9 64 130 93 354 -66 -70 -124 -133 -145 -197 -38 165 169 -299
3793 -299 -33 -77 -273 52 -237 -28 -34 -97 -53 34 92 -136 217 23 122 114 25 22 104 30 132 296 122 0 -21
3818 -21 -9 370 37 -158 85 -90 -62 131 -172 -120 -145 -133 -77 17 -113 57 152 75 225 164 235 -108 295 80
3842 80 418 -221 -42 166 -17 111 80 442 -168 -241 -216 -269 -90 -59 -139 -151 -99 -58 152 -216 84 49 44 64 88
3867 88 -30 -99 101 277 2 1 100 315 173 9 -60 245 -35 -9 -58 -13 13 -2 -183 -242 13 -315 -14 83
3891 83 -177 121 -106 -399 95 4 247 36 87 77 57 196 -106 -41 194 166 8 -266 -144 43 18 79 -65
3914 -65 -37 9 92 -106 -355 86 -248 48 -122 -270 -201 5 -289 -95 -148 -95 2 -70 -17 -82 103 13 13 -150 134
3939 134 181 -306 5 26 57 56 -68 233 -226 -10 63 -1 -197 68 -170 89 -197 -57 -191 -36 -58 -340 154
3962 154 112 -10 -273 13 236 -27 0 371 -190 31 110 437 146 140 -80 10 -300 -179 -31 23 -141 35
3984 35 -280 -95 -353 -344 -205 -276 -114 -71 57 -65 69 -247 19 224 -8 77 33 16 -44 68 157 82 184 148
4008 148 37 186 -146 129 24 -100 45 -64 -54 -262 -45 30 249 102 -258 -89 -145 -24 98 48 207
4029 207 116 -29 298 133 118 68 -36 123 278 212 2 106 64 134 -62 -220 50 -170 -48 87 -288 -156
4051 -156 -254 -354 -287 -251 -61 -19 66 -80 -59 148 -164 142 138 102 66 102 71 -63 166 -83 100 74 257 218 -410
4076 -410 52 -87 -403 -115 -104 -205 -216 -264 -116 -202 -132 1 -90 -42 118 -7 -18 2 -172 149 98 53 180 40
4100 40 -177 -45 1 17 182 -17 95 -245 -5 -40 -134 -70 -77 -369 -143 -42 -188 -277 -416 -391 -149 80 89 135
4124 135 -108 262 99 335 10 149 -113 54 139 89 21 117 -60 401 73 -106 -99 23 -223 -338 -8 -216
4146 -216 57 -264 -112 15 -86 212 115 -75 -171 -20 145 51 -38 -91 253 216 82 239 82 -117 -133 69
4168 69 305 -9 -55 -183 -4 142 113 -317 37 -168 -311 -207 33 -100 31 -138 195 -172 -34 161 -102
4189 -102 118 -1 72 405 42 200 203 319 -135 137 15 171 144 278 247 -67 70 -101 -110 -43 -111 -27 -22 -171
4213 -171 -227 24 -22 -278 103 -148 -25 -226 -122 108 -82 60 33 474 254 -59 -17 -12 -3 -24 354 229 13
4236 13 43 -38 83 213 -215 -61 93 -19 25 -28 53 -122 -344 -245 -23 -124 64 -76 45 123 -78 187 144
4259 144 -69 116 104 -62 0 151 97 151 147 -4 -195 -166 -410 -298 -111 -165 57 43 -36 3 -163 34 -178 -270
4283 -270 -235 30 -3 -90 26 1 -35 -6 241 125 60 301 80 116 217 -42 26 245 374 -31 169 -28 -288
4306 -288 10 -138 -133 -199 -245 -53 66 -20 -88 16 -26 203 38 -107 -81 -22 294 435 -16 -51 172 26 241
4329 241 -53 254 -24 126 82 -106 -146 36 -26 43 48 7 -226 97 61 -268 -196 -133 -183 -294 81 215 -54 128
4353 128 -56 -100 -13 -44 108 92 14 -44 -184 123 -2 -45 6 38 154 -165 -228 -123 -212 -89 -106 -167 -137 -167 -163 -16
4379 -16 -46 -6 112 255 -11 5 193 145 66 24 215 -302 -38 164 245 186 -125 -153 14 56 27 91 61 -256 145
4404 145 -99 -153 26 -182 -121 -160 -141 -106 -175 76 94 -355 0 -23 -179 53 119 -232 49 -121 248 145 88
4427 88 176 -175 99 42 35 -116 -111 42 -31 -151 37 146 -279 -297 -85 -233 37 91 -69 -319 40 119 -30 123
4451 123 -51 -25 13 -57 172 52 118 -20 87 -4 244 -177 3 164 -205 -65 171 -75 -324 -184 70 -135
4473 -135 37 -342 -126 6 -80 191 -166 74 133 86 44 245 -133 -63 -21 -57 247 245 -67 135 237 -209 52
4496 52 66 -47 -278 -75 -211 15 -217 -181 -409 -265 -46 -235 -5 -6 -219 -177 150 40 156 118 20 206 217
4519 217 35 139 -44 95 90 -47 157 -63 -147 -132 -69 310 221 -91 -353 -357 17 55 150 -214 68 101 2 63
4543 63 114 9 99 83 -191 21 -12 249 372 184 -63 351 203 36 34 -8 -146 192 165 -46 -147 -12 278
4566 278 172 -14 -480 63 -138 -331 243 -38 -361 206 50 -78 33 124 10 184 173 54 238 272 38
4587 38 263 219 -149 5 -4 -123 -89 -192 322 -155 -28 107 113 -273 -20 -254 -10 -78 -179 68 86 124 284
4610 284 135 223 67 -329 30 160 3 -226 229 77 77 -14 144 -72 60 -42 135 250 -52 -270 60
4631 60 53 -297 17 -288 -64 -161 -122 -61 -165 -31 69 207 65 -41 265 17 141 -192 154 111 159 218 -7
4654 -7 36 -82 -104 53 105 98 144 -364 -58 12 -178 -225 -206 -35 8 54 118 260 -25 -331 75 27 66 314 155
4679 155 95 1 20 239 -20 -60 -114 -192 82 57 -157 -177 159 -20 -8 -108 35 -87 -271 -178 -100 157 -99 -214
4703 -214 -265 30 5 -23 -33 -54 95 64 -45 253 93 198 12 51 -37 88 -68 146 -69 -168 -60 -51 -29 -54
4727 -54 62 175 -267 -166 -227 99 -53 -83 146 -12 -83 -107 -45 318 95 -119 -28 -128 -20 -137 97 90 39
4750 39 122 -100 155 -41 -195 439 79 -235 -148 152 64 -121 -6 61 -2 25 -82 -271 -88 -102 128 -50 -66
4773 -66 134 93 447 87 83 154 -38 240 156 -36 12 231 92 68 -395 -75 42 -233 -102 -36 32 -246 -52
4796 -52 -71 -46 92 -125 -272 -117 -26 -228 -29 -278 76 201 14 -211 197 369 32 17 39 62 22 251 -11
4819 -11 95 -15 14 -134 95 -162 -5 73 -18 -107 34 43 -215 5 34 -192 163 4 26 43 149 -101 -48 149
4843 149 24 144 146 -156 123 62 116 -94 28 -69 -81 -42 43 -250 -35 -39 -40 -19 -18 -116 -376 28 -157 126 291
4868 291 -122 157 256 -175 -25 96 -194 -173 14 88 -35 52 157 -64 109 -84 -154 -207 27 127 49 105 -133
4891 -133 -74 -102 -84 -146 -239 25 80 -4 -160 71 308 222 13 -7 112 -26 -148 95 -34 46 37 -103 -33 -16 -60
4916 -60 -52 -79 -150 56 56 -114 18 -8 -37 76 -39 198 -312 131 163 -45 173 -9 86 166 3 27 -128 -13
4940 -13 165 -14 175 -183 -56 98 247 -210 150 151 -107 32 -169 -67 -147 82 -23 17 -138 -89 -28 -31 -84
4963 -84 194 340 77 60 370 66 88 310 78 265 -87 -142 27 -71 187 65 72 64 -15 48 -173 -239 -214 -37
4987 -37 -74 -175 145 -40 57 -153 -4 -31 -5 254 102 9 51 383 208 51 71 260 232 162 -153 45 80 23
5011 23 -70 155 207 -102 -125 -103 71 25 -62 63 -101 -51 96 -98 -108 -173 48 -76 -185 -78 126 61 211 -105
5035 -105 510 373 55 125 227 -183 74 206 -72 -227 106 -326 60 -182 -74 -77 153 -34 101 -70 -209
5056 -209 19 -36 -21 -238 -80 -26 15 32 220 320 9 -39 -62 -178 10 -23 126 100 25 106 34 -16 -12 46 -223
5081 -223 88 -80 -271 13 -135 -16 -40 122 -112 5 119 341 -199 -86 242 -34 29 169 118 140 56 -75
5103 -75 173 16 32 68 -55 198 -96 -196 -3 -114 -221 -80 -278 -131 92 -64 -133 109 -128 226 62
5124 62 -201 -1 -208 258 -118 -197 -59 -48 66 -157 -6 12 241 -202 271 101 -40 96 26 -22 -122 -170
5146 -170 -111 69 -236 -206 59 -291 -158 1 83 221 81 -80 -49 71 -56 29 304 219 -18 -89 307 262 123
5169 123 158 -3 -45 -54 -87 175 42 -297 39 -92 -181 -291 322 -197 59 18 2 -234 -214 75 76 -86 -31 175
5193 175 221 -44 -22 96 29 -133 22 -85 -95 -40 -51 -148 48 -42 36 -86 -36 -9 -149 -100 -344 142 62 18 -2
5218 -2 -149 60 19 234 -146 96 255 55 -32 -87 -6 115 -81 -58 67 84 -230 117 0 279 -60 -383 74
5241 74 -307 -208 -14 -183 -20 29 112 -243 -38 -75 56 52 -84 -81 34 40 139 287 87 85 179 32 106 -76 191
5266 191 -92 315 0 21 103 12 -30 -301 77 -175 -12 -56 -115 -346 39 -88 -89 -279 -263 46 -51 53 114 -365
5290 -365 -134 375 -100 -14 263 115 158 217 -10 180 -79 159 218 -146 2 -47 -49 147 -62 5 -160 -224 -317
5313 -317 -204 -328 197 -27 2 243 -1 -143 124 98 81 229 -1 96 237 -101 -81 44 127 -117 25 132
5335 132 -50 210 -116 68 -94 -104 136 139 -161 35 -137 -57 256 -29 126 -12 -116 279 -69 212 292 -92
5357 -92 216 191 -135 -4 -1 266 -96 68 -77 232 44 -59 76 -135 -62 139 11 83 -128 -359 112 39
5379 39 -41 110 74 66 -176 -41 80 119 -297 91 69 138 -114 30 -66 128 187 18 63 -5 -89 -63 -80 59 127
5404 127 -59 -10 -59 -252 -250 -199 52 -93 146 323 197 181 -166 6 -140 -267 22 142 232 98 40 -154 20
5427 20 13 -51 242 -23 46 -169 -174 -13 -44 30 160 -202 7 -73 120 -160 -2 89 290 94 80 -62 -10 -338
5451 -338 69 68 -23 82 96 -53 115 106 201 14 -16 249 -109 -43 -201 38 -97 37 -153 -2 -113 -83 -142 161
5475 161 -66 -100 -69 15 -357 133 -78 -149 -27 140 -163 -26 -25 138 -191 -156 7 -305 18 -101 177 81 121
5498 121 -35 150 -122 -57 -114 -26 56 260 111 -265 -84 -191 -404 146 16 -225 -19 -173 105 95 74 105
5520 105 104 154 -58 -53 75 -233 292 191 -19 -115 -149 -200 -56 -228 -134 -38 195 76 39 -193 19 160 -68 -70
5544 -70 94 104 -85 109 129 -17 209 295 82 47 188 3 -129 92 155 -30 -163 -250 -162 -84 297 43 62
5567 62 231 147 21 -222 -66 73 -68 -38 -13 -57 59 202 8 121 45 103 -159 -109 95 138 162 178 28 -70
5591 -70 11 -11 154 -58 -215 55 -6 113 146 -120 -14 160 26 -83 -226 -119 192 -179 118 461 34 -70
5613 -70 16 141 144 127 94 -55 151 -71 37 207 30 300 146 98 -3 -22 -97 -190 -157 -350 32 183 -104 117
5637 117 -35 -225 -205 75 108 -216 -19 62 94 389 47 114 -80 -8 -180 -80 -33 -38 128 45 80 -43 -100 18
5661 18 63 -35 -7 -230 -214 -183 -236 -108 84 87 -65 5 -46 -11 48 -52 238 -106 80 -209 -30 77 274 256 169
5686 169 -78 135 222 -82 -66 38 -100 -297 -39 -115 -152 102 -106 126 7 -156 29 127 191 38 81 59 169
5709 169 157 171 40 217 131 -66 46 92 146 62 300 -45 -48 54 -175 -47 -89 -18 -71 -30 117 -65 -49 -81 -220
5734 -220 -430 -33 49 34 181 -117 -161 193 -141 115 112 273 142 87 306 -41 -57 -143 -180 -155 -116 -84 19 30
5758 30 -142 46 -218 -65 -221 -38 -66 -11 -186 -45 9 316 -11 -162 -103 50 326 -65 17 28 196 35
5780 35 208 119 302 25 5 -4 203 3 91 -70 -184 72 35 -278 -86 15 14 54 -77 -172 -22 -158 20 144
5804 144 -175 194 5 -156 193 -230 85 177 151 268 109 351 -3 287 -93 13 68 -108 -230 -56 -224
5825 -224 -119 -196 -1 -143 -9 -216 -126 -109 -80 67 36 -3 83 203 -133 -38 83 45 110 128 141 38 262 248
5849 248 102 -198 257 11 106 1 -256 -165 137 211 101 -97 155 -232 -77 -101 -239 117 64 -77 66 -50
5871 -50 -118 350 17 -3 22 51 -42 55 -42 384 -47 72 -16 -243 32 -48 6 -125 -42 -227 51 17 -53 12 -49
5896 -49 18 -59 95 -19 96 -271 -43 352 285 -88 326 -25 -106 149 172 -19 3 306 -13 51 69 118 -70
5919 -70 -62 24 -38 42 -183 -148 135 -184 108 95 -163 33 81 -49 257 -51 -13 197 76 127 129 -123 60 -71
5943 -71 106 -134 133 74 -101 412 -103 -24 -70 -156 202 -10 500 121 -21 -166 -222 -180 54 -23 -152 15 -171
5966 -171 -174 -48 241 -224 -15 178 107 -137 105 -85 122 61 -20 -220 -156 424 65 249 48 96 -50 -167
5988 -167 -105 -300 2 37 72 196 50 59 -104 -165 341 28 223 -1 -118 57 129 294 235 332 -252 -55 102
6011 102 28 84 118 144 -61 -75 -93 113 153 -165 64 -149 99 371 -120 158 -16 -22 -180 32 186 -177 78
6034 78 352 149 187 -52 96 -100 -166 18 5 0 100 -117 141 -60 -168 20 -416 -32 -39 -23 -154 -26 78
6057 78 37 -135 -105 186 10 -331 -66 -20 120 66 -31 126 -66 196 67 241 148 -36 -23 260 242 229 -207
6080 -207 75 -210 29 -72 21 -100 -130 -110 240 -273 -188 114 164 -72 106 40 3 14 -201 -120 -29 176 117 246
6104 246 272 226 -107 132 -234 35 118 -18 -136 -60 -195 237 -13 -229 261 -67 -6 227 -124 -39 44 -67
6126 -67 45 -165 167 385 -75 114 122 -71 108 64 45 65 -91 158 -73 -24 259 5 -144 55 -175 114
6148 114 -216 -71 -60 -216 -97 76 -129 -136 -186 173 1 66 137 37 -329 194 94 4 -107 -101 -295 101 407
6171 407 95 -127 -11 207 34 -154 46 254 -80 155 -122 -59 -60 9 -128 -163 -172 41 -62 -13 -71 -102 6
6194 6 164 156 22 71 191 -254 -52 148 171 -143 273 91 -175 120 138 200 -64 75 -55 -172 168 85 100
6217 100 -124 -133 -33 -109 51 -10 -127 132 413 108 -68 199 215 -227 -32 309 295 -62 67 287 84 -224
6239 -224 -20 192 48 74 -16 269 -85 30 -36 -170 49 -266 -40 -248 49 -33 -282 -1 -160 -72 169 230
6261 230 72 -121 -261 -43 35 -158 -8 -126 -52 50 -164 -8 -4 -387 -108 -33 102 85 -131 46 87 -128
6283 -128 100 -84 -139 383 167 -23 -103 -14 121 -234 87 187 -57 -146 -74 37 119 -19 17 -200 -42 -5 80
6306 80 -160 28 -172 -240 -161 -89 -56 -143 214 16 -136 -113 -81 51 -194 -151 -75 -36 105 -87 -179 -39 -24 220
6330 220 40 31 -81 -241 85 142 100 -96 131 -169 61 309 -14 17 -34 -275 -30 -104 -302 104 13 -13 33
6353 33 -62 130 19 136 48 50 42 63 255 175 80 -38 61 92 -150 21 17 58 -157 160 -213 -153 -39 -72 20 -30
6379 -30 -103 208 -153 35 -132 235 27 -293 -173 149 59 190 178 131 -41 -237 -84 34 340 -27 55 -7
6401 -7 56 84 10 4 96 71 1 -144 -101 106 211 -90 -91 -56 -138 21 183 34 43 -16 126 75 163 63 -125 109 -26
6428 -26 67 257 -67 -130 -198 278 131 -225 -8 -13 -132 -242 -344 113 -62 -275 -13 14 136 -213 -134 -105 92
6451 92 123 98 45 -399 19 140 147 -111 -132 59 -20 141 10 201 32 63 -62 -189 -229 -214 54 -219 115 -176
6475 -176 202 -213 1 105 -88 20 -35 -178 124 23 -21 133 -163 195 208 210 76 33 -143 107 67 -124
6497 -124 -38 -52 5 140 -221 44 -115 -139 23 -59 -246 80 331 -51 -157 -33 -107 -51 169 -149 -13 24 -157
6520 -157 35 -96 23 44 78 -36 64 -27 -124 13 -292 114 -131 -4 139 -229 -105 19 -227 -1 -30 -43
6542 -43 -51 -144 164 160 108 14 54 137 1 34 -83 25 217 71 -56 150 305 -61 223 37 -63 12 -205 77
6566 77 295 -110 -338 -25 -159 70 -97 -143 229 35 100 -314 -6 297 -46 -184 71 -12 138 151 -47 59
6588 59 -262 -74 -52 -54 1 -90 -186 33 -122 -135 188 17 -231 -104 -99 -30 -71 -55 -201 3 200 -108 128 -61
6612 -61 80 -77 -88 -145 -34 43 -110 105 109 204 -107 53 -82 65 -239 93 -159 21 -171 -86 -16 -47 20 169
6636 169 -95 -116 -172 -93 -243 117 -202 -107 11 -80 -117 -318 -96 14 36 -35 -31 -188 -272 161 -124 -273 30 -55
6660 -55 -122 169 -64 92 234 -121 -6 42 105 67 149 263 156 84 -105 247 179 30 -171 268 63 68 149 12
6684 12 11 -226 -579 -102 -67 -112 75 100 85 116 -52 -110 90 35 -197 -160 -11 -273 96 91 -295 210 1 166
6708 166 177 -201 -21 193 65 103 67 90 13 0 -51 160 266 150 -2 200 -87 -195 -269 -270 154 3 -56 -115
6732 -115 137 -8 126 -65 110 -171 -233 -124 -7 127 -7 -37 -84 139 350 -91 -87 -130 62 -93 76 -121
6754 -121 147 111 77 -312 141 -93 -129 5 -329 153 -201 68 -24 -81 -13 13 -215 23 177 -271 171 133 92
6777 92 85 -63 314 85 154 177 210 -80 32 -168 89 -35 -96 64 -16 69 -147 32 83 -112 -97 -68 469 59
6801 59 107 -89 20 -283 113 189 -107 140 50 -141 -30 -133 -68 194 134 -135 159 -128 211 -19 -61 126
6823 126 -142 -23 -263 31 -188 -43 -73 -137 25 -60 165 -309 41 347 -151 15 -126 -100 69 -116 -108 -77
6845 -77 7 -41 32 -146 266 11 43 -22 41 141 -29 27 7 -98 18 -78 -29 -130 -136 -159 59 96 33 85 216 -124
6871 -124 183 29 -87 -2 -16 -13 204 -25 100 -62 -160 106 3 -172 72 162 -136 -359 -74 -13 65 -191 -31
6894 -31 -101 -70 -18 -88 102 -137 199 150 109 16 -38 254 -138 2 184 -131 -130 133 163 306 54 -10 58 -156 75
6919 75 -2 -73 -35 87 -108 49 -66 -19 -337 -182 214 -24 -172 -96 84 -135 27 76 217 128 -19 12 17 -148
6943 -148 93 54 19 29 -120 -175 -53 -159 -222 165 -70 143 -93 -1 -145 -304 -126 -10 18 -82 -60 200 12
6966 12 -49 84 97 -151 259 -54 -255 234 -64 -62 -25 156 -327 269 -110 70 12 -272 -16 -2 30 -237 5
6989 5 -118 -146 -318 264 133 -146 -201 347 -3 60 -22 89 134 4 -169 95 95 -85 -93 -109 23 20 -127 -189 116
7014 116 69 -289 -141 53 -100 -9 -354 -202 -9 434 -69 -16 -49 169 37 327 110 224 155 -92 89 34
7036 34 214 -24 214 110 -120 -300 -68 -3 107 22 -23 146 -184 -214 -42 -109 159 -103 49 -12 -150 472
7058 472 -1 37 -182 20 204 -109 -19 222 -1 69 151 -79 -29 -119 275 58 -16 -29 -133 -90 -89 -54 -69 -32 31
7083 31 54 249 179 -218 -92 14 37 -183 30 -100 -129 43 -177 -190 -118 328 198 -13 54 -9 2 2 63 -55
7107 -55 268 88 66 -78 0 -59 91 199 -169 130 98 -46 87 -42 -80 -6 -60 -213 229 310 -78 -17 102
7130 102 99 115 26 91 -83 -32 280 160 5 61 208 56 254 198 182 -145 175 -223 -182 -146 -259 158 -48 52
7154 52 -233 24 140 -156 -143 -182 -162 -56 134 195 30 -85 11 128 -136 90 74 -51 62 193 59 -99
7176 -99 114 -101 -115 82 96 -128 98 -32 -88 -230 -28 -233 -155 38 242 102 77 81 -75 318 -82 84 28
7199 28 70 188 -86 407 43 103 163 -296 95 85 37 -30 -110 -27 79 -115 -146 -236 -233 -240 46 -87 295 84 139
7224 139 -185 84 -38 291 109 -96 1 -37 30 27 -7 34 -22 -65 -236 69 128 31 3 -306 -85 -148 32 22 -203
7249 -203 -42 15 -8 -42 -4 16 19 -70 83 -284 -134 -204 174 55 204 -109 -120 62 15 263 172 -184 65 240
7273 240 -40 15 -164 -32 138 23 37 6 -53 -83 230 26 53 25 116 -51 251 312 -66 100 13 232 83
7296 83 -17 -213 -205 -269 -199 -2 -112 84 123 -166 -222 -281 -138 -142 -137 -92 -50 58 94 286 -21 165 26 122 -19
7321 -19 54 132 -70 297 -6 11 -1 109 79 56 107 46 -97 175 74 -144 121 339 -74 -24 -204 54 -60
7344 -60 -43 31 14 37 -130 -211 78 -111 160 181 118 -57 305 -99 120 209 -105 94 -200 -54 -95 -94 174 74
7368 74 129 -284 -232 128 -124 -5 10 154 199 79 19 129 -31 86 -10 -54 -132 -51 -247 -9 -219 102 13 -143
7392 -143 -163 -115 106 51 295 104 39 137 -84 157 67 55 -218 -266 -168 -69 -19 -75 151 -110 -46 -244 53 123 9
7417 9 -241 -112 10 17 161 -38 220 -91 20 -160 151 -25 152 79 84 14 43 132 105 -64 39 -102 69 118
7441 118 -122 -47 -228 -12 71 108 -20 2 24 147 95 113 -40 -253 286 -79 65 148 34 105 -348 78 65
7464 65 97 -36 -87 -30 112 35 59 -245 -144 54 -98 265 -46 238 198 -37 -63 -94 -230 168 234 112 166 -117
7488 -117 47 -107 118 -2 197 170 -9 -69 -117 -9 -65 97 -19 -154 106 -139 6 -104 -91 -23 204 125
7510 125 -196 239 -31 -230 22 69 61 -51 68 61 -88 178 -21 9 -30 18 -84 -51 23 -164 -67 -76 114 184 -60
7535 -60 7 -131 -3 -91 62 287 4 51 173 182 -102 -33 -147 -30 -138 -64 -136 -141 133 -208 -116 -299 -130 -65
7559 -65 -163 -216 87 -28 -92 -41 18 -23 -224 61 94 -34 -33 82 29 397 -127 4 -17 126 -185 431 149 -209
7583 -209 129 -155 -106 -26 21 188 116 -52 160 115 -160 -168 121 63 -16 16 183 90 179 -173 -173 327 -170 126 -77
7608 -77 -45 203 -143 -126 -117 143 -385 -111 -157 -126 -59 222 27 -18 -78 117 336 55 104 -15 -51 20 -91 15
7632 15 48 -218 5 -29 -301 137 139 33 -239 -158 104 -193 73 -21 25 -241 -98 -29 4 -122 -45 -40 154 -200
7656 -200 -234 160 29 -175 160 -71 165 5 66 81 30 69 64 111 -92 -99 -66 -47 -110 -142 -38 -143 140 69 167
7681 167 -170 92 58 95 12 50 -138 -108 -77 -60 -84 -188 -46 145 148 19 -95 -82 121 132 117 -87 73 33 -99
7706 -99 -121 134 161 -319 45 182 -114 13 -197 149 -12 -261 -121 76 -75 217 -224 226 -154 -81 184
7727 184 130 47 16 -13 -5 -23 105 -188 -268 68 -130 -88 -242 -217 21 69 -39 10 -54 92 -129 -1 -386 152
7751 152 122 93 -25 -219 157 -144 -69 84 250 152 -71 -176 -23 77 -132 49 50 123 -60 -87 241 -29 -167
7774 -167 -43 177 -158 222 237 -13 -93 121 28 -93 183 -44 39 168 -124 -165 -166 -231 126 -166 165 49 42
7797 42 -20 -1 16 -116 -127 121 403 81 60 186 51 -35 100 -61 -109 -226 309 238 19 -25 40 140 7 -85
7821 -85 -197 -22 99 66 85 145 76 -55 -37 -10 44 -177 15 -185 4 -125 8 13 -164 -148 -12 116 31 -130
7845 -130 -75 113 63 155 -82 -3 -149 -197 13 -83 63 147 25 -38 29 -99 -105 -24 -79 80 93 86 -22 -422 -91
7870 -91 -54 30 -9 -141 60 96 105 175 107 8 82 -157 40 76 -58 11 -46 47 226 -161 7 144 102 -67 34
7895 34 326 -181 -151 -15 35 33 309 -78 -176 105 14 76 -25 168 94 -17 27 159 -238 296 141 -109 -204 -230
7919 -230 -55 -147 -100 78 248 72 -32 133 67 -43 199 351 141 41 50 108 43 181 73 9 -189 -2 188
7942 188 -287 87 -43 -59 -26 -273 193 132 -29 90 67 98 122 205 52 86 -32 -266 -327 142 -16 -154 -284
7965 -284 -110 -36 31 -26 -50 25 -86 -97 71 1 -159 -54 318 76 57 -187 -80 -128 -133 61 74 -32 24 -66 97
7990 97 -87 -69 -152 -138 54 -7 -67 195 -180 141 124 36 157 -36 114 -31 -6 86 -68 251 -233 -90 3 -71
8014 -71 -292 125 -21 120 -207 108 9 105 -125 -46 -5 -46 238 86 173 138 33 156 42 -128 10 -77 182
8037 182 26 104 -296 -306 129 65 26 173 -356 75 -221 66 -409 -174 -72 124 -44 -47 -124 -187 115 6 191
8060 191 -306 -1 38 45 -79 161 -86 15 137 -232 40 143 -71 -308 169 107 40 -131 -52 -88 -35 -320 -151
8083 -151 -35 -49 62 15 -159 -26 15 17 -231 187 -168 -91 123 23 47 -166 -53 -168 8 137 46 131 -46
8106 -46 -7 331 -118 46 -209 -25 41 172 216 -89 78 217 43 145 -142 -55 172 -165 -7 8 138 149
8128 149 132 239 185 130 47 -52 28 -150 88 132 -32 272 56 -10 82 -97 51 -26 167 -12 -204 130 -60
8151 -60 58 55 -202 9 -111 72 171 -92 90 -148 149 65 -86 -200 -53 138 -30 132 -204 -118 -138 -88 -22
8174 -22 62 -115 37 -216 39 112 -72 -112 -277 365 103 -30 82 -161 70 -9 94
8191I4
$$ Imaginary data points
##PAGE= N=2
##DATA TABLE= (X++(I..I)), XYDATA
0 0 0 0 0 0 0 0 3 0 0 -8 8 -8 8 -8 16 -16 18 -24 32 -35 42 -48 58 -72 82 -94 109 -126 146 -165 188 -216
32 -216 243 -274 310 -347 388 -435 485 -539 600 -665 737 -814 898 -994 1094 -1206 1329
49 1329 -1463 1610 -1776 1960 -2164 2395 -2658 2959 -3309 3720 -4215 4815 -5568 6543 -7856
64 -7856 9721 -12570 17421 -27217 54557 -285150 -924257 109587 744513 22802 -519317
75 -519317 33991 385460 -15431 -238609 28480 131579 114559 155564 -38817 -331695
85 -331695 -72664 410130 218473 -333064 -226073 201141 94636 -202499 -63349 147907
95 147907 19955 -121557 -59787 -78601 -71940 173747 196997 -196198 -300097 110503 281866
106 281866 -49206 -169871 108012 145362 -93292 -87372 85527 100249 62657 55537 -81370
117 -81370 -175726 72292 262222 -27175 -238461 30715 150603 -149493 -177937 191620
127 191620 160786 -260615 -183362 216806 64085 -273846 -4836 332205 -14454 -385256
137 -385256 -23434 358603 69058 -223993 -6194 166505 -9675 -87599 68425 91365
147 91365 -6642 24511 9158 -116980 -23172 186812 71144 -194556 -106340 135796 27468
158 27468 -164411 -5294 143759 -46547 -177502 -6939 100015 -16952 -40631 56455
168 56455 -9216 -100445 22805 118226 8406 -49854 47157 51339 -59796 -16245 111385
179 111385 52723 -50686 -6788 20342 -37687 -2611 86373 4108 -118556 -16258 80936
190 80936 -62720 -114923 81849 112611 -135038 -177495 96748 153392 -96611 -125905 93883
201 93883 100661 -86795 -83370 86773 105232 -6857 -35527 -16019 1569 70400 79498 -37917
213 -37917 -78615 48122 89993 -60701 -97691 72021 95245 -80846 -115500 22185 53592
224 53592 -34397 -31515 17525 -39499 -63563 33695 50019 -43157 -37687 56266 33792 -64067
236 -64067 -19494 91407 54904 -33806 -19756 22599 22446 25142 32114 -8046 -33348 25888 36230
249 36230 -50393 -44062 60929 44447 -84183 -86367 42010 51399 -53767 -48191 21859 -2957
261 -2957 -45844 -3753 36212 -3222 -22942 23281 16786 -27734 8411 59993 27110 -21405
273 -21405 -2710 29083 11645 7774 31585 1951 -31415 4978 25041 -19901 -33804 22350
285 22350 25953 -57241 -61047 28055 32137 -41075 -42715 14565 11331 -36136 -16815 30797 15198
298 15198 -10033 -1244 2976 6118 27053 34966 2157 -16356 22026 34994 -7226 -8237 29987
311 29987 19670 -24830 -23754 14131 7282 -21873 -5321 1497 -31799 -31312 6508 10978 -23891
324 -23891 -27271 7012 1220 -22947 -619 22580 7727 -7905 2035 15310 8869 13521 26555
337 26555 9097 -4792 12999 18056 2655 525 16445 9413 -23136 -17335 13565 3172 -21445
350 -21445 -15565 -3326 -12804 -24697 -7698 5134 -12611 -15077 -2053 -4770 -6312 4833 14782
363 14782 6010 -5382 7797 17377 7939 11373 18403 11770 2936 3242 12007 9508 2460 6146 -3086
378 -3086 -15409 -4546 4787 -6509 -21085 -13880 2878 -10891 -29062 -11555 8520 3934 -15495
391 -15495 -22036 -158 18354 12002 -4753 -9884 13603 29778 6207 -10621 9039 33907 20982
404 20982 -14681 -11437 21382 23218 -1643 -16172 -8103 4785 -378 -10535 -14846 -13610 -2341
417 -2341 -2929 -20037 -21939 -4048 10514 -1107 -22339 -10925 12898 12921 368 -3142 8544 16172
431 16172 7702 6394 10915 9166 11886 12469 6144 -3402 -3810 13918 15730 -12170 -24230 -5064
445 -5064 13052 -553 -28637 -21829 3936 3473 -14465 -24574 -11990 9522 11202 -5800 -23672
458 -23672 -10996 31416 34850 -15105 -33071 18149 60264 14616 -45557 -8186 60138 37544
470 37544 -36986 -40001 29933 48270 -12938 -45255 -11726 20844 10957 -21627 -32253 -12850
482 -12850 10568 11915 -23151 -42782 833 40229 6759 -45556 -23849 44963 41067 -25805
494 -25805 -30365 27820 46312 1256 -24999 9955 33910 10053 -8252 -3080 3619 4675 4776
507 4776 1997 -15874 -21453 4880 12062 -18701 -30975 -4380 14761 -10356 -30239 -2366 14862
520 14862 -7091 -12423 10003 11677 -13224 -3666 38131 21484 -31273 -11824 51210 39384 -34131
533 -34131 -34185 43936 49974 -28992 -46437 16494 41649 -8565 -41244 -11940 11129 1385 -7835
546 -7835 -19115 -26049 -2274 23147 -309 -44497 -20442 45642 30765 -41386 -36394 39242 55530
559 55530 -13213 -41975 16896 51544 11403 -24261 -6517 25996 20658 -6204 -14313 -6880 7231
572 7231 13083 -6921 -27381 -17000 11061 12373 -24202 -35452 4275 23180 -10494 -35226 -3620
585 -3620 31445 4080 -27922 832 30837 8112 -16625 9451 34229 1817 -21098 16936
597 16936 36340 -3477 -26603 8564 31873 -5187 -30486 -687 16295 -5042 -18969 -11355
609 -11355 -5260 -6039 292 -2434 -24080 -16059 19300 14372 -24608 -23772 22922 34035 -11706 -26247
623 -26247 15916 36786 9331 -15843 -2911 22800 20590 521 -10794 -4577 15048 15210 -11795
636 -11795 -23162 -3215 16934 1356 -29046 -22815 8184 12860 -12383 -29803 -9013 20636
648 20636 7459 -21767 -15925 17288 24109 -7237 -16528 13826 25533 4841 -6140 7259 16073
661 16073 4690 703 8816 2167 -5156 2917 5220 -6258 -12607 -1739 3969 -10822 -14986 -4182
675 -4182 -3401 -7378 -6122 -4617 -6469 -5322 4414 4059 -7022 -1025 13207 8523 -2275 1142 14684
690 14684 12802 90 2821 9763 5791 3359 3660 1189 -2094 -1185 2562 -4287 -11675 -3920 -60
705 -60 -7252 -11825 -8973 -2271 -3015 -7664 -6634 -4182 846 4804 -2718 -3997 6662 11840 4057 -3049
721 -3049 7025 17679 6185 -2905 6012 11801 5650 -2818 -52 5693 -34 -5231 -3790 -4278 -3774
736 -3774 -4805 -8407 -8493 -6237 -2926 -5604 -9838 -2870 1728 -3327 -3523 1084 5377 3018 1175 7182
752 7182 7156 2455 7379 10585 5269 1256 4181 9750 3514 -4157 783 3778 -1151 -5653 -6889 -2599
768 -2599 -2070 -6337 -8316 -8912 -4545 -777 -6735 -8743 -1997 2426 460 -4116 44 7433 4597 2305
784 2305 4396 5698 7356 6934 5564 4329 2941 6780 6194 -2183 -2223 3114 2129 -4706 -8663 -3248
800 -3248 -198 -6538 -8854 -7107 -4659 -2025 -5470 -7450 -3881 719 2673 -3007 -3949 6370 8695
815 8695 1968 -130 5827 11865 5520 -65 5810 8214 4295 926 230 2381 2035 -1362 -3236 -5499
831 -5499 -3151 -564 -7132 -9496 -4455 -1908 -5229 -9133 -4134 1267 -2543 -3805 324 1425 2362
846 2362 3432 4802 4049 2308 7404 8694 2040 2506 7309 6835 1806 -1115 2415 2867 -1905 -1930 -3049
863 -3049 -5589 -3327 -3251 -5904 -8644 -6134 -514 -4200 -8572 -3233 623 -442 -1360 -422 1978 2650
879 2650 4945 6823 644 1712 10227 9344 409 -669 7680 9966 -1162 -4579 2887 3098 -1977
894 -1977 -4664 -4887 -4013 -3687 -2140 -6118 -11495 -4069 3136 -4670 -10488 -3200 5673 2235 -5654 -381
910 -381 6472 4813 3582 3328 3443 5442 7023 6452 1215 681 7237 4795 -2353 -565 1378 -1758
926 -1758 -3321 -1898 -2897 -9601 -5573 2948 -4696 -14261 -5047 5374 -1360 -11595 -3631 8274 1133
941 1133 -4236 3615 4673 1345 4919 9914 2664 -5018 8917 17211 -1843 -10745 7175 15760
955 15760 -1636 -14627 -51 10117 -3339 -11387 -5100 -1677 -3272 -4492 -5089 -7942 -6329 3701
969 3701 1575 -10204 -5570 7416 7819 -2733 -5366 5744 11304 4725 -449 84 7774 11847 1834
984 1834 -5089 2404 9681 1963 -8761 -1774 6012 -4501 -9660 579 -53 -11266 -8354 5258
998 5258 -225 -16912 -6032 11998 -162 -14847 -666 13468 1439 -9212 6643 12962 -3195
1011 -3195 -1241 14910 7597 -9166 1239 19982 4423 -17748 236 19034 -108 -18724
1023 -18724 -3915 11059 -1991 -14967 -4761 1350 -5701 -4443 -1321 -6639 -7093 3022 6566
1036 6566 -6227 -8970 7807 11992 -977 -5432 3741 12461 7645 -1688 -1726 5786 11807 3920 -9242
1051 -9242 -2252 11771 3736 -12025 -7310 6726 1316 -12732 -5813 3196 -6469 -9090 1895 985
1065 985 -11005 -5358 11112 2559 -14337 349 17150 1805 -10861 5423 17796 3 -8431
1078 -8431 11142 13222 -6616 -4068 12824 5862 -11641 -3601 11529 -1380 -15193 -1153 7007
1091 7007 -7204 -11918 217 2097 -9358 -6300 5199 -2261 -9582 2071 7958 -2064 -5802
1104 -5802 6034 10300 -526 -1444 7386 5909 2548 3960 2796 -157 2915 6353 -1424 -8142 2882
1119 2882 6895 -7325 -10590 1375 3323 -8909 -9665 2284 -297 -9536 -2066 3787 -4346 -5275
1133 -5275 5382 5764 -5732 -2119 12947 6019 -7143 3508 13932 2660 -5818 5538 11443
1146 11443 -2571 -5723 7221 3989 -8226 -3246 4915 -2987 -11063 -1085 4272 -9180 -10342 3778
1160 3778 1987 -10325 -5565 6621 1572 -8253 787 9148 -90 -2871 6649 7059 -714 1458 8975
1175 8975 3883 -3447 4616 8461 -3118 -4184 4930 3375 -6978 -5337 3883 -1391 -10061 -2375
1189 -2375 2182 -6348 -7635 505 1336 -6863 -4166 5470 511 -5879 2520 7179 240 -1557 6161
1204 6161 7017 -1615 1661 9431 2538 -3908 4480 7252 -2349 -5102 3772 4025 -7502 -5344 3649
1219 3649 -2171 -9076 -2862 2060 -5077 -8329 1141 2523 -6966 -3630 5668 1751 -4569 787 7830
1234 7830 2068 -2360 5813 7337 -788 1128 7391 3623 -2575 1327 6591 -882 -5944 1900 2883
1249 2883 -5904 -5496 703 -901 -7229 -4433 1664 -4019 -6974 703 1809 -4387 -3053 3787 3242
1264 3242 -3032 963 7194 1863 -773 4719 5894 722 926 6050 3381 -3125 1064 5659 -2128
1279 -2128 -5407 730 1927 -4747 -6683 96 -244 -7044 -3823 780 -3067 -4809 -516 2005 -2443
1294 -2443 -2286 4569 2791 -2568 2096 6436 2155 -640 3835 6640 850 -1122 5414 3516 -2692
1309 -2692 -94 3275 -868 -4806 -1179 1521 -4615 -6054 327 -1154 -5944 -4193 702 -920 -5313
1324 -5313 -1280 2964 -1034 -1913 2834 3355 319 1047 4919 3699 73 3317 5355 874 10 3244
1340 3244 2939 -974 -1310 1807 -460 -3985 -1363 -448 -3923 -4096 -1722 -1716 -4297 -3607 317 -1637 -3554
1357 -3554 169 1536 -746 -146 3060 3512 -166 1504 6067 2559 -473 3519 4934 1208 -1126
1372 -1126 2335 3713 -2017 -2946 1418 -613 -3924 -2637 -516 -2776 -4940 -1708 -380 -4130 -3797
1387 -3797 -40 68 -2015 -1689 1990 2077 -76 1398 3243 1874 2443 3445 2760 2276 2278 2892 1304 -256
1405 -256 1688 1334 -1340 -1011 -918 -1519 -2767 -2290 -1406 -3827 -3415 -586 -1764 -3622 -2230 735 275
1422 275 -2313 -307 3181 1217 118 2794 3264 1936 1389 3632 3606 220 756 4114 2227 -1480
1438 -1480 -792 1929 780 -3141 -2818 35 -1772 -3636 -3180 -2218 -1248 -2865 -2640 -1090 -1516 -1050 152
1455 152 256 548 282 1832 3029 1657 1337 2820 3813 2905 424 1618 3708 1432 -969 40 1255
1472 1255 30 -2874 -1944 8 -2380 -3600 -1788 -1319 -2943 -3608 -1013 -256 -3344 -2622 1474 1353
1488 1353 -1066 -674 2915 3450 -210 1375 4577 2913 432 1706 3408 2056 -1109 855 2985
1503 2985 -816 -2650 -337 784 -2324 -4660 -1679 311 -3236 -4416 -1672 -319 -1796 -3095 -327
1518 -327 1169 -1134 -538 2249 1666 440 1335 3720 2882 422 1868 4374 2084 -83 547 2818
1534 2818 1525 -2363 -1003 1285 -1073 -3077 -2412 -614 -1878 -4076 -2205 -526 -2535 -3142 -749
1549 -749 300 -1423 -1764 1491 2353 -290 329 2832 3276 1218 961 3543 3173 514 943 2862 1490
1566 1490 -819 -480 1065 -231 -3331 -1372 -256 -2255 -3412 -2304 -791 -2081 -3248 -1383 -129
1581 -129 -1639 -1088 46 988 41 270 2220 2575 775 1594 2811 2523 1617 1192 2646 1963 -289 261
1599 261 794 220 -1277 -1780 -310 -1199 -3233 -2128 -1335 -2103 -2497 -2161 -738 -1305 -2286 -433 581 -473
1617 -473 21 1047 2123 1446 742 2748 2879 1115 1685 2447 2094 898 309 1419 680 -1118 -484 -437
1635 -437 -989 -1820 -2244 -1247 -1854 -2917 -1583 -1384 -1600 -1239 -1197 61 -10 -288 711 1167 919 1339 1436 2366
1655 2366 1653 1222 2181 2076 1239 835 961 1280 212 -943 123 -848 -1563 -1489 -1661 -1450 -2053 -2437 -1222
1674 -1222 -1686 -2012 -1335 -666 -300 -646 -487 1112 945 320 1693 1930 1730 1550 1635 2344 1909 1125 1629
1693 1629 1257 496 -10 -270 263 -914 -1578 -1403 -1161 -1672 -2157 -2168 -803 -1605 -2372 -1030 -363 -586 -468
1712 -468 314 1037 599 494 2198 1614 1324 1455 1913 2220 1429 1184 2116 1348 -121 333 109 -144 -1151
1731 -1151 -1345 -144 -1541 -2055 -1418 -1603 -1930 -1705 -1713 -734 -1363 -1413 222 -41 334 443 988 1879 1144 1343
1751 1343 2159 1859 1763 1599 1319 1580 1375 284 789 96 -67 -247 -845 -767 -1493 -2031 -1484 -1757 -1933 -1806
1771 -1806 -1492 -712 -1095 -1286 284 21 -125 474 771 1818 1245 1126 2111 1818 1261 1519 1663 1386 585
1790 585 427 1033 176 -534 -206 -548 -985 -1650 -1763 -1185 -1943 -2017 -1263 -1684 -1291 -897 -897 -159 -179 -110 733 774
1812 774 1279 1282 838 1680 1869 1379 1592 1432 1705 989 470 1002 651 -196 -793 -418 -528 -1692 -1856 -490
1832 -490 -1595 -2530 -1334 -984 -1205 -1590 -788 260 -343 -690 902 1090 495 636 1822 1905 902 916 2465
1851 2465 1554 502 857 1191 892 -230 -259 382 -587 -1389 -947 -830 -1128 -1924 -1669 -913 -1605 -1527 -647 -940
1871 -940 -146 -375 78 632 575 377 826 1417 1552 1292 933 1920 1460 626 940 1164 717 -398 -434 555
1891 555 -581 -1576 -556 -415 -1782 -2094 -1035 -536 -1997 -1980 -212 -431 -1450 -730 650 917 -33 137
1909 137 2027 1005 263 1431 1880 1469 758 1090 2256 857 -178 590 276 -285 -918 -708 -143 -1470
1927 -1470 -1822 -1089 -1399 -1546 -1465 -1084 -671 -748 -921 -313 -177 421 121 626 1796 1157 598 1654 1855 1255
1947 1255 664 1093 2019 629 -448 996 641 -451 -958 -61 -83 -1604 -1704 -202 -1094 -2215 -1270 -615
1965 -615 -638 -1559 -736 613 -335 -727 1073 1068 786 261 1129 2018 679 676 1796 1162 937 531 796 906
1985 906 -84 -143 256 -564 -1033 -1398 -887 -932 -1658 -1496 -814 -1113 -1255 -914 -445 171 -583 -274 757 670 473
2006 473 638 1351 1559 670 361 1900 1238 525 486 1134 881 -554 -309 400 -511 -1451 -780 -197 -1205
2025 -1205 -2022 -953 -379 -1714 -1490 -288 -56 -827 -741 585 712 -330 629 1516 917 717 1316 1660
2043 1660 1084 447 1250 1090 184 343 532 120 -535 -626 -588 -639 -1187 -905 -934 -1317 -884 -902 -755 -797 -387 -261
2065 -261 -387 -35 559 -31 338 1244 1120 732 871 1800 1543 444 895 1598 238 -105 563 641 -225 -994
2085 -994 -224 -102 -1465 -1373 -315 -1154 -1549 -1070 -313 -856 -1647 -133 488 -241 -416 764 580 186 465
2104 465 1531 1046 532 1257 1319 558 551 811 551 63 -40 292 -248 -626 -503 -567 -1090 -1442 -1114 -1187 -1606
2125 -1606 -920 -215 -1062 -859 187 86 -527 127 895 964 301 977 1624 696 644 1592 1416 430 49 877
2145 877 538 -979 -125 576 -437 -1331 -745 131 -1144 -1845 -506 -402 -1981 -1064 16 -532 -819 -492
2163 -492 1045 87 -240 1082 1220 235 539 1218 1289 549 921 1161 591 92 585 153 -433 -204 23 -572
2183 -572 -1144 -555 -276 -1281 -1063 -257 -842 -1073 -488 166 -165 -878 615 758 -34 12 1363 1156 178
2202 178 632 1779 1408 -90 1272 1507 31 -214 784 559 -690 -926 543 -405 -1521 -889 -283 -1103
2220 -1103 -1533 -639 74 -987 -1013 453 56 -736 -76 937 372 84 1074 1310 651 461 1619 1079 85
2239 85 580 999 274 -403 383 213 -698 -526 299 -607 -1354 -782 -428 -597 -1189 -483 -47 -1241 -571 412
2259 412 -154 -448 247 917 467 148 1061 1224 521 633 1350 640 163 279 1071 357 -614 269 113 -557
2279 -557 -718 -231 -183 -1357 -1207 -308 -676 -1254 -355 -191 -516 -533 -120 401 -98 181 791 599 266 1056
2299 1056 1129 612 543 825 785 -159 377 701 -214 -508 44 -94 -790 -1116 3 -161 -1575 -931 -204 -886
2319 -886 -1231 -384 283 -579 -718 485 512 -168 238 872 725 219 826 1164 672 -56 828 848 -211 65
2339 65 341 75 -484 -350 117 -779 -755 -366 -836 -734 -872 -638 -408 -812 -396 71 -230 -65 852 122 -31
2360 -31 514 898 619 679 817 1353 477 433 913 657 42 -50 424 10 -681 -1 -73 -1156 -942 -532 -466 -1154
2382 -1154 -1252 -92 -385 -927 97 252 -30 -424 253 796 174 76 956 633 656 605 867 885 65 317 580
2403 580 289 -69 -139 -178 -480 -714 -529 -381 -851 -651 -497 -593 -433 -288 -563 -466 -261 -74 -98 58 687 436
2425 436 297 865 1027 594 331 896 1000 75 222 665 308 -300 -135 204 -171 -713 -582 132 -570 -1240
2445 -1240 -526 -219 -684 -874 -168 -30 -242 -277 432 245 83 334 668 442 306 772 1189 432 258 638
2465 638 543 141 12 178 96 -581 -453 -323 -687 -561 -534 -616 -714 -641 -352 -449 -400 -84 -437 -189 350 544 73
2488 73 318 330 444 106 549 862 627 377 541 458 197 20 36 217 -574 -254 -68 -208 -638 -671 -465 -789
2510 -789 -890 -505 -264 -605 -536 83 -200 -282 284 516 434 177 349 727 326 585 806 751 470 162 467
2531 467 197 275 -94 -298 -341 -169 -553 -336 -228 -848 -420 -449 -809 -161 -477 -409 -159 -225 -42 167 189 420
2553 420 241 481 608 424 763 548 499 376 339 292 166 115 -46 101 -134 -229 -127 -377 -405 -645 -543 -279
2575 -279 -687 -596 -353 -241 -238 -308 240 175 -45 341 428 457 755 382 634 605 324 600 318 16 186 24 108
2598 108 -122 -289 -226 -301 -322 -672 -528 -639 -427 -347 -356 -650 -453 4 -164 -93 183 177 343 167 383 598 430
2621 430 784 679 634 389 379 418 531 301 92 80 66 -237 -612 -261 -288 -738 -507 -539 -358 -315 -293 -170 -133
2644 -133 -306 -105 215 192 280 408 504 531 263 453 679 337 243 297 392 212 192 -102 278 -36 -342 -306 -535
2667 -535 -252 -639 -686 -263 -733 -396 -129 -46 48 -322 1 164 173 -101 447 542 334 435 526 582 396 417 593
2690 593 360 37 327 204 243 -245 -185 -346 -455 -423 -349 -164 -281 -649 -508 -241 -204 -343 -133 -49 55 -121
2712 -121 327 732 159 414 527 446 247 334 203 560 97 173 161 146 -75 -31 119 145 -475 -334 -116 -148 -481
2735 -481 -430 -404 -432 -467 -538 128 -278 -27 17 593 231 -172 430 785 238 568 531 516 214 5 296 518 -63
2758 -63 50 -30 -191 -326 -224 -448 -56 -565 -529 -388 -177 -497 -155 -134 -403 -104 -235 135 320 1 -32 433
2780 433 434 219 553 390 177 464 330 20 28 -293 223 165 -263 -213 -387 -16 -229 -672 -55 -222 -416 -242
2802 -242 -224 -134 -366 -279 121 -31 333 59 304 647 339 310 393 402 187 409 788 138 -93 -6 100 -143 -376
2825 -376 -427 -153 -184 -311 -256 -47 -213 -427 -224 -312 -458 -280 140 225 -162 147 -4 356 15 52 294 466
2847 466 416 526 254 215 215 5 193 -54 20 -311 128 -310 -584 -265 -215 -247 -204 -267 -175 -253 -606 43 334 186
2871 186 1 -154 168 286 172 123 187 326 465 370 464 116 283 323 -5 117 -114 -90 -318 -148 -315 -150
2893 -150 -276 -714 -472 10 -220 -542 -256 -71 -256 -100 -210 381 387 -66 298 304 107 196 311 359 448 290
2915 290 345 34 273 -15 91 -29 -225 -70 -105 -305 -369 -338 -23 -198 -233 -171 -239 -62 -18 -316 239 284 50
2938 50 475 61 186 191 41 305 433 70 272 449 -34 -54 19 358 110 -368 131 -290 -316 -354 -193 -493
2960 -493 -221 -641 -201 47 -157 -273 283 78 25 26 315 292 255 431 400 529 220 329 368 242 122 175 -67
2983 -67 131 -94 -207 -286 -369 -430 73 -384 -176 -250 -257 -129 -224 -392 -207 -110 -88 35 -11 143 -216 258 515 477
3007 477 144 244 561 237 29 517 264 137 -154 18 83 -269 -327 -194 -18 -257 -168 -261 -74 -327 -294 -312
3029 -312 42 -179 -156 71 297 -61 -80 176 209 379 359 200 276 439 211 426 190 -36 -148 -144 -219 -271 -247
3052 -247 -39 16 -362 -139 -264 -339 -135 -8 -505 -396 42 -17 -72 -108 -98 101 -10 285 348 562 79 23 378
3075 378 261 137 -73 182 169 -82 -170 -75 -217 -142 -316 -230 -184 -53 -259 -146 -314 -160 -82 -28 222 -69 88
3098 88 309 83 313 454 299 282 319 169 289 386 6 315 132 139 -211 -94 145 -357 -285 -134 -151 -334 29
3121 29 -54 -236 -223 -318 175 -7 -167 -130 -201 39 -27 229 163 147 273 671 413 -97 -10 160 379 200 66
3144 66 89 -106 -291 126 -42 -105 -201 -32 122 -74 -302 -15 -287 16 29 116 44 78 125 92 113 252 206 107
3168 107 157 151 394 30 -9 304 66 -14 252 -51 -76 -491 23 -102 -370 -239 -90 -96 -383 -70 -148 -40 -157
3191 -157 -111 -11 154 177 350 99 91 274 46 353 367 481 326 9 190 92 -171 49 91 94 52 -321 -577
3214 -577 -262 -294 -198 56 -221 -97 -215 5 -99 -62 -173 -21 -33 -135 -110 -25 91 87 192 404 -3 339 39
3237 39 221 207 106 209 -358 -102 -326 -41 -54 -89 -16 -252 -152 -312 204 -157 -12 -147 111 63 -346 54
3259 54 -206 -190 218 28 331 35 308 185 3 142 203 187 -8 70 159 -198 -104 -67 -159 -51 -184 20 -66
3282 -66 -199 -168 -151 -368 113 86 30 -154 34 -49 63 -123 206 -23 99 85 353 97 -94 -20 89 -2 4 50
3306 50 -141 232 -471 166 66 -365 -215 -123 -285 -236 -302 -459 -247 143 -6 -188 -66 -77 215 46 329 163
3328 163 317 360 155 263 169 22 113 168 9 -195 175 7 229 191 -78 86 -441 -50 -171 -197 -91 -151
3350 -151 121 -307 -280 160 71 -119 -44 -20 417 77 193 118 66 167 345 116 -30 278 37 -40 29 79 179
3373 179 -297 -36 -189 -86 -175 -25 -88 -200 -12 244 -57 27 -50 215 133 -204 -56 524 422 -106 404 274
3395 274 84 -74 334 87 -111 -27 9 -202 -147 60 55 -31 -288 -356 -54 -125 -136 121 -114 -475 206 0 12
3418 12 -162 61 142 81 -53 -118 206 18 82 57 71 120 44 182 92 -103 191 41 -25 -212 -216 -123 -64 28 -229
3443 -229 -130 -68 24 -72 -188 21 28 -195 -9 -156 193 -131 -73 73 174 72 -214 508 70 250 -96 -21 -118
3466 -118 72 378 -259 -35 19 -7 -6 -242 89 42 140 -137 -303 -65 -430 -69 -25 -104 176 176 14 117 -133
3489 -133 -40 40 192 92 104 411 32 54 109 133 72 197 35 -107 164 -115 -423 15 -8 -394 -72 -110 -120
3512 -120 -143 54 -84 129 102 -44 -182 133 -16 -26 158 46 94 29 144 214 -158 -25 128 -145 102 145
3534 145 6 -155 -191 -245 -131 -227 23 166 -18 -33 -149 -58 -75 -139 253 -56 13 2 170 -3 249 40 235
3557 235 -16 -3 144 40 187 249 35 -16 31 -157 -301 -12 -152 190 -84 233 -172 -325 -114 -205 227 -6
3579 -6 -415 -53 73 11 -168 129 251 152 227 44 273 187 -127 -94 268 57 136 -3 56 31 131 87 -126 66
3603 66 -143 -258 -196 -171 -242 -60 -82 -155 -40 -8 -130 132 236 -234 65 -18 11 150 -42 205 -6 58 103 106
3627 106 211 -59 -92 102 -128 37 -113 -120 -39 -151 313 -167 -52 25 -55 46 -92 -295 -113 -14 -18 -80 96
3650 96 132 47 293 97 6 7 150 339 185 -94 -225 79 -209 3 -126 -29 148 -340 -454 -95 -48 -229 -455
3673 -455 -207 -192 -22 -11 128 87 -265 163 303 146 -38 263 281 162 82 151 -86 -81 -90 476 -106 -26 147 -38
3697 -38 67 -94 -6 15 -176 17 -13 -265 -11 -145 -173 -48 19 -397 -95 40 193 -21 319 411 -26 225
3719 225 34 -168 -81 105 95 378 344 280 58 -141 29 -301 -72 -42 104 -84 -126 -202 -258 -319 -56 -71 -265
3742 -265 -30 94 -19 36 272 -65 108 23 239 249 -37 -30 154 -47 70 100 -64 -110 77 -142 56 -175
3764 -175 -267 107 76 -297 -118 89 -357 -10 -52 -125 -191 23 101 187 278 80 -208 -11 40 -225 356 4 163
3787 163 56 62 -18 55 229 -65 -163 158 -117 0 -64 23 -60 -79 -40 -303 -102 -195 -206 -82 -20 -4 -77 114 138
3812 138 19 84 -158 172 94 141 4 -8 163 -17 99 -152 140 9 91 -46 -262 -338 -181 -52 75 -240
3834 -240 -182 -103 -118 -13 -223 181 -57 -205 35 186 -178 214 132 374 29 39 173 121 280 111 67 -12 206
3857 206 -67 -177 -63 102 -92 154 30 -217 51 -153 -115 -3 -254 -89 169 -143 -210 225 -36 40 170
3878 170 59 62 -152 316 371 583 196 259 123 204 143 -42 118 -250 -280 -73 30 -109 -130 97 -226 -218 -303 -36
3902 -36 -86 73 -44 248 7 52 110 -45 243 -345 158 128 130 303 10 161 97 166 -135 36 17 80 58 -131
3926 -131 -239 95 27 -4 -35 101 26 -159 62 -45 12 70 4 204 69 52 89 211 190 -13 121 29 54 201
3950 201 213 129 -45 102 35 -74 139 -213 57 -131 -103 -225 -20 -73 -1 -161 72 -122 -205 -86 11 54 107
3973 107 143 66 67 230 177 177 -10 304 10 77 204 60 67 27 -16 -208 -132 -277 -2 -274 -155 -78 -40 -238 147
3998 147 -147 -9 -34 55 -34 -22 59 -90 29 61 282 -3 99 181 147 224 127 157 -71 45 100 19 117 16 -112
4023 -112 -421 -221 63 -229 -478 120 -196 -91 -137 26 102 -19 117 -24 -51 -211 -232 157 100 52 30 180
4045 180 162 -139 146 107 -151 -306 11 104 143 -136 -106 -98 -8 -247 -389 139 28 -121 -92 -122 -178 10 36 106
4069 106 1 -109 13 -81 104 149 -113 -141 37 295 60 303 129 81 -183 -84 160 -145 58 -23 -157 -176
4091 -176 -100 -151 -269 -1 -89 -275 127 -2 -299 -40 -184 40 129 100 35 65 19 17 68 -48 0 5 63 -68 -18
4116 -18 -171 147 -136 -140 5 -99 -64 -73 -182 25 83 -395 -146 21 57 14 -169 -5 -279 170 233 -203 -32
4139 -32 -18 128 28 169 38 -1 17 177 265 86 -18 93 -71 -129 -106 -204 -66 -151 -147 16 77 -383 16 -283
4163 -283 -32 71 36 184 73 289 -157 167 242 153 -226 3 224 -125 157 -138 78 -248 106 67 -56
4184 -56 -217 -233 94 59 -109 -156 -125 25 -65 -119 -24 49 -140 302 -15 16 106 241 219 -80 -217 257 -4 11
4208 11 -77 15 132 108 -38 -43 -229 -108 -59 137 54 -60 -255 -96 -272 40 -93 47 -28 -30 50 65 -231 -186 44
4233 44 -100 68 148 147 166 122 24 234 -129 -87 -14 -163 -257 -111 -109 -70 111 -181 25 -251 -58 -28 79 -88 -156
4258 -156 -114 233 -213 -43 -177 77 154 -76 36 -78 177 -146 -43 -219 -34 476 313 -170 36 192 -204
4279 -204 44 24 -226 173 -141 -248 -64 -106 -211 15 -38 137 30 25 212 -9 35 119 -6 197 -11 79 208
4302 208 -113 149 64 -130 48 282 266 -43 -256 -41 134 116 -96 -41 70 56 -105 -109 -98 -30 -78 68 -137
4325 -137 -130 16 -69 139 24 128 307 -24 59 -54 18 175 23 -156 76 -75 -15 86 64 -68 -148 230 130
4348 130 -80 -21 -137 56 -66 -201 -76 -133 -72 -94 91 -106 384 67 -19 -104 133 -169 128 47 -1 -218 4
4371 4 95 -288 47 -42 -40 137 -199 -6 -92 -378 136 141 -192 -105 42 -97 -224 -317 -255 180 325 230 -3 138
4395 138 31 52 12 79 -166 211 121 55 12 149 9 -24 -262 -12 9 -39 57 -117 -94 -19 -58 -324 -226 -68 -98
4420 -98 -52 -118 -168 91 104 151 -166 327 -147 -60 123 -75 -26 -50 379 295 239 135 -49 -120 79 -147 -21 9
4444 9 -106 31 85 -62 -62 -285 -259 25 -40 -110 46 125 -86 161 53 47 177 117 156 117 146 126 262 113 62 197
4470 197 -90 93 -157 91 -29 203 -23 -312 -276 -288 -183 47 -78 -24 -240 -144 2 86 -102 86 159 107
4492 107 392 -172 257 41 398 30 12 58 86 183 182 -112 8 145 128 45 -58 -304 -239 158 -154 -148 -30 -35
4516 -35 -117 -78 3 -183 165 124 183 -3 -13 222 377 63 251 39 390 -4 129 117 -134 8 -248 -38 -139
4539 -139 -105 -118 187 -61 -129 -46 -130 -304 -33 41 -73 -13 -192 160 1 111 -63 88 -224 106 280 195 182
4562 182 -30 45 271 -205 21 -30 -142 -88 -59 180 -81 -46 -298 -306 -147 -168 2 -16 -83 74 -140 -178 214 98
4586 98 141 198 178 173 40 38 143 126 498 -22 -54 -301 324 -41 84 77 71 130 -79 -155 -314 -389 -401 -188 -3 -43
4612 -43 46 92 -362 51 22 -115 -110 36 -113 -25 2 319 269 63 -38 -6 268 -350 147 -66 307 -86 -331
4635 -331 162 -159 -53 39 -47 6 -140 -157 -37 -167 24 -176 -336 -83 110 -166 -145 -146 74 337 136 15
4657 15 86 -35 -183 -62 92 -24 -29 333 -115 -165 -144 -224 -246 -310 -51 -87 -96 -145 34 -34 -222 -12 222 -99 -89
4682 -89 110 175 -127 155 70 -27 113 -70 430 210 -86 -73 -236 68 -96 108 144 19 -348 -128 32 -250
4704 -250 -29 -45 -36 -276 127 -33 -27 -417 -293 67 -46 210 199 -71 9 177 -85 207 244 177 -172 -158 154
4727 154 140 -112 85 110 -163 -288 -262 -67 161 133 103 -30 -140 -169 -386 18 113 254 201 207 206 142 -325 317
4751 317 -37 211 -21 209 291 236 75 16 -161 95 -222 2 -164 182 -264 -52 -57 -115 77 -167 -63 -97
4773 -97 -87 -244 70 83 44 28 83 76 6 -118 14 -1 23 -130 78 86 337 -101 58 -131 8 114 -116 -239
4797 -239 -9 -353 31 -150 -226 -95 -85 -177 -29 -25 -318 99 -114 13 384 290 -24 1 -11 134 -10 -57 -63 129
4821 129 275 132 -11 14 -26 103 -160 -288 29 205 28 -149 -23 28 42 72 -74 95 -42 -27 -80 -74 -235
4844 -235 87 2 66 11 45 -27 -51 10 -203 126 171 -79 -4 -268 39 22 -27 13 109 23 -80 -242 -75 93 -274
4869 -274 -198 46 -263 -212 245 -19 111 380 55 95 -148 -175 100 173 264 48 -18 151 122 83 45 -158 -17
4892 -17 -24 -149 -218 66 139 -85 -203 -304 -33 29 -81 27 -267 -30 -33 -31 25 -74 133 154 114 -19 337 225 182
4917 182 47 20 169 -120 -30 33 70 14 -164 -92 222 -102 -113 129 -244 -139 -153 -27 19 53 -108 -96 64 237
4941 237 165 133 -152 -113 -84 315 -138 102 -19 149 -63 6 -73 94 -118 12 147 -74 107 2 55 -228
4963 -228 117 165 -183 -302 279 -123 214 -59 -66 -130 24 87 31 -19 -38 49 49 36 -68 134 262 1 71 -195
4987 -195 -13 -209 -160 -67 -200 -52 36 -33 24 83 -108 107 61 -113 -188 58 109 2 -216 -69 -302 287 -92
5010 -92 -66 -117 68 29 -136 143 28 -157 -62 76 -134 -75 -182 204 -395 -162 -145 24 -8 -175 -39 -109 -70
5033 -70 107 -86 230 195 44 103 80 243 138 -15 210 113 -91 82 154 268 95 -65 -46 100 49 54 -164
5056 -164 -26 92 -157 37 -127 -49 -142 -81 -93 101 -26 -54 -133 132 -139 -43 186 158 325 108 -92 280 116
5079 116 -153 -287 32 233 143 77 -219 -92 -74 146 14 -60 -274 -80 -49 -235 -112 -6 45 18 181 242 -164
5102 -164 4 15 196 40 48 -83 88 294 -137 -21 -27 106 98 -169 -237 -122 -38 17 -177 36 -156 47 -14 -7
5126 -7 60 -22 219 -97 -188 1 156 -172 -190 156 -5 -60 -109 -82 26 239 -140 216 131 57 -57 140 -67 -323
5150 -323 -28 -23 115 -155 33 -251 -158 -134 -128 28 -221 -106 -171 249 95 -149 -21 254 -32 87 71 3 -25
5173 -25 -44 140 108 108 322 -155 -135 132 57 -121 30 -186 -219 -112 -226 -108 -145 132 79 220 28 -284 -86
5196 -86 135 -6 109 137 109 -14 -244 -177 -20 -222 108 342 -99 76 406 -26 -43 7 -86 -354 529 246
5218 246 164 171 -43 -222 -243 -145 61 -158 -108 -7 145 135 47 141 -87 -101 125 49 197 120 -198 93 -5 -100 136
5243 136 31 142 138 170 18 -41 -95 -76 -228 -120 -378 -163 -336 -55 10 -141 -112 54 63 201 31 100 198 -133
5267 -133 -63 -24 166 -14 -100 21 40 32 -165 105 -209 -90 139 80 88 -60 53 10 61 -304 -285 299 -36 31
5291 31 38 170 -17 -23 49 -273 184 -146 -23 -47 25 69 -155 16 138 200 8 167 13 -45 50 45 -94 -71 -11
5316 -11 9 -95 -154 139 9 377 -88 -185 -258 68 -125 139 4 -32 -9 396 -23 -191 126 -37 -20 -21 87
5339 87 288 132 66 -137 -77 -146 -25 -139 -239 33 -143 -146 52 -226 -217 -218 -159 -26 -38 86 121 -72 244 79
5363 79 152 -236 35 -158 -39 75 -16 238 25 -151 -47 -108 -86 171 -112 174 44 97 210 -31 -50 -135 -118
5386 -118 35 252 15 -54 -113 233 -260 -242 158 242 -26 101 35 32 -36 -23 -48 97 24 -91 -49 99 -120 88
5410 88 -51 -73 142 -46 -153 -168 261 -59 88 -201 -13 -133 -11 149 115 151 -2 76 67 215 186 152 105 84
5434 84 158 382 -217 -149 -33 -123 120 -115 -198 -110 -10 -29 321 -92 -103 -93 -73 56 -105 -156 -67 75 47 82 86
5459 86 22 118 74 174 83 268 103 165 49 -125 -86 121 13 149 -182 20 -1 113 -24 -494 -17 49 -137
5482 -137 -222 -60 -195 -5 34 -161 -373 317 127 108 146 221 -139 -102 99 -216 125 146 74 225 -165 65 -427
5505 -427 111 -134 32 210 153 -136 -84 -246 -79 -92 -13 -80 -169 12 -1 -155 -89 -197 197 140 -4 -243 -20
5528 -20 -103 182 33 17 -59 -128 -129 303 -15 -8 287 -203 -264 151 88 44 108 -315 33 48 -17 192 204 83 11 112
5554 112 29 -4 184 113 115 180 25 -114 56 65 -99 137 21 71 151 20 362 164 -418 -96 -97 -180 -80 100
5578 100 25 -184 101 66 21 55 142 177 -339 -163 39 -79 283 46 -77 -38 -9 185 53 -10 157 304 70
5601 70 142 163 55 64 -252 -218 -262 61 26 -47 -211 -214 27 41 -39 227 -1 -43 80 -62 225 255 2 214 117
5626 117 90 321 94 215 216 -7 -111 58 -178 287 13 20 -342 -118 -190 -339 -210 -80 -271 -109 -202 -57
5648 -57 -48 -186 187 73 106 55 215 -130 151 4 -99 -102 -44 165 93 91 -192 152 -250 1 -232 46 -372 -89
5672 -89 32 -87 -229 0 1 10 77 10 77 172 -97 43 42 60 125 -86 -95 -35 77 57 72 56 36 13 -194 130 189
5699 189 -109 58 -145 -151 60 -164 -329 -30 -9 132 -57 -70 -88 -308 25 99 -77 23 147 380 -113 197
5721 197 -169 187 86 195 27 101 7 -6 181 -48 -38 -216 -132 -32 -167 -113 -139 -26 74 115 -58 -241 179
5744 179 33 29 -65 -60 -136 148 -50 319 51 -182 -178 -118 64 -47 88 -22 -189 8 -11 -371 193 122 -125 -111
5768 -111 -90 -6 184 92 362 -163 -90 57 -88 -182 -139 155 5 -35 -152 -53 -144 125 21 133 210 110 141 183
5792 183 38 -113 -3 131 164 -139 -51 -7 37 -58 -32 -92 -20 64 11 48 -242 -342 -47 -159 -255 85 119 180 40
5817 40 -56 124 79 13 -100 -18 5 234 -268 93 11 0 212 7 67 238 -90 -45 -172 -115 20 -100 -78 -15
5841 -15 151 47 56 61 -228 33 396 179 158 -100 148 185 -77 -25 -36 -389 23 4 112 -117 -77 -3 -137 -8
5865 -8 310 -80 -148 -61 -181 46 -97 -4 -106 259 -63 117 -134 114 16 441 45 -35 -94 251 -51 23 42
5888 42 -40 47 200 -28 155 -108 225 105 21 -97 -98 -62 -151 -5 69 -128 35 260 134 177 89 -8 37 12 260
5913 260 146 107 -169 -114 -23 105 -319 173 209 -23 -215 212 209 143 -146 92 -165 -162 -71 -100 11 -168 32 -79
5937 -79 -173 -267 -65 -35 96 -63 -170 96 42 163 323 -3 131 -68 148 129 180 81 -136 10 -153 107 -111
5960 -111 -86 -129 -73 -33 -25 -285 -288 55 41 -147 -115 -36 -96 178 -65 226 178 14 327 -23 238 100 159 238 -69
5985 -69 -237 397 70 -53 328 -82 -37 41 66 -311 -7 47 124 -161 125 269 32 94 -113 11 24 -4 -78
6008 -78 -14 190 179 -94 -94 75 -147 100 180 -143 -242 78 72 7 -170 94 32 -25 -84 -134 139 -20 -160 -226 68
6033 68 -44 258 223 -125 79 -242 48 -53 135 11 42 -15 99 47 -76 -4 -140 -20 130 237 -72 -58
6055 -58 2 65 -60 -155 -136 -68 17 15 -140 11 -169 88 -32 -162 110 66 -46 47 -18 209 -183 14 329 134
6079 134 8 83 437 121 182 -110 191 120 -30 -78 -137 52 -139 -41 -6 -73 -103 181 28 78 55 -27 54 28 -46
6104 -46 -56 178 389 411 103 61 129 463 60 36 162 7 75 109 150 -3 -58 -146 -294 -27 16 71 -443 -135
6128 -135 42 -16 -203 232 -179 255 19 93 13 -32 -32 -88 107 154 126 -272 -162 12 3 79 -31 294 -7 69
6152 69 -42 36 -45 -82 -8 -175 -43 4 163 -151 83 -121 -22 221 161 36 50 77 8 -27 33 -74 232 393
6176 393 -31 -278 91 -178 -26 -76 48 16 -35 -87 39 -175 -84 -146 42 14 -133 -58 54 182 -333 -57 45
6199 45 115 -140 -43 19 413 128 -105 3 -23 -85 -93 201 103 182 -210 86 -61 -85 24 50 -68 -64 -254 237 -266
6224 -266 -300 47 25 38 -357 -109 -154 255 -32 163 189 179 142 -98 -11 190 15 188 -65 -34 68 170 225
6247 225 49 -20 121 107 -222 52 50 -258 -24 -49 161 -170 14 23 263 51 58 -102 -26 171 149 -9 -17 285
6271 285 174 75 91 406 151 87 -81 -38 -66 248 141 -99 -132 -167 -21 72 -88 -85 145 73 -95 -91 -55 295 -125
6296 -125 -40 72 46 -172 118 217 -105 88 257 124 -93 -36 458 143 41 22 -52 3 -111 -96 -38 -63 94
6319 94 -199 -301 -155 -67 -170 7 -33 -155 -105 56 71 141 225 -10 -5 195 236 262 160 21 -32 142 83 -30
6343 -30 -31 9 -105 -79 213 114 -98 45 154 -95 164 -392 219 147 -136 -163 -17 -3 186 306 88 -123 337
6366 337 36 -28 -16 91 -48 120 -19 187 120 -241 -57 -102 64 -83 -268 -74 -98 -98 -228 -249 114 96 58
6389 58 80 164 -28 -16 -33 22 186 -83 -40 229 -101 229 226 -45 44 325 -119 -47 18 228 -138 -52 -205 -169 225
6414 225 -199 154 167 -10 -73 -92 55 10 196 -202 211 169 -237 22 146 114 136 -234 -40 80 142 -245 -73
6437 -73 -91 -95 44 171 167 -259 -151 -7 -286 -255 -5 -226 263 -404 -198 17 -66 7 62 -67 353 69 -66
6460 -66 -159 -30 235 103 54 -42 37 67 310 -123 173 41 64 -366 -162 118 205 -148 -125 191 0 -63 58
6483 58 -207 -91 -16 25 -107 -48 32 -59 58 58 343 6 -253 144 -11 -156 -72 -34 21 199 92 21 -56 -23 21
6508 21 86 91 -12 -106 -135 38 57 -37 185 -119 56 -303 -179 244 175 247 -91 178 -84 -61 9 -191 124 270
6532 270 331 64 76 69 -238 73 -39 36 35 52 94 169 129 -148 -119 -449 234 -144 -250 97 -113 114 51 -176
6556 -176 -118 -112 -42 0 247 234 75 239 128 -31 -170 -174 423 59 -96 -22 -118 105 -145 54 -126 -75 36 -64
6580 -64 -47 -154 96 -39 15 245 124 -188 -90 -71 59 -53 8 -67 259 -71 -30 31 211 -111 -7 123 82
6603 82 -160 -162 62 -50 154 -85 104 -139 -162 -9 78 194 -1 200 -80 7 168 108 -15 98 185 276 -168
6626 -168 -150 2 -58 13 -1 249 -38 0 -64 193 260 -14 -123 -30 86 211 -191 -8 -137 64 -21 -149 -37
6649 -37 90 -206 46 148 107 307 34 65 20 169 -31 143 -48 -44 34 79 -132 -90 154 -122 -206 237 93
6672 93 -32 6 -54 -298 36 149 4 32 -163 16 -180 6 88 -16 -120 -122 191 -206 -219 -9 100 -109 171
6695 171 -31 -91 7 -194 22 -17 79 43 -91 302 -100 -17 148 108 -96 -44 118 -243 70 -304 -52 -151 103
6718 103 -82 139 137 -60 -34 2 458 -33 -9 -129 167 209 43 -43 78 56 88 -65 -232 51 44 -14 -100 -56 -45
6743 -45 -297 52 124 33 8 7 -128 30 361 -18 0 272 52 67 -2 150 -60 180 97 -45 -1 -210 140 -120
6767 -120 -302 196 4 39 -46 -115 45 -15 -76 114 -134 33 -265 122 -50 -51 25 -137 113 252 138 170 245
6790 245 217 90 -103 305 186 -115 109 50 -178 -118 -59 202 18 -166 -123 -56 -2 -106 -64 46 -17 225 155
6813 155 -310 185 -152 -21 106 84 154 95 110 -226 145 223 -133 43 -152 197 157 -20 -267 -95 -116 -412
6835 -412 -6 -78 -105 -216 8 -193 272 321 147 139 -63 10 48 -110 82 116 60 231 89 66 396 105 139 -23
6859 -23 90 4 38 -170 -171 -81 59 -85 260 -88 -52 38 79 -64 -246 79 24 -85 107 23 27 -51 224 110 -8
6884 -8 17 52 38 45 180 -115 -111 -123 -106 20 -67 -134 25 50 -26 288 50 -40 -166 124 -219 -119 -105 190 -93 60
6910 60 118 100 -165 240 80 -9 71 84 -101 270 109 144 179 29 -406 -46 -249 53 -89 -70 147 31 -175
6933 -175 -129 -8 -91 -73 57 258 -3 -121 109 -30 -9 237 207 167 -174 133 56 175 -30 -48 -24 -92 -213
6956 -213 161 -17 -139 -203 -26 -5 -37 -42 -330 -40 116 9 -392 -17 45 -191 -100 -69 198 314 31 -48 21
6979 21 -111 182 132 -13 14 -62 -217 267 -87 -250 -94 200 10 293 -22 29 -145 -23 -44 -138 127 186 -117
7002 -117 -125 14 90 -224 -307 -99 120 163 -186 130 29 148 -22 44 97 -262 9 83 22 -39 -66 -143 -115 106
7026 106 87 130 -1 -161 -78 9 -58 9 -21 -7 188 23 77 132 -88 172 4 113 -196 362 -31 -88 33 -111
7050 -111 50 -136 100 -245 156 -113 163 84 -29 -127 -233 140 39 75 -231 -115 -91 -34 -16 52 108 14 101
7073 101 99 101 -43 -49 91 317 156 -137 224 72 77 73 -172 -269 -24 120 -245 137 85 -9 18 101 -12 -143 -285
7098 -285 -113 6 36 221 -4 -142 -47 234 99 207 -210 225 -47 -21 51 92 -23 3 -98 -144 -171 181 -92
7121 -92 -157 283 103 -144 -25 -244 236 -72 30 -71 -179 187 10 119 -57 74 219 -76 -31 324 101
7142 101 231 -6 -94 145 306 -195 61 -3 205 -111 -2 -27 67 289 -25 117 -38 -92 -32 -16 -150 -172 154
7165 154 162 -46 -63 -108 -206 200 85 239 -58 -51 -77 7 54 130 118 -153 -3 167 112 12 -10 -14 30 -18 195 154
7191 154 -82 -193 5 -296 -54 -86 168 22 12 543 -41 29 182 79 197 155 -58 159 -88 126 -43
7212 -43 104 -32 13 85 24 -28 -96 -27 -293 -101 7 25 268 -47 57 -195 -40 -123 -48 -9 -44 2 -67 152 -27
7237 -27 245 126 -254 -130 113 43 -159 -269 174 248 -306 -6 -302 -166 -27 -1 -180 -94 -120 -54 26 -193 -194
7260 -194 -95 9 -490 -25 294 270 -73 13 79 -34 171 248 145 251 121 -8 -59 -154 120 18 147 85 -64
7283 -64 170 -117 89 -168 105 -101 4 -39 24 -192 193 -20 -125 -270 -26 -139 -57 -171 -144 59 225 -153
7305 -153 10 61 86 87 103 -39 -49 -27 178 -72 -119 -84 182 10 -52 90 9 91 -76 -107 78 70 95 -39 -82 104
7331 104 175 -104 111 102 -16 206 -27 92 -16 -15 46 -247 -269 -175 -262 156 -180 54 224 68 -89 25 312
7354 312 -192 271 27 -84 -49 -13 108 55 -40 8 -123 234 -10 -373 130 147 6 -195 -86 -171 191 -207
7376 -207 31 -11 -173 -16 9 -296 -60 -284 38 -66 -124 -257 -84 0 156 53 -63 -109 -143 -187 38 76 6
7399 6 231 63 -75 19 181 179 -156 -236 300 83 391 58 41 -301 -292 6 -33 -290 154 -58 -101 -51 20 26 -83
7424 -83 239 -46 87 -319 -225 117 125 61 -22 -97 -2 -12 13 -2 -124 156 -6 -78 16 116 181 121 -185 -192 -150 147
7450 147 -150 -242 -79 -89 -44 -141 0 285 31 162 11 72 -148 58 -56 309 7 -15 128 -36 203 46
7472 46 -101 -210 -54 13 -142 -76 -102 -74 -71 90 -58 -8 16 2 175 28 264 6 83 29 -122 18 68 -98
7496 -98 97 -19 116 33 -98 -36 67 93 157 -83 112 52 55 201 -63 156 108 33 72 -109 54 45 -1 200 102
7521 102 -68 -87 37 152 -116 305 -63 -26 195 204 72 30 -69 127 -211 21 81 188 146 -45 114 -61 210
7544 210 61 51 -189 -174 -246 -209 110 222 -349 47 -153 -89 -31 -6 35 -25 -114 185 18 -2 97 107 77 135 191
7569 191 35 -203 -24 -31 -67 78 227 -99 -90 -58 -25 -166 75 -175 97 -123 256 -12 70 189 98 -90 54
7592 54 113 92 -376 -53 91 -238 158 -226 -188 -45 -254 10 80 -103 41 84 -221 67 99 -171 -94 80 17
7615 17 -27 18 -79 177 -55 334 27 110 -69 44 33 -15 -181 23 99 261 -55 96 -3 4 -115 82 -124 -77
7639 -77 331 78 -24 -42 -100 217 -37 -325 4 -29 -68 -231 103 -208 -116 52 194 -4 12 -96 -224 -247 21
7662 21 -51 27 333 -60 -185 61 60 -233 12 -57 -205 -171 -14 -131 -90 -14 112 95 -96 -94 164 108 -10 35 185
7687 185 71 -180 153 -5 -76 -93 65 246 75 94 -126 -3 -146 185 -339 349 1 64 40 3 -252 126
7709 126 -77 141 242 -119 -88 258 -91 -84 -269 -84 74 250 -14 -67 -72 -75 -99 29 28 62 134 -246 -59 198
7733 198 -136 14 231 11 -72 -114 -35 -63 69 -116 -35 191 206 14 73 85 339 82 104 11 -178 177 -230
7756 -230 -203 -112 -171 56 -109 138 45 -15 -117 -213 167 -33 157 126 133 -36 -191 -52 -77 -151 19 184 47 29
7780 29 103 131 -85 76 164 54 -106 222 83 -3 186 -206 -18 105 180 -108 -140 -228 -110 9 60 159 -30
7803 -30 -152 -61 51 35 -12 -431 -94 99 128 -29 -21 270 90 -192 -48 124 -165 -61 59 -97 65 -272
7825 -272 16 -17 -39 92 94 161 -55 86 -32 89 -369 -135 -55 119 58 -17 36 -84 -100 48 121 19 -70 17
7849 17 167 -35 10 59 -42 -56 107 312 93 -90 -136 120 138 -201 -70 -59 -234 -65 26 82 185 -187 -136
7872 -136 -104 -131 23 116 133 -61 146 74 -39 216 231 44 4 -41 -204 -255 -164 124 -217 -78 -137 -159 -181 85
7896 85 206 -12 -70 -36 125 247 14 -120 76 22 70 105 43 80 118 62 216 -20 -44 259 150 188 -230 -135
7920 -135 124 9 7 -172 252 -92 100 21 35 50 93 45 43 40 178 149 -93 -143 144 130 -60 -53 -61 -271 -102 -39
7946 -39 23 59 37 48 -33 -95 106 61 91 17 24 -2 -37 -5 44 143 -97 82 331 51 39 -191 -16 81 -71 83
7972 83 -105 177 -93 21 111 -83 163 -187 -74 161 296 24 157 64 49 21 -31 15 18 -48 -126 -35 -171 -192
7996 -192 362 -62 -252 -122 -111 -94 127 30 -96 -42 -13 20 215 151 59 116 -163 -100 -206 -339 -242 -138 -102 126
8020 126 -3 -124 95 -268 60 26 -117 37 174 -87 -341 60 -57 88 163 47 -84 -275 -92 64 -33
8041 -33 109 -298 -64 16 -49 31 -29 -101 290 -4 -4 -137 150 330 -116 78 7 197 78 -175 -53 122 -283
8064 -283 133 -101 34 299 40 -5 0 223 -124 -47 76 -102 146 69 36 74 23 -30 -127 76 -135 -9 87 -88
8088 -88 107 -84 -12 101 22 -25 120 -59 -205 257 2 38 70 7 -94 -158 -213 167 -68 185 -20 -96 168
8111 168 129 -20 104 79 -36 95 -4 -40 10 -71 59 -226 51 255 145 -100 -105 -64 -121 232 28 109 113 -39
8135 -39 77 329 101 -24 -32 331 -48 -200 171 37 -124 -15 -8 162 -10 14 245 -6 29 -193 169 -9
8157 -9 -22 85 37 86 -105 -148 151 -104 -53 -110 197 -99 158 184 -105 -2 226 -5 63 59 107 80 -72 8 -18
8182 -18 -136 64 37 28 -201 -28 9 383 111
8191A11
##END NTUPLES=NMR FID
##END=
