##TITLE=1H_Pr 5002-Am-m
 CDCl3, 8 sc, 
 29.9.2020
##JCAMPDX= 6.0         $$ Bruker NMR JCAMP-DX V2.0
##DATA TYPE= NMR FID
##DATA CLASS= NTUPLES
##ORIGIN= UXNMR, Bruker Analytische Messtechnik GmbH
##OWNER= root
$$ XWIN-NMR		Version 3.5
$$ Tue Sep 29 10:40:13 2020 Russian Standard Time (UT+4h)  she@DPX200
##.OBSERVE FREQUENCY= 200.1315066352
##.OBSERVE NUCLEUS= ^1H
##.DELAY= (6, 6)
##.ACQUISITION MODE= SIMULTANEOUS
##.ACQUISITION SCHEME= undefined
##.AVERAGES= 8
##.DIGITISER RES= 18
##SPECTROMETER/DATA SYSTEM= spect
##.PULSE SEQUENCE= zg30
##.SOLVENT NAME= CDCl3
##.SHIFT REFERENCE= (INTERNAL, CDCl3, 0, 15.7039)
##AUDIT TRAIL= $$ (NUMBER, WHEN, WHO, WHERE, WHAT)
$$ ##TITLE= Audit trail, XWIN-NMR		Version 3.5
$$ ##JCAMPDX= 5.01
$$ ##ORIGIN= Bruker BioSpin GmbH
$$ ##OWNER= she
$$ F:/spectra/data/she/nmr/H-F/1/audita.txt
$$ ##AUDIT TRAIL=  $$ (NUMBER, WHEN, WHO, WHERE, WHAT)
(   1,<2020-09-29 10:39:15.53 +0400>,<she>,<DPX200>,
      <created by zg, POWCHK disabled, PULCHK disabled
       configuration hash MD5:
       00 E9 B6 7A A2 85 ED C7 34 08 36 98 17 FE 4E 26
       data hash MD5: 16K
       D2 E5 F7 6A D5 8E CB C3 DB CA BF 55 52 6D 5D 6D>)
$$ ##END=
$$ 
$$ hash MD5
$$ 1E 06 8D 9C 47 1F 45 11 06 75 40 F3 73 94 33 EA
##$RELAX= 
##$RELAX= 
##$RELAX= 
##$RELAX= 
##$RELAX= 
##$RELAX= 
$$ Bruker specific parameters
$$ --------------------------
##$DU= <F:/spectra>
##$EXPNO= 1
##$NAME= <H-F>
##$PROCNO= 1
##$TYPE= <nmr>
##$USER= <she>
##$AMP= (0..31)
100 100 100 100 100 100 100 100 100 100 100 100 100 100 100 100 100 100 
100 100 100 100 100 100 100 100 100 100 100 100 100 100 
##$AQSEQ= 0
##$AQ_mod= 1
##$AUNM= <au_zg>
##$AUTOPOS= <>
##$BF1= 200.13
##$BF2= 200.13
##$BF3= 200.13
##$BF4= 200.13
##$BF5= 200.13
##$BF6= 200.13
##$BF7= 200.13
##$BF8= 200.13
##$BYTORDA= 1
##$CFDGTYP= 0
##$CFRGTYP= 5
##$CHEMSTR= <none>
##$CNST= (0..31)
1 1 145 1 1 1 1 1 1 1 1 1 1 1 1 1 1 1 1 1 1 1 1 1 1 1 1 1 1 1 1 1 
##$CPDPRG= <>
##$CPDPRG1= <>
##$CPDPRG2= <>
##$CPDPRG3= <>
##$CPDPRG4= <mlev>
##$CPDPRG5= <mlev>
##$CPDPRG6= <mlev>
##$CPDPRG7= <mlev>
##$CPDPRG8= <mlev>
##$CPDPRGB= <>
##$CPDPRGT= <>
##$D= (0..31)
0 1.2 0 0 0 0 0 0 0 0.06 0 0.03 0 0 0 0 0.0002 0 0 0 0 0 0 0 0 0 0 0 0 
0 0 0 
##$DATE= 1601361554
##$DBL= (0..7)
120 120 120 120 120 120 120 120 
##$DBP= (0..7)
150 150 150 150 150 150 150 150 
##$DBP07= 0
##$DBPNAM0= <>
##$DBPNAM1= <>
##$DBPNAM2= <>
##$DBPNAM3= <>
##$DBPNAM4= <>
##$DBPNAM5= <>
##$DBPNAM6= <>
##$DBPNAM7= <>
##$DBPOAL= (0..7)
0.5 0.5 0.5 0.5 0.5 0.5 0.5 0.5 
##$DBPOFFS= (0..7)
0 0 0 0 0 0 0 0 
##$DE= 6
##$DECBNUC= <off>
##$DECIM= 32
##$DECNUC= <off>
##$DECSTAT= 4
##$DIGMOD= 1
##$DIGTYP= 9
##$DL= (0..7)
0 120 120 120 120 120 120 120 
##$DP= (0..7)
150 150 150 150 150 150 150 150 
##$DP07= 0
##$DPNAME0= <>
##$DPNAME1= <>
##$DPNAME2= <>
##$DPNAME3= <>
##$DPNAME4= <>
##$DPNAME5= <>
##$DPNAME6= <>
##$DPNAME7= <>
##$DPOAL= (0..7)
0.5 0.5 0.5 0.5 0.5 0.5 0.5 0.5 
##$DPOFFS= (0..7)
0 0 0 0 0 0 0 0 
##$DQDMODE= 0
##$DR= 18
##$DS= 0
##$DSLIST= <SSSSSSSSSSSSSSS>
$$ [...]
##$SUBNAM2= <"">
##$SUBNAM3= <"">
##$SUBNAM4= <"">
##$SUBNAM5= <"">
##$SUBNAM6= <"">
##$SUBNAM7= <"">
##$SUBNAM8= <"">
##$SUBNAM9= <"">
##$SW= 16.880792210976
##$SWIBOX= (0..15)
0 0 2 0 0 0 0 0 0 0 0 0 0 0 0 0 
##$SW_h= 3378.37837837838
##$TD= 16384
##$TD0= 1
##$TE= 0
##$TE2= 300
##$TE3= 300
##$TEG= 300
##$TL= (0..7)
0 120 120 120 120 120 120 120 
##$TP= (0..7)
150 150 150 150 150 150 150 150 
##$TP07= 0
##$TPNAME0= <>
##$TPNAME1= <>
##$TPNAME2= <>
##$TPNAME3= <>
##$TPNAME4= <>
##$TPNAME5= <>
##$TPNAME6= <>
##$TPNAME7= <>
##$TPOAL= (0..7)
0.5 0.5 0.5 0.5 0.5 0.5 0.5 0.5 
##$TPOFFS= (0..7)
0 0 0 0 0 0 0 0 
##$TUNHIN= 0
##$TUNHOUT= 0
##$TUNXOUT= 0
##$USERA1= <user>
##$USERA2= <user>
##$USERA3= <user>
##$USERA4= <user>
##$USERA5= <user>
##$V9= 5
##$VALIST= <valist>
##$VCLIST= <CCCCCCCCCCCCCCC>
##$VD= 0
##$VDLIST= <DDDDDDDDDDDDDDD>
##$VPLIST= <PPPPPPPPPPPPPPP>
##$VTLIST= <TTTTTTTTTTTTTTT>
##$WBST= 1024
##$WBSW= 4
##$XGAIN= (0..3)
0 0 0 0 
##$XL= 0
##$YL= 0
##$YMAX_a= 255867
##$YMIN_a= -234900
##$ZGOPTNS= <>
##$ZL1= 120
##$ZL2= 120
##$ZL3= 120
##$ZL4= 120
##$ABSF1= 10
##$ABSF2= 0
##$ABSG= 5
##$ABSL= 3
##$ALPHA= 0
##$AQORDER= 0
##$ASSFAC= 0
##$ASSFACI= 0
##$ASSFACX= 0
##$ASSWID= 0
##$AUNMP= <proc_1d>
##$AZFE= 0.1
##$AZFW= 0.1
##$BCFW= 1
##$BC_mod= 2
##$BYTORDP= 1
##$COROFFS= 0
##$CY= 11.3945322036743
##$DATMOD= 1
##$DC= 2
##$DFILT= <>
##$DTYPP= 0
##$F1P= 16.9975609425685
##$F2P= -3.02152046262296
##$FCOR= 0.5
##$FTSIZE= 0
##$FT_mod= 4
##$GAMMA= 1
##$GB= 0.15
##$INTBC= 1
##$INTSCL= 1
##$ISEN= 128
##$LB= 0.24
##$LEV0= 0
##$LPBIN= 0
##$MAXI= 10000
##$MC2= 0
##$MEAN= 0
##$ME_mod= 0
##$MI= 1.114404
##$NCOEF= 0
##$NC_proc= 0
##$NLEV= 6
##$NOISF1= 3.799351
##$NOISF2= 2.8
##$NSP= 1
##$NTH_PI= 0
##$NZP= 0
##$OFFSET= 15.70392
##$PC= 1
##$PHC0= -10128.47
##$PHC1= 12.40089
##$PH_mod= 1
##$PKNL= yes
##$PPARMOD= 0
##$PSCAL= 0
##$PSIGN= 0
##$REVERSE= no
##$SF= 200.130013532006
##$SI= 16384
##$SIGF1= 3
##$SIGF2= 2
##$SINO= 400
##$SIOLD= 16384
##$SREGLST= <1H.CDCl3>
##$SSB= 0
##$STSI= 0
##$STSR= 0
##$SW_p= 3612.71676300578
##$SYMM= 0
##$S_DEV= 0
##$TDeff= 0
##$TDoff= 0
##$TI= <>
##$TILT= no
##$TM1= 0
##$TM2= 0
##$TOPLEV= 0
##$USERP1= <user>
##$USERP2= <user>
##$USERP3= <user>
##$USERP4= <user>
##$USERP5= <user>
##$WDW= 1
##$XDIM= 8192
##$YMAX_p= 0
##$YMIN_p= 0
$$ End of Bruker specific parameters
$$ ---------------------------------
##NTUPLES= NMR FID
##VAR_NAME=  TIME,          FID/REAL,        FID/IMAG
##SYMBOL=    X,             R,               I
##VAR_TYPE=  INDEPENDENT,   DEPENDENT,       DEPENDENT
##VAR_FORM=  AFFN,          ASDF,            ASDF
##VAR_DIM=   8192,          8192,            8192
##UNITS=     SECONDS,       ARBITRARY UNITS, ARBITRARY UNITS
##FACTOR=    0.000296,      1,               1
##FIRST=     0,             0,               0
##LAST=      2.424536,      0,               0
##MIN=       0,             -234900,         0
##MAX=       2.424536,      255867,          0
$$ Real data points
##PAGE= N=1
##DATA TABLE= (X++(R..R)), XYDATA
$$ plain form
0 0 0 0 0 0 0 0 0 0 0 0 0 8 -8 8 -8 16 -16 24 -24 32 -40 46 -55 64 -73 88 -102 118 -137 155 -177 203 -232
33 -232 263 -297 336 -376 424 -473 529 -590 655 -726 807 -892 984 -1087 1200 -1323 1458
50 1458 -1605 1768 -1948 2147 -2372 2623 -2906 3231 -3606 4042 -4563 5192 -5974 6970 -8296
65 -8296 10155 -12963 17761 -28226 101946 -111502 -20396 255867 -64285 -15977 111454
76 111454 1622 -70075 37435 77078 -58272 -93266 48657 -57025 -65884 9269 -112110
87 -112110 -82494 786 -57381 -57544 -88663 -66708 -26162 -88732 -38202 -34295 -132129 22563
99 22563 17685 -129368 -1058 10130 -71871 40089 34783 -64053 -6214 76996 33274 -38203
111 -38203 60930 78926 -55947 94897 125787 -85818 51483 154026 -11647 8927 84007
$$ packed form
0@%%%%%%%%%%%Qj6J6j6K4l2M0m8N6p2Q6j01J19j37J61j90K20k55K92l32L80m35
33b32M95n60O33p12Q00q97J002j119J245j381J533j699J876k071K287k523K781
50A458l063L373l716M095m519M995n529O137o837P648q605R755j1166J2944j5266
65h296J8451k3118L0724m5987J30172k13448R1106K76263l20152M8308J27431
76A11454j09832p1697J07510L9643j35350l4994J41923j05682q859P5153j21379
87a12110K9616Q3280n8167j63l1119K1955M0546o2570N0530L907r7834J54692
99B2563m878j47053J28310J1188q2001J11960n306r8836N7839Q3210m3722p1477
111c8203R9133J7996j34873J50844L0890k11605J37301J02543j65673K0574P5080
$$ plain form
122 84007 31402 11139 57076 83155 -23055 -18502 105630 -580 -37847 55774 -15042 -23877
134 -23877 41575 -11730 -46085 -11955 10657 -14756 -53200 -5527 -23746 -65419 28045 -15286
146 -15286 -92214 12248 6107 -67575 1834 2492 -59701 -5680 32431 -25613 -50526 33104
158 33104 26302 -51389 36390 38084 -61368 34292 66943 -39908 4706 51266 3544 5598
170 5598 28200 30589 -14442 8482 65837 -18087 -23204 58299 238 -23225 39283 5400 -28870
183 -28870 13517 28910 -19123 -31481 30357 -5281 -40985 30134 -5650 -47518 22815 5764
195 5764 -41650 6323 4311 -26765 1060 7868 -20123 -17947 23469 1020 -28907 21407 10024
208 10024 -32767 18963 27414 -30471 3953 34051 -8541 -11924 23828 17448 -19871 14947 32202
$$ packed form
122H4007n2605k0263M5937K6079j06210M553J24132j06210l7267R3621p0816q835
134b3877O5452n3305l4355L4130K2612k5413l8444M7673j8219m1673R3464m3331
146a5286p6928J04462o141p3682O9409O58o2193N4021L8111n8044k4913Q3630
158C3104o802p7691Q7779J694r9452R5660L2651j06851M4614M6560m7722K054
170E598K2602K389m5031K2924N7355q3924n117Q1503n8061k3463O2508l3883l4270
183b8870M2387J5393m8033j2358O1838l5638l5704P1119l5784m1868P0333j7051
195E764m7414M7973k012l1076K7825O808k7991K176M1416k2449k9927N0314j1383
208A0024m2791N1730Q451n7885L4424L0098m2592l383L5752o380l7319L4818J7255
$$ plain form
221 32202 -25582 -3943 39572 -10673 -13654 33103 -4157 -19738 18502 9347 -20569 -234
233 -234 20801 -20686 -15882 20687 -12996 -22661 19951 -3731 -32374 8146 2418 -26002 -2082
246 -2082 11278 -20276 -16792 16928 -11954 -22845 17458 2955 -28428 8875 13773 -27420 2716
259 2716 24432 -12859 -11391 23821 1172 -19816 21107 16770 -18417 6728 26331 -13525 -3949
272 -3949 31608 -1546 -10315 23106 9429 -17518 14466 20789 -15432 3939 23273 -9840 -10146
285 -10146 25261 -699 -17995 18472 6161 -21759 5121 16626 -19104 -5454 19101 -12529
297 -12529 -16852 14056 68 -23709 8050 8017 -23991 -2636 13983 -15749 -12959 17033 -8317
310 -8317 -19668 12293 3001 -20749 4360 14335 -19186 -3255 19165 -9957 -11060 18765 1338
$$ packed form
221C2202n7784K1639M3515n0245k981M6757l7260j5581L8240r155k9916K0335
233b34K1035m1487M804L6569l3683r665M2612k3682k8643M0520n728k8420K3920
246b082J3360l1554L484L3720k8882j0891M0303j4503l1383L7303M898m1193L0136
259B716K1716l7291J468L5212k2649k0988M0923m337l5187K5145J9603l9856R576
272c949L5557l3154q769L3421j3677k6947L1984O323l6221J9371J9334l3113l06
285a0146L5407k5960j7296L6467j2311k7920K6880J1505l5730J3650K4555l1630
297a2529m323L0908j3988k3777L1759l3l2008K1355J6619k9732K790K9992k5350
310h317j1351L1961r292k3750K5109R975l3521J5931K2420k9122j103K9825j7427
$$ plain form
323 1338 -17960 14747 11383 -15964 5617 19424 -11219 -5374 23862 -3319 -11821 18614 6317
336 6317 -16792 9736 16528 -15624 107 19463 -9697 -12661 18149 -283 -19404 12926 5735
349 5735 -21147 894 13156 -15164 -9115 14820 -9595 -18160 10364 1725 -22407 5251 10985
362 10985 -22165 -3828 13278 -13037 -10554 14921 -2777 -18337 7836 8538 -15184 924 18201
375 18201 -12863 -6303 20795 -6957 -9154 18045 4867 -9936 9046 10563 -8322 3148 20978
388 20978 -3237 -10335 22396 828 -13210 21720 4915 -13343 12941 11103 -11780 -383
400 -383 14880 -2233 -10243 13780 1028 -23951 15553 11582 -26176 4583 11715 -19141 -5919
413 -5919 11292 -8771 -16216 5422 8548 -22237 -8782 18620 -17166 -8309 18148 -16590 -12260
$$ packed form
323A338j9298L2707l364k7347K1581J3807l0643N845K9236k7181q502L0435j2297
336F317k3109K6528O792l2152J5731J9356k9160k964L0810j8432j9121L2330p191
349E735k6882K2041J2262k8320O049K3935k4415q565K8524q639k4132K7658N734
362A0985l3150J8337J7106k6315K483K5475j7698j5560K6173P02k3722J6108J7277
375A8201l1064O560K7098k7752k197K7199j3178j4803J8982J517j8885J1470J7830
388B0978k4215p098L2731k1568j4038L4930j6805j8258K6284j838k2883J1397
400c83J5263j7113q010K4023j2752k4979L9504l971l7758L0759P132l0856J3222
413e919J7211k0063p445K1638L126l0785J3455K7402l5786Q857K6457l4738M330
$$ plain form
426 -12260 15518 -1557 -9489 3726 5322 -4085 -2646 17294 -6775 -13316 30753 -1981 -17133
439 -17133 24031 -1030 -9780 22224 3977 -11565 4958 12711 1701 -11216 13537 2059
451 2059 -21217 22913 3767 -32333 12284 12198 -21524 -4340 3997 -10845 -14647 2952 8311
464 8311 -32330 -11814 23875 -22838 -17387 14079 -17917 -13024 14434 -8199 -15509 989 8330
477 8330 -2096 -8821 13011 -5200 -6027 30898 -4599 -13649 26831 4192 1562 23336 -2692
490 -2692 4334 18091 10790 10487 -3947 14614 15672 -5864 19034 2773 -17647 24241 11152
503 11152 -19902 2221 2326 -5138 -7903 -662 361 -33387 -2239 19171 -40115 -20472 15683
516 15683 -28737 -16894 6644 -29218 -21681 2321 -3609 -20611 -18066 3945 -13634 -11440 14319
$$ packed form
426a2260K7778j7075p932J3215J596r407J439J9940k4069o541M4069l2734j5152
439a7133M1164k5061q750L2004j8247j5542J6523P753j1010j2917K4753j1478
451B059k3276M4130j9146l6100M4617q6l3722J7184Q337j4842l802J7599N359
464H311m0641K0516L5689m6713N451L1466l1996M893K7458k2633p310J6498P341
477H330j0426o725K1832j8211q27L6925l5497r050M0480k2639k630K1774k6028
490b692P026J3757p301l03j4434J8561J058k1536K4898j6261k0420M1888j3089
503A1152l1054K2123J05p464k765P241J023l3748L1148K1410n9286J9643L6155
516A5683m4420J1843K3538l5862P537K4002n930j7002K545K2011j7579K194K5759
$$ plain form
529 14319 -18584 -15226 23607 -5573 -6994 11845 -5832 13460 14268 149 10089 1221 18120
542 18120 22020 -3735 17831 14160 -3734 30723 13616 -11365 18132 18527 4405 -1956 9733
555 9733 10815 -14728 15285 18676 -36552 -844 27300 -26897 -10836 10479 -22531 -13584 2797
568 2797 -9248 -24352 -14537 4446 -15750 -22902 -2315 -16533 -15880 4891 -14485 -16168 -5079
581 -5079 -7276 3417 -8310 -10133 5383 -3389 3306 5797 -8072 10960 9075 -2694 20406
594 20406 2258 -6706 25871 15597 -3294 7551 20044 7989 -1518 23624 12697 -17249
606 -17249 22183 25194 -20486 7580 20552 -8687 1503 10641 -2939 -9796 3560 9395 -12261
619 -12261 -11283 7165 -8996 -10069 3888 -12417 -10874 -1295 -5775 -7945 -11021 -4612 -3593 -9438
$$ packed form
529A4319l2903L358L8833k9180j421J8839j7677J9292Q08j4119R940q868J6899
542A8120L900k5755K1566l671j7894L4457j7107k4981K9497L95j4122o361J1689
555I733J082k5543L0013L391n5228L5708K8144n4197J6061K1315l3010Q947J6381
568B797j2045j5104R815J8983k0196p152K0587j4218O53K0771j9376j683J1089
581e079k197J0693j1727j823J5516q772O695K491j3869J9032j885j1769K3100
594B0406j8148q964L2577j0274j8891J0845J2493j2055r507K5142j0927k9946
606a7249L9432L011m5680K8066J2972k9239J0190R138j3580o857J3356N835k1656
619a2261R78J8448j6161j073J3957j6305J543R579m480k170l076O409J019n845
$$ plain form
633 -9438 -2164 -7090 -12128 6419 -4132 -12038 8113 -6555 -9156 12309 748 -11150 5059
646 5059 11410 -5124 -3314 15286 2094 -9866 18891 8784 -14895 12667 14302 -5252 3785
659 3785 11181 964 -2356 9333 8694 -6501 1741 12827 -6002 -2120 9218 -3908 -2394 5395
673 5395 -960 -7065 25 2455 -5414 -3005 2199 -7492 -5996 5465 -7826 -7096 5231 -6492
687 -6492 -7922 3515 -3123 -9704 3231 2781 -9521 -3093 6472 -5444 -6792 10550 -1730 -10098
701 -10098 8119 4558 -8700 3228 9945 -4957 -2060 9842 1190 -6304 8677 8393 -7876
714 -7876 4044 9675 -4485 156 10351 -380 -3914 7574 2532 -4643 3749 6113 -4801 220
728 220 6707 -5363 -2020 6646 -2487 -5087 5078 -754 -7491 3582 2586 -7285 -785 5352 -6780
$$ packed form
633i438P274m926n038J8547j0551p906K0151j4668k601K1465j1561j1898J6209
646E059O351j6534J810J8600j3192j1960K8757j0107k3679K7562J635j9554R037
659C785P396j0217l320J1689o39j5195Q242J1086j8829L882J1338j3126J514P789
673E395o355o105P090K430p869K409N204r691J496J1461j3291P30J2327j1723
687f492j430J1437o638o581J2935m50j2302O428R565j1916j348J7342j2280q368
701a0098J8217l561j3258J1928O717j4902K897J1902q652p494J4981k84j6269
714g876J1920N631j4160M641J0195j0731l534J1488n042p175Q392K364j0914N021
728B20O487j2070L343Q666r133k600J0165n832o737J1073r96r871O500O137j2132
$$ plain form
743 -6780 -4778 7215 -3292 -7188 5197 1282 -9300 2192 5947 -7296 -1723 7144 -3537
756 -3537 -6469 7584 1457 -7877 4807 4829 -7136 86 7974 -4311 -3165 7630 -1175 -5853
770 -5853 5256 3409 -6743 2723 5206 -6267 -1084 6107 -2999 -4477 6078 -788 -6795 3732
784 3732 2672 -6534 351 5642 -6267 -3134 6199 -2821 -5154 5273 1033 -7503 3034 4020 -5913
799 -5913 66 6260 -3622 -4258 7059 -550 -5212 5846 3000 -6085 2381 5829 -4835 262 6770
814 6770 -1730 -3716 5735 1895 -5928 4943 4777 -6192 683 6307 -4344 -2424 7024 -1778 -4913
829 -4913 3517 2015 -5971 481 5205 -5641 -2592 4805 -3694 -5097 5206 -886 -6321 2814 380
844 380 -5057 -265 3704 -3589 -3692 5004 -1558 -5563 4658 2170 -5993 3822 2868 -5086 2135 3885
$$ packed form
743f780K002J1993j0507l896J2385l915j0582J1492L755j3243N573Q867j0681
756c537k932J4053o127r334J2684K2j1965P222P888j2285J146J0795q805m678
770e853J1109j847j0152R466K483j1473N183P191r106j478J0555o866o007J0527
784C732j060r206O885N291j1909L133R333r020k333J0427m240q536J0537R86r933
799e913N979O194r882o36J1317p609m662J1058k846r085Q466L448j0664N097O508
814F770q500j986R451l840p823J0871j66j0969O875N624j0651J920R448q802l135
829d913Q430j502p986O452M724j0846L049P397q499j403J0303o092n435R135k434
844C80n437M792L969p293j03Q696o562m005J0221k488q163R815r54p954P221J750
$$ plain form
860 3885 -484 -1037 3684 1331 -2937 4397 4002 -4295 2779 6108 -5039 1394 5200 -2433 180
875 180 3118 870 -3725 409 4374 -3274 -2288 4555 -4009 -4035 5818 -3974 -4464 3524 -1752 -4098
891 -4098 -479 865 -3750 -2391 4055 -2261 -7377 4988 1501 -6960 4827 950 -4817 2873 2442
906 2442 -402 -533 2122 3824 -1283 1011 5344 -2958 3237 7160 -4144 2046 4380 -202 2758
921 2758 1788 1131 112 -11 4566 -1353 -3573 5715 -2538 -2701 4612 -6352 -2215 4474 -4122 -3749
937 -3749 -74 -2894 -2925 -1318 190 -4408 -6434 4736 -2313 -8315 3695 -1575 -4562 2655 -1473
952 -1473 -2397 -74 374 4668 -2236 -2318 6783 -1390 2022 6221 -2470 3355 5280 1339 3832 1615
968 1615 3293 5229 1221 4815 625 258 8598 -1005 1337 5376 -5488 4132 6496 -6811 94
$$ packed form
860C885m369n53M721k353m268P334l95q297P074L329j1147O433L806p633K613
875A80K938k248m595M134L965p648R86O843q564k6R853r792m90P988n276k346
891d098L619J344m615J359O446o316n116J2365l487q461J1787l877n767P690m31
906B442k844j31K655J702n107K294M333q302O195L923j1304O190K334m582K960
921B758r70o57j019j23M577n919k220R288q253j63P313j0964M137O689q596L73
937c749L675k820l1J607J508m598k026J1170p049o002J2010n270k987P217m128
952a473r24K323M48M294o904q2R101q173L412M199q691N825J925l941K493k217
968A615J678J936m008L594m190l67Q340r603K342M039j0864R620K364j3307O905
$$ plain form
983 94 4367 -3582 -1759 431 -763 -5396 -2411 5338 -7919 -8059 4782 -4199 -6215 713 -4242
998 -4242 -5087 -2204 -906 -455 -8135 -1322 4580 -7575 -1396 2989 -5090 903 3216 -2220 -880
1013 -880 870 3203 2121 -564 3899 -89 1716 7105 -1469 2863 5073 -1120 6268 3685 -3820
1028 -3820 6046 5551 -1900 2605 2453 712 -330 2978 4216 -5589 -850 5940 -3053 -3517 2411 -1590
1044 -1590 -2900 -876 -284 -2503 -6368 2674 873 -9074 -25 893 -6912 18 1624 -6173 -2291
1059 -2291 765 -1319 -2498 -1698 1046 -2165 53 950 -3420 1596 1813 -1821 3343 51 -3639 5893
1075 5893 2009 -2647 3432 2012 364 486 3321 2717 -2891 2615 6538 -3107 -1701 6272 383
1090 383 -1763 2366 3080 -2736 -2419 7189 -832 -6639 5349 1912 -6931 2661 2533 -5626 -61 2254
$$ packed form
983I4M273p949J823K190j194m633K985P749j3257j40J2841q981k016O928m955
998d242q45K883J298M51p680O813N902j2155O179M385q079N993K313n436J340
1013h80J750K333j082k685M463l988J805N389q574M332K210o193P388k583p505
1028c820R866m95p451M505j52j741j042L308J238r805M739O790q993m64N928m001
1044a590j310K024N92k219l865R042j801r947R049R18p805O930J606p797L882
1059b291L056k084j179Q00K744l211K218Q97m370N016K17l634N164l292l690R532
1075E893l884m656O079j420j648J22K835o04n608N506L923r645J406P973n889
1090C83k146M129P14n816L17R608q021n807J1988l437q843R592j28q159N565K315
$$ plain form
1106 2254 -1743 -4109 -76 1696 -3467 -1163 505 -3177 -1148 526 -1898 -171 -1824 -1799 2211
1121 2211 -2160 -1809 1081 -3 -225 -1170 910 1243 -2490 1713 4337 -3954 -611 5711 -726 -1893
1137 -1893 3607 3022 -3214 1018 6300 -2381 -2428 6889 779 -4554 4463 2224 -3247 1866 3050 -1542
1153 -1542 -2321 2471 951 -2807 563 1224 -2592 -789 975 -2330 -831 -77 -1395 -1105 -1439 -1383 -1425
1170 -1425 113 -946 -2878 -174 191 -3515 18 2245 -4097 -1021 3196 -2464 -2718 3045 1188
1185 1188 -3537 1480 3003 -3084 -433 5107 -688 -2643 4322 1166 -2393 2456 3286 -1362 54
1200 54 3913 -212 -1381 3120 2008 -1720 1758 2246 -2096 900 2420 -807 -544 1871 -576 -1577
1216 -1577 1695 -105 -1734 916 640 -2809 -117 1593 -2483 -593 1526 -1857 -2415 1618 -236
$$ packed form
1106B254l997k366M033J772n163K304J668l682K029J674k424J727j653K5M010
1121B211m371L51K890j084k22r45K080L33l733M203K624q291L343O322o437j167
1137a893N500n85o236M232N282q681m7R317o110n333R017k239n471N113J184m592
1153a542p79M792j520l758L370O61l816J803J764l305J499P54j318K90l34N6m2
1170a425J538j059j932K704L65l706L533K227o342L076M217n660k54N763j857
1185A188m725N017J523o087K651N540n795j955O965l156l559M849Q30m648J416
1200E4L859m125j169M501j112l728L478M88m342K996J520l227K63K415k447j001
1216a577L272j800j629K650k76l449K692J710m076J890K119l383n58M033j854
$$ plain form
1231 -236 -3015 1136 910 -2876 -910 2252 -1991 -1842 2662 -629 -2622 1228 1505 -2477 491 2434
1247 2434 -1854 -896 2447 -8 -1928 2383 1029 -2081 1263 1747 -1420 131 2844 -1099 -946 2384
1263 2384 2 -1406 1790 1395 -2287 993 1946 -1692 -131 2206 -704 -1556 2025 -9 -1721 1069
1279 1069 1218 -1825 -490 2141 -1658 -985 1930 -597 -1963 1158 476 -2261 668 1027 -1624 -1158
1295 -1158 1369 -1088 -2083 1963 -576 -2583 891 238 -2834 336 1232 -2558 -862 1143 -1142 -2378
1311 -2378 1577 638 -3062 821 1139 -2582 -160 2373 -1404 -887 1626 -167 -790 745 1802 -950
1327 -950 157 2517 -974 -376 2868 361 -418 2460 300 -616 1592 1608 67 -97 2272 -266 -956
1344 -956 2610 -257 -1495 2617 38 -2562 1634 223 -1834 582 717 -1698 -2171 1427 -297 -3268
$$ packed form
1231b36k779M151k26l786J966L162m243J49M504l291j993L850K77l982K968J943
1247B434m288R58L343k455j920M311j354l110L344M84l167J551K713l943J53L330
1263B384k382j408L196l95l682L280R53l638J561K337k910q52L581k034j712K790
1279A069J49l043J335K631l799O73K915k527j366L121o82k737K929L59k651M66
1295a158K527k457r95M046k539k007L474o53l072L170Q96l790J696K005k285j236
1311b378L955r39l700L883L18l721K422K533l777N17K513j793o23J535J057k752
1327i50J107K360l491N98L244k507p79K878k160r16K208J6j541j64K369k538o90
1344i56L566k867j238M112k579k600M196j411k057K416J35k415m73L598j724k971
$$ plain form
1360 -3268 827 350 -3569 -64 822 -3186 -721 710 -1117 -1881 -743 497 -1997 -139 1649 -2646
1376 -2646 -1169 2607 -1354 -1307 2275 -648 -628 1472 776 -925 48 2914 -53 -969 2333 39 -611
1393 -611 3321 84 -1415 2394 435 -3 1158 281 25 124 1438 -12 -1848 1207 1193 -1839 590
1410 590 0 -2230 852 272 -1267 -1288 -638 225 -1372 -541 -59 -2759 -90 1885 -3646 -1241 1972
1427 1972 -2130 -589 834 -1388 -1696 835 1746 -1748 -1334 2063 -516 -710 2652 -1315 -748 2857
1443 2857 98 -83 377 770 1382 485 1064 297 -992 2469 2075 -1560 1241 688 -214 1786 304
1460 304 -384 -15 1181 861 -1326 72 879 -1465 1648 1128 -4260 785 2261 -2205 -362 674
1476 674 -1342 -1339 1137 522 -2898 -880 2810 -1629 -2130 1371 -1555 -360 1488 -561 -1327 -1073 1293
$$ packed form
1360c268M095m77l919L505Q86m008K465J431j827p64J138J240k494J858J788m295
1376b646J477L776l961M7L582k923K0K100o96j701R73K866k967r16L302k294o50
1393f11L932l237j499L809j959m38J161q77k56R9J314j450j836L055j4l032K429
1410E90n90k230L082n80j539k1O50Q63j597Q31M82k700K669J975n531K405L213
1427A972m102J541J423k222l08K531R11l494M14L397k579j94L362l967N67L605
1443B857k759j81M60L93O12q97N79p67j289L461l94l635K801n53r02K000j482
1460C04o88L69J196l20k187J398Q07k344L113n20n388N045J476m466J843J036
1476F74k016LK476o15l420K018L690m439n01L501k926J195J848k049p66K54K366
$$ plain form
1493 1293 896 -1737 294 995 -1647 1375 915 -2090 752 1176 505 -106 -770 375 849 861 405 -911
1511 -911 442 1092 -649 1950 -150 -2398 3225 1122 -2689 1117 1490 -1025 537 1454 -559 -1892
1527 -1892 1320 2806 -2575 -775 2304 -1363 -265 1284 -705 -1047 244 1458 -572 -2448 1555
1542 1555 880 -2357 1542 -109 -2626 1180 872 -1037 -892 -308 433 -139 -405 -72 -1003 563 463
1559 463 -1416 1043 -912 -1193 2663 -732 -2371 1686 648 -1099 619 440 -596 -812 1619 1281
1575 1281 -2675 600 2397 -1363 -415 1559 -250 -754 1137 1272 -1331 -1268 2857 168 -2128 2112
1591 2112 91 -1675 1637 923 -1268 -132 946 230 -615 -287 686 -263 231 185 -692 240 -567 306
1609 306 1048 -1398 -893 1459 -467 -1097 846 57 -653 -279 875 -265 -1709 1257 1304 -1781 -459
$$ packed form
1493A293l97k633K031P01k642L022m60l005K842M24o71o11o64J145M74J2m56j316
1511i11J353O50j741K599k100k248N623k103l811L806L73k515J562R17k013j333
1527a892L212J486n381J800L079l667J098J549j989l42J291J214k030j876M003
1542A555o75l237L899j651k517L806l08j909J45N84P41n72k66L33r31J566j00
1559D63j879K459j955k81L856l395j639M057j038j747J718j79j036k16K431l38
1575A281l956L275J797l760R48J974j809n04J891J35k603O3M125k689k296M240
1591B112k021j766L312p14k191J136J078p16q45L28R73r49M94m6q77R32q07Q73
1609C06P42k446N05K352j926o30J943p89p10L74J154j140j444K966M7l085J322
$$ plain form
1626 -459 1610 -863 -854 1539 307 -1641 125 2015 -1307 -1112 2190 -183 -1399 1178 432 -1398
1642 -1398 541 1064 -190 -670 183 703 -544 159 548 -110 -130 115 276 -24 -172 271 864 -554 -366
1661 -366 614 217 -32 42 893 -247 -671 1069 732 -1081 371 1606 -1027 -411 1348 219 -1034
1678 -1034 909 1174 -1419 -77 1438 -364 -978 1101 215 -1202 472 503 -540 -551 671 -69 -986
1695 -986 197 202 -453 -293 300 -475 -277 146 -160 -23 -123 -82 -196 199 -257 -230 613 -150 -415 424 391
1716 391 -803 404 810 -729 -122 891 -64 -697 894 373 -872 269 690 -523 -388 968 -287
1733 -287 -697 501 318 -456 64 659 -489 -283 532 36 -366 462 368 -675 378 332 -342 230 676
1752 676 -159 -166 700 28 -73 698 387 -371 413 558 -510 570 722 -239 61 581 -163 -331 656 170
$$ packed form
1626d59K069k473RK393j232j948J766J890l322J95L302k373j216K577p46j830
1642a398J939N23j254m80Q53N20j247P03L89o58k0K45J61l00j48M43N93j418J88
1661c66R80l97k49P4Q51j140m24J740l37j813J452J235k633O16J759j129j253
1678a034J943K65k593J342J515j802o14K079q86j417J674L1j043j1J222p40r17
1695i86J183No55J60N93p75J98M23l06J37j00M1j14L95m56K7Q43p63k65Q39l3
1716C91j194J207M06j539O07J013r55o33J591n21j245J141M21j213J35J356j255
1733b87m10J198j83p74N20N95j148K06Q15m96m02Q28r4j043J053m6o74N72M46
1752F76q35pQ66o72j01P71l11p58P84J45j068J080J52r61L00N20p44j68R87m86
$$ plain form
1772 170 -311 -30 336 -504 -217 644 -395 -331 252 -202 -551 32 71 -217 -69 -11 -232 -587 570 33
1792 33 -635 623 -82 -537 485 383 -499 216 766 -179 -327 552 512 -401 828 552 -822 503 704
1811 704 -233 93 500 -206 -44 392 47 -330 -54 752 -375 -497 267 -417 -92 245 -275 -558 -143 -66
1831 -66 -42 -457 -253 -110 -501 578 -537 -895 770 -93 -618 338 -117 -696 584 548 -301 -609 622
1850 622 754 -670 717 300 -645 897 788 -492 34 577 409 397 -85 366 -71 352 1249 -675 -386
1869 -386 771 187 80 176 -434 -138 383 189 -26 -996 284 396 -473 142 -942 -493 953 -339 -946
1888 -946 49 -736 -74 446 -691 -634 -725 709 84 -1348 133 -185 -394 838 -650 -1378 561 292
1906 292 142 -250 -765 312 -209 640 330 -1466 460 1215 -599 -136 161 -419 834 447 -133 -613
$$ packed form
1772A70m81K81L66q40K87Q61j039O4N83m54l49N83L9k88J48N8k21l55J157n37
1792C3o68J258p05m55J022j02q82P15N50r45j48Q79m0r13J229k76j374J325K01
1811G04r37L26M07p06J62M36l45l77K76Q06j127j22P64o84L25L37n20k83M15P7
1831f6K4m15K04J43l91J079j115l58J665q63n25R56m55n79J280l6q49l08J231
1850F22J32j424J387m17r45J542j09j280N26N43j68j2m82M51m37M23Q97j924K89
1869c86J157n84j07R6o10K96N21j94k15r70J280J12q69O15j084M49J446j292o07
1888i46R95p85O62N20j137N7r1J434o25j432J481l18k09J232j488p28J939k69
1906B92j50l92n15J077n21Q49l10j796J926P55j814M63K97n80J253l87n80m80
$$ plain form
1924 -613 -388 1506 109 -668 363 -517 285 1209 -722 -639 669 244 453 -542 -491 339 -60 917 -329
1943 -329 -1502 555 553 -262 269 -1036 -481 1062 -331 -433 -549 -311 754 -314 -232 -571 -1011 1183
1961 1183 569 -1684 -122 80 -388 703 -544 -777 -252 142 853 -1002 -1040 804 -5 -51 351 -1220
1979 -1220 -62 995 84 -67 -848 211 1034 -302 311 -7 -640 1262 726 -719 282 -32 746
1996 746 1145 -853 74 589 361 911 -105 -123 261 237 1320 32 -1335 1304 618 -501 659 -580
2014 -580 -166 490 202 46 -1209 -310 1311 -744 -887 401 -1026 -61 442 -765 -831 -821 520 -128
2032 -128 -1560 -93 -75 -1028 462 -345 -1559 111 -86 60 -396 -1105 390 95 -393 144 -340 -233
2050 -233 541 23 279 -432 -161 1504 -85 -497 757 -3 332 834 210 -9 -132 649 1101 -793 69
$$ packed form
1924f13K25J894j397p77J031q80Q02R24j931Q3J308m25K09r95N1Q30l99R77j246
1943c29j173K057kq15N31j305N55J543j393j02j16K38J065j068Q2l39m40K194
1961A183o14k253J562K02m68J091j247k33N25L94P11j855l8J844q09m6M02j571
1979a220J158J057r11j51p81J059Q23j336O13l18o33J902n36j445J001l14P78
1996G46L99j998R27N15k28N50j016j8L84k4J083j288j367K639o86j119J160j239
2014e80M14O56k88j56j255Q99J621k055j43J288j427R65N03j207o6J0J341o48
2032a28j432J467J8r53J490q07j214J670j97J46m56p09J495k95m88N37m84J07
2050b33P74n18K56p11K71J665j589m12J254p60L35N02o24k19j23P81M52j894Q62
$$ plain form
2069 69 1151 -454 173 534 -250 -245 416 677 -476 -779 683 194 -791 560 -156 -803 336 -85 -271
2088 -271 -446 -164 282 -326 -679 80 -147 -369 248 -258 -281 -408 33 446 -708 -299 485 -334 -454 273
2108 273 -166 -257 -16 218 -7 -861 333 530 -710 -37 448 -444 -295 560 104 -470 60 682 -316 -484
2128 -484 762 23 -327 396 244 -250 36 403 166 -148 47 493 -187 -74 445 101 -119 58 273 -112
2148 -112 -180 197 288 -348 -146 248 -157 -303 -3 78 -283 -361 271 -142 -529 42 213 -580 -308 327 -285
2169 -285 -377 122 156 -538 -155 474 -142 -241 263 211 -329 81 374 -17 -91 253 328 -162 102 423 127 -5
2191 -5 300 273 -130 142 193 83 13 152 165 -143 -15 132 97 -199 -142 99 -75 -294 8 108 -518 -85 150
2214 150 -437 -306 41 -5 -418 -103 36 -244 -216 121 -22 -391 -14 24 -125 -109 106 113 -190 153 67 -171
$$ packed form
2069F9J082j605O27L61p84NO61K61j153l03J462m89r85J351p16o47J139m21j86
2088b71j75K82M46o08l53P59k27k22O17n06k3j27M41M13j154M09P84q19j20P27
2108B73m39r1K41K34k25q54J194J97j240O73M85q92J49Q55m56n74N30O22r98j68
2128d84J246p39l50P23j52m94K86L67k37l14J95M46o80J13N19l44k20J77K15l85
2148a12o8L77R1o36K02L94m05j46L00Q1l61p8O32m13l87N71J71p93K72O35o12
2169b85r2M99L4o94L83O29o16r9N04n2n40M10K93l91p4L44P5m90K64L21k96j32
2191eL05k7m03K72N1j10p0J39J3l08J28J47l5k96N7K41j74k19L02J00o26M33K35
2214A50n87J31L47m6m13L15J39k80K8L37j43l69L77L8j49J6K15Pl03L43q6k38
$$ plain form
2236 -171 66 325 -85 -83 230 -70 93 110 115 -12 27 124 -80 83 41 -27 120 105 -267 40 142 -273 175
2259 175 7 -267 -150 26 -39 -197 -74 -5 -157 -131 20 -263 -88 -2 -250 64 -290 -112 48 -37 90 -190
2281 -190 -191 177 53 -191 199 -108 -147 198 -58 -72 -122 244 157 -143 103 5 -98 429 108 -381 279 99
2303 99 -30 274 -54 46 38 184 194 -147 -118 388 140 30 19 -217 377 103 41 92 -351 142 412 -190 13
2326 13 -38 -101 444 -105 -302 241 -194 319 111 -396 -11 -6 293 124 -479 -27 167 -190 433 -346 -434 554
2348 554 -71 43 28 -411 296 295 -229 68 -400 -18 718 -256 -109 -107 -44 626 -262 -258 237 -274 452 393 -689
2371 -689 160 246 102 540 -723 -184 598 -185 427 -160 -621 394 100 -1 6 -610 471 380 -449 230
2391 230 -523 -37 958 -457 -339 26 -201 630 4 -536 188 -354 390 556 -958 39 319 -41 370
$$ packed form
2236a71K37K59m10KL13l00J63J7Nj27L9R7k04J63m2o8J47j5l72L07J02m15M48
2259A75j68k74J17J76o5j58J23O9j52K6J51k83J75Q6k48L14l54J78J60q5J27k80
2281a90jL68j24k44L90l07l9L45k56j4n0L66q7l00K46r8j03N27l21m89O60j80
2303I9j29L04l28J00qJ46J0l41K9N06k48j10j1k36N94k74o2N1m43M93K70o02K03
2326A3n1o3N45n49j97N43m35N13k08n07L85NK99j69o03M52J94l57O23p79q8R88
2348E54o25J14j5m39P07jn24K97m68L82P36r74J47KO3O70q88MM95n11P26n9j082
2371f89Q49Q6j44M38j263N39P82p83O12n87m61J015k94j01Po16J081r1q29O79
2391B30p53M86R95j415J18L65k27Q31o26n40P24n42P44J66j514R97K80l60M11
$$ plain form
2410 370 -512 -210 489 -28 405 -129 -811 803 268 -320 333 -676 218 724 -359 26 -180 -99 860
2429 860 -285 -358 269 -474 751 321 -858 214 -148 271 604 -853 -72 486 -210 396 -357 -561 641
2448 641 -123 92 -37 -964 564 279 -482 70 -628 -81 615 -405 -149 -241 -424 885 -391 -605 289
2467 289 -418 393 353 -736 -47 211 158 517 -627 -104 560 -197 626 -123 -563 726 251 121 244 -494
2487 -494 562 714 -364 348 -114 -18 880 -136 5 -80 -194 805 -12 -517 399 -165 106 367 -598 -57
2507 -57 -34 20 400 -763 -268 418 -365 -53 13 -657 110 153 -215 -109 -603 269 232 -615 133 -88 -325 439
2529 439 54 -324 -17 -92 511 24 -476 443 -73 -27 495 -193 -105 235 172 245 -242 -148 595 -90 40 297
2551 297 -293 157 175 89 46 -286 209 342 -429 39 262 -335 139 110 -227 -128 -95 336 -123 -485 239 -3
$$ packed form
2410C70q82L02O99n17M33n34o82J614n35n88O53j009Q94N06j083L85k06Q1R59
2429H60j145p3O27p43J225m30j179J072l62M19L33j457P81N58o96O06p53k04J202
2448F41p64K15j29r27J528k85p61N52o98N47O96j020K56r2j83J309j276k14Q94
2467B89p07Q11m0j089O89K58n3L59j144N23O64p57Q23p49m40J289m75j30J23p38
2487d94J056J52j078P12m62R6Q98j016J41q5j14R99q17n05R16n64K71K61r65N41
2507e7K3N4L80j163M95O86p83L12O6o70P67M3l68J06m94Q72l7q47P48k21k37P64
2529D39l85l78L07p5O03m87n00R19n16M6N22o88Q8L40o3P3m87R4P43o85J30K57
2551B97n90M50J8q6m3l32M95J33p71M68K23n97M74k9l37R9L3M31m59l62P24k42
$$ plain form
2573 -3 -405 144 -1 -363 -2 -37 -31 -338 -152 325 -303 -255 100 -245 -188 154 -83 -183 -169 8 152 -337 -37
2596 -37 279 -187 32 113 55 -106 5 205 19 -260 226 233 -221 168 228 1 27 191 253 -163 55 396 -26
2619 -26 -221 361 92 -171 163 148 -147 -85 221 20 -254 70 164 -156 -205 161 -128 -171 -75 -88 -104 -288 78
2642 78 -35 -256 -123 57 -152 -220 58 -18 -150 -156 132 -128 -198 170 75 -81 -150 201 -33 -75 234 185 -13
2665 -13 31 334 34 8 258 213 0 101 288 29 60 224 268 -53 27 341 -51 -44 160 140 -127 -20 168
2688 168 -81 -68 -11 81 -232 -117 9 -117 -135 -120 26 -266 -166 -25 -92 -226 -62 -9 -209 -181 -98 -33 -158
2711 -158 -36 60 -178 42 44 55 -64 -41 31 -1 -31 86 156 -122 137 139 35 48 119 185 6 67 174 46 40 253
2737 253 96 26 240 79 152 7 29 204 -21 51 121 -41 26 154 31 94 -105 -16 179 -138 67 -30 -161
$$ packed form
2573cm02N49j45l62L61l5Ol07J86M77o28M8L55l45N7L42k37j00J4J77J44m89L00
2596c7L16m66K19Q1n8j61J11K00j86k79M86Pm54L89O0k27K6J64O2m16K18L41m22
2619b6j95N82k69k63L34j5k95O2L06k01k74L24R4l20m9L66k89m3R6j3j6j84L66
2642G8j13k21J33J80k09o8K78p6j32oK88k60p0L68r5j56o9L51k34m2L09m9j98
2665a3M4L03l00k6K50m5k13J01J87k59L1J64M4l21Q0L14l92PK04k0k67J07J88
2688A68k49J3N7R2l13J15J26j26j8J5J46k92J00J41o7j34J64N3k00K8Q3O5j25
2711a58J22R6k38K20KJ1j19K3P2l2l0J17P0k78K59Kj04J3P1O6j79O1J07j28oK13
2737B53j57p0K14j61P3j45K2J75k25P2P0j62O7J28j23O3j99Q9J95l17K05r7j31
$$ plain form
2760 -161 162 -99 -93 -4 -174 -26 104 -284 0 -58 -175 224 -190 -205 -23 -129 29 -140 -255 55 -106 -73
2782 -73 174 -353 32 181 -159 150 -136 -145 300 -19 -30 96 -142 212 167 -140 218 -165 71 479 -253 36
2804 36 119 -67 345 -105 -200 343 -180 151 275 -447 250 129 -122 273 -301 -53 258 -163 47 -78 -284
2825 -284 396 -46 -200 150 -369 256 190 -352 240 -263 -102 547 -376 -231 238 -306 269 -4 -429 285
2845 285 -99 171 235 -560 123 174 -134 271 -334 -228 499 -308 121 91 -535 518 101 -354 209 -284 69
2866 69 438 -377 60 27 -224 568 -240 -288 283 -296 393 89 -471 295 -75 -40 388 -567 -104 501 -319
2887 -319 265 -161 -282 491 -140 14 187 -434 315 350 -388 189 -204 -14 530 -382 86 121 -212 625 -119
2908 -119 -344 383 -65 222 302 -547 200 155 -125 450 -465 -84 460 -262 138 -111 -471 408 5 -219 182
$$ packed form
2760a61L23k61OQ9j70J48J30l88K84n8j17L99m14j5J82j06J58j69j15L10j61L3
2782g3K47n27L85J49l40L09k86rM45l19j1J26k38L54m5l07L58l83K36M08p32K89
2804C6Q3j86M12m50r5N43n23L31J24p22O97j21k51L95n74K48L11m21K10j25k06
2825b84O80m42j54L50n19O25o6n42N92n03J61O49r23J45M69n44N75k73m25P14
2845B85l84K70O4p95O83N1l08M05o05J06P27q07M29l0o26J053m17m55N63m93L53
2866F9L69q15M37l3k51P92q08m8N71n79O89l04n60P66l70L5M28r55M63O05q20
2887c19N84m26j21P73o31J54J73o21P49L5p38N77l93J90N44r12M68L5l33Q37p44
2908a19k25P27m48K87Q0q49P47m5k80N75r15L81N44p22M00k49l60Q79m03k24M01
$$ plain form
2929 182 -532 198 316 -545 135 -244 -152 393 -297 -229 66 -342 389 -56 -567 270 -148 25 269 -410 73
2950 73 221 -142 371 -227 -107 543 -138 88 227 -363 422 176 -92 279 -206 268 431 -343 194 51
2970 51 -154 550 -113 -167 279 -192 363 43 -333 241 -47 -34 237 -297 -82 270 -186 229 -144 -262 398
2991 398 -193 -48 89 -372 148 98 -225 18 -209 -28 252 -338 14 32 -338 237 -54 -209 54 -117 134
3012 134 36 -227 177 55 -166 267 -215 -76 270 -118 165 -53 -56 317 10 16 247 -126 109 221 -80 145
3034 145 -59 60 273 -191 107 161 -91 129 151 -47 51 -16 71 84 -261 165 9 -239 135 -39 -178 35
3056 35 0 -64 -85 -188 83 -82 -153 117 -133 -150 43 -63 -62 -146 34 86 -166 -65 124 -234 1 106 -119
3079 -119 -39 -70 177 -42 -110 155 61 -94 30 159 -42 133 105 67 29 58 191 -7 -17 135 49 -86 114
$$ packed form
2929A82p14P30J18q61O80l79R2N45o90O8K95m08P31m45n11Q37m18J73K44o79M83
2950G3J48l63N13n98J20O50o81K26J39n90P85k46k68L71m85M74J63p74N37j43
2970E1k05P04o63n4M46m71N55l20l76N74k88J3K71n34K15L52m56M15l73j18O60
2991C98n91J45J37m61N20n0l23K43k27J81K80n90L52J8l70N75k91j55K63j71K51
3012A34r8k63M04j22k21M33m82J39L46l88K83k18lL73l07OK31l73K35J12l01K25
3034A45k04J19K13m64K98N4k52K20K2j98R8o7Q7J3l45M26j56k48L74j74j39K13
3056C5l5o4k1j03K71j65p1K70k50j7J93j06Jq4J80N2k52J01J89l58K35J05k25
3079a19Q0l1K47k19o8K65r4j55J24J29k01J75k8l8l8K9J33j98j0J52q6j35K00
$$ plain form
3102 114 100 39 28 55 129 -56 6 149 -14 -63 68 19 -188 -61 107 -97 -211 -33 25 -204 13 72 -179
3125 -179 -149 25 -62 -152 54 -8 -103 -165 64 -6 -121 7 24 -45 -109 55 58 -108 -3 66 -52 -30 60 62 -4 53
3151 53 97 27 -38 73 112 -41 12 109 0 -33 145 85 13 15 108 30 -114 152 60 -123 0 125 -15 -30 -19 46
3177 46 -65 -73 127 -67 -98 31 -47 -20 -88 -10 -58 -136 2 11 -131 4 38 -124 40 13 -37 29 -76 77 30 -69
3203 -69 57 65 -119 104 -48 14 66 -62 119 -8 -30 192 -8 -75 107 -8 -43 11 -96 155 -53 -88 188
3226 188 -219 -36 147 -94 73 45 -62 80 -116 6 80 -161 82 -3 -200 117 -82 -46 153 -53 59
3247 59 46 -124 191 5 -178 214 -89 3 165 -164 59 50 -63 206 -76 -150 227 -122 79 59 -170 318
3269 318 -48 -46 238 -217 110 257 -184 75 66 -206 270 -145 -80 190 -216 169 -17 -257 177 -120 -94 231
$$ packed form
3102A14j4o1j1K7P4j85O2J43j63m9J31m9k07J27J68k04j14J78N8k29K17N9k51
3125a79L0J74q7r0K06o2r5o2K29p0j15J28J7o9o4J64Lj66J05O9j18K2R0Ko6N7
3151E3M4p0o5J11L9j53N3R7j09l3J78o0p2KR3p8j44K66r2j83J23J25j40j5J1O5
3177D6j11qK00j94l1J29p8K7o8P8m8p8J38Rj42J35L4j62J64k7n0O6j05J53m7r9
3203f9J26Qj84K23j52O2N2j28J81j27k2K22k00o7J82j15l5N4j07K51k08l5K76
3226A88m07J83J83k41J67k8j07J42j96J22P4k41K43q5j97L17j99L6J99k06J12
3247E9j3j70L15j86j83L92l03R2J62l29K23rj13K69k82p4L77l49K01k0k29M88
3269C18l66KK84m55L27J47m41K59rk72M76m15O5K70m06L85j86k40M34k97K6L25
$$ plain form
3291 231 -296 26 173 -216 212 -149 -232 277 -219 -59 103 -389 204 38 -347 149 -165 -88 303 -275 104
3312 104 19 -204 383 -82 -177 300 -202 175 253 -331 270 50 -115 414 -250 35 324 -175 283 77 -181
3333 -181 406 -20 -59 229 -329 277 288 -331 229 -190 -66 387 -275 4 159 -290 293 -19 -298 259 -189
3354 -189 -24 203 -453 40 34 -251 244 -274 -164 284 -270 40 1 -387 300 -45 -163 237 -369 62 289
3375 289 -308 133 -23 -174 379 -149 -104 205 -266 280 106 -332 306 -67 34 293 -325 83 225 -236
3395 -236 376 -138 -240 463 -153 74 214 -339 264 102 -124 248 -253 34 372 -311 80 36 -279 338
3415 338 -87 -160 188 -260 184 58 -410 153 -118 -241 247 -376 -62 171 -262 149 -66 -279 279 -163
3435 -163 -34 105 -316 141 104 -257 187 -190 -74 336 -231 46 173 -185 291 83 -136 225 -103 137
$$ packed form
3291B31n27L22J47l89M28l61q3N09m96J60J62m92N93j66l85M96l14P7L91n78L79
3312A04q5k23N87m65r5M77n02L77P8n84O01k20j65N29o64K85K89m99M58k06k58
3333a81N87m26l9K88n58O06J1o19N60m19J24M53o62K79J55m49N83l12k79N57m48
3354a89J65K27o56M93ok85M95n18J10M48n54L10l9l88O87l45j18M00o06M31K27
3375B89n97M41j56j51N53n28M5L09m71N46j74m38O38l73J01K59o18M08J42m61
3395b36O12n14j02P03o16K27J40n53O03j62k26L72n01K87L38o83L91m4l15O17
3415C38m25p3L48m48M44j26m68N63k71j23M88o23L14K33m33M11k15k13N58m42
3435a63J29J39m21M57l7l61M44l77J16M10n67K77J27l58M76k08k19L61l28K40
$$ plain form
3455 137 213 -236 209 135 -91 289 -82 -39 199 -58 131 30 -179 212 -74 -69 171 -238 73 131 -216 38
3477 38 -48 -85 177 -119 -107 111 -243 112 32 -231 115 -148 -44 77 -206 38 68 -182 123 -66 -129 158
3499 158 -105 65 76 -203 189 -6 -105 170 -31 -52 227 -40 36 20 -34 202 -105 47 158 -173 87 102
3521 102 -91 78 73 -90 48 -76 -24 58 -124 48 6 -83 70 -17 -31 -46 -68 85 14 -104 42 12 -98 69
3545 69 -39 6 -46 -39 116 -81 -19 54 -37 -24 143 0 -10 46 51 57 -122 48 49 -68 96 123 -15 42 63 -27 21
3572 21 5 74 33 -22 155 -11 -20 89 23 -18 -3 3 28 -30 -7 82 -71 -61 35 -11 -6 -34 60 -7 -45 -17 11 -39 -34 36
3602 36 -92 -1 13 11 -5 -51 89 -53 -70 -2 69 -50 3 80 -52 2 10 20 -37 1 112 -46 -48 25 61 10 11 84 18
3631 18 5 44 84 -51 79 56 -33 49 67 25 0 2 6 10 -60 51 56 -75 24 37 10 2 -14 90 25 -15 54 6 -145 58
$$ packed form
3455A37P6m49M45p4k26L80l71M3K38k57J89j01k09L91k86NK40m09L11N8l47K54
3477C8q6l7K62k96J2K18l54L55q0k63L46k63J04J21k83K44L0k50L05j89o3K87
3499A58k63J70J1k79L92j95r9K75k01k1K79k67P6j6n4K36l07J52J11l31K60J5
3521A02j93J69nj63J38j24N2Q2j82J72m2q9J53q7j4j5k2J53p1j18J46l0j10J67
3545F9j08M5n2PJ55j97O2P3r1J3J67j43j0N6NOj79J70Jj17J64K7j38N7K1r0M8
3572B1j6O9m1n5J77j66rJ09o6m1J5OK5n8K3Q9j53J0R6m6Nk8R4o7l8K8K8n0NP0
3602C6j28R1J4kj6m6J40j42j7O8P1j19N3P7j32N4QJ0n7L8J11j58kP3L6n1JP3o6
3631A8j3L9M0j35J30k3q9Q2J8m2k5KMMp0J11Nj31R9J3k7qj6J04o5m0O9m8j51K03
$$ plain form
3661 58 -38 -97 46 -35 -39 -139 -52 21 -95 -60 34 -65 -86 26 -134 41 -70 -16 71 -85 -12 16 -45 58 30 -64
3687 -64 78 46 -14 84 -74 77 122 -62 101 85 11 76 18 86 113 -49 164 -6 -33 173 -73 -29 103 -28
3711 -28 114 1 -77 64 -123 -88 128 -173 -24 54 -148 92 -78 -59 94 -137 9 69 -205 39 -34 -139
3733 -139 121 -175 -4 80 -149 74 8 -221 156 22 -110 129 -174 59 121 -145 173 -21 -75 244 -72
3754 -72 80 121 -69 163 19 -123 211 -84 66 168 -236 89 107 -84 175 -136 -108 165 -99 37 25 -192
3776 -192 147 18 -166 134 -219 80 156 -207 57 15 -158 220 -99 -122 115 -214 108 42 -257 202 -136
3797 -136 -81 205 -253 -21 170 -98 133 -68 -187 242 -99 19 70 -228 225 51 -161 200 -96 -14 253
3818 253 -190 38 79 -160 301 -72 -146 189 -214 81 172 -199 109 8 -135 204 -133 -104 162 -190 159
$$ packed form
3661E8r6n9J43q1mj00Q7P3j16L5R4r9k1J12j60J75j11N4Q7j56P3K8o1J03k8r4
3687f4J42l2o0R8j58J51M5j84J63j6p4O5n8O8K7j62K13j70k7K06k46M4J32j31
3711b8J42j13p8J41j87L5K16l01J49P8k02K40j70J9J53k31J46O0k74K44p3j05
3733a39K60k96J71Q4k29K23o6k29L77j34j32K39l03K33O2k66L18j94n4L19l16
3754g2J52M1j90K32j44j42L34k95J50J02m04L25J8j91K59l11K8K73k64J36j2k17
3776a92L39j29j84L00l53K99P6l63K64m2j73L78l19k3K37l29L22o6k99M59l38
3797a36N5K86m58K32J91k68K31k01j19M29l41J18N1k98M53j74k12L61k96Q2K67
3818B53m43K28M1k39M61l73p4L35m03K95R1l71L08j01j43L39l37K9K66l52L49
$$ plain form
3839 159 -48 -197 221 -85 -108 191 -315 35 157 -271 123 -132 -97 223 -261 19 123 -222 219 5 -192
3860 -192 187 -155 68 207 -307 103 106 -126 257 -152 -70 224 -170 100 136 -229 213 71 -146 205 -152
3881 -152 73 191 -193 145 -36 -141 334 -168 -7 194 -178 102 89 -231 153 -39 -73 161 -242 57 144
3902 144 -123 102 -85 -203 187 -131 -7 56 -231 113 -17 -180 74 -193 -58 168 -210 -2 20 -190 213
3923 213 -46 -129 170 -49 75 60 -89 112 3 -21 201 -158 12 197 -140 151 33 -159 198 -33 -33 94
3945 94 -117 142 121 -108 120 33 -76 175 -49 30 60 -132 102 -62 -107 36 -133 -19 57 -185 5 -1 -141
3968 -141 33 -148 -108 76 -140 -61 12 -145 61 -7 -46 37 -158 16 85 -123 53 -7 -73 82 -12 -38 67 -50
3992 -50 123 67 -93 81 9 7 130 -11 23 127 2 72 -30 90 52 -32 13 62 -105 27 11 -69 55 -75
$$ packed form
3839A59k07j49M18l06k3K99n06L50J22m28L94k55L5L20m84K80J04l45M41k14j97
3860a92L79l42K23J39n14M10Lk32L83m09Q2K94l94K70L6l65M42j42k17L51l57
3881a52K25J18l84L38j81j05M75n02J61K01l72K80j3l20L84j92l4K34m03K99Q7
3902A44k67K25j87j18L90l18J24O3k87L44j30j63K54k67J35K26l78K08K2k10M03
3923B13k59q3K99k19J24j5j49K01j09k4K22l59J70J85l37K91j18j92L57k31%J27
3945I4k11K59k1k29K28q7j09K51k24P9L0j92K34j64m5J43j69J14P6k42J90oj40
3968a41J74j81M0J84k16P9P3j57K06o8l9Q3j95J74O9k08J76o0o6J55r4k6J05j17
3992e0J73n6j60J74p2kJ23j41L4J04j25P0j02J20l8q4M5M9j67J32j6q0J24j30
$$ plain form
4016 -75 -25 28 -38 -58 -16 -118 -38 -32 -65 14 -64 18 6 -122 28 -51 -72 -1 -64 -92 31 -81 -17 -22 -54 33 -52 7 74
4045 74 -30 -24 103 -16 15 34 75 35 -53 24 50 -15 71 23 -47 36 3 29 33 -10 -39 84 -8 -1 50 -54 -1 8 24 -78
4075 -78 -80 -36 -11 -38 26 25 -80 78 14 33 -37 18 9 -66 60 75 -87 1 100 -7 -9 91 15 0 -11 75 8 -73 85
4104 85 -44 -5 57 3 -16 20 3 -7 65 -36 24 -53 -1 -21 4 -16 -44 -79 37 -43 -93 36 -34 -68 18 -68 -30 -2
4132 -2 30 4 -60 32 16 -109 15 46 -49 60 55 29 -36 -21 43 -24 -6 114 13 -2 37 5 -30 63 28 7 29 59 43
4161 43 2 -10 59 -16 22 4 -47 32 -13 19 49 -72 -71 48 -43 47 -49 -45 23 -17 -58 -6 -133 1 23 -78 26 29 15
4190 15 -21 -67 15 18 -78 65 -81 -96 83 -90 30 43 -125 23 63 -11 42 -74 26 129 -72 14 -14 -71 114
4215 114 36 3 76 -112 2 85 -115 104 9 12 70 -114 19 65 -124 81 10 -148 101 -11 -15 21 -28 44 57
$$ packed form
4016g5N0N3o6k0M2j02Q0Ol3P9p8Q2j2j28J50p9k1P1o3k8J23j12O4nl2Q7q5N9O7
4045G4j04OJ27j19L1J9M1m0q8P7K6o5Q6m8p0Q3l3K6Mm3k9J23r2PN1j04N3RJ6j02
4075g8kM4K5k7O4jj05J58o4J9p0N5rp5J26J5j62Q8R9j07kJ00p6j5j1Q6o7q1J58
4104H5j29L9O2n4j9L6j7j0P2j01O0p7N2k0K5k0k8l5J16q0n0J29p0l4Q6q6L8K8
4132bL2k6o4R2j6j25J24L1r5J09nk6o5J5O4o7J8J20j01j5L9l2l5R3l5k1K2L0j6
4161D3m1j2O9p5L8j8n1P9m5L2L0j21JJ19r1R0r6MO8m0m1N2j27J34K2j01J04Lj4
4190A5l6m6Q2Lr6J43j46j5J79j73J20J3j68J48M0p4N3j16J00J03k01Q6k8n7J85
4215A14p8l3P3j88J14Q3k00K19r5LN8j84J33M6j89K05p1j58K49j12mL6m9P2J3
$$ plain form
4240 57 -37 69 -80 -57 211 -102 11 58 -125 139 16 -73 52 -53 39 105 -121 60 38 -61 81 -91 -65
4263 -65 170 -54 66 20 -165 11 29 -59 45 -180 30 25 -181 94 -85 -127 126 -72 -166 17 -102 59 -15
4286 -15 -108 98 -107 6 140 -226 -33 49 -116 186 -7 -97 137 -10 43 127 -148 202 32 -33 114 -135
4308 -135 45 203 -45 39 16 -125 176 9 -76 57 -177 129 38 -161 112 -85 -51 171 -139 -148 61 -175
4330 -175 10 -76 -194 43 -163 -2 16 -202 47 32 -76 76 -122 -126 150 -85 35 -13 -89 126 41 -66 100
4353 100 -37 76 196 -95 99 62 -84 210 -8 38 83 -63 132 41 -145 127 21 -58 105 -83 -6 113
4375 113 -75 30 -86 -18 152 -136 -14 -14 -153 134 12 -176 52 -45 -66 83 -108 -45 -2 -112 51 -84
4397 -84 -121 74 -56 41 92 -125 71 76 -104 129 -85 -10 102 -53 127 30 -113 173 57 -83 125 -42 -6
$$ packed form
4240E7r4J06j49K3K68l13J13M7j83K64j23q9J25j05R2O6k26J81k2r9J42j72K6
4263f5K35k24J20m6j85J76J8q8J04k25K10nk06K75j79m2K53j98r4J83j19J61p4
4286a5r3K06k05J13J34l66J93Q2j65L02j93r0K34j47N3Q4k75L50j70o5J47k49
4308a35J80J58k48Q4k3j41L01j67q5J33k34L06r1j99K73j97L4K22l10rK09k36
4330a75J85q6j18K37k06J61J8k18K49j5j08J52j98mK76k35J20m8p6K15q5j07J66
4353A00j37J13J20k91J94l7j46K94k18M6M5j46J95r1j86K72j06p9J63j88P7J19
4375A13j88J05j16O8J70k88J22%j39K87j22j88K28r7k1J49j91O3M3j10J63j35
4397h4l7J95j30R7N1k17J96Nj80K33k14P5J12j55J80r7j43K86j16j40K08j67L6
$$ plain form
4420 -6 107 -3 75 -1 76 54 -64 115 120 -92 95 48 -128 39 -9 -18 53 -67 17 -11 -11 27 -75 -28 119 -72
4446 -72 -15 28 -88 63 -14 -68 -32 -63 -37 1 -82 8 -28 -39 105 -26 -94 103 -82 8 64 24 -39 -12 117 11
4472 11 -18 91 -18 -58 75 29 -42 57 56 -34 45 -27 24 -29 -3 -12 -20 -39 36 -89 -32 -10 -27 -11 -19 -35 -35 -31 1 12 -67
4503 -67 5 -16 -100 -12 -24 -82 118 -58 -42 63 8 -66 31 68 -16 3 61 -2 -42 90 -10 -55 86 24 11 -9 35
4530 35 12 18 16 41 -1 44 87 -9 -76 55 -14 -23 37 27 -66 -11 4 -47 -18 -14 -23 -35 43 -28 -4 26 -70 -74 95 -70 -80 -11
4562 -11 -36 -49 -53 28 -71 -49 13 -27 -5 -36 -29 -42 -61 37 0 -3 33 7 -49 16 43 -22 17 19 -9 -12 44 31 31 88 -13 88
4594 88 -18 41 -12 20 79 -45 31 102 0 25 16 -63 4 -11 -31 -36 -39 -12 -35 -98 22 -75 -74 13 1 -110 83 -49 -66
4623 -66 -55 -22 -52 -104 -17 -14 -63 -13 45 -124 48 21 -18 -5 42 42 26 59 35 29 -2 44 -6 -29 119 -2 4 24 -11 58
$$ packed form
4420fJ13j10P8p6P7k2j18J79Nk12J87m7j76J67m8rP1j20Q4k8%L8j02M7J47j91
4446g2N7M3j16J51p7n4L6l1K6L8q3R0l6j1J44j31o8J97j85R0N6m0o3K7J29j06
4472A1k9J09j09m0J33m6p1R9jr0P9p2N1n3K6rqj9P5j25N7K2j7J6qj6%ML2J1p9
4503f7P2k1q4Q8j2n8K00j76J6J05n5p4R7L7q4J9N8o3m0J32j00m5J41o2j3k0M4
4530C5k3OkK5m2M5M3r6o7J31o9rO0j0r3N5J5n1K9Mrj2P8p1K4L0r6mJ69j65j0O9
4562a1k5j3mQ1r9K2O2m0K2l1Pj3j9R8l7lL6k6n6O5K7o5L9Kk8lN6j3%N7j01J01
4594H8j06N9n3L2N9j24P6P1j02K5rp9O7j5k0nlK7k3o3J20r7JQ7j2j11J93j32j7
4623f6J1L3l0n2Q7Lm9N0N8j69J72k7l9J3M7%j6L3k4ol1M6n0k3J48j21OK0l5O9
$$ plain form
4653 58 83 -13 21 16 42 -39 -59 39 -9 -38 68 -91 -25 71 -38 -10 2 26 5 -66 58 2 -75 63 38 -116 31
4680 31 2 -51 63 -11 21 -1 58 96 25 -19 20 3 112 109 -66 26 39 -8 35 -43 -50 24 39 41 -48 -63 44 -13 -48 100
4710 100 -117 -63 35 -107 -20 -27 -60 -11 -78 20 -43 -118 55 12 -124 -7 -47 23 53 -26 42 5 7 100 -34 -4 76 -43
4738 -43 145 87 -67 123 105 74 97 -45 21 70 32 105 -10 0 178 -8 -10 64 -115 55 25 -84 -35 -36 -54 3
4764 3 -118 -27 -41 -129 91 -81 -173 41 -1 -61 -27 -91 5 -18 -28 -30 -102 9 112 -72 83 88 -97 164 58 0
4790 0 6 7 131 108 -15 91 -2 19 170 -84 20 116 -73 82 79 -45 29 91 35 -19 -80 34 9 -93 47 -112
4816 -112 -92 65 -53 -102 -5 -103 -16 -112 -127 61 -102 37 29 -129 42 20 -36 86 -31 -61 80 -6 92 76 -61
4841 -61 104 28 24 84 -86 -2 107 -13 83 42 -30 67 11 -46 47 -60 55 13 -104 51 -19 -26 65 -77 -120 27
$$ packed form
4653E8K5r6L4nK6q1k0R8m8k9J06j59O6R6j09K8J2K4k1p1J24n6p7J38k5j54J47
4680C1k9n3J14p4L2k2N9L8p1m4L9j7J09lj75R2J3m7M3p8pP4J5Kq9j5J07n7l5J48
4710A00k17N4R8j42Q7pl3M9o7R8o3p5J73m3j36J17m0P0L0p9O8l7KR3j34L0Q0j19
4738d3J88n8j54J90j8l1K3j42O6M9l8P3j15J0J78j86kP4j79J70l0j09M9jj8N7
4764Cj21R1j4q8K20j72r2K14m2o0L4o4R6k3j0kp2J11J03j84J55Nj85K61j06n8
4790@OJJ24k3j23J06r3K1J51k54J04R6j89J55lj24P4O2n6n4o1J14k5j02J40j59
4816a12K0J57j18m9R7r8Q7r6j5J88j63J39qj58J71k2n6J22j17l0J41q6R8j6j37
4841f1J65p6mO0j70Q4J09j20R6m1p2R7n6n7R3j07J15m2j17J55p0pR1j42m3J47
$$ plain form
4867 27 -19 -40 -95 -90 17 -82 10 11 -159 11 13 -80 -1 -97 -145 27 -19 -43 -58 -34 89 -42 3 51 -60 70 116 -6
4895 -6 14 78 0 126 6 -7 105 43 94 33 -10 117 12 12 61 -63 -69 67 15 -33 -17 -14 32 -68 15 -91 -74 37
4923 37 -21 -113 10 -42 5 -1 -66 -76 -41 -49 -10 -30 -6 5 -74 -4 -1 -58 2 74 23 -12 0 46 37 0 26 10 1 51 2 36
4955 36 128 93 -69 85 -14 36 46 57 42 -5 28 55 -44 39 36 -94 36 -35 -80 75 9 -38 -22 65 29 -51 -29 5
4983 5 -88 -12 0 -13 -44 -10 -37 -19 33 -8 -27 -35 -43 -10 -63 24 -55 -48 133 33 -53 86 30 -66 58 47 -91 18 44
5012 44 -52 -38 145 31 -41 19 55 -22 40 17 15 23 -10 11 -3 -18 61 -13 -33 0 -33 -11 54 -64 -56 -9 -19 -25 -3 5 -32
5043 -32 -36 24 -51 -32 64 -96 -23 16 20 -6 56 35 -20 55 16 16 65 44 29 2 81 44 -46 33 80 -4 131 32 -9 48 11
5074 11 -10 0 34 55 4 -7 -3 8 -36 34 -46 -58 -2 -56 -15 -37 -19 -53 -61 2 -67 -37 2 -84 -63 6 -26 -74 -17 -18 -62 5
$$ packed form
4867B7m6k1n5NJ07r9R2Jj70J70Kr3P9r6m8J72m6k4j5K4J23j31M5M8j11J30M6j22
4895fK0O4p8J26j20j3J12o2N1o1m3J27j05%M9j24oJ36n2m8J6LM6j00Q3j06J7J11
4923C7n8r2J23n2M7oo5j0L5qL9k0K4J1p9P0Ln7O0P2n1l5J2M6rl7K6j6rN0m9L4
4955C6R2l5j62J54r9N0J0J1j5m7L3K7r9Q3lj30J30p1m5J55o6m7J6Q7l6q0K2L4
4983Er3P6J2j3l1L4k7J8N2m1j9qqL3n3Q7p9PJ81j00q6J39n6r6J24j1j38J09K6
5012D4r6J4J83j14p2O0L6p7O2k3kQl3K1j4j5P9p4k0L3l3K2O5j18QM7j0oK2Ql7
5043c2mO0p5J9R6j60P3L9Mk6O2k1n5P5l9%M9k1j5k7P9l7r0P9M7q4J35r9m1N7l7
5074A1k1J0L4K1n1j1MJ1m4P0q0j2N6n4M1k2J8l4qO3o9L0L9q6K1O9l2m8N7jm4O7
$$ plain form
5106 5 36 -10 -8 96 12 -46 39 27 -16 64 66 1 36 39 18 -49 80 31 7 113 49 21 42 72 36 23 -8 20 -18 -35 67
5137 67 -49 -40 24 -78 -17 23 -39 -27 -5 -21 -80 -95 19 -68 -22 44 -93 -79 31 -73 -51 18 -75 2 3 5 -16 -27 68
5166 68 39 -28 87 24 -46 8 12 9 81 67 39 16 -48 19 -6 -19 81 -84 26 42 -44 32 26 -84 41 -13 -32 -2 -29
5195 -29 64 -72 -81 42 -42 -32 6 -107 -39 2 -45 57 50 -43 33 -13 41 -4 -92 81 8 -49 53 -15 -16 61 49 42 -4
5224 -4 19 146 -21 6 41 -77 93 23 -52 40 -28 -59 44 -12 -73 28 -72 69 -87 -50 15 -40 50 67 -108 -20
5250 -20 93 -68 46 -16 -56 4 -76 45 -26 -86 107 42 -86 80 -54 -5 82 -75 60 -49 25 41 -72 39
5274 39 99 -77 39 56 -84 9 76 -34 22 -47 21 75 -12 47 -139 -69 77 -61 -33 28 -117 35 31 -54 56 -15
5300 -15 -51 34 -60 -30 -22 -37 67 -15 -90 58 -72 -36 18 -97 25 -25 5 3 -65 -1 45 -75 57 -19 -51 77 -21
$$ packed form
5106EL1m6KJ04q4n8Q5j2m3Q0Ko5L5Lk1o7J29m9k4J06o4k8K1L0l6j3l1K8l8j7J02
5137F7j16RO4j02O1M0o2J2K2j6n9j5J14q7M6O6j37J4J10j04K2O9r3P7JKk1j1R5
5166F8k9o7J15o3p0N4MlP2j4k8k3o4O7k5j3J00j65J10J6q6P6oj10J25n4j9L0k7
5195b9R3j36rJ23q4J0L8j13O8M1m7J02pr3P6m6N4m5q8J73p3n7J02o8jP7j2pm6
5224dK3J27j67K7L5j18J70p0p5R2o8l1J03n6o1J01j00J41j56L7O5n5R0J7j75Q8
5250b0J13j61J14o2m0O0q0J21p1o0J93o5j28J66j34M9Q7j57J35j09P4J6j13J11
5274C9O0j76J16J7j40R3O7j10N6o9O8N4q7N9j86P0J46j38K8O1j45J52mq5J10p1
5300a5l6Q5r4L0Qj5J04q2p5J48j30L6N4j15J22n0L0ko8O4M6j20J32p6l2J28r8
$$ plain form
5327 -21 -54 -7 -56 37 34 -44 40 7 58 43 -30 88 89 -20 42 26 -2 18 39 37 0 -19 23 7 -69 45 -55 -40 92
5356 92 -32 -32 0 -65 -46 -34 -22 8 -83 -2 33 -135 20 -56 -24 5 -22 -28 20 3 -9 -54 -34 19 45 8 29 -48 7 66
5386 66 -12 27 12 12 44 72 28 41 20 23 55 -3 8 -30 -6 77 -32 19 -24 -57 8 -23 -17 -25 -58 26 -45 -109 86 -39 -61
5417 -61 -30 -12 -79 0 -23 -13 -75 -27 -16 -38 80 -3 -24 -18 36 -29 2 7 -9 44 6 2 30 32 83 48 27 20 66 21 50 47 8
5450 8 8 3 -25 26 8 2 -8 -19 18 -52 45 -39 -45 -43 -23 -132 -33 -23 -52 -3 -33 -1 -72 0 -3 -89 -40 -33 -41 -9 -34 -24 13 5 -8
5485 -8 44 -45 58 -13 19 66 16 20 84 65 -18 80 0 42 71 110 -32 17 39 22 -17 16 10 -74 52 25 9 1 -11 -53 -29
5516 -29 -13 -31 -34 -58 -77 -104 23 -3 -69 14 -64 -12 -52 -36 -6 10 -42 -17 35 -65 76 6 -16 79 -29 32 78 -4 33
5545 33 75 18 -25 46 59 86 30 114 27 54 61 60 -24 -8 26 -2 44 58 -15 -7 -46 -19 -30 -42 35 -60 -36 -42 -57 23 -50 -43 -49
$$ packed form
5327b1l3M7m9R3lp8Q4l3N1j5p3J18Jj09O2j6k8K0K1kl7j9M2j6p6J14j00J5J32
5356I2j24%L2o5J9J2J2L0r1Q1L5j68J55p6L2K9k7oM8j7j2m5K0N3K6l7K1p7N5N9
5386F6p8L9j5%L2K8m4J3k1LL2n8J1l8K4Q3j09N1m3l3O5l1Oql3Q4p1o4J95j25k2
5417f1L1J8o7P9k3J0o2M8J1k2J18q3k1ON4o5L1Nj6N3l8mK8KN1l5k1pM6m5K9ll9
5450H%nk8N1j8oj0j1L7p0R7q4oKK0j09R9J0k9M9l0L2p1P2lq6M9PqL2k5J0L7qj3
5485hN2q9J03p1L2M7n0MO4j9q3R8q0M2K9L9j42M9K2j7l9L3oq4J26k7j6qj2m2K4
5516b9J6j8lk4j9k7J27k6o6Q3p8N2m0J6L0J6n2K5N2j00J41p0k2R5j08O1M6q2L7
5545C3M2n7m3P1J3K7n6Q4q7K7Pjq4J6L4k8M6J4p3Ql9K7j1j2P7r5K4oj5Q0p3Po
$$ plain form
5578 -49 -30 19 -68 -4 -27 -28 31 30 2 7 -39 -67 36 34 30 18 23 23 -12 -40 70 34 -15 126 -61 47 103 42 41 50 19 56
5610 56 -39 16 38 -60 69 46 -37 17 -16 -73 -42 -44 -47 -27 -70 -19 -87 -67 58 -78 25 9 -38 -4 -26 -16 22 -26 17
5639 17 15 14 84 50 33 102 9 32 71 -19 59 72 14 9 31 19 20 14 94 63 -22 77 -19 -59 130 -63 -5 6 -39 34 -16 -43
5671 -43 32 -84 -21 25 -104 -25 -11 -21 -19 -7 -54 6 -44 11 -30 -41 36 5 -45 90 -54 -51 102 -55 49 0 -29 48
5699 48 -12 -3 37 -22 126 13 -80 71 -4 -47 47 -34 -27 12 -60 49 -47 -66 42 -44 -11 27 -81 77 -32 -59 44
5726 44 -72 -38 53 -55 29 -12 -64 68 -37 -21 46 -69 55 51 -61 51 -24 -14 37 -35 16 104 -7 44 -21 -58
5752 -58 93 -17 -30 35 -60 73 57 -48 -4 -2 -56 12 -63 25 0 -107 36 6 -71 87 -3 32 91 -79 21 -38
5778 -38 -35 40 -54 -41 66 -42 52 82 -15 63 39 -1 123 -78 29 64 -29 19 43 -6 94 -28 -31 58 -67 44 16
$$ packed form
5578d9J9M9q7O4k3jN9jk8Nm6k8J03kmj2N%l5k8J10l6m9J41j87J08N6o1jRl1L7
5610E6r5N5K2r8J29k3q3N4l3n7L1klK0m3N1o8K0J25j36J03j6m7L4k2J0L8m8M3
5639A7kjP0l4j7O9r3K3L9r0P8J3n8nK2j2JoQ0l1q5R9r6m0J89j93N8J1m5P3n0k7
5671d3P5j16O3M6j29P9J4j0KJ2m7O0n0N5m1j1P7l1n0J35j44LJ53j57J04m9k9P7
5699D8o0RM0n9J48j13r3J51p5m3R4q1PL9p2J09r6j9J08q6L3L8j08J58j09k7J03
5726D4j16L4R1j08Q4m1n2J32j05J6O7j15J24mj12J12p5J0N1p2N1Q8j11N1o5l7
5752e8J51j10j3O5r5J33j6j05M4Kn4O8p5Q8k5j07J43l0p7J58r0L5N9j70J00n9
5778c8LP5r4J3J07j08R4L0r7P8k4m0J24k01J07L5r3M8K4m9J00j22lQ9j25J11k8
$$ plain form
5805 16 -54 17 -30 -27 43 -101 14 28 -48 84 -14 -68 94 -6 -5 -14 -69 14 -17 -37 49 -27 28 49 -66 -5 27 -67 23
5834 23 28 -11 -4 -35 48 27 -19 53 11 -22 72 -54 16 17 -50 -54 29 -41 -29 -72 -17 15 -19 1 -27 -102 56 -12 -31 86 -27
5865 -27 15 -18 24 31 20 21 45 11 7 38 -51 17 51 -8 34 16 22 11 -10 20 -6 -8 27 41 -32 67 -52 -29 -20 -54 21 -18 -35
5898 -35 -8 -32 -14 36 -9 12 -8 -66 29 -40 -69 -5 -48 -15 -23 -8 -18 -36 -19 63 10 -21 8 -23 31 41 39 -16 -24 -1 -38 -25
5930 -25 28 9 45 37 54 16 1 15 24 -25 -24 41 -28 35 27 1 -29 -28 -41 36 1 -96 18 -48 -2 11 -25 30 -7 31 14 -2
5962 -2 -37 -30 -25 -37 -18 -10 5 -36 -2 -17 16 28 -12 11 8 26 11 50 4 -30 1 -16 -11 53 15 -15 -2 1 30 -22 -27 37 -23 25
5996 25 -29 11 24 14 -47 18 2 -31 -27 26 -7 -59 -11 -10 -56 22 46 -1 -18 -16 -22 -21 13 3 44 -27 32 8 -9 53 -5 -22 35
6029 35 9 5 32 25 7 12 16 43 41 22 -51 -38 -8 -37 -33 1 -11 -47 -5 -58 -26 4 -108 -18 -36 -17 -28 -94 -16 -51 -70 50
$$ packed form
5805A6p0P1m7LP0j44J15J4p6J32r8n4J62j00Jrn5Q3l1k0Q6p6N5K1j15O1L2r4R0
5834B3Nl9Pl1Q3k1m6P2m2l3R4j26P0Jo7mQ3p0J2m3N5L2l4K0k8p5J58o8j9J17j13
5865b7M2l3M2Pj1JK4l4mL1q9O8L4n9M2j8Oj1k1L0k6kL5J4p3R9j19K3Rl4P5l9j7
5898c5K7k4J8N0m5K1k0n8R5o9k9O4m3L3qJ5j0j8J7Q2n3l1K9l1N4J0kn5qK3l7J3
5930b5N3j9L6qJ7l8j5J4Rm9JO5o9O3qk6l0Jj3P7l5r7J14o6M6J3l6N5l7L8j7j6
5962bl5PNj2J9QJ5m1L4j5L3J2m0K3lJ8j5L9m6l4L1j7NO4l8l0J3LK9n2nO4o0M8
5996B5n4M0J3j0o1O5j6l3MN3l3n2M8Jm6P8K4m7j7KoJL4j0M1p1N9k4j7O2n8j7N7
6029C5k6mK7pj8NMK7kj9p3J3L0k9ML4j2l6M2n3L2L0j12R0j8J9j1o6P8l5j9J20
$$ plain form
6061 50 27 -29 -26 -39 -13 -23 -53 27 -61 -43 102 -43 16 36 -11 47 56 13 57 8 42 114 15 39 -53 2 58 48 37 50
6091 50 30 -32 -8 -47 22 23 -78 1 -59 -11 -17 -76 11 20 -47 69 9 -4 49 -41 60 -34 -20 31 -2 32 25 -51 -9 47 -61
6122 -61 46 -29 -77 85 3 -12 -7 -19 -26 63 6 110 25 9 74 -44 0 12 -70 32 -5 -20 13 -30 -9 51 -36 44 35
6151 35 -58 93 -21 -28 -8 22 48 47 -43 52 29 3 74 -73 6 77 -56 49 11 -21 60 -101 36 26 -59 54 31
6178 31 -26 113 -68 -13 41 -121 53 -4 -13 26 -56 -75 61 -32 7 -8 -119 -17 -76 -99 41 -64 -36 50 -2 45
6204 45 -30 -65 68 -21 -34 60 -74 43 32 -80 -26 -49 18 27 4 -1 20 15 71 0 -65 26 -104 23 31 -32 67 3 29
6233 29 47 -77 -29 72 -27 42 17 -81 46 -27 -59 55 -60 7 20 -51 42 3 -68 37 -23 15 48 -36 68 25 -72
6260 -72 14 -53 -11 -7 -39 18 43 -47 59 -9 -6 70 -83 -13 17 -74 -4 -12 -70 15 -45 31 49 -21 -14 37 -47 28 -65 5 62
$$ packed form
6061E0k3n6Lj3K6j0l0Q0q8J8J45j45N9K0m7N8Rm3M4m9L4P2r9K4r2N5N6j0j1J3
6091E0k0o2K4l9O9Jj01P9o0M8on9Q7Ro7J16o0j3N3r0J01r4J4N1l3L4pp6M2N6j08
6122f1J07p5m8J62q2j5Nj2pQ9n7J04q5j6O5j18M4J2q2J02l7j5L3m3K1O0q7Q0r
6151C5r3J51j14pK0L0K6jr0R5k3k6P1j47P9P1j33J05l8l2Q1j61J37j0q5J13k3
6178C1n7J39j81N5N4j62J74n7rL9q2j9J36r3L9j5j11J02n9k3J40j05K8Q6n2M7
6204D5p5l5J33q9j3R4j34J17j1j12N4k3O7Rk3nK1nN6p1o5R1j30J27Qo3R9o4K6
6233B9J8j24M8J01r9O9k5r8J27p3l2J14j15O7J3p1R3l9p1J05o0L8L3q4J04m3r7
6260g2Q6o7M2Ml2N7K5r0J06o8LP6j53P0L0r1P0qn8Q5o0P6J8p0PN1q4P5r3P0N7
$$ plain form
6291 62 -62 3 -53 -32 54 53 -73 45 -53 -40 18 -23 -2 56 -8 50 -25 -46 20 -31 15 8 -3 22 -24 -37 76 -63 -47
6320 -47 52 -26 3 -60 -5 79 -17 -13 43 -53 38 -7 34 25 -26 42 51 -32 -36 11 -35 35 -3 -68 9 -71 16 75 31 74 -3 -73
6352 -73 16 -2 -28 8 -41 -31 1 -33 32 14 35 54 -51 -41 -18 10 -17 -16 -14 39 -15 -16 9 -56 17 33 31 -6 -54 -65 10 -37
6384 -37 14 35 -36 -5 -13 5 44 -35 37 -15 12 38 -15 -31 27 5 -6 12 -34 6 22 -15 42 -23 -53 9 -71 -1 -27 16 -51
6415 -51 -35 -26 -29 43 -38 -3 -12 -4 -41 -48 26 -83 3 13 17 20 13 -36 34 3 -30 31 8 -9 -8 -38 44 -33 -25 60 21 -54 55 36
6449 36 45 36 -30 28 23 19 -4 37 23 35 12 -14 0 -6 -5 -19 -45 -14 -82 16 15 -38 -29 -55 14 -5 -1 4 -52 -14 -30 34 -4 12 -46
6484 -46 -5 3 -58 8 -13 17 87 -36 -12 -2 21 27 -33 37 19 -46 9 3 -11 1 5 -97 16 6 -14 -45 -18 42 -40 33 12
6515 12 -17 -7 30 -30 30 21 -61 8 9 6 -6 -32 21 -18 -66 0 -17 8 56 -3 -44 20 -34 51 0 -36 61 33 6 -28 -19 8
$$ packed form
6291F2j24O5n6K1Q6jj26J18r8J3N8m1K1N8o4N8p5k1O6n1M6pj1K5m6j3J13j39J6
6320d7R9p8K9o3N5Q4r6MN6r6R1m5M1rn1O8Rq3mM7m6P0l8o5P7q0Q7N9m4M3p7p0
6352g3Q9j8k6L6m9J0L2l4O5j8K1J9j05J0K3K8k7JKN3n4jK5o5P3J6kl7m8j1P5m7
6384c7N1K1p1L1qJ8L9p9P2n2K7K6n3j6N8k2j1J8m6M0J6l7N7o5l0O2q0P0k6M3o7
6415e1J6RlP2q1L5rQl7pP4j09Q6J0MLpm9P0l1l3O1k3j7Jl0Q2p7QQ5l9p5J09j9
6449C6Rro6N8nmk3M1j4J2k3k6J4oJj4k6L1o8R8jn3Rk6O9j9MNn6L8j6O4l8J6n8
6484d6M1Qo1O6k1L0P0j23K4J0K3Oo0P0j8o5N5oj4J2Mj02J13j0k0l1K7O0q2P3k1
6515A2k9J0L7o0O0rq2O9Jlj2k6N3l9m8O6j7K5M8n9m1O4n4Q5n1l6R7k8k7l4RK7
$$ plain form
6547 8 31 -41 36 61 -31 27 15 15 -47 -41 2 -60 -44 40 -24 -96 80 -11 13 -28 -9 58 -15 13 52 -29 33 7 -63 43 6
6578 6 -23 15 -20 34 49 -56 31 20 -20 37 -52 26 54 -2 53 23 -7 47 -25 41 9 -28 38 28 -8 8 35 -47 18 -29
6608 -29 26 81 -48 57 20 -67 73 -81 -6 36 -45 13 -3 -41 32 4 22 123 -35 4 15 -32 53 -41 34 73 -77
6635 -77 -43 92 4 35 34 -33 45 -75 12 44 2 46 -21 -72 89 -24 7 24 -47 35 61 -5 -17 -9 -46 -8 9 -1 33
6664 33 -58 30 -3 -148 47 -44 24 84 -68 42 45 -17 16 5 7 66 -72 14 4 -51 43 2 -8 35 -20 25 82 -36
6692 -36 19 41 -30 15 -67 16 71 -31 20 49 -17 60 4 30 -2 -24 -17 -22 -131 90 9 -41 50 -44 -25 1 -70 28 10 -15
6722 -15 71 -14 -9 14 -82 -12 29 -56 36 -1 -46 39 -4 27 105 -58 23 20 28 54 -59 35 41 -49 31 -25 -41 37 -13 -72 49
6753 49 -2 27 57 -71 37 -33 9 53 -35 -32 46 -79 5 32 -16 36 -49 -25 28 -11 55 -9 -65 68 4 -18 24 4 -23
$$ packed form
6547HK3p2P7K5r2N8j2%o2OM3o2J6Q4o4p2J76r1K4m1J9O7p3K8L9q1O2k6p0J06l7
6578Fk9L8l5N4J5j05Q7j1m0N7q9P8K8n6N5l0l0N4p2O6l2l7O6j0l6J6K7q2O5m7
6608b9N5N5j29J05l7q7J40j54P5M2q1N8j6l8P3k8J8J01j58L9J1m7Q5r4P5L9j50
6635g7L4J35q8L1jo7P8j20Q7L2m2M4o7n1J61j13L1J7p1Q2K6o6j2Ql7L8J7j0L4
6664C3r1Q8l3j45J95r1O8O0j52J10Lo2L3j1KN9j38Q6j0n5R4m1j0M3n5M5N7j18
6692c6N5K2p1M5q2Q3N5j02N1K9o6P7n6K6l2k2Pnj09K21q1n0R1r4J9K6p1R8j8k5
6722a5Q6q5NK3r6P0M1q5R2l7m5Q5m3L1P8j63Q1lQK6j13R4Or0Q0n6j6P8n0n9J21
6753D9n1K9L0j28J08p0M2M4q8LP8j25Q4K7m8N2q5K4N3l9O6o4n6J33o4k2M2k0k7
$$ plain form
6782 -23 3 16 8 -22 -58 50 -33 -54 32 -33 9 -3 -12 8 -48 -41 -19 -35 -5 -64 -32 56 -53 -16 18 0 1 43 -4 45 31
6813 31 -10 32 1 21 10 -6 65 2 -22 32 -12 23 40 33 -10 34 15 20 -3 4 46 -10 51 10 -36 -11 12 -38 5 -17 -3 1
6845 1 -52 -15 -1 -21 -27 -21 16 7 -42 -19 -29 -29 -40 27 -33 34 -24 -11 -4 -58 36 -19 -42 24 -16 -5 76 -28 9 -18 -5 -10 -1 -43
6879 -43 13 -13 7 30 -49 -33 7 -71 6 24 -20 -5 -23 21 -35 62 -21 22 -11 -25 36 10 2 -19 6 0 38 -33 8 -18 20
6910 20 3 32 20 -59 24 14 30 30 -4 11 19 -15 9 8 -13 -26 -51 14 31 -31 24 -4 9 -59 -14 24 -13 40 -34 -48 -7 -20
6942 -20 -3 1 20 -53 14 21 -22 -22 -31 -17 28 8 10 -7 -3 -17 -72 -22 25 -39 -26 -19 -9 8 -22 -9 28 -1 -15 27 -3 25 -26 -23
6976 -23 39 -14 19 24 16 -27 32 3 11 18 -54 -17 21 26 17 9 10 24 -47 -28 -16 4 -49 -81 -11 -32 -37 -13 -40 -15 -9 -35 -32 47 -38 22
7012 22 -17 -21 -50 -53 50 -30 -38 16 3 -14 58 -11 -43 7 -16 -8 39 5 -5 -21 -4 4 -50 -21 6 -29 25 -19 -17 -7 -15 28 3
$$ packed form
6782b3K6J3ql0l6J08q3k1Q6o5M2j2rK0n6PK2j6L0n9L2Q8j09L7L4j8JM2m7M9j4
6813C1m1M2l1K0j1j6P1o3k4N4m4L5J7pm3M4j9Nk3PM2n6O1m1m6K5K3n0M3k2J4M
6845An3L7J4k0oOL7rm9K3j0%j1O7o0O7n8J3Pn4R4n5k3O6m0J1Q1j04L7k7J3nRm2
6879d3N6k6K0K3p9J6M0p8P7J8m4J5j8M4n6R7q3M3l3j4O1k6qk1K5oL8p1M1k6L8
6910B0j7K9j2p9Q3j0J6%l4J5Ql4K4jk1j3k5O5J7o2N5k8J3o8M5L8l7N3p4j4M1j3
6942b0J7MJ9p3O7Pm3%rJ4M5k0Kj7Mj4n5N0M7o4J3PJ0J7l0J3L7k9j4M2l0K8n1L
6976b3O2n3L3Nqm3N9k9QPp2L7L8NrqJJ4p1J9J2K0n3l2P0k1nK4k7K5Ok6LP9q5O0
7012B2l9mk9lJ03q0qN4j3j7P2o9l2N0k3QM7l4j0j6J7Qn4K9K7l5N4m4KJ0qM3k5
$$ plain form
7045 3 -29 7 -32 -28 48 -31 30 76 -32 -26 32 -25 41 5 -50 21 21 -6 7 -36 20 46 11 -13 -17 53 -9 12 19 21 -75 64 -65
7078 -65 11 41 -63 44 -4 -4 3 -5 25 26 -90 40 34 -78 -11 38 -28 5 -3 -34 6 -34 -20 -35 -45 21 -16 -23 31 -66 42
7109 42 -6 -61 24 -27 -30 21 -76 29 19 -33 68 1 -38 49 -35 26 56 7 44 19 -8 46 20 32 20 -42 55 59 21 4
7139 4 5 -24 35 -69 29 33 -72 23 27 -70 -6 -17 -6 37 -47 6 19 -7 1 -27 -75 30 -69 -18 34 -57 -19 39 13 43 -49
7170 -49 -5 -19 -106 -42 9 -21 48 -18 2 22 -55 52 6 -74 3 10 0 36 -108 32 41 -54 81 52 6 92 -16 -20 38
7199 38 -27 17 7 -9 36 11 -59 46 -60 38 46 -54 19 -36 37 45 -45 51 30 -34 17 0 -45 6 -12 -33 60 9 6 -9
7229 -9 -34 -6 6 18 53 38 10 7 -15 39 -51 -3 -4 30 -15 -16 -36 -33 13 -20 28 -25 1 41 -31 42 43 -9 1 3 -26 32 -10 22
7263 22 -16 7 4 57 8 15 -21 28 24 -22 17 -41 -26 -4 -4 7 -27 29 1 7 4 29 16 -53 27 -45 -3 4 -22 -14 1 -41 50 -69
$$ packed form
7045Cl2L6l9MP6p9O1M6j08ON8n7O6l6n5P1%k7J3m3N6K6l5k4mP0o2K1PKr6J39j29
7078f5P6L0j04J07m8%PqL0Jj16J30oj12O7M9o6L3ql1M0m0J4j5j0O6l7pN4r7J08
7109D2m8n5Q5n1lN1r7J05j0n2J01o7l9Q7q4O1L0m9L7k5k7N4k6J2j2o2R7Ml8j7
7139DJk9N9j04R8Mj05R5Mr7O4j1J1M3q4N3J3k6Qk8m8J05r9N1N2r1L8N8k6L0r2
7170d9M4j4q7O4N1l0O9o6K0K0p7J07m6q0P7Pj0L6j44J40Rr5J35k9m6Q6j08mN8
7199C8o5M4j0j6M5k5p0J05j06R8Qj00P3n5P3Qr0R6k1o4N1j7m5N1j8k1R3n1lj5
7229ik5K8J2J2L5j5k8lk2N4r0M8jL4m5jk0LM6l3M8n3K6M0p2P3Jn2J0Kk9N8m2L2
7263B2l8K3lN3m9Pl6M9mm6L9n8J5K2%J1l4N6k8OlK5j3o9Q0p2M2Pk6QJ5m2R1j19
$$ plain form
7297 -69 2 7 -42 20 19 -23 -30 -13 11 25 -16 8 7 -21 17 15 6 89 -11 5 53 -9 -23 34 61 47 -41 -11 38 45 7 -16 -12 -20
7331 -20 11 -39 -23 2 -27 -31 -4 24 -44 6 46 29 67 58 -20 65 -28 -46 0 28 -11 17 8 2 16 -30 22 -10 21 3 11 -12 -28
7364 -28 15 -21 -35 -29 19 9 -13 4 -17 -37 11 -38 6 -66 -36 -34 -42 -31 -45 -26 37 2 -42 -41 -54 -13 0 -54 35 10 -30 -23 -6
7397 -6 12 2 -13 18 33 -37 73 -19 2 2 -44 27 -42 -4 -7 6 13 -12 -32 16 3 31 -7 17 -4 -8 -36 9 30 14 36 -2
7429 -2 11 40 43 17 -22 -24 27 21 -43 -4 10 30 15 27 -15 18 -1 54 9 -24 30 -28 -2 18 -20 -11 54 -15 1 -25 -6 -13 15
7462 15 3 -27 -6 7 -4 -27 62 3 2 -27 -42 9 28 -30 8 -7 -17 54 -17 -29 -59 11 -5 48 -9 57 -42 16 -4 -7 5
7493 5 -50 -3 -16 -15 -33 29 -18 -23 -6 -19 37 -21 20 12 -52 29 -21 -31 22 -5 22 -11 3 20 -1 -38 -37 -26 -44 -13 -43 -37 46
7526 46 -7 12 -63 -29 95 -40 18 19 -28 -33 -37 -69 -11 -35 -30 40 -46 4 35 -25 3 55 0 67 30 -48 22 -71 11 9 -35 9
$$ packed form
7297f9P1Nm9O2jm2pJ7K4J4m1K4jk8L8krQ3j00J6M8o2j4N7K7j4q8L0M9Pl8k3Mq
7331b0L1n0J6K5k9mK7K8o8N0M0j7L8rp8Q5r3j8M6K8l9K8roJ4m6N2l2L1j8Qk3j6
7364b8M3l6j4OM8j0k2J7k1k0M8m9M4p2L0KqJ1j4J9O3l5m4Jj3M1J3n4Q9k5m0PJ7
7397fJ8j0j5L1J5p0J10r2K1%m6P1o9L8lJ3Pk5k0M8j3K8l8K4k1mk8M5K1j6K2l8
7429bJ3K9Lk6l9kN1oo4L9J4K0j5J2m2L3j9N5m5l3N4n8K6K0l8RO5o9J6k6J9pK8
7462A5j2l0K1J3j1k3Q9n9jk9j5N1J9n8L8j5j0P1p1j2l0P0j6N3n7O6r9N8k0lJ2
7493En5M7j3Jj8O2m7nJ7j3N6n8M1qo4Q1n0j0N3k7K7l3J4J7k1l7JJ1j8L1l0OQ3
7526D6n3J9p5L4J24j35N8Jm7nml2N8k4NP0q6N0L1o0K8N2n5O7l7p8P0r3Q2km4M4
$$ plain form
7558 9 -29 14 38 -12 3 -40 -21 -5 -11 -30 -44 -13 -10 -36 -60 14 25 -9 31 -6 -29 59 -51 72 47 -13 22 16 -20 20 21 9
7590 9 18 -33 -26 -13 -87 37 12 -2 32 15 8 -24 53 -3 -50 0 4 41 0 27 -92 54 10 -9 51 -13 -53 -4 -20 -25 -23 -1
7622 -1 26 -94 -76 50 20 15 2 -32 60 -23 1 40 -7 30 12 6 26 8 1 -13 9 -2 39 -13 20 -7 2 29 1 -17 11 1
7654 1 16 26 -48 -15 -4 -1 19 -7 54 22 -33 -26 -39 -7 50 44 -73 -29 -22 -2 27 -53 19 2 -20 -21 -64 17 -16 -39 49 -16 -44
7687 -44 11 2 -28 -36 -50 -17 24 -33 37 -4 -44 26 -62 31 -8 -21 9 -22 -36 -29 -18 57 27 -31 13 1 52 50 0 6 4 58 31
7720 31 43 -13 21 -15 -28 -3 4 -16 34 7 16 28 25 28 -26 -28 -3 1 61 3 -8 -13 15 -41 -2 -25 16 -68 -43 37 -71 0 13
7753 13 -23 7 -11 -3 15 1 -3 37 -50 -19 23 -64 -15 11 -33 17 -18 -18 14 6 22 -10 24 19 9 -35 2 -7 8 -1 -49 22 8 44
7787 44 -15 45 -10 72 -16 16 32 43 -40 -30 8 17 28 -40 -10 4 46 -20 27 40 -62 -13 16 -25 -4 31 -51 -18 -26 4 -40
$$ packed form
7558Il8M3K4n0J5m3J9J6oj9j4L1Lk6k4P4J1l4M0l7k3Q8j10J23k5o0L5ol6M0Jj2
7590IRn1PJ3p4J24k5j4L4j7pl2P7n6m7N0ML7m1K7j19J46m4j9O0o4m0M9j6nKK2
7622aK7j20J8J26l0nj3l4R2q3K4L9m7L7j8oK0j8pj4K2j1M1n2L3k7RK7k8j8K8j0
7654AJ5J0p4L3J1LK0k6O1l2n5Pj3L2N7oj17M4PK0K9q0P2j7k2jm3Q1l3k3Q8o5k8
7687d4N5rl0qj4L3M1n7P0m1m0P0q8R3l9j3L0l1j4PJ1P5l0n8M4j2N1kn0OkN4k7
7720C1J2n6L4l6j3K5Pk0N0k7RJ2lLn4kK5MO0n8j1nK8n6L9k3M1q4K5Q0j08P1J3
7753A3l6L0j8QJ8j4mM0q7L1M2q7M9K6m4N0l5%L2qJ6l2L4nj0m4L7rJ5rm8P1j4L6
7787D4n9O0n5Q2q8L2J6J1q3J0L8RJ1o8L0J4M2o6M7J3j02M9K9m1K1L5q2L3qL0m4
$$ plain form
7818 -40 -25 4 0 -32 -29 -36 -36 9 -45 0 13 27 7 -12 -44 -44 5 25 32 -15 21 -12 1 -5 15 42 19 -1 39 1 -25 22 27 -6
7852 -6 58 -37 -5 -51 0 11 -18 -2 10 28 -2 22 18 58 -4 -5 -15 -74 46 -25 6 0 7 2 27 37 49 17 -1 33 17 6 -10
7885 -10 -34 -36 -3 -10 -1 2 38 -39 -13 3 21 27 -21 18 -21 -31 -20 -7 -1 11 -17 -3 14 -57 17 -16 -33 23 -29 -22 14 -40 -9 26
7919 26 6 14 -21 -57 -10 -7 -7 -24 23 -38 41 5 2 12 -1 -23 -13 -11 -12 -8 10 -31 11 -22 -53 2 -8 67 0 16 -3 -8 -35 49
7953 49 -52 -30 11 30 -46 23 -29 32 -34 -1 -12 -1 7 -13 -2 -21 -2 11 15 10 -20 12 -14 3 -5 -3 51 7 18 18 5 -12 31
7986 31 -23 76 25 -22 9 35 -12 9 1 -3 -80 -33 16 28 3 92 -30 35 -44 -46 34 -21 11 -44 3 -28 -14 5 -11 13 -12
8017 -12 2 -2 40 38 6 13 -18 -14 36 -20 14 6 -40 16 -26 -35 38 -15 -1 40 5 88 20 8 27 25 18 11 34 -8 -11 46 36 7 10 83
8053 83 -11 -28 -28 38 -13 -13 0 30 -23 -20 3 -44 -7 -23 -33 2 -19 21 72 -29 17 -8 -27 44 -31 16 37 28 14 7 46 8
$$ packed form
7818d0J5K9ml2Lp%M5n4M5J3J4k0j9l2%M9K0Pm7L6l3J3oK0K7k3k0M0l8k6M7Nl3
7852fO4r5L2m6N1J1k9J6J2J8l0K4mM0o2jj0n9J20p1L1oPnK5J0J2l2j8L4j6j1j6
7885a0k4kL3pRLL6p7K6J6J8Om8L9l9j0J1J3OJ2k8J4J7p1P4l3j7N6n2PL6n4L1L5
7919B6k0Ql5l6M7L%j7M7o1P9l6lJ0j3k2J0KjMJ8m1M2l3l1N5j0P5o7J6j9nk7Q4
7953D9j01K2M1J9p6O9n2O1o6L3j1J1Qk0J1j9J9J3Mnl0L2k6J7qKN4m4J1%j3j7M3
7986C1n4R9n1m7L1K6m7K1qmp7M7M9J2k5Q9j22O5p9kQ0n5L2n5M7l1J4J9j6K4k5
8017a2J4mM2kl2Pl1MN0n6L4qm6N6m2rP3n3J4M1l5Q3o8j2J9kppK3m2lN7j0k9LP3
8053H3r4j7%O6n1%J3L0n3LK3m7L7j6j0L5k1M0N1j01M6k5j9P1p5M7K1rj4pL9l8
$$ plain form
8085 8 -3 -23 109 -27 10 16 -10 6 -19 32 -8 -37 7 36 -31 -60 -14 -2 8 30 -73 -7 19 -11 11 5 4 13 -32 -69 4
8116 4 54 48 -7 -14 -3 15 -10 6 -24 23 -16 5 74 -43 34 32 -30 -8 21 64 15 -44 39 -15 -40 -38 -30 0 37 -19 12 -9 -12
8149 -12 -2 -26 19 -6 -33 -23 30 33 52 26 11 23 -39 48 14 -22 29 44 -2 -19 -48 44 25 2 73 3 9 16 -15 -9 42 -18
8181 -18 61 -14 -39 -15 40 -55 12 -38 32 -20
$$ packed form
8085Hj1k0J32j36L7Ok6J6k5N1m0k9M4K9o7k9M6J2J0K2j03O6K6l0K2ojRm5l7P3
8116DN0on5pJ1J8k5J6l0M7l9K1O9j17P7ko2K2K9M3m9n9Q3n4k5KQL0L7n6L1k1l
8149a2J0k4M5k5k7J0N3LJ9k6j5J2o2Q7l4l6N1J5m6j7k9R2j9k3P1p0OPl1ON1o0
8181a8P9p5k5K4N5r5O7n0P0n2
8191b0
$$ Imaginary data points
##PAGE= N=2
##DATA TABLE= (X++(I..I)), XYDATA
$$ plain form
0 0 0 0 0 0 0 0 0 0 0 0 0 -8 8 -8 8 -14 16 -16 24 -24 32 -40 48 -56 64 -72 86 -97 112 -129 146 -166 189
33 189 -213 240 -270 303 -339 378 -423 467 -519 576 -637 704 -777 857 -944 1038 -1144 1260
51 1260 -1388 1530 -1691 1868 -2072 2306 -2572 2888 -3262 3717 -4280 5002 -5957 7285 -9263
66 -9263 12504 -18672 34395 -152713 -234900 182913 -101650 -180871 30216 -68323 -166184 -47149
78 -47149 -40 -101978 -154690 7277 -31017 -114773 -1276 -68849 -91138 37867 -20802
89 -20802 -41195 -17426 -8035 45827 -190 -4070 52336 -34195 54960 125126 -46945 34631
101 34631 120295 -4547 60964 98415 -15240 26110 113509 61244 -16260 44946 103994 -29346
113 -29346 28355 125450 -85017 -25904 144506 -30229 -65725 53755 -909 -42839 -41
$$ packed form
0@%%%%%%%%%%%qJ6j6J6k2L0l2M0m8N6p2Q8j04J20j36J58j83K09k41K75l12L55
33A89m02M53n10N73o42P17q01Q90r86J095j213J341j481J634j801J982k182K404
51A260k648K918l221L559l940M378m878N460o150O979p997R282j0959J3242j6548
66i263K1767l1176N3067j87108q2187M17813k84563p9221K11087r8539r7861J19035
78d7149M7109j01938n2712J61967l8294q3756J13497o7573k2289J29005n8669
89b0802k0393K3769R391N3862m6017l880N6406q6531Q9155P0166j72071Q1576
101C4631Q5664j24842O5511L7451j13655M1350Q7399n2265p7504O1206N9048j33340
113b9346N7701R7095k10467N9113J70410j74735l5496J19480n4664m1930M2798
$$ plain form
124 -41 19930 -49906 -75148 50530 -11131 -105840 11593 -13981 -66642 12504 -20352 -69897
136 -69897 -19254 6245 -15553 -47512 -13260 6727 -47562 17502 26454 -68141 18591 56844
148 56844 -42514 3227 44288 -25103 11720 61814 3617 -27463 40813 58947 -28597 20156
160 20156 67476 -40772 9867 82228 -30862 -18404 62549 4566 -13168 16347 13044 -14674
172 -14674 -12399 45441 -12814 -53775 37284 5720 -49523 18619 8040 -43769 -2912 17114
184 17114 -24706 -39641 17611 10360 -48149 11461 12374 -49690 13387 26452 -38852 -1457 20927
197 20927 -22107 271 19245 -7476 -9587 23471 14081 -25765 15151 27900 -23052 10021
209 10021 36897 -23404 -7649 40677 -2137 -16613 19564 16822 -20602 -1716 30745 -19339
$$ packed form
124d1J9971o9836k5242J25678o1661r4709J17433k5574n2661P9146l2856m9545
136f9897N0643K5499k1798l1959L4252J9987n4289O5064Q952r4595Q6732L8253
148E6844r9358M5741M1061o9391L6823N0094n8197l1080O8276J8134q7544M8753
160B0156M7320j08248N0639P2361j13090J2458Q0953n7983j7734K9515l303k7718
172a4674K275N7840n8255m0961R1059l1564n5243O8142j0579n1809M0857K0026
184A7114m1820j4935N7252p251n8509N9610R13o2064O3077J3065o5304L7395K2384
197B0927m3034K2378J8974k6721k111L3058r390l9846M0916J2749n0952L3073
209A0021K6876o0301J5755M8326m2814j4476L6177k742l7424J8886L2461n0084
$$ plain form
221 -19339 -18746 34253 -6080 -31830 22308 2729 -30275 10365 8510 -25538 -11315 17032 -13358
234 -13358 -23952 18238 -4138 -28832 12996 7586 -30364 5505 16286 -21405 -3044 18597
246 18597 -6832 -12273 22711 5360 -19736 18634 17883 -18159 8938 29168 -14939 -819 33255
259 33255 -2135 -10345 26027 13266 -18773 14864 23990 -15307 904 28419 -6820 -15006 25981
272 25981 2345 -19798 15401 10576 -22187 -418 18309 -18134 -9659 19042 -10017 -21983
284 -21983 13005 810 -27578 7938 9027 -25706 -6078 14416 -17180 -15471 18441 -7101
296 -7101 -22368 9094 4705 -22783 2654 17079 -18287 -6675 17696 -8059 -14212 18959 4827
309 4827 -18591 11851 11451 -16061 2861 22573 -8665 -6840 22582 -2783 -13407 18260 10961
$$ packed form
221a9339N93N2999m0333k5750N4138j9579l3004M0640j855l4048J4223K8347l0390
234a3358j0594M2190k2376k4694M1828n410l7950L5869J0781l7691J8361K1641
246A8597k5429n441L4984j7351k5096L8370p51l6042K7097K0230m4107J4120L4074
259C3255l5390q210L6372j2761l2039L3637R126l9297J6211K7515l5239q186M0987
272B5981k3636k2143L5199m825l2763K1769J8727l6443Q475K8701k9059j1966
284b1983L4988j2195k8388L5516J089l4733J9628K0494l1596J709L3912k5542
296g101j5267L1462m389k7488K5437J4425l5366J1612K4371k5755o153L3171j4132
309D827k3418L0442m00k7512J8922J9712l1238J825K9422k5365j0624L1667p299
$$ plain form
322 10961 -15998 9486 16912 -15687 -786 21045 -5519 -11648 19088 200 -20257 11934
334 11934 9661 -17815 811 15734 -16604 -11612 16754 -6694 -18301 11451 3056 -24823 3610
347 3610 10913 -20099 -3905 14746 -11964 -15675 13565 -1435 -17651 10031 9176 -18590 415
360 415 18945 -13141 -5096 21236 -3908 -10839 16634 7689 -12976 10718 18247 -8189 -920
373 -920 21792 -1433 -8145 24290 3539 -12841 17109 10295 -10158 6815 14046 -6986 -2919
386 -2919 15352 -1555 -15927 14280 6707 -22240 9424 6714 -21409 3399 9922 -16715 -10404
399 -10404 8302 -5665 -16698 3806 3445 -24908 1705 15391 -27393 -5665 18361 -15671
411 -15671 -10914 13128 -4142 -13819 8135 14165 -11603 -9556 23641 -1905 -12212 25148 -832
$$ packed form
322A0961k6959K5484P426l2599J4901K1831k6564o129L0736j8888k0457L2191
334A1934k273k7476J8626J4923l2338M992K8366k3448j1607K9752q395k7879K8433
347C610P303l1012J6194J8651k6710l711K9240j5000j6216K7682q55k7766J9005
360D15J8530l2086Q045K6332k5144o931K7473q945k0665K3694P529k6436P269
373i20K2712k3225o712L2435k0751j6380K9950o814k0453J6973P231k1032M067
386b919J8271j6907j4372L0207p573k8947L1664k710k8123K4808O523k6637O311
399a0404J8706j3967j1033K0504l61k8353K6613J3686m2784K1728K4026l4032
411a5671M757K4042j7270r677K1954O030k5768K047L3197k5546j0307L7360k5980
$$ plain form
424 -832 -12240 21529 7714 -8961 8601 11788 1658 -918 12296 2098 -16012 23084 9846
437 9846 -26371 15579 6761 -20802 12744 5171 -19837 -610 6680 -5708 -16899 29 6068
450 6068 -23732 6126 9541 -36724 1082 20351 -21595 -9380 10340 -7293 -9634 5015 13254
463 13254 -14554 -10279 33831 -3608 -19310 26475 5211 -7216 25898 7992 -8860 13660
475 13660 19250 9293 -512 15407 11200 -5900 26744 8525 -18784 24398 13406 -12621 14067
488 14067 -2376 -9753 13831 -536 -5390 -11909 -5398 7576 -18015 -4599 -782 -30163 2245
501 2245 6348 -34326 -11357 2439 -13972 -12283 -9726 -2879 -22807 -9585 24806 -25303 -26792
514 -26792 27819 -7456 -17776 22398 -6446 -11797 20883 11461 -4391 -1112 20737 12115 -1712
$$ packed form
424h32j1408L3769j3815j6675J7562L187j0130k576J3214j0198j8110L9096j3238
437I846l6217M1950q818k7563L3546p573k5008J9227P290j2388j1191J6928O039
450F068k9800K9858L415m6265L7806J9269m1946J2215J9720j7633k341J4649Q239
463A3254k7808M275M4110l7439j5702M5785k1264j2427L3114j7906j6852K2520
475A3660N590r957r805J5919m207j7100L2644j8219k7309M3182j0992k6027K6688
488A4067j6443p377K3584j4367m854o519O511J2974k5591J3416L817k9381L2408
501B245M103m0674K2969J3796j6411J689K557O847j9928J3222L4391n0109j489
514b6792N4611l5275j0320M0174k8844n351L2680r422j5852L279K1849q622j3827
$$ plain form
527 -1712 23954 5712 -7549 34561 15244 -8383 20731 6488 8395 20908 -2241 6335 5707
540 5707 5569 15756 -11000 -1519 12329 -14334 6308 6080 -29706 -1210 9037 -14485 -16516
553 -16516 -8934 -2150 -22468 -9701 10028 -37498 -22004 24869 -26089 -30241 13024 -16332 -18641
566 -18641 6735 -6481 -18740 -7938 12032 -1222 -15986 7071 3756 -7085 15720 4922
578 4922 -6617 12845 8786 10818 7644 -665 17538 12563 6656 14535 678 10039 19418 -630
592 -630 13952 10173 -11111 18128 15251 -11619 233 12881 1644 -12027 5203 6845 -23936
605 -23936 1177 20026 -29304 -15444 16131 -16958 -14624 3657 -10684 -17686 -5543 2115 -14597
618 -14597 -17764 4417 -4857 -16552 1959 -6779 -11723 4495 -928 -5110 -4596 -170 4702 -1487
$$ packed form
527a712K5666j8242j3261M2110j9317k3627K9114j4243J907J2513k3149Q576o28
540E707j38J0187k6756R481J3848k6663K0642k28l5786K8496J0247k3522k031
553a6516P582O784k0318J2767J9729m7526J5494M6873n0958m152M3265k9356k309
566a8641K5376j3216j2259J0802J9970j3254j4764K3057l315j0841K2805j0798
578D922j1539J9462m059K032l174q309J8203m975n907P879j3857R361R379k0048
592f30J4582l779k1284K9239k877k6870J1852J2648j1237j3671J7230J642l0781
605b3936K5113J8849m9330J3860L1575l3089K334J8281j4341p002J2143P658j6712
618a4597l167K2181r274j1695J8511q738m944J6218n423m182N14M426M872o189
$$ plain form
632 -1487 2664 4411 -3877 9377 8596 -7150 12253 8518 -5246 15344 8984 -7538 7880 16974
646 16974 266 -3184 13573 6619 -10300 11834 14189 -16476 4200 15846 -10419 -4369 8277
659 8277 -1959 -7581 1977 2686 -10803 -6955 8062 -6723 -11926 4762 -6280 -10101 1658 -2818
673 -2818 -9326 -3227 1068 -6621 -5989 1694 -3511 -6546 5325 -2646 -8927 7022 223 -6224 6076
688 6076 2806 -6611 4145 8289 -4413 -318 10293 1061 -5685 10567 5823 -8218 8652 9922
702 9922 -7029 1044 11747 -1971 -3732 9740 2827 -7500 4007 8952 -7856 -1308 9935
715 9935 -5373 -5614 6827 -841 -7904 3990 2149 -8149 -1278 3775 -5502 -4402 5409 -4808
729 -4808 -6837 4435 -2101 -7096 3191 1665 -8237 767 3843 -6467 -1827 6602 -3029 -6267
$$ packed form
632a487M151J747q288J3254p81j5746J9403l735j3764K0590o360j6522J5418R094
646A6974j6708l450J6757o954j6919K2134K355l0665K0676J1646k6265O050J2646
659H277j0236n622R558P09j3489L848J5017j4785n203J6688j1042l821J1759m476
673b818o508O099M295p689O32P683n205l035J1871p971o281J5949o799o447J2300
688F076l270r417J0756M144j2702M095J0611r232o746J6252m744j4041J6870J270
702I922j6951Q073J0703j3718j761J3472o913j0327J1507M945j6808O548J1243
715I935j5308k41J2441p668p063J1894j841j0298O871N053r277J100R811j0217
729d808k029J1272o536m995J0287j526r902R004L076j0310M640Q429r631l238
$$ plain form
743 -6267 6858 313 -7316 5389 5290 -7002 407 8215 -4848 -2919 8898 347 -6363 5985
757 5985 4592 -7811 3101 7879 -5355 -2176 7801 -2278 -5762 7289 1598 -6645 3050 4275
771 4275 -6811 -457 6923 -4698 -3281 5762 -1862 -6219 4703 2403 -6807 2301 4086 -6066
785 -6066 -1626 6716 -2968 -4439 6827 -462 -6057 4480 4170 -5867 1714 6463 -5020 -1666
799 -1666 6936 -618 -4499 6475 2389 -6644 3895 4988 -5149 430 6833 -4156 -3279 6235
813 6235 -936 -4720 3821 2745 -7218 583 5174 -6339 -2266 5840 -3830 -6327 4836 -839 -6904
828 -6904 2233 2341 -6151 -2710 4787 -4047 -4555 5249 -1403 -6274 3669 1948 -6334 2726 3746 -4076
844 -4076 -279 4337 -875 -3038 5979 2340 -4977 3798 5025 -4562 2378 6660 -4134 778 4925
$$ packed form
743f267J3125o545p629J2705r9j2292P409P808j3063J929J1817q551o710J2348
757E985j393j2403J0912M778j3234L179R977j0079l484J3051n691q243R695J225
771D275j1086O354P380j1621J417R043p624m357J0922k300r210R108J785j0152
785f066M440Q342r684j471J1266p289n595J0537l10j0037P581M749j1483L354
799a666Q602p554l881J0974m086r033J0539J093j0137N579O403j0989Q77R514
813F235p171l784Q541j076r963P801M591j1513M073Q106r670k497J1163n675o065
828f904R137J08q492L441P497q834n08R804o652m871R943j721q282R060J020p822
844d076L797M616n212k163R017l639p317Q775J227r587O940M282j0794M912M147
$$ plain form
859 4925 -980 -1229 2961 2467 -3296 1281 3390 -4813 -900 5943 -4606 -3553 4580 -4078 -3250 2009
875 2009 -621 -4160 -2165 2527 -3488 -4929 3417 -1304 -5972 4340 -1226 -6666 4352 1145 -3484
890 -3484 796 2114 -1498 -1374 5064 1740 -4763 4577 6109 -5982 3460 6261 -3777 3386 4568
905 4568 -1019 -139 2259 3841 -169 -1173 4079 -2077 -1818 6254 -4328 -2746 4270 -3292 -1955
920 -1955 -530 -2370 -1591 -2344 141 -2475 -7211 1960 -651 -6806 2915 -4230 -6109 4524 -2822
935 -2822 -4897 1878 -615 -2072 263 879 -554 -2876 5730 3827 -6804 4712 5129 -2756 5427
950 5427 3716 -751 3344 2993 4731 2015 -1735 7785 2456 -1649 6477 -1273 414 6221 -781
965 -781 0 246 -854 2540 -1425 -778 -539 -4892 2941 -2300 -6343 2860 -6068 -3325 4310 -9177
$$ packed form
859D925n905k49M190m94n763M577K109q203L913O843j0549J053Q133q658Q28N259
875B009k630l539J995M692o015j441Q346m721m668J0312n566n440J1018l207m629
890c484M280J318l612J24O438l324o503R340J532j2091R442K801j0038P163J182
905D568n587Q80K398J582m010j004N252o156K59Q072j0582J582P016p562J337
920a955J425j840P79p53K485k616m736R171k611o155R721p145j879J0633p346
935b822k075O775k493j457K335O16j433k322Q606j903j0631J1516M17p885Q183
950E427j711m467M095l51J738k716l750R520n329m105Q126p750J687N807p002
965g81P81K46j100L394l965O47K39m353P833n241m043R203q928K743P635j3487
$$ plain form
981 -9177 -5795 4136 -4505 -4984 -339 -2584 -4499 -3211 4481 -3390 -8781 6192 765 -6597 3316
996 3316 1289 -2242 2533 2229 2158 -1917 700 9848 -1116 -1151 8370 -414 1831 7695 963 1088
1012 1088 4172 3795 3403 81 3455 3065 -102 5746 -1011 -1826 5229 -1803 1178 3059 -6416 373
1028 373 4399 -5452 -1777 943 -3059 -2878 -1670 765 -6107 -4634 4414 -3643 -7447 863 -1180
1043 -1180 -4310 -550 -851 -2156 -4798 905 3668 -6958 -601 5235 -4383 -514 4850 -2875 -766
1058 -766 4887 863 -450 392 3288 1687 1028 3816 -812 1482 4396 -543 2641 3095 -2772 4237
1074 4237 4065 -4272 2379 3177 -748 69 1027 1288 -3273 -192 5147 -3059 -5137 4301 -208 -4948
1090 -4948 688 1353 -2970 -4360 3581 -164 -8682 2656 3858 -7748 -681 3923 -5893 -1623 3678
$$ packed form
981i177L382R931q641m79M645k245j915J288P692p871n391J4973n427p362R913
996C316k027l531M775l04p1m075K617R148j0964l5R521q784K245N864o732J25
1012A088L084l77l92l322L374l90l167N848o757q15P055p032K981J881r475O789
1028C73M026r851L675K720m002J81J208K435o872J473R048q057l804Q310k043
1043a180l130L760l01j305k642N703K763j0626O357N836r618L869N364p725K109
1058g66N653m024j313Q42K896j601o59K788m628K294K914m939L184M54n867P009
1074D237j72q337O651P98l925Q17R58K61m561L081N339q206k078R438m509m740
1090d948N636O65m323j390P941l745q518J1338J202j1606P067M604r816M270N301
$$ plain form
1105 3678 -1490 -3422 -192 2561 -2087 -1377 2650 -851 -675 2217 -487 139 1390 -294 3386 577
1121 577 -1730 2801 1630 904 832 1458 2249 -976 828 4847 -1694 -1837 6054 -22 -3583 2629 2933
1138 2933 -2607 -954 5007 -2102 -5152 4631 1648 -6333 1700 2755 -5427 -820 2222 -2382 -3221
1153 -3221 1020 635 -4125 -1303 1259 -2212 -1683 1205 -2043 -1917 702 -927 -501 -243 -479 -427 253
1170 253 424 -1288 812 2095 -1443 -196 3509 -1518 -838 5001 -145 -2370 3295 2663 -2451 1166
1186 1166 4525 -1700 -1298 4642 559 -3439 3620 2633 -3338 909 2833 -1765 -1350 3083 -165 -3096
1202 -3096 1298 1236 -2782 -410 1995 -2642 -1380 1588 -1822 -1927 985 -409 -2652 370 -184 -2541
1218 -2541 128 923 -2296 -1172 1757 -2018 -1401 2145 -611 -1947 1476 995 -2758 947 2456 -1536
$$ packed form
1105C678n168j932L230K753m648P10M027l501J76K892k704O26J251j684L680k809
1121E77k307M531j171p26p2O26P91l225J804M019o541j43P891o076l561O212L04
1138B933n540J653N961p109l050R783k983p981Q033J055q182M607L042m604q39
1153c221M241l85m760K822K562l471N29K888l248J26K619j629M26K58k36N2O80
1170B53J71j712K100J283l538J247L705n027O80N839n146k225N665o32n114L617
1186A166L359o225M02N940m083l998P059r87n971M247J924m598M15M433l248k931
1202c096M394o2m018K372K405m637J262K968l410j05K912j394k243L022n54k357
1218b541K669P95l219J124K929l775O17L546k756j336L423m81l753L705J509l992
$$ plain form
1234 -1536 -525 2746 -397 -1967 3183 1302 -1983 1540 2406 -1598 -124 3526 -462 -839 2691
1249 2691 754 -1957 1744 2336 -1793 845 2147 -1389 -817 2570 -84 -1632 2183 322 -2098
1264 -2098 748 1720 -1924 -119 2257 -1900 -1350 1737 -205 -1948 1449 556 -2566 223 1110 -1506
1280 -1506 -1059 2014 -1018 -2317 1502 -116 -2106 810 1085 -2406 -421 1255 -1361 -978 1439 18
1296 18 -2285 1363 654 -2379 1094 1610 -1935 -222 2265 -1518 -611 2376 159 -1532 1311 2014
1312 2014 -2051 772 2986 -1319 -310 2948 -272 -1080 2526 899 -662 715 1523 -318 -554 2559
1328 2559 -207 -1393 2008 268 -1784 1309 551 -1707 556 446 -1110 -1291 814 -214 -2367 977
1344 977 -479 -2966 1009 448 -3386 245 679 -2804 -285 623 -1353 -1834 956 531 -3152 385
$$ packed form
1234a536J011L271l143j570N150j881l285L523Q66m004J474L650l988l77L530
1249B691j937k711L701N92m129K638J302l536N72L387k654j548L815j861k420
1264b098K846R72l644J805K376m157N50L087j942j743L397q93l122K789Q87k616
1280a506M47L073l032j299L819j618j990K916K75l491J985J676k616L83K417j421
1296A8k303L648p09l033L473N16l545J713K487l783R07K987k217j691K843P03
1312B014m065K823K214m305J009L258l220q08L606j627j561J377Q08j841k36L113
1328B559k766j186L401j740k052L093p58k258K263j10j556j81K105j028k153L344
1344I77j456k487L975n61l834L631M34l483K519R08j976m81K790m25l683L537
$$ plain form
1360 385 1900 -2303 -249 2229 -2039 -761 2328 11 -604 390 1487 -313 -161 2690 -519 -820
1376 -820 3392 322 -1781 2775 1010 -728 2014 969 -703 -176 2422 681 -1620 1734 702
1391 702 -1761 1848 575 -2573 1608 780 -1722 168 -554 -724 -233 316 -568 -2544 -286 1070 -2073
1408 -2073 -843 682 -2462 -184 492 -1910 -951 -244 510 -932 -1300 353 -1327 -269 2730 -1930
1424 -1930 -2064 3073 -737 -904 2118 -132 -735 1254 2042 -828 -1076 2753 1307 -1151 2134 73
1440 73 -1542 3255 955 -987 578 366 853 67 78 263 -992 905 1462 -2642 -572 1262 -1257
1457 -1257 365 -554 -1933 -710 95 124 -1897 -1318 313 -1618 -594 1141 -3739 -779 2993 -2629
1473 -2629 -1758 1068 -833 -1084 988 591 -2353 -1030 3037 11 -2531 2033 171 -871 2157 62
$$ packed form
1360C85J515m203K054K478m268J278L089k317o15R94J097j800J52K851l209l01
1376h20M212l070k103M556j765j738K742j045j672N27K598j741k301L354j032
1391G02k463L609j273l148M181q28k502J890p22j70M91N49q84j976K258J356l143
1408b073J230J525l144K278O76k402R59P07P54j442l68J653j680J058K999m660
1424a930j34N137l810j67L022k250o03J989P88k870k48L829j446k458L285k061
1440G3j615M797k300j942J565k12M87p86J1J85j255J897N57m104K070J834k519
1457a257J622r19j379J223Q05K9k021N79J631j931J024J735m880K960L772n622
1473b629Q71K826j901k51K072l97k944J323M067l026k542M564j862j042L028k095
$$ plain form
1489 62 -697 319 1630 1427 -1202 15 2266 -384 730 1977 -1850 485 2175 224 59 -470
1505 -470 435 882 247 81 -607 -5 1286 -829 54 489 -2593 1916 1945 -3559 -253 1751 -1438 -418
1523 -418 1209 -894 -1875 363 2230 -2084 -2139 2798 -684 -1576 1167 -653 -1070 635 1231 -319 -2266
1540 -2266 676 1996 -2176 598 1419 -2465 844 1597 -1259 -610 465 745 75 -723 -28 -243 275
1557 275 1168 -1252 90 320 -1551 2099 393 -2669 1335 1431 -1767 134 815 -500 -394 786 1103
1574 1103 -2342 -503 2949 -1020 -1253 1429 -221 -1119 840 1160 -922 -1264 2051 802 -2847 1245
1590 1245 1307 -1982 934 1047 -1738 -607 1122 141 -699 -551 349 -367 -567 264 -803 -78 -228 -523
1608 -523 531 -1101 -1184 1368 -14 -1826 438 222 -852 -94 516 36 -1552 587 1544 -1503 -722
$$ packed form
1489F2p59J016J311k03k629J217K251k650J114J247l827K335J690j951j65n29
1505d70R05M47o35j66o88O02J291k115Q83M35l082M509K9n504L306K004l189J020
1523d18J627k103r81K238J867m314n5M937l482q92K743j820m17J705N96j550j947
1540b266K942J320m172K774Q21l884L309P53k856O49J075K80o70p98O95k15N18
1557B75Q93k420J342K30j871L650j706l062M004R6l198J901O81j315J06J180L17
1574A103l445J839L452l969k33K682j650q98J959L20k082l42L315j249l649M092
1590A245O2l289K916J13k785J131J729r81q40J48R00p16k00Q31j067P25j50k95
1608e23J054j632q3K552j382j812K264k16j074P58O10m80j588K139R57l047P81
$$ plain form
1625 -722 1939 -139 -1341 1392 634 -1217 160 2145 -491 -1713 2093 693 -1584 1037 1211 -1277
1641 -1277 191 1403 -334 -479 337 812 -444 -427 670 -175 -171 111 90 -326 -373 -46 513 -387 -801 529
1661 529 -115 -480 -239 435 -61 -1028 462 451 -1194 -298 1582 -686 -1115 1202 57 -1171 333 1337
1679 1337 -1162 -707 1401 -301 -1237 851 770 -1241 90 637 -635 -534 610 364 -977 26 254
1696 254 -536 -290 386 -113 -483 137 -339 -218 -81 0 -41 -34 -243 -522 347 62 -410 286 362 -704 -191
1717 -191 944 -496 -238 935 94 -852 510 781 -779 276 925 -298 -609 849 283 -655 664
1734 664 526 -467 -169 722 -68 -286 699 118 -525 84 473 -569 119 546 -544 -144 244 -293 -496
1753 -496 394 -54 -620 97 8 -625 -51 504 -704 -308 463 -561 -356 385 -131 -620 332 101 -584 28
$$ packed form
1625g22K661k078j202K733p58j851J377J985k636j222L806j400k277K621J74k488
1641a277J468J212j737j45Q16M75j256J7J097q45MK82k1m16m7L27N59r00m14J330
1661E29o44l65K41O74m96r67J490j1j645Q96J880k268m29K317j145j228J504J004
1679A337k499M55K108j702r36K088q1k011J331N47j272J01J144k46j341J003K28
1696B54p90K46O76m99l70O20m76J21J37Q1m1Pk09k79Q69k85m72O96P6j066N13
1717a91J135j440K58J173q41r46J362K71j560J055O49j223l11J458n66r38J319
1734F64j38r93K98Q91p90k18R85n81o43O09L89j042O88M27j090M00L88n37k03
1753d96Q90m48n66P17q9o33N74N55j208L96P71j024K05P41n16m89R52k31o85O12
$$ plain form
1773 28 392 -134 -453 548 -143 -400 592 148 -259 97 290 -147 49 228 86 -240 375 386 -692 503
1793 503 461 -588 248 366 -562 -113 770 -175 -548 205 301 -653 118 725 -947 -59 683 -642 -323 391
1813 391 -145 -313 256 -160 -465 -206 614 -36 -727 455 -110 -203 412 20 -334 194 248 -33 -75 -15 504
1834 504 -36 447 105 -806 951 607 -477 397 392 -499 531 791 -238 -178 549 939 -615 73 752
1853 752 -596 685 906 -782 -386 723 211 192 -87 -56 43 -177 798 -534 -882 853 152 -553 -88
1872 -88 -303 -226 480 8 -291 -857 -92 749 -640 -41 -299 -598 924 -145 -1106 307 185 -168 579
1891 579 -577 -546 116 712 720 -1102 70 714 -263 772 197 -992 813 943 -260 169 -302 592 617
1910 617 163 588 -1084 288 1732 -372 -544 519 -193 451 619 -449 -251 -216 1155 320 -1384 327
$$ packed form
1773B8L64n26l19J001o91k57R92m44m07L56J93m37J96J79j42l26O15J1j078J195
1793E03m2j049Q36J18r28M49Q83r45l73P53R6r54P71O07j672Q88P42j325L19P14
1813C91n36j68N69m16l05K59Q20o50o91J182n65r3O15l92l54N28N4k81m2O0N19
1834E04n40M83l42r11J757l44j084Q74nq91J030K60j029O0P27L90j554O88O79
1853G52j348J281K21j688L96J109n12j9k79L1R9k20R75j332l48J735p01p05M65
1872h8k15P7P06m72k99n66P65Q41j389N99k58k99J522j069r61J413j22l53P47
1891E79j156L1O62N96Qj822J172O44r77J035n75j189J805J30j203M29m71Q94K5
1910F17m54M25j672J372J444k104j72J063p12O44J68j068J98L5J371q35j704J711
$$ plain form
1928 327 86 -108 818 -752 -1209 717 236 -250 -471 -955 319 -123 70 -186 -1520 271 764 -854
1946 -854 -353 -469 -729 1044 -277 -1122 -234 -291 678 -56 -744 -256 -673 791 887 -1532 -283 1065 -389
1965 -389 440 -28 -720 560 585 826 -494 -930 1180 771 -233 543 -432 -104 1462 151 -210 -142 253
1984 253 1352 -225 -301 370 -358 908 870 -1178 -146 418 124 896 -921 -661 760 -151 71 -395
2002 -395 -620 233 -106 192 -241 -1774 617 997 -1318 -10 -388 -806 473 -63 -372 -870 -490 1091
2020 1091 -430 -1335 657 -270 -399 761 -665 -651 -68 664 511 -1188 -35 872 -525 399 601 -1046
2038 -1046 477 820 -90 186 -515 703 979 -279 248 238 -42 846 462 114 126 -206 1323 450 -820
2057 -820 855 414 -84 618 14 -185 85 389 722 -693 -678 1144 -317 -454 475 -516 -459 162 315
$$ packed form
1928C27k41j94R26j570m57J926m81m86k21m84J274m42J93k56j334J791M93j618
1946h54N01j16k60J773j321q45Q88n7R69p34o88M88m17J464R6k419J249J348j454
1965c89Q29m68o92J280K5K41j320m36K110m09j004P76r75L28J566j311l61O8L95
1984B53J099j577p6O71p28J266l8k048J032N64k94P72j817K60J421r11K22m66
2002c95k25Q53l39K98m33j533K391L80k315J308l78m18J279n36l09m98L80J581
2020A091j521r05J992r27j29J160j426J4N83P32j53j699J153R07j397R24K02j647
2038a046J523L43r10K76p01J218K76j258N27j0k80Q88l84l48J2l32J529q73j270
2057h20J675m41m98P02o04j99K70L04L33j415J5J822j461j37R29r91N7O21J53
$$ plain form
2076 315 -639 -897 335 286 -1193 -26 131 -1027 230 93 -676 -530 -246 239 -215 -716 -9 48 -482
2095 -482 160 -31 -318 -28 25 483 -430 -322 722 92 -380 419 231 -167 341 380 258 -398 251 876
2115 876 -468 12 781 -44 -294 491 219 -455 99 647 -82 -725 521 195 -639 161 194 -408 -260 199
2135 199 -122 -373 -222 268 -259 -540 149 -176 -423 -51 54 -218 -416 21 123 -249 -269 330 -111 -321
2155 -321 106 145 -46 -228 384 154 -388 106 549 -174 -134 606 83 -322 306 427 -109 -100 620 -62 -328
2176 -328 357 378 -192 -61 411 -119 -165 80 249 -131 -105 282 -155 -279 129 172 -169 -28 79 -174 -155 -28
2198 -28 181 -218 -119 52 -4 -163 -122 216 -19 -214 6 158 -291 -100 386 -209 -247 96 103 -257 -9 241
2220 241 -130 -176 127 121 -216 121 226 -125 -74 35 143 -148 135 240 -110 -8 259 45 -113 271 -3
$$ packed form
2076C15r54k58J232m9j479J167J57j158J257j37p69J46K84M85m54n01P07N7n30
2095d82O42j91k87K90N3M58r13J08J044o30m72P99j88l98N08L9j22o56O49O25
2115H76j344M80P69q25k50P85k72o74N54N48p29o43J246l26q34Q00L3o02J48M59
2135A99l21k51J51M90n27k81O89l25k47L72J05k72j98M37J02l72k0N99m41k10
2155c21M27L9j91j82O12k30n42M94M43p23M0P40n23m05O28J21n36RP20o82k66
2176c28O85K1n70J31M72n30m6K45J69l80K6L87m37j24M08M3l41J41J07k53J9J27
2198b8K09l99R9J71n6j59M1L38k35j95K20J52m49J91M86n95l8L43Pl60K48K50
2220B41l71m6L03ol37L37J05l51N1J09J08k91K83J05l50J02K67k14j58L84k74
$$ plain form
2241 -3 -22 118 31 16 -42 146 -16 -1 3 -57 53 75 -209 -64 123 -325 7 15 -282 -26 -12 -40 -249 -159 -68 -61
2267 -61 -179 -73 -161 -203 191 -180 5 -133 -220 155 -60 34 25 -34 124 119 -162 119 186 -56 345 -24 -87 -21
2291 -21 169 279 -171 109 120 -109 212 260 -475 129 314 -262 133 -178 -143 182 57 27 -288 -283 170 16
2313 16 -269 -31 -262 51 45 -335 115 -290 -42 382 -354 -382 33 -137 244 -35 -597 163 -33 10 198 -456
2335 -456 -74 146 97 121 -407 -96 487 -165 158 -67 -540 585 275 -370 149 -316 164 454 -242 -66
2355 -66 -23 -47 658 -123 -358 285 62 546 5 -484 438 12 187 453 -618 -114 578 -69 304 -352 -421
2376 -421 775 -109 -138 83 -542 464 453 -349 -44 -344 199 698 -529 9 -13 -303 916 -226 -625
2395 -625 403 -37 367 239 -664 306 260 84 622 -706 -227 839 -30 242 -234 -295 695 100 14 89
$$ packed form
2241cj9J40q7j5n8J88j62J5Mo0J10K2k84J45J87m48L32Qk97K56J4k8k09R0R1P
2267f1j18J06q8m2L94l71J85j38q7L75k15R4rn9J58nk81K81O7k42M01l69o3O6
2291b1J90J10m50K80J1k29L21M8p35O04J85n76L95l11L5L25j25l0l15NM53j54
2313A6k85K38k31L13ol80M50m05K48M24p36k8M15j70L81k79n62P60j96M3J88o54
2335d56L82K20m9K4n28L11N83o52L23k25m73J125l10o45N19m65M80K90o96J76
2355f6M3k4P05p81k35O43k23M84n41m89R22m26J75K66j071N04O92o47L73o56o9
2376d21J196q84k9K21o25J006j1q02L05l00N43M99j227N38k2k90J219j142l99
2395f25J028m40M04j28r03R70m6j76N38j328M79J066q69K72m76o1R90n95q6P5
$$ plain form
2415 89 -714 545 653 -699 189 -214 -159 921 -447 -413 54 -263 622 -132 -811 318 -210 103 431
2434 431 -1032 -24 255 -240 347 -796 -451 763 -238 -97 -132 -729 609 233 -379 195 -700 347
2452 347 728 -616 59 19 -114 689 -210 -443 286 -139 780 127 -865 574 137 105 615 -582 -29 623
2472 623 70 358 -373 -334 851 -153 44 237 -740 630 511 -399 70 -349 133 666 -528 -181 186
2491 186 -327 614 -92 -511 204 -262 450 26 -868 176 152 -284 347 -507 -298 343 -202 261 -439 -424
2511 -424 637 -181 -299 213 -406 22 515 -277 -133 -255 184 614 -488 60 341 -296 417 293 -332
2530 -332 141 267 335 284 -558 439 411 -156 507 -69 -250 367 225 100 -39 -204 457 89 -322 353 -139
2551 -139 -46 305 -172 -106 -298 56 294 -483 -354 257 -366 -101 188 -419 -212 -155 122 -108 -531 88 181
$$ packed form
2415H9q03J259J08j352Q88m03N5J080j368L4M67l17Q85p54o79J129n28L13L28
2434D31j463J008K79m95N87j143L45J214j001J41l5n97J338l76o12N74q95J047
2452C47L81j344O75m0j33Q03q99k33P29m25R19o53r92J439m37l2N10j197N53O52
2472F23n53K88p31L9J185j004J97J93r77J370j19r10M69m19M82N33j194L47L67
2491A86n13R41p06m19P15m66P12m24q94J044k4m36O31q54K09O41n45M63p00J5
2511d24J061q18j18N12o19M28M93p92J44j22M39M30j102N48K81o37P13j24o25
2530c32M73J26O8n1q42R97k8n67O63n76j81O17j42j25j39j65O61l68m11O75m92
2551a39R3L51m77O6j92L54K38p77J29O11o23K65K89o07K07N7K77k30m23O19R3
$$ plain form
2572 181 -445 -7 151 -333 68 181 -51 -185 -157 393 -12 -234 343 60 -87 279 183 22 83 165 369
2593 369 -30 -32 462 -12 36 213 109 25 39 215 91 -223 115 296 -303 -42 285 -114 -115 21 62 -289 -188
2616 -188 198 -100 -407 84 60 -423 -12 42 -302 -164 42 -5 -352 -86 104 -86 -210 76 5 -200 11
2637 11 25 27 -146 38 128 -179 -27 150 87 -166 80 98 -55 -16 216 136 -252 202 236 -56 -25 231 115 -110
2661 -110 130 182 -82 29 239 64 -179 167 118 -133 -52 182 -79 -170 103 36 -139 -176 127 -114 -217 17
2683 17 18 -110 -153 76 -183 -190 -60 14 -152 -208 43 -153 -180 -111 16 -97 -140 51 -46 -170 20 132 -27 -30 100
2708 100 52 -40 69 212 -46 91 182 81 53 44 215 76 4 153 163 6 109 258 -14 68 156 149 -46 19
2732 19 215 -10 -92 145 5 -168 109 28 -63 -87 -130 53 -88 -119 -27 -170 -173 -1 -81 -147 -115 -209 58 -189 -165
$$ packed form
2572A81o26M38J58m84M01J13k32j34K8N50m05k22N77k83j47L66r6j61O1Q2K04
2593C69l99kM94m74M8J77j04q4J4J76j24l14L38J81n99K61L27l99jJ36M1l51J01
2616a88L86k98l07M91k4m83M11N4l44J38K06m7l47K66J90j90j24K86p1k05K11
2637A1J4Kj73J84R0l07J52J77o3k53K46J8j53L9K32q0l88M54L4k92L1K56j16k25
2661a10K40N2k64J11K10j75k43L46m9k51Q1K34k61r1K73o7j75l7L03k41j03K34
2683A7Jj28m3K29k59pJ30P4j66n6K51j96k7O9J27j13m3J91r7j24J90J12j59lJ30
2708A00m8r2J09J43k58J37R1j01k8rJ71j39p2J49J0j57J03J49k72Q2Q8pj95O5
2732A9J96k25q2K37j40j73K77q1r1k4m3J83j41l1R2j43lJ72q0o6L2r4K67k47K4
$$ plain form
2757 -165 0 -231 -30 -5 -291 -32 -133 -131 134 -134 -94 125 -143 153 68 -233 191 104 45 31 -132 213 163
2780 163 -24 228 -36 -76 418 -64 149 149 -238 367 101 -186 207 21 84 296 -163 117 64 -143 393 -217
2802 -217 -201 198 -164 191 50 -323 209 -20 -205 231 -434 -43 377 -307 106 -124 -305 339 -79 -85 48
2823 48 -294 193 142 -348 178 -213 -69 348 -447 -8 117 -246 450 -172 -462 386 -115 1 234 -472 184
2844 184 105 -170 310 -351 -55 381 -249 22 -76 -326 507 -117 -281 282 -374 222 385 -521 182 -48 -97
2865 -97 483 -311 -169 297 -152 425 22 -514 361 -36 41 240 -494 213 314 -151 339 -315 -312 653 -172
2886 -172 -70 157 -371 467 76 -322 234 -269 156 470 -455 -79 176 -181 499 -249 -256 387 -337 286 91
2907 91 -641 249 97 -184 290 -444 -102 439 -308 170 -212 -414 542 -204 -270 114 -413 165 187 -418 174
$$ packed form
2757a65J65k31K01K5k86K59j01KK65k68M0K19k68K96q5l01M24q7n9j4j63L45n0
2780A63j87K52k64m0M94m82K13%l87O05k66k87L93j86O3K12m59K80n3k07N36o10
2802b17J6L99l62L55j41l73N32k29j85M36o65L91M20o84M13k30j81O44m18oJ33
2823D8l42M87n1m90N26l91J44M17p95M39J25l63O96o22k90Q48n01J16K33p06O56
2844A84p9k75M80o61K96M36o30K71r8k50Q33o24j64N63o56N96J63r06P03k30m9
2865i7N80p94J42M66m49N77m03n36Q75l97P7J99p34P07J01m65M90o54LR65q25
2886a72J02K27n28Q38l91l98N56n03M25L14r25L76K55l57O80p48pO43p24O23j95
2907I1p32Q90j52k81M74p34L42N41p47M78l82k02R56p46o6L84n27N78K2o05N92
$$ plain form
2928 174 -145 -50 543 -488 -47 209 -274 435 -76 -331 308 -153 150 353 -475 244 263 -181 370 -258
2948 -258 -36 458 -166 149 9 -324 557 64 -208 332 -322 231 412 -379 187 -51 -76 424 -330 -134
2968 -134 284 -244 187 44 -452 222 -101 -16 152 -473 129 86 -270 159 -226 -209 216 -219 -49 27 -426
2989 -426 293 -19 -327 165 -184 -26 266 -194 1 -17 -115 277 -134 -115 299 -202 166 164 -258 192 89 81
3011 81 188 -169 231 267 -112 270 122 -163 321 27 53 49 -74 287 100 -150 198 12 -81 226 -89 -75
3033 -75 16 -120 222 -168 -97 175 -179 -81 105 -176 -91 -15 -87 23 -246 29 136 -232 101 -7 -224 25
3055 25 -32 -63 35 -57 56 60 -168 191 7 -106 105 75 -18 52 157 146 -28 9 258 21 6 248 -23 53 120
3080 120 106 84 -21 148 180 -111 92 217 -35 64 136 -11 27 -27 124 18 -24 127 46 -120 13 18 -129 -25
$$ packed form
2928A74l19R5N93j031M41K56m83P09n11k55O39m61L03K03q28P19J9m44N51o28
2948b58K22M94o24L15j40l33Q81m93k72N40o54N53J81p91N66k38k5N00p54J96
2968a34M18n28M31j43m96O74l23Q5J68o25O02m3l56M29l85J7M25m35J70P6m53
2989d26P19l12l08M92l49J58K92m60J95j8r8L92m11J9M14n01L68km22M50j03q
3011H1J07l57M00L6l79L82j48k85M84k94K6mj23L61j87k50L48j86r3L07l15J4
3033g5R1j36L42l90P1K72l54R8J86k81Q5P6p2J10k69K75J07l68L33j08k17K49
3055B5n7l1R8r2J13Mk28L59j84j13K11l0r3P0J05j1j74L7K49k37j5K42k71P6O7
3080A20j4k2j05J69L2k91K03J25k52R9P2j47L8n4J51j06m2J51q1j66J33Nj47J04
$$ plain form
3104 -25 -7 45 -113 -127 92 -83 -87 -9 42 -139 -89 103 -58 -92 -11 92 -191 -53 89 -95 -90 47 -8 -161 78
3129 78 103 -52 -78 19 134 -50 38 131 25 -52 106 122 -17 35 103 60 -23 109 61 -10 72 70 70 -61 48 80 -91
3156 -91 -26 103 55 -102 33 80 -97 -82 54 34 -201 26 69 -159 -82 67 -47 -187 5 31 -68 -103 78 8
3180 8 -107 72 27 -62 -2 97 -17 -67 31 82 -87 -29 128 -21 -15 76 8 81 6 42 51 -120 47 120 -71 26 135
3207 135 -55 71 -101 -4 1 -169 67 -13 -139 70 6 -110 0 -58 61 -3 -136 126 -90 -177 195 -16 -67
3230 -67 121 -63 22 -8 -150 165 -84 40 189 -178 91 113 -77 186 -40 -88 137 -12 75 166 -206 163
3252 163 125 -145 193 -123 -7 142 -117 148 42 -215 231 -12 -126 173 -156 111 93 -305 195 -119 -52
3273 -52 228 -129 -103 182 -207 107 3 -274 163 -110 -23 161 -294 120 45 -244 165 -144 -154 272 -120 20
$$ packed form
3104b5J8N2j58j4K19j75mP8N1j81N0J92j61l4Q1J03k83J38J42j84NJ37n5j53K39
3129G8K5j55k6R7J15j84Q8R3j06p7J58J6j39N2O8m3q3J32m8p1Q2k%j31J09L2j71
3156i1O5J29m8j57J35M7j77J5J36k0k35K27M3k28P7J49j14j40J92K6r9l5J81p0
3180Hj15J79m5q9O0R9j14n0R8N1j69N8J57j49OR1o8P3p5L6Rj71J67P3j91R7J09
3207A35j90J26j72R7Nj70K36q0j26K09o4j16J10n8J19o4j33K62k16q7L72k11n1
3230f7J88j84Q5l0j42L15k49J24J49l67K69K2j90K63k26m8K25j49Q7R1l72L69
3252A63l8k70L38l16J16J49k59K65j06k57M46k43j14K99l29K67j8l98N00l14O7
3273e2K80l57K6K85l89L14j04k77M37k73Q7J84m55M14p5k89M09l09j0M26l92J40
$$ plain form
3295 20 104 -298 352 2 -199 210 -216 89 282 -260 207 138 -202 360 -44 -95 300 -147 274 96 -193
3316 -193 347 -10 -15 323 -231 83 300 -216 266 -25 -212 361 -108 -73 191 -239 199 121 -274 216 -225
3337 -225 -124 361 -404 48 92 -288 305 -153 -292 223 -246 85 161 -444 212 27 -226 286 -270 -113 308
3358 308 -259 94 0 -309 358 -40 -92 280 -275 212 260 -334 263 -132 -29 493 -229 -11 268 -194 307
3379 307 100 -266 352 -104 97 320 -382 185 185 -207 357 -174 -102 382 -158 82 103 -409 326 -11 -256
3400 -256 260 -278 19 209 -325 94 -130 -231 296 -270 -227 141 -324 128 62 -413 164 -115 -65 237 -360
3421 -360 43 168 -256 186 -50 -234 370 -76 39 171 -253 289 124 -134 250 -102 -10 319 -185 148
3441 148 95 -178 378 -92 -105 280 -135 110 139 -279 194 8 -108 277 -226 -35 217 -283 78 -5 -239
$$ packed form
3295B0Q4m02O50l50k01M09m26L05J93n42M67o9l40N62m04n1L95m47M21j78k89
3316a93N40l57nL38n54L14K17n16M82k91j87N73m69L5K64m30M38p8l95M90m41
3337b25J01M85p65M52M4l80N93m58j39N15m69L31P6o05O56j85k53N12n56J57M21
3358C08n67L53r4l09O67l98n2L72n55M87M8n94N97l95J03N22p22K18K79m62N01
3379C07k07l66O18m56K01K23p02N67%l92N64n31P2M84n40K40K1n12P35l37k45
3400b56N16n38K97J90n34M19k24j01N27n66M3L68m65M52o6m75N77k79N0L02n97
3421c60M03J25m24M42k36j84O04m46J15J32m24N42j65k58L84l52R2L29n04L33
3441A48n3k73N56m70j3L85m15K45K9m18M73j86j16L85n03J91K52n00L61q3k34
$$ plain form
3462 -239 224 -81 -137 29 -252 60 38 -229 152 -115 -185 244 -242 -30 111 -171 105 -2 -177 91 -159
3483 -159 -34 198 -199 42 33 -109 244 -147 -22 192 -110 52 89 -138 164 65 -80 128 -150 140 136 -154
3505 -154 117 29 -122 168 -12 -85 84 -23 143 -10 -92 193 -130 -35 189 -110 49 50 -84 48 -26 -66 102
3528 102 -67 -18 50 -152 33 -32 -30 25 -64 -23 39 -108 69 53 -136 102 11 -9 47 -46 -3 -47 -65 62 -4 -28
3554 -28 147 7 -5 80 29 30 -40 56 153 -25 84 129 -38 1 62 -11 -17 33 59 16 -83 55 43 -48 28 12 -21 -65
3582 -65 -19 -9 -27 -78 12 -51 -76 55 -38 -119 -63 -9 -30 -110 0 -14 -28 -8 66 17 -29 85 86 -1 33 55 81 -23 73
$$ packed form
3462b39M63l05n6J66k81L12k2k67L81k67p0M29m86K12J41k82K76j07j75K68k50
3483a59J25K32l97K41rj42L53l91J25K14l02J62L7k27L02r9j45K08k78K90mk90
3505a54K71q8j51K90j80p3J69j07J66j53q2K85l23R5K24k99J59Jj34J32p4m0J68
3528A02j69M9O8k02J85o5KN5q9M1O2j47J77j6j89K38r1k0N6r3M3m4j8J27o6k4
3554b8J75j40j2Q5n1Jp0R6R7j78J09M5j67L9O1p3oN0K6m3r9J38j2r1P6j6l3m4
3582f5M6J0j8n1R0o3k5J31r3q1N6N4k1q0J10j4j4K0P4m9m6J14Jq7L4K2K6j04R6
$$ [...]
8191b7
##END NTUPLES=NMR FID
##END=
