##TITLE=1H_Pr 5002-Am-d
 CDCl3, 8 sc, 
 29.9.2020
##JCAMPDX= 6.0         $$ Bruker NMR JCAMP-DX V2.0
##DATA TYPE= NMR FID
##DATA CLASS= NTUPLES
##ORIGIN= UXNMR, Bruker Analytische Messtechnik GmbH
##OWNER= root
$$ XWIN-NMR		Version 3.5
$$ Tue Sep 29 10:45:17 2020 Russian Standard Time (UT+4h)  she@DPX200
##.OBSERVE FREQUENCY= 200.1315066352
##.OBSERVE NUCLEUS= ^1H
##.DELAY= (6, 6)
##.ACQUISITION MODE= SIMULTANEOUS
##.ACQUISITION SCHEME= undefined
##.AVERAGES= 8
##.DIGITISER RES= 18
##SPECTROMETER/DATA SYSTEM= spect
##.PULSE SEQUENCE= zg30
##.SOLVENT NAME= CDCl3
##.SHIFT REFERENCE= (INTERNAL, CDCl3, 0, 15.7039)
##AUDIT TRAIL= $$ (NUMBER, WHEN, WHO, WHERE, WHAT)
$$ ##TITLE= Audit trail, XWIN-NMR		Version 3.5
$$ ##JCAMPDX= 5.01
$$ ##ORIGIN= Bruker BioSpin GmbH
$$ ##OWNER= she
$$ F:/spectra/data/she/nmr/H-F/1/audita.txt
$$ ##AUDIT TRAIL=  $$ (NUMBER, WHEN, WHO, WHERE, WHAT)
(   1,<2020-09-29 10:44:26.01 +0400>,<she>,<DPX200>,
      <created by zg, POWCHK disabled, PULCHK disabled
       configuration hash MD5:
       00 E9 B6 7A A2 85 ED C7 34 08 36 98 17 FE 4E 26
       data hash MD5: 16K
       E3 20 2E C6 38 B4 70 5B 7C FF B8 94 77 16 B0 21>)
$$ ##END=
$$ 
$$ hash MD5
$$ E3 79 16 34 D8 6C F5 61 56 3D 44 8F 77 F9 E6 38
##$RELAX= 
##$RELAX= 
##$RELAX= 
##$RELAX= 
##$RELAX= 
##$RELAX= 
$$ Bruker specific parameters
$$ --------------------------
##$DU= <F:/spectra>
##$EXPNO= 1
##$NAME= <H-F>
##$PROCNO= 1
##$TYPE= <nmr>
##$USER= <she>
##$AMP= (0..31)
100 100 100 100 100 100 100 100 100 100 100 100 100 100 100 100 100 100 
100 100 100 100 100 100 100 100 100 100 100 100 100 100 
##$AQSEQ= 0
##$AQ_mod= 1
##$AUNM= <au_zg>
##$AUTOPOS= <>
##$BF1= 200.13
##$BF2= 200.13
##$BF3= 200.13
##$BF4= 200.13
##$BF5= 200.13
##$BF6= 200.13
##$BF7= 200.13
##$BF8= 200.13
##$BYTORDA= 1
##$CFDGTYP= 0
##$CFRGTYP= 5
##$CHEMSTR= <none>
##$CNST= (0..31)
1 1 145 1 1 1 1 1 1 1 1 1 1 1 1 1 1 1 1 1 1 1 1 1 1 1 1 1 1 1 1 1 
##$CPDPRG= <>
##$CPDPRG1= <>
##$CPDPRG2= <>
##$CPDPRG3= <>
##$CPDPRG4= <mlev>
##$CPDPRG5= <mlev>
##$CPDPRG6= <mlev>
##$CPDPRG7= <mlev>
##$CPDPRG8= <mlev>
##$CPDPRGB= <>
##$CPDPRGT= <>
##$D= (0..31)
0 1.2 0 0 0 0 0 0 0 0.06 0 0.03 0 0 0 0 0.0002 0 0 0 0 0 0 0 0 0 0 0 0 
0 0 0 
##$DATE= 1601361865
##$DBL= (0..7)
120 120 120 120 120 120 120 120 
##$DBP= (0..7)
150 150 150 150 150 150 150 150 
##$DBP07= 0
##$DBPNAM0= <>
##$DBPNAM1= <>
##$DBPNAM2= <>
##$DBPNAM3= <>
##$DBPNAM4= <>
##$DBPNAM5= <>
##$DBPNAM6= <>
##$DBPNAM7= <>
##$DBPOAL= (0..7)
0.5 0.5 0.5 0.5 0.5 0.5 0.5 0.5 
##$DBPOFFS= (0..7)
0 0 0 0 0 0 0 0 
##$DE= 6
##$DECBNUC= <off>
##$DECIM= 32
##$DECNUC= <off>
##$DECSTAT= 4
##$DIGMOD= 1
##$DIGTYP= 9
##$DL= (0..7)
0 120 120 120 120 120 120 120 
##$DP= (0..7)
150 150 150 150 150 150 150 150 
##$DP07= 0
##$DPNAME0= <>
##$DPNAME1= <>
##$DPNAME2= <>
##$DPNAME3= <>
##$DPNAME4= <>
##$DPNAME5= <>
##$DPNAME6= <>
##$DPNAME7= <>
##$DPOAL= (0..7)
0.5 0.5 0.5 0.5 0.5 0.5 0.5 0.5 
##$DPOFFS= (0..7)
0 0 0 0 0 0 0 0 
##$DQDMODE= 0
##$DR= 18
##$DS= 0
##$DSLIST= <SSSSSSSSSSSSSSS>
$$ [...]
##$SUBNAM2= <"">
##$SUBNAM3= <"">
##$SUBNAM4= <"">
##$SUBNAM5= <"">
##$SUBNAM6= <"">
##$SUBNAM7= <"">
##$SUBNAM8= <"">
##$SUBNAM9= <"">
##$SW= 16.880792210976
##$SWIBOX= (0..15)
0 0 2 0 0 0 0 0 0 0 0 0 0 0 0 0 
##$SW_h= 3378.37837837838
##$TD= 16384
##$TD0= 1
##$TE= 0
##$TE2= 300
##$TE3= 300
##$TEG= 300
##$TL= (0..7)
0 120 120 120 120 120 120 120 
##$TP= (0..7)
150 150 150 150 150 150 150 150 
##$TP07= 0
##$TPNAME0= <>
##$TPNAME1= <>
##$TPNAME2= <>
##$TPNAME3= <>
##$TPNAME4= <>
##$TPNAME5= <>
##$TPNAME6= <>
##$TPNAME7= <>
##$TPOAL= (0..7)
0.5 0.5 0.5 0.5 0.5 0.5 0.5 0.5 
##$TPOFFS= (0..7)
0 0 0 0 0 0 0 0 
##$TUNHIN= 0
##$TUNHOUT= 0
##$TUNXOUT= 0
##$USERA1= <user>
##$USERA2= <user>
##$USERA3= <user>
##$USERA4= <user>
##$USERA5= <user>
##$V9= 5
##$VALIST= <valist>
##$VCLIST= <CCCCCCCCCCCCCCC>
##$VD= 0
##$VDLIST= <DDDDDDDDDDDDDDD>
##$VPLIST= <PPPPPPPPPPPPPPP>
##$VTLIST= <TTTTTTTTTTTTTTT>
##$WBST= 1024
##$WBSW= 4
##$XGAIN= (0..3)
0 0 0 0 
##$XL= 0
##$YL= 0
##$YMAX_a= 28855
##$YMIN_a= -24007
##$ZGOPTNS= <>
##$ZL1= 120
##$ZL2= 120
##$ZL3= 120
##$ZL4= 120
##$ABSF1= 10
##$ABSF2= 0
##$ABSG= 5
##$ABSL= 3
##$ALPHA= 0
##$AQORDER= 0
##$ASSFAC= 0
##$ASSFACI= 0
##$ASSFACX= 0
##$ASSWID= 0
##$AUNMP= <proc_1d>
##$AZFE= 0.1
##$AZFW= 0.1
##$BCFW= 1
##$BC_mod= 2
##$BYTORDP= 1
##$COROFFS= 0
##$CY= 11.3945322036743
##$DATMOD= 1
##$DC= 2
##$DFILT= <>
##$DTYPP= 0
##$F1P= 16.9975609425685
##$F2P= -3.02152046262296
##$FCOR= 0.5
##$FTSIZE= 0
##$FT_mod= 4
##$GAMMA= 1
##$GB= 0.15
##$INTBC= 1
##$INTSCL= 1
##$ISEN= 128
##$LB= 0.24
##$LEV0= 0
##$LPBIN= 0
##$MAXI= 10000
##$MC2= 0
##$MEAN= 0
##$ME_mod= 0
##$MI= 1.114404
##$NCOEF= 0
##$NC_proc= 0
##$NLEV= 6
##$NOISF1= 3.799351
##$NOISF2= 2.8
##$NSP= 1
##$NTH_PI= 0
##$NZP= 0
##$OFFSET= 15.70392
##$PC= 1
##$PHC0= -9966.729
##$PHC1= 6.600891
##$PH_mod= 1
##$PKNL= yes
##$PPARMOD= 0
##$PSCAL= 0
##$PSIGN= 0
##$REVERSE= no
##$SF= 200.130013532006
##$SI= 16384
##$SIGF1= 3
##$SIGF2= 2
##$SINO= 400
##$SIOLD= 16384
##$SREGLST= <1H.CDCl3>
##$SSB= 0
##$STSI= 0
##$STSR= 0
##$SW_p= 3612.71676300578
##$SYMM= 0
##$S_DEV= 0
##$TDeff= 0
##$TDoff= 0
##$TI= <>
##$TILT= no
##$TM1= 0
##$TM2= 0
##$TOPLEV= 0
##$USERP1= <user>
##$USERP2= <user>
##$USERP3= <user>
##$USERP4= <user>
##$USERP5= <user>
##$WDW= 1
##$XDIM= 8192
##$YMAX_p= 0
##$YMIN_p= 0
$$ End of Bruker specific parameters
$$ ---------------------------------
##NTUPLES= NMR FID
##VAR_NAME=  TIME,          FID/REAL,        FID/IMAG
##SYMBOL=    X,             R,               I
##VAR_TYPE=  INDEPENDENT,   DEPENDENT,       DEPENDENT
##VAR_FORM=  AFFN,          ASDF,            ASDF
##VAR_DIM=   8192,          8192,            8192
##UNITS=     SECONDS,       ARBITRARY UNITS, ARBITRARY UNITS
##FACTOR=    0.000296,      1,               1
##FIRST=     0,             0,               0
##LAST=      2.424536,      0,               0
##MIN=       0,             -24007,          0
##MAX=       2.424536,      28855,           0
$$ Real data points
##PAGE= N=1
##DATA TABLE= (X++(R..R)), XYDATA
$$ plain form
0 0 0 0 0 0 0 0 0 0 0 0 0 0 0 0 0 0 0 0 0 0 0 -1 8 -8 8 -8 8 -8 11 -16 16 -16 21 -24 25 -32 32 -40 41 -48 53 -61 65
43 65 -73 81 -91 101 -110 122 -134 148 -164 180 -197 218 -240 266 -295 328 -366 410 -465 529 -611
64 -611 716 -860 1065 -1399 2074 -10388 25515 4962 -19318 6201 9093 -8379 -4557 1412
78 1412 963 7830 -3298 4216 4761 1490 -6244 3868 6807 913 5599 2263 6315 1022 -1213
93 -1213 1231 8738 2704 -275 11785 -540 495 2352 1018 1672 7903 81 508 10202 -5413
108 -5413 -2122 3354 1404 -1216 2825 1421 -1045 626 -7518 2349 -109 -4703 62 4546 -5947
123 -5947 -7112 5176 -7684 -5735 3006 564 -8029 -645 460 -8261 -2901 -3332 736 -3245 -2873
138 -2873 -1083 -696 -5024 -4787 2959 -3754 210 -636 -261 -31 -2078 -3470 1656 5026 -5890 3422
$$ packed form
0@%%%%%%%%%%%%%%%%%%%%%jRj6J6j6J6j6J9k7L2l2L7m5M9n7O4p2Q1q9J01j14J26
43F5j38J54j72J92k11K32k56K82l12L44l77M15m58N06n61O23o94P76q75R94j140
64f11J327j576J925k464L473j2462L5903k0553k4280K5519K892j7472L822N969
78A412m49O867j1128P514N45l271p734J0112K939n894M686l336M052n293k235
93a213K444P507o034k979J2060j2325J035J857j334O54O231p822M27R694j5615
108e413L291N476j950k620M041j404k466J671q144R867k458m594M765M484j0493
123e947j165J2288j2860J949Q741k442q593P384J105q721N360m31M068l981L72
138b873J790L87m328K37P746o713L964q46L75K30k047j392N126L370j0916R312
$$ plain form
154 3422 4624 -2121 -1498 3761 1457 -731 5636 -17 3389 2753 355 19 4530 3680 -1460 5765
170 5765 2842 2417 -835 1805 3936 1910 -17 2410 6689 -3958 480 3401 794 -1252 1470
185 1470 2806 -670 331 -2584 2184 -1522 -1863 538 513 -1060 -3470 374 -2802 -1129 -2721 -517
201 -517 -371 -2675 -2303 -2539 -96 -5348 -761 -1041 -2521 -1467 -967 -2356 -3218 636 -3883 7 -347
218 -347 -1578 -1133 -919 -621 -2470 1414 -1087 1178 -472 738 884 -659 887 545 2741 -998 3138
235 3138 1890 263 1525 2197 1836 273 4219 522 2651 1545 1430 2045 1540 2248 485 3848 110
252 110 1728 955 1408 1320 43 2058 39 1662 -1451 1536 -465 -1043 506 -328 60 -1876 910
269 910 -2343 -252 -1534 -1532 -801 -1657 -853 -2522 -329 -3144 -1352 -1812 -1594 -1461 -2479 -641 -2684 -946
$$ packed form
154C422J202o745O23N259k304k188O367n653L406o36k398l36M511q50n140P225
170E765k923m25l252K640K131k026j927K427M279j0647M438K921k607k046K722
185A470J336l476J001k915M768l706l41K401k5j573k410L844l176J673j592K204
201e17J46k304L72k36K443n252M587k80j480J054N00j389q62L854m519L890l54
218c47j231M45K14K98j849L884k501K265j650J210J46j543J546l42K196l739M136
235C138j248j627J262O72l61j563L946l697K129j106j15O15n05P08j763L363l738
252A10J618p73M53q8j277K015k019J623l113K987k001n78J549q34L88j936K786
269I10l253K091j282KP31q56Q04j669K193k815J792m60K18J33j018J838k043J738
$$ plain form
287 -946 -3053 -76 -1590 -1949 -60 -1502 -886 -2097 842 -1932 410 38 -214 644 -704 829 -629
304 -629 1531 -352 1649 1003 776 1657 419 2043 34 2632 316 2419 1525 891 2084 1149 2045
321 2045 604 3102 391 2047 1299 867 1747 319 1799 -78 2101 -286 1044 -37 41 703 -891
338 -891 986 -1452 662 -1328 -294 -950 -959 -231 -1620 -153 -2028 -102 -2507 -1048 -1255 -1718 -801
355 -801 -2377 -417 -2320 -868 -2530 -669 -1417 -1498 -580 -1771 79 -2382 -315 -1083 -251 -793 -811 1021
373 1021 -1117 286 -743 1270 -717 758 965 621 1209 -111 1643 180 1802 226 1575 1032
389 1032 931 1765 688 2296 484 1786 354 1752 1825 382 1783 717 1794 -405 1866 707
405 707 1042 436 183 1270 -477 817 -845 1273 -790 -599 484 -525 -645 -1617 770 -1854 -366
$$ packed form
287i46k107K977j514l59J889j442O16j211K939k774K342l72k52Q58j348J533j458
304f29K160j883K001o46k27Q81j238J624k009K598k316K103q94o34J193r35Q96
321B045j441K498k711J656p48m32Q80j428J480j877K179k387J330j081P8O62j594
338h91J877k438K114j990J034o56rP28j389J467j875J926k405J459k07m63R17
355h01j576J960j903J452j662J861p48q1R18j191J850k461K067p68Q32n42j8J832
373A021k138J403j029K013j987J475K07l44N88j320J754j463J622j576J349n43
389A032j01Q34j077J608j812J302j432J398P3j443J401j066J077k199K271j159
405G07L35o06k53J087j747J294j662K118k063J91J083j009j20r72K387k624J488
$$ plain form
422 -366 -1478 -1147 -791 -1495 -701 -2046 -231 -1698 -1302 -1916 -346 -1384 -2477 59 -1365 -713 -2107
439 -2107 -444 -468 -920 -1656 -739 594 -1848 -259 -399 1170 -1098 -429 1278 93 -134 -12 1778
456 1778 -440 962 478 1127 1287 41 1416 912 1805 133 1381 862 1471 898 366 2163 369
473 369 1648 74 1712 1379 286 213 1509 1731 -1479 1365 516 595 -1086 578 1080 -1064 -25
490 -25 -512 300 -1067 -203 -811 -328 -492 -2093 94 -771 -777 -1811 -258 -1656 -1506 -587 -1488 -961 -1440
509 -1440 52 -2330 -378 -344 -1806 -1421 15 -452 -2423 739 -369 -393 -666 73 263 -609 465 -111
527 -111 1234 -571 735 477 672 931 -389 1644 190 1159 302 982 911 1429 1293 17 2215 631
545 631 1088 409 1681 874 144 1207 1051 1004 -545 1509 247 834 -137 -107 1872 -559 -470 23 889
$$ packed form
422c66j112L31L56p04P94j345J815j467L96o14J570j038j093K536j424O52j394
439b107J663k4m52p36R17J333k442J589j40J569k268O69J707j185k27J22J790
456A778k218J402m84O49J60j246J375n04Q93j672J248n19O09n73n32J797j794
473C69J279j574J638l33j093p3J296K22l210K844q49P9j681J664N02k144J039
490b5m87Q12j367Q64o08M83j64j601K187q65oj034J553j398J50R19r01N27m79
509a440J492k382J952L4j462L85J436m67j971L162j108k4k73P39J90q72J074n76
527a11J345j805J306k58J95K59j320K033j454R69q57O80p1N18j36j276K198j584
545F31M57o79J272q07p30J063j56m7j549K054j262N87r71L0J979k431Q9M93Q66
$$ plain form
564 889 -1630 -111 297 -579 -687 -1136 526 -1392 -542 -949 -746 -1175 -645 -1010 -1442 149 -1661 -788
582 -788 -1239 -351 -1085 -1657 8 -1158 -783 -1121 395 -1257 -389 -353 -653 762 -1218 105 329 421 -867
601 -867 701 548 -423 355 62 1549 -95 925 452 699 434 721 1188 442 1305 425 1431 449 983
620 983 1322 449 1212 550 1350 235 1043 -35 565 642 372 1019 -288 617 84 443 -350 271 8 -310
640 -310 326 -961 101 -844 -193 -907 -470 -740 -946 -172 -1380 -90 -1059 -296 -1098 -715 -704 -1420 -201
659 -201 -1108 -487 -1372 -158 -837 -458 -751 -727 475 -948 186 -433 -174 -752 179 358 -255 637 -630
678 -630 771 93 572 201 789 931 63 1179 446 972 66 1301 645 665 997 456 1141 387 1278 423
698 423 974 415 721 932 -96 922 -175 848 36 501 132 248 138 -375 294 -525 268 -689 -121
$$ packed form
564H89k519J519M08q76j08m49J662j918Q50m07K03m29N30l65m32J591j810Q73
582g88m51Q88p34n72J665j166L75l38J516j652Q68L6l00J415j980J323K24R2j288
601h67J568j53r71P78k93J487j644J020m73K47k65K87M67p46Q63q80J006r82N34
620I83L39q73P63o62Q00j115Q08j078O00P7k70O47j307R05n33L59p93O21k63l18
640c10O36j287J062r45O51p14M37k70k06P74j208J290r69P63q02L83J1p16J219
659b01r07O21q85J214o79L79k93K4J202j423J134o19K59n78R31J79o13Q92j267
678f30J401o78M79l71N88J42q68J116p33N26r06J235o56K0L32n41O85p54Q91q55
698D23N51n59L06K11j028J018j097J023q12M65l69J16j10n13O69q19P93r57N68
$$ plain form
717 -121 -479 -336 -331 -822 -317 -1152 -126 -949 -457 -792 -696 -520 -886 -231 -1089 -341 -1000 -412 -721 -525 -263
738 -263 -1192 57 -672 -158 -960 -110 -479 -384 143 -432 307 -356 610 -201 309 -93 469 775 118 730
758 730 41 880 287 544 536 552 833 284 1033 234 1288 515 1019 483 506 737 112 924 38 948 158
779 158 396 129 100 504 -123 52 -383 476 -404 -60 107 -379 -191 -711 212 -1247 -228 -636 -369 -749
799 -749 -969 -405 -993 -222 -1207 -366 -774 -437 -835 -722 -350 -874 -18 -1131 -299 -633 -598 -7 -481 -93
819 -93 -555 615 -452 120 -50 245 278 -168 589 -260 615 -151 459 241 596 639 338 851 166 849 161
840 161 973 419 722 544 373 799 198 1064 81 444 130 589 591 452 574 -113 445 52 524 -223 361
861 361 159 -667 2 -259 -87 -436 -60 -619 -312 -374 -570 -135 -807 -206 -828 -178 -980 -421 -370 -451 -369 -858
$$ packed form
717a21l58J43Nm91N05q35J026q23M92l35R6J76l66O55q58P48o59N88l09J96K62
738b63r29J249p29N14q02Q50l69R5N27n75P39o63R66q11N10m02N62L06o57O12
758G30o89Q39n93K57qJ6K81n49P49p99J054p73N04n36K3K31o25Q12q86R10p90
779A58K38k67k9M04o27J75m35Q59q80L44J67m86J88n20R23j459J019m08K67l80
799g49k20N64n88P71r85Q41m08L37l98J13L72n24Q56j113Q32l34L5N91m74L88
819i3m62J170j067N72j70K95L3m46P57q49Q75p66O10k18L55M3l01N13o85O83o88
840A61Q12n54L03j78j71M26o01Q66r83L63l14M59Kj39J22o87N58l93M72p47N84
861C61k02q26O69k61J72l49L76n59L07o2j96M35o72O01o22O50q02N59N1q1Q2m89
$$ plain form
883 -858 -157 -993 -106 -631 -529 -282 -219 -121 -837 242 -480 -136 -255 309 102 -504 434 -49 530 106 513
904 513 198 523 267 247 776 -61 877 223 584 344 342 763 603 945 212 743 352 925 329 236 1009 292
926 292 413 229 797 -159 423 154 148 163 -389 391 -521 -59 -355 79 -299 -353 -378 -530 226 -1226 -204
947 -204 -547 -19 -432 -517 -385 -870 -190 -714 -163 -919 -164 -762 -495 -135 -890 -197 -524 -193 -578 -136 -224
968 -224 -129 201 -630 576 -126 351 35 101 73 -117 258 302 391 -120 713 320 558 558 631 438 92 709 -237
991 -237 837 28 509 689 484 326 -105 854 196 503 246 333 71 352 254 -160 391 -116 181 -128 -37
1012 -37 56 47 24 -443 71 -669 -53 -473 -222 -483 -473 -387 -659 -196 -866 78 -743 -269 -609 -617 79 -745 -66
1035 -66 -466 -200 -578 -342 -239 -288 -143 -295 537 -417 0 -94 164 -20 -195 284 -127 460 -11 606 341
$$ packed form
883h58P01q36Q87n25J02K47O3R8p16J079p22L44j19N64k07o06R38m83N79m24M07
904E13l15L25k56k0N29q37R38o54L61k40kM21j60L42p33N31l91N73n96r3P73p17
926B92J21j84N68r56N82k69oJ5n52P80r12M62k96M34l78n4k5j52P56j452J022
947b04l43N28m13q5J32m85O80n24N51p56P55n98K67L60p55O93l27L31l85M42q8
968b24R5L30q31J206p02M77l16O6k8j90L75M4Q9n11Q33l93K38%P3j93l46O17r46
991b37J074q09M81J80k05j58m31R59o58L07k57Q7k62K81r8m14N51n07K97l09R1
1012c7R3rk3m67N14p40O16m20K51k61J0Q6k72M63o70R44q21M74l40qO96q24O79
1035f6m00K66l78K36J03m9J45j52Q32r54M17r4K58j84j75M79m11N87m71O17k65
$$ plain form
1056 341 304 424 130 706 77 568 143 539 503 424 614 198 633 182 678 -37 516 230 232 372 -107 231
1078 231 -18 455 -190 350 235 117 -53 -48 160 -241 484 -529 182 -172 -233 165 -351 7 -364 -251 -512
1099 -512 -299 -377 -372 -178 -610 -212 -698 -172 -794 -138 -399 -336 -242 -199 -73 -486 51 -402 84 -236 -72 100
1121 100 -159 112 -308 236 -210 484 -118 431 392 -26 813 -128 460 189 437 218 624 328 238 627 121
1142 121 633 54 635 381 441 313 67 560 -215 425 204 92 215 126 469 20 -21 -138 211 -442 87
1163 87 -214 -185 199 -522 149 -614 67 -495 -231 -439 -560 -454 -556 -243 -242 138 -487 -8 -259 -486 -95
1184 -95 -332 -311 -437 -214 -524 0 -330 -152 -40 -200 182 -116 205 -419 132 275 10 514 18 674 60
1205 60 446 -49 297 320 431 414 116 583 76 773 102 325 242 294 430 117 511 -109 552 220 38 296
$$ packed form
1056C41l7J20k94N76o29M91m25L96l6p9J90m16M35m51M96p15N53k86KJ40m79L38
1078B31k49M73o45N40j15j18j70NK08m01P25j013P11l54o1L98n16L58l71J13k61
1099e12K13p8NJ94m32L98m86N26o22O56k61O3R4M3J26m13N37m53M86l20J64J72
1121A00k59K71m20N44m46O94o02N49l9m18Q39r41N88k71K48k19M06k96r0L89n06
1142A21N12n79N81k54O0j28k46M93p75O40k21j12J23q9L43m49m1j17L49o53N29
1163H7l01K9L84p21O71p63O81n62K64k08j21J06j02L13JL80o25M79k51k27L91
1184i5k37K1j26K23l10N24l30J78J12j60L82k98L21o24N51J43k65N04m96O56o14
1205F0L86m95L46K3J11j7k98M67n07O97o71K23q3N2J36l13L94o20O61l32j82K58
$$ plain form
1227 296 -18 121 -174 424 -352 453 -229 44 94 8 64 -447 -225 -223 117 -445 -185 -180 -536 -112 -547 -307
1249 -307 -525 -46 -375 7 -282 -501 -189 -684 -28 -355 -336 -317 -172 -44 -316 98 -369 -129 -316 202 -159
1270 -159 -40 45 -152 150 -298 99 -95 153 145 214 153 73 546 22 849 19 519 78 321 394 -110 244
1292 244 180 422 205 703 155 144 331 -24 454 50 282 -140 202 -90 93 -28 -178 -35 -380 230 -357
1313 -357 -126 7 -171 -378 -159 -241 -569 9 -300 -131 -387 -24 -2 -387 -29 -655 -121 -307 -70 -568 -135
1334 -135 -188 -325 178 -480 -456 -235 53 -153 61 42 -136 203 -221 410 -4 141 -102 -80 384 157 334
1355 334 258 374 -19 522 104 262 169 169 632 103 101 203 397 224 215 192 209 268 152 213 152 316 294 304 -60
1380 -60 94 188 -129 -142 -254 -204 -184 -125 -126 -325 151 -475 2 -555 63 -202 -372 -182 -392 -168 -500 -54 -370
$$ packed form
1227B96l14J39k95N98p76Q05o82K73N0q6N6n11K22KL40n62K60Nl56M24m35K40
1249c07k18M79l29L82k89k19L12m95O56l27J9J9J45J28k72M14m67K40j87N18l61
1270a59J19Q5j97L02m48L97j94K48qO9o1q0M73n24Q27q30N00m41K43P3n04L54
1292B44o4K42k17M98n48j1J87l55M78m04K32m22L42k92J83j21j50J43l45O10n87
1313c57K31J33j78k07K19q2l28N78l09J69k56L63K2l85L58o26N34j86K37m98M33
1334a35n3j37N03o58K4K21K88k06K14j9j78L39m24O31m14J45k43K2M64k27J77
1355C34p6J16l93N41m18J58r3%M63n29kJ02J94j73rk3J7N9j16O1o1J64k2J0l64
1380f0J54R4l17j3j12N0K0N9jj99M76o26M77n57O18k65j70J90k10K24l32M46l16
$$ plain form
1403 -370 -183 -133 -247 17 -542 -150 -420 -79 -175 -106 -54 -130 -21 -363 148 -225 216 -76 84 63 85 195
1425 195 -86 210 -233 390 212 445 101 161 499 235 155 396 330 288 437 341 497 277 -23 286 125 146
1447 146 404 202 -28 307 161 -40 153 -144 214 109 27 -150 30 -125 -347 125 -130 264 -234 -149 -52
1468 -52 -185 -21 -543 -13 -354 -93 -211 -69 -390 -105 11 -306 -1 -297 -117 -340 -62 -46 -105 -338 42
1489 42 25 26 -10 130 76 -8 -129 115 232 -40 79 260 -92 262 279 324 320 -219 189 136 289 158 123 278
1513 278 18 15 -41 706 107 427 414 7 359 211 376 144 1 95 116 32 6 100 -98 288 -165 182 -18
1536 -18 257 -93 -77 257 -483 190 -290 234 -350 -213 -253 -267 -250 -323 -54 -438 -105 -504 -145 -391 -348 114
1558 114 -501 156 -283 -98 -530 -299 -66 -178 -70 -181 74 -8 173 -68 -11 98 36 196 45 241 -123
$$ packed form
1403c70J87N0j14K64n59L92k70L41r6O9N2p6J09l42N11l73M41k92J60k1K2J10
1425A95k81K96m43O23j78K33l44O0L38k64q0K41o6m2J49r6J56k20l00L09j61K1
1447A46K58k02k30L35j46k01J93k97L58j05q2j77J80j55k22M72k55L94m98Q5R7
1468e2j33J64n22N30l41K61j18J42l21K85J16l17L05k96J80k23K78J6n9k33L80
1489D2j7Jl6J40n4q4j21K44J17k72J19J81l52L54J7M5mn39M08n3J53j31l5J55
1513B78k60ln6P47n99L20j3m07L52j48J65k32j43R4K1q4k6R4j98L86m53L47k00
1536a8K75l50J6L34p40O73m80N24n84J37m0j4J7p3K69l84L33l99L59k46M3M62
1558A14o15O57m39J85m32K31K33j12J08j11K55q2J81k41N7J09o2J60j51J96l64
$$ plain form
1579 -123 169 130 302 105 230 393 -49 153 10 194 126 257 222 -42 258 16 416 170 43 -102 409
1600 409 308 156 94 43 258 -133 183 -20 45 12 246 -66 -228 -63 -90 72 -174 15 -240 -163 -46 -408
1622 -408 -45 -334 -29 -277 93 -372 -313 -1 -389 25 -251 49 -61 -21 20 -122 -80 34 57 33 351 -106
1644 -106 -83 -115 134 215 -167 226 38 305 -50 31 293 302 242 96 146 31 132 114 315 306 498 496 -24 358
1668 358 -36 140 -71 215 226 67 54 -24 -54 50 235 81 142 -64 -35 11 -142 284 -214 151 -102 -288
1690 -288 -356 -241 -202 -233 -75 -293 -143 -303 -252 -246 -149 -79 -441 138 -264 73 -136 -294 53 -271 -3 -345 -34
1713 -34 -40 150 -57 76 -83 95 48 31 57 -235 103 334 218 132 85 102 196 275 178 51 317 217 236 35
1737 35 308 24 198 140 162 101 71 151 185 477 166 196 67 231 304 190 -231 213 220 -65 -115 -308 100 -136
$$ packed form
1579a23K92l9J72j97J25J63m42K02j43J84o8J31l5k64L00k42M00k46j27j45N11
1600D09j01j52o2n1K15l91L16k03O5l3K34l12j62J65k7J62k46J89k55P7J17l62
1622d08L63k89L05k48L70m65N9L12l88M14k76L00j10M0M1j42M2J14K3k4L18m57
1644a06K3l2K49Q1l82L93j88K67l55Q1K62Ro0j46N0j15J01j8K01rJ92kn20L82
1668C58l94J76k11K86J1j59j3p8l0J04J85j54O1k06K9M6j53M26m98L65k53j86
1690b88o8J15L9l1J58k18J50j60N1OR7P0l62N79m02L37k09j58L47l24K68l42L11
1713c4oJ90k07J33j59J78m7j7K6k92L38K31j16q6m7J7R4P9r7j27K66j00J9k01
1737C5K73k84J74n8K2o1l0Q0L4K92l11L0j29J64P3j14m21M44Pk85n0j93M08k36
$$ plain form
1761 -136 -172 -248 -253 23 -309 -117 -162 73 -24 -274 -210 -79 60 -262 -225 -109 -318 -331 142 -259 -220 -96 -284
1784 -284 -89 -411 -287 -47 15 -232 50 -9 -44 218 41 84 -108 -117 -115 -16 333 -213 304 -164 290 -77 136
1807 136 65 65 299 222 206 43 317 300 192 104 -39 230 -102 267 33 129 -211 -54 223 -255 118 -39 52
1830 52 -223 43 28 -99 283 124 251 -152 -15 -237 93 -287 -38 -219 -187 -97 -284 72 -261 32 -408
1851 -408 1 119 -242 102 -142 144 -224 -95 95 -78 121 137 -10 -148 172 73 79 92 -165 21 12 188
1873 188 123 59 340 47 43 191 102 -90 246 -208 -24 152 -101 -49 10 293 -23 84 -119 145 -26 159
1895 159 128 102 37 -65 243 15 259 -204 67 1 -24 248 29 58 -180 -78 10 -104 -131 -73 -103 -259 322
1918 322 -154 40 185 -293 -189 -105 -105 -272 -18 -196 -66 -200 -394 -66 -47 -58 -101 110 38 0 8 -178 91
$$ packed form
1761a36l6p6nK76l32J92m5K35r7k50O4J31J39l22L7J16k09j3M73m01L9J24j88
1784b84J95l22J24K40O2k47K82n9l5K62j77M3j92rKR9L49n46N17m68M54l67K13
1807A36p1%K34p7j6j63K74j7j08q8j43K69l32L69k34R6l40J57K77m78L73j57R1
1830E2k75K66j5j27L82j59J27m03J37k22L30l80K49j81L2R0j87L56l33K93m40
1851d08M09J18l61L44k44K86l68J29J90j73J99J6j47j38L20r9OJ3k57J86rJ76
1873A88o5o4K81k93mJ48q9j92L36m54J84J76k53N2N9K83l16J07k03K64j71J85
1895A59l1k6o5j02L08k28K44m63K71o6k5K72k19K9k38J02Q8j14k7N8l0j56N81
1918C22m76J94J45m78J04Q4%j67K54j78J30j34j94L28J9j1m3K11p2l8Qj86K69
$$ plain form
1941 91 -91 -93 -311 -95 -271 128 161 69 91 61 90 50 59 23 156 117 182 304 165 169 -84 236 140 181 381 317
1967 317 477 2 404 -31 -16 122 -16 66 -44 38 159 89 -119 72 -134 -14 -172 -280 97 -268 -54
1988 -54 131 97 52 -85 -64 -136 -73 -68 -190 -156 -214 -165 131 -95 -24 -20 -88 -188 -362 -15 -169 -37 -4 -357 -230
2013 -230 -148 -196 -57 116 -90 -36 16 -55 167 -158 116 88 51 212 43 104 -142 235 205 426 -108 244 77
2036 77 222 239 96 392 -114 298 -133 274 222 208 62 17 204 -156 131 26 44 45 -119 -29 -62 -74 -75 77
2060 77 -98 184 -85 -64 125 -103 126 -293 -166 -187 -23 -66 -128 -132 -94 -38 -448 73 11 -115 -65 -201 -83 -145
2084 -145 42 -141 -150 -175 -58 -116 -127 68 49 6 -146 395 -180 -34 68 112 242 400 114 227 186 -103 300
2107 300 206 336 -169 31 298 -124 325 77 276 -135 53 77 -119 124 43 235 32 207 -26 -19 -23 137
$$ packed form
1941I1j82kk18K16j76L99L3r2K2l0K9m0Rl6J33l9O5J22j39Mk53L20r6M1K00o4
1967C17J60m75M02m35J5J38j38Q2j10Q2J21p0k08J91k06J20j58j08L77l65K14
1988e4J85l4m5j37K1p2O3Nj22L4n8M9K96k26P1Mo8j00j74L47j54J32L3l53J27
2013b30Q2m8J39J73k06N4N2p1K22l25K74k8l7J61j69O1k46L77l0K21n34L52j67
2036G7J45J7j43K96n06M12m31M07n2j4j46m5J87l60K87j05J8Jj64R0l3j2jJ52
2060G7j75K82k69K1J89k28K29m19J27k1J64m3o2mL8N6m10N21o2j26N0j36J18o2
2084a45J87j83rk5J17n8j1J95j9m3j52N41n75J46J02M4J30J58k86J13m1k89M03
2107C00r4J30n05K00K67m22M49k48J99m11J88K4j96K43q1J92k03J75k33PmJ60
$$ plain form
2129 137 31 -18 73 4 140 -68 -53 108 -404 13 -125 -79 -227 -130 -118 -56 -45 -9 -61 -177 -100 -32 -14 -380 -51
2154 -51 117 -93 57 105 2 35 29 -157 -256 -150 142 0 -8 39 -48 105 -108 -171 76 -19 140 -131 -27 -54
2178 -54 441 175 -87 184 -145 147 64 -36 244 51 161 391 174 -171 4 152 146 350 155 95 154 -13
2200 -13 -46 163 -36 231 -98 105 -247 -2 63 -24 73 -11 29 -22 45 86 -278 -118 15 -15 -425 -132 -288 -3
2224 -3 -179 -249 -21 -243 -44 229 91 -242 -144 -180 -41 27 -227 17 128 89 -283 -32 126 25 6 -69 81
2247 81 -217 377 -174 74 132 8 169 -26 -66 66 282 -22 281 92 47 134 128 79 2 39 11 143 228 234 189
2272 189 -77 125 -117 -162 -41 -158 221 -29 -34 47 56 114 63 -56 12 -16 -92 -102 66 -54 146 -215 76 -151
2296 -151 2 107 78 -243 18 -144 -240 12 77 169 -31 -215 81 -61 86 71 -222 162 -127 -36 296 -36
$$ packed form
2129A37j06m9R1o9J36k08J5J61n12M17j38M6j48R7J2O2J1L6n2j16P7O8J8l66L29
2154e1J68k10J50M8j03L3oj86r9J06K92j42qM7q7J53k13o3K47r5J59k71J04k7
2178e4M95k66k62K71l29K92q3j00K80j93J10K30k17l45J75J48oK04j95o0N9j67
2200a3l3K09j99K67l29K03l52K45O5q7R7q4M0n1O7M1l64J60J33l0m10K93j56K85
2224cj76p0K28k22J99K73j38l33R8l6J39O8k54K44J11l9l72K51J58j01j9p5J50
2247H1k98N94n51K48N8j24J61j95m0J32K16l04L03j89m5Q7om9p7L7k8J32Q5Om5
2272A89k66K02k42m5J21j17L79k50nQ1RN8n1j19O8k8p6j0J68j20K00l61K91k27
2296a51J53J05k9l21K61j62r6K52O5R2k00j84K96j42J47j5k93L84k89R1L32l32
$$ plain form
2318 -36 288 -170 83 -81 -81 -64 -54 -146 97 -108 -112 132 57 -217 -41 158 -85 131 6 34 118 98 -75 115
2342 115 146 14 -40 300 54 105 -24 -3 60 31 -201 -109 150 -121 174 3 41 341 39 -138 -82 4 -52 -235
2366 -235 -91 -258 98 -137 174 40 67 97 -53 89 -150 -95 -20 62 -88 138 -16 10 -77 -243 58 -271
2388 -271 -45 -63 272 -174 45 26 -127 71 8 -200 -12 -127 11 195 -208 -182 27 14 334 -13 217 75
2410 75 103 30 133 200 -73 -120 -152 -67 -138 -122 244 176 -81 92 -30 -162 128 69 -72 5 -288 87 190 -138
2434 -138 -86 -190 15 -133 102 -437 -11 -41 195 -164 -72 -39 -106 -210 -50 -147 24 -39 -248 225 18 4 -288
2457 -288 -60 59 -62 78 -53 -107 -100 -158 -2 126 -109 -155 51 -11 147 148 -231 139 -69 -55 -237 -174 100
2480 100 -112 240 -93 116 22 -45 -258 239 181 99 -43 316 63 -16 168 166 151 269 -165 135 201 -77 72
$$ packed form
2318c6L24m58K53j64%J7J0r2K43k05mK44p5k74J76J99k43K16j25K8Q4k0j73J90
2342A15L1j32n4L40k46N1j29K1O3k9k32R2K59k71K95j71L8L00l02j77N6Q6n6j83
2366b35J44j67L56k35L11j34K7L0j50J42k39N5P5Q2j50K26j54K6q7j66L01l29
2388b71K26j8L35m46K19j9j53J98o3k08J88j15J38J84m03K6K09j3L20l47K30j42
2410G5K8p3J03O7k73m7l2Q5p1J6L66o8k57J73j22j32K90n9j41P7k93L75J03l28
2434a38N2j04K05j48K35n39M26l0K36l59R2L3o7j04J60r7J71o3k09M73k07j4k92
2457b88K28J19j21J40j31n4Pn8J56J28k35m6K06o2J58Jl79L70k08J4j82O3K74
2480A00k12L52l33K09r4o7k13M97n8q2j42L59k53p9J84kj5J18m34L00O6k78J49
$$ plain form
2503 72 -130 75 91 179 -108 -199 -44 -48 50 66 -79 -50 93 -53 -299 -80 -183 -94 -358 -239 -56 -21 157 -285
2527 -285 -332 -184 -256 -49 94 194 -229 -324 -70 -58 22 -57 -138 -306 -69 143 -18 -137 10 5 59 -146 68
2550 68 -72 124 -46 206 -26 30 72 132 21 50 20 35 357 139 36 178 110 -86 -37 44 192 -135 -99 2
2574 2 -116 157 67 74 148 191 -192 -159 -28 46 135 -110 81 -2 16 63 15 -228 180 -138 -222 11 -185 98 72
2599 72 -66 -90 -12 -72 -101 19 64 -46 134 273 20 128 147 -45 52 38 56 12 -143 107 96 -72 -42 26 51
2624 51 -63 -8 -152 -93 -60 73 84 137 20 -85 211 183 127 -120 18 -33 158 55 94 -190 46 -50 -103 -27
2648 -27 297 30 60 -160 -61 230 -96 -33 -146 -19 232 -217 5 -86 -64 -145 -12 46 -177 -90 59 223 -79
2671 -79 -104 -239 4 112 -49 181 -53 54 34 -206 24 232 -115 -29 62 -44 -58 53 -262 153 -9 -14 299
$$ packed form
2503G2k02K05J6Q8k87r1J55mR8J6j45K9J43j46k46K19j03Q9k64J19J83L5J78m42
2527b85m7J48p2K07J43J00m23r5K54J2Q0p9q1j68K37K12j61j19J47nN4k05K14
2550F8j40J96j70K52k32N6M2O0j11K9l0J5L22k18j03J42o8j96M9Q1J48l27L6J01
2574Bj18K73r0PP4M3l83L3J31P4Q9k45J91q3J8M7m8k43M08l18q4K33j96K83k6
2599G2j38k4P8o0k9J20M5j10J80J39k53J08J9j92R7j4J8m4j55K50j1j68L0O8K5
2624E1j14N5j44N9L3J33J1N3j17j05K96k8n6k47J38n1J91j03L9k84K36r6n3P6
2648b7L24k67L0k20R9K91l26O3j13J27K51m49K22r1K2q1J33N8k23Q7J49J64l02
2671g9k5j35K43J08j61K30k34J07k0k40K30K08l47Q6R1j06j4J11l15M15j62nL13
$$ plain form
2694 299 41 68 60 88 -219 134 51 -13 54 -12 -96 -57 117 119 109 -105 61 -72 42 -11 123 -46 210 195 -64
2719 -64 -1 0 132 145 -166 -269 -87 275 27 50 46 -255 -35 -133 -87 69 -137 -272 31 30 -48 -70 -16 -137 -6
2744 -6 134 59 -91 -50 -41 -278 -13 -113 -305 6 -36 -25 -10 -120 409 91 -35 41 -35 -281 -318 -59 115 123 -116
2769 -116 121 -71 161 176 182 -25 -62 69 -131 200 101 -29 -24 318 317 138 132 38 101 89 112 -131 131 21 196
2794 196 -131 211 -36 40 -32 100 -38 155 231 37 -166 -196 -104 71 -157 -190 -73 44 29 101 85 -188 329
2817 329 -166 46 172 -151 -30 -104 91 -186 95 45 -136 -155 -103 168 249 8 -10 -78 102 196 -64 -145 -64
2840 -64 -12 45 152 132 -169 -172 87 -24 -7 30 177 35 -18 163 291 146 100 -36 -180 149 -82 118 -31
2863 -31 94 158 -11 -3 23 -33 -4 -53 -74 49 73 14 145 -161 -140 -179 -63 235 85 -170 32 52 25 149 -181
$$ packed form
2694B99k58K7qK8l07L53q3o4O7o6q4L9J74Kj0k14J66j33J14n3J34j69K56j5k59
2719f4O3JJ32J3l11j03J82L62k48K3ml01K20r8M6J56k06j35L03jp8k2N4j21J31
2744fJ40p5j50M1Rk37K65j00j92L11m2J1J5j10N29l18j26P6p6k46l7K59J74Qk39
2769a16K37j92K32J5Ok07l7J31k00L31r9j30NL42jj79or4O3j2K3k43K62j10J75
2794A96l27L42k47P6p2J32j38J93P6j94k03l0R2J75k28l3J17J17j5P2j6k73N17
2817C29m95K12J26l23J21p4J95k77K81n0j81j9N2K71Q1k41j8o8J80R4k60q1Q1
2840f4N2N7J07k0l01lK59j11J7L7J47j42n3J81J28j45m6j36j44L29k31K00j49
2863c1J25O4j69QK6n6K9m9k1J23K4n9J31l06K1l9J16K98j50k55K02K0k7J24l30
$$ plain form
2888 -181 21 111 -49 193 -322 -63 213 -67 -135 184 -75 9 124 -22 62 -12 133 -152 5 -171 142 -254
2910 -254 12 100 -43 18 264 115 125 -96 236 131 6 -42 134 -61 168 -47 -236 23 -95 32 167
2931 167 -162 34 261 206 120 104 226 62 135 22 202 123 -30 173 -19 44 122 207 72 19 -68 -129 -15 -15
2955 -15 -82 -53 90 38 -150 46 95 76 -45 22 -27 29 108 -71 151 21 -41 -38 55 -77 -41 -4 122 -282 -62
2980 -62 -44 179 91 -43 -23 33 31 -119 -262 -78 14 -65 -162 -181 132 -103 50 55 189 23 -99 -226 -40 210
3004 210 -96 69 226 50 -124 110 204 91 211 37 -68 125 -117 227 -113 -31 -32 -96 1 -7 -25 269 -116
3027 -116 89 -138 118 225 2 23 -27 -82 -50 -22 63 -43 -15 -103 -26 59 -66 -43 -20 -140 -222 -5 -44 121 -47
3052 -47 -230 -110 -182 64 130 -71 -164 251 128 -101 166 -21 27 -76 -54 5 38 -31 -24 -43 50 216 -66 109
$$ packed form
2888a81K02R0j60K42n15K59K76k80o8L19k59Q4J15j46Q4p4J45k85J57j76L13l96
2910b54K66Q8j43O1K46j49J0k21L32j05j25m8J76j95K29k15j89K59j18J27J35
2931A67l29J96K27n5q6j6J22j64P3j13J80p9j53K03j92O3P8Q5j35n3q7o1J14%
2955a5o7K9J43n2j88J96M9j9j21O7m9N6P9j79K22j30o2LR3j32L6L7J26m04K20
2980f2J8K23q8j34K0N6kj50j43J84R2p9r7j9L13k35J53NJ34j66j22j27J86K50
3004B10l06J65J57j76j74K34R4j13J20j74j05J93k42L44l40Q2jo4R7qj8K94l85
3027a16K05k27K56J07k23K1n0n5L2K8Q5j06K8q8P7Q5j25K3K3j20q2K17l9J65j68
3052d7j83J20p2K46O6k01r3M15j23k29K67j87M8j03K2N9L3o9Pj9R3J66k82J75
$$ plain form
3076 109 99 146 -179 278 -24 97 -34 76 117 -170 -73 181 -146 64 -169 -112 103 77 118 -220 112 -45
3098 -45 31 -180 234 -12 -64 -63 -93 -23 -168 116 -137 -20 -264 -144 -118 45 14 -96 -34 -108 -374 -225 7 -227
3122 -227 -167 -150 190 -198 -140 104 197 -23 -161 -48 -122 -82 187 -68 196 -63 88 278 -61 -284 -57 -246
3144 -246 33 -35 223 70 32 168 204 -12 208 46 62 9 164 187 36 -184 -86 -4 107 -64 -33 169 71
3167 71 278 -38 -78 -187 17 206 81 -46 -24 -77 101 -78 32 -225 -160 -109 163 1 90 -74 -349 -126
3189 -126 -62 35 -229 -89 77 123 -20 19 -123 22 66 -115 -11 -1 81 183 -216 9 329 -152 -4 12 -210
3212 -210 -3 -14 -250 -31 15 -198 -239 113 -19 -107 134 -25 71 197 170 -27 116 -215 -184 -25 85 221
3234 221 162 147 7 235 -115 -158 -122 120 -35 -100 -95 -53 47 -30 126 240 4 -7 -137 61 -8 142 -54 -64
$$ packed form
3076A09j0M7l25M57l02J21j31J10M1k87R7K54l27K10k33N7K15k6M1l38L32j57
3098d5P6k11M14k46n2Jl0P0j45K84k53J17k44J20K6J63l1j10O2p4k66J49K32k34
3122b27O0J7L40l88N8K44R3k20j38J13p4M0K69k55K64k59J51J90l39k23K27j89
3144b46K79o8K58j53l8J36L6k16K20j62J6n3J55K3j51k20R8Q2J11j71L1K02r8
3167G1K07l16m0j09K04J89j25j27K2n3J78j79J10k57O5N1K72j62Q9j64k75K23
3189a26O4R7k64J40J66M6j43L9j42J45M4j81J04J0Q2J02l99K25L20m81J48J6k22
3212b10K07j1k36K19M6k13m1L52j32q8K41j59R6J26k7j97J43l31L1J59J10J36
3234B21n9j5j40K28l50m3L6K42j55o5NM2J00p7J56J14k36j1j30J98o9J50j96j0
$$ plain form
3258 -64 157 -88 -16 -66 -128 -73 -8 -143 -85 173 -126 16 -62 -137 -97 -31 -235 -130 8 -22 -34 -88 143 -166 -78
3283 -78 8 -85 23 271 40 -77 108 178 77 24 153 24 206 5 58 -97 171 284 68 -16 -25 -114 288
3306 288 5 -27 241 121 70 20 108 -120 183 -220 91 152 250 -141 144 -20 93 27 5 -219 -52 202 16
3329 16 49 121 17 84 15 -88 188 -134 -158 -76 -42 36 198 -184 28 -23 -191 -179 27 -70 11 -109 -23 93 -107
3354 -107 -197 35 -1 -99 197 -164 148 1 -45 -186 -325 -131 -142 -104 -12 -38 103 -281 54 194 269 -48 0
3377 0 -151 -216 26 -129 -61 108 131 96 80 298 164 118 182 -75 -18 219 190 215 -52 -82 83 110 -109 136 46
3402 46 225 186 31 -91 111 205 337 21 139 -65 57 36 -252 54 -144 -150 -141 -25 10 67 -131 -60 -232 279
3426 279 -77 -131 -51 -19 113 45 35 -91 141 358 47 -108 65 -30 27 -98 83 39 -52 92 123 -49 -175
$$ packed form
3258f4K21k45P2n0o2N5O5j35N8K58k99J42p8p5M0O6k04J05J38l0j2n4K31l09Q8
3283g8Q6r3J08K48k31j17J85P0j01n3J29j29J82k01N3j55K68J13k16q4rq9M02
3306B88k83l2K68j20n1n0Q8k28L03m03L11O1R8l91K85j64J13o6k2k24J67K54j86
3329A6L3P2j04O7o9j03K76l22k4Q2L4P8J62l82K12n1j68J2K06r7Q1j20Q6J16k00
3354a07r0K32l6r8K96l61L12j47m6j41j39J94j1L8R2k6J41l84L35J40P5l17M8
3377@j51o5K42j55O8J69K3l5j6K18j34m6O4k57N7K37k9K5k67l0J65K7k19K45r0
3402D6J79l9j55j22K02R4J32l16J18k04J22k1k88L06j98oRJ16L5N7j98P1j72N11
3426B79l56n4Q0L2J32o8j0j26K32K17l11j55J73r5N7j25J81m4r1J44L1j72j26
$$ plain form
3449 -175 -35 -35 -162 1 -316 73 33 -190 -4 -41 29 -80 -56 154 9 -138 -11 222 47 -33 -25 147 231
3472 231 -157 -98 135 -98 165 -64 -100 162 100 57 -136 178 -173 -318 68 266 -92 -19 51 40 270 249 -221
3495 -221 -31 16 50 -169 -6 -203 -151 61 -158 -169 66 133 -135 54 47 -51 58 -78 -3 362 -47 156 166
3518 166 -90 4 22 -179 -56 8 -42 251 10 -14 4 136 -144 -302 199 121 -225 161 31 101 134 90 -182
3541 -182 -39 -284 -96 -121 -62 -74 150 179 -151 -134 161 31 28 102 -31 -80 96 27 91 187 104 71 -162 103 -182
3566 -182 202 -227 -56 -94 -6 302 59 -17 103 121 -89 177 -123 19 133 5 -77 140 -11 5 125 17
3588 17 133 145 -236 217 -44 20 91 -127 -13 107 162 242 -39 -127 7 63 225 42 2 248 -73 -33 -62 19
3612 19 -95 174 126 402 197 -68 -40 -86 217 3 209 21 62 191 -180 -42 149 60 -115 118 212 193 188
$$ packed form
3449a75J40%j27J63l17L89m0k23J86l7P0j09K4K10j45j47J27K33j75q0QJ72Q4
3472B31l88N9K33k33K63k29l6K62o2m3j93L14l51j45L86J98l58P3P0j1K30k1m70
3495b21J90M7L4k19J63j97N2K12k19j1K35O7k68J89pr8J09j36P5L65m09K03J0
3518A66k56R4J8k01J23O4n0K93k41k4J8J32k80j58N01p8l46L86j30P0L3m4k72
3541a82J43k45J88k5N9j2K24K9l30J7K95j30lP4j33m9J76o9O4R6q3l3k33K65k85
3566a82L84m29J71l8Q8L08k43p6J20J8k10K66l00J42J14j28q2K17j51J6J20j08
3588A7J16J2l81M53k61O4P1k18J14J20N5Q0k81q8J34N6J62j83m0K46l21M0k9Q1
3612A9j14K69m8K76k05k65K8m6L03k14K06j88M1J29l71J38J91q9j75K33R4j9n
$$ plain form
3635 188 -126 34 174 87 136 -190 -157 87 -57 -81 -23 37 -74 21 -73 158 -247 -144 -9 83 -158 -152 -414 113
3659 113 -88 3 -162 -219 43 -225 170 -64 -82 -165 3 27 -107 45 46 59 -158 101 -38 -148 -62 110 72
3682 72 30 -94 43 13 100 205 28 16 -238 -20 53 -127 -110 40 -38 148 26 26 -101 135 191 70 11 30
3706 30 204 -34 32 -33 123 80 -36 177 -213 -212 -9 -13 41 50 219 169 49 -41 5 -201 -65 -108 -186 -30 16 -158
3732 -158 72 -5 -31 -34 248 195 51 -335 -144 19 279 -79 18 -13 -58 84 91 -48 54 -165 -62 71 -204
3755 -204 -31 105 131 69 21 133 -84 -99 -2 42 -35 2 40 29 -114 147 4 -126 56 -85 -15 -135 133 -41
3779 -41 50 -73 121 -132 -86 -37 -233 178 50 -139 70 -152 -14 -14 80 47 -148 149 -56 -34 -60 214 80
3802 80 105 63 -19 153 -4 123 -14 -133 -160 -105 -110 -112 116 113 -75 -2 -104 215 66 -59 -168 -18 102 244
$$ packed form
3635A88l14J60J40q7M9l26L3K44j44k4N8O0j11R5r4K31m05J03J35R2k41Ok62N27
3659A13k01R1j65n7K62k68L95k34j8q3J68K4j34J52JJ3k17K59j39j10Q6J72l8
3682G2m2j24J37l0Q7J05j77j2k54K18P3j80J7J50p8J86j22%j27K36N6j21n9J9
3706C0J74k38O6o5J56m3j16K13l90JK03mN4RJ69n0j20r0M6k06J36m3p8J56M6j74
3732a58K30p7k6lK82n3j44l86J91J63K60l58R7l1m5J42Pj39J02k19J03J33k75
3755b04J73J36K6o2m8J12k17j5R7M4p7L7L8j1j43K61j43j30J82j41P0j20K68j74
3779d1R1j23J94k53M6M9j96M11j28j89K09k22J38%R4l3j95K97k05K2k6K74j34
3802H0K5m2q2J72j57J27j37j19k7N5nkK28lj88P3j02L19j49j25j09J50J20J42
$$ plain form
3826 244 117 169 -33 -32 89 -126 24 -143 145 44 118 8 127 -33 -4 199 46 124 -185 212 -68 64
3848 64 256 -106 55 -145 -250 51 -171 138 -11 -271 50 70 -36 96 15 228 37 55 -247 -196 -20 52
3870 52 52 -70 -149 -189 -131 108 16 -102 5 144 56 23 144 -61 14 151 20 -99 -50 -162 -225 225 270 -7
3894 -7 -9 -85 -247 -4 117 -114 -94 -78 68 22 30 -104 155 -22 61 39 132 43 44 216 -6 -235 9 -147 99
3919 99 186 45 -94 137 51 153 150 -1 25 -18 -104 74 49 221 -180 86 115 25 -62 152 -227 46 110 -3
3943 -3 -71 19 -91 122 7 25 15 -30 87 -135 16 4 0 77 -135 81 -7 -50 -115 -170 139 19 -16 104 146 94
3969 94 112 -182 -79 51 -134 83 119 88 -226 54 -31 -29 87 20 157 30 11 -132 21 49 -105 14 -228
3992 -228 99 74 119 -172 68 61 214 104 -115 97 5 -108 114 -79 28 314 89 268 43 -44 104 81
$$ packed form
3826B44j27N2k02JJ21k15J50j67K88j01P4j10J19j60K9K03j53P8l09L97k80J32
3848F4J92l62J61k00j05L01k22L09j49k60L21K0j06J32q1K13j91J8l02N1J76P2
3870E2%j22p9m0N8K39r2j18J07J39q8l3J21k05P5J37j31j19M9j12o3M50M5k77
3894gkp6j62K43J21k31K0J6J46m6Qj34K59j77Q3k2R3q9JJ72k22k29K44j56K46
3919I9Q7j41j39K31q6J02lj51K6m3q6J78k5J72m01K66K9r0q7K14l79K73O4j13
3943co8R0j10K13j15J8j0m5J17k22J51j2mP7k12K16q8m3o5n5L09j20l5J20M2n2
3969I4J8k94J03J30j85K17L6l1l14K80q5KJ16o7J37j27j9j43J53K8j54J19k42
3992b28L27k5M5k91K40pJ53j10k19K12r2j13K22j93J07K86k25J79k25q7J48k3
$$ plain form
4014 81 -27 165 -101 -28 91 -7 -218 142 12 235 230 136 173 92 31 -25 147 -26 30 -147 3 41 34 -39 98
4039 98 90 -110 14 135 -5 -53 -64 -122 169 -42 -1 29 -114 -31 -68 232 -62 70 106 -169 -302 -75 22 97
4063 97 -8 -107 15 -9 108 -26 -121 44 181 40 -32 -217 -115 16 69 59 -132 84 85 -139 227 -227 111
4086 111 99 -29 -80 -245 0 -215 12 8 -35 -106 41 21 67 -102 -41 -203 143 -57 76 51 -111 65 -204
4109 -204 129 -65 39 103 125 -31 -80 14 -108 40 -114 -106 34 57 -164 -129 -94 161 -93 -61 230 -103 16
4132 16 117 -117 -164 77 112 -92 -169 10 -147 -76 246 147 -89 -163 -18 -138 -45 -168 36 -51 44 13 122 -4
4156 -4 161 89 119 -42 -55 236 105 317 89 37 -19 -109 -132 -271 -20 -80 216 153 9 -27 -179 -27 -252 -77
4180 -77 -167 -5 -28 108 68 -17 185 -16 166 87 37 162 63 -221 -181 5 31 23 -317 -200 33 138 -82 23
$$ packed form
4014H1j08J92k66P3J19r8k11L60j30K23nr4L7q1o1n6J72j73N6j77J50L8pp3J37
4039I8qk00J24J21j40m8j1n8K91k11M1L0j43Q3l7L00k94J32L6k75j33K27R7P5
4063I7j05r9J22k4J17j34r5J65J37j41p2j85J02J31N3j0j91K16Jk24L66m54L38
4086A11j2j28n1j65K45k15K27mm3p1J47k0M6j69O1j62L46k00J33k5j62J76k69
4109b04L33j94J04O4K2j56m9R4j22J48j54QJ40K3k21L5L5K55k54L2K91l33J19
4132A6J01k34m7K41L5k04p7J79j57P1L22r9k36p4J45j20R3j23K04q7R5l1J09j26
4156dJ65p2L0j61j3K91j31K12k28n2n6r0k3j39K51o0K96o3j44l6j52J52k25J75
4180g7r0J62k3J36m0q5K02k01J82p9n0J25r9k84M0J86K6ql40J17K33J05k20J05
$$ plain form
4204 23 100 83 -57 -26 255 25 136 -74 -75 44 -90 -6 15 -142 -52 21 31 -65 -172 -248 202 -35 70 -48
4228 -48 -182 -62 -1 -83 8 -2 310 93 74 -148 -228 -68 61 163 71 -112 82 -74 9 -276 -35 -144 -85
4251 -85 66 124 70 -262 -63 40 -126 136 -85 -127 -96 5 130 19 -87 -202 -148 -161 -87 -137 -143 -85 -75 -18 -102
4276 -102 -122 -22 -37 -23 -109 84 -35 -26 149 -108 201 297 239 -195 42 -18 -104 -277 122 -29 -31 -222 -31 80
4300 80 -92 -27 -150 184 -64 43 -72 -134 -177 92 98 53 93 -137 -75 -197 -4 -107 215 -76 -63 70 25 -180
4324 -180 -117 -45 36 16 -192 -242 -133 -5 -51 49 -243 -74 -211 -193 -44 23 12 254 96 -67 -135 133 102 -115
4348 -115 262 -146 39 170 66 7 173 -48 -153 -95 -180 -61 66 -132 23 28 -64 78 284 -147 -286 82
4370 82 251 9 -99 188 89 81 -82 125 -111 -146 -60 -327 -150 -5 128 221 35 -138 -56 132 -102 -169 -191
$$ packed form
4204B3P7j7j40L1K81k30J11k10jJ19j34Q4K1j57R0P3J0r6j07p6M50k37J05j18
4228d8j34J20O1q2R1j0L12k17j9k22q0J60J29J02r2j83J94j56Q3k85K41j09N9
4251h5J51N8n4l32J99J03j66K62k21m2L1J01J25j11j06j15N4j3P4n0oN8J0N7q4
4276a02k0J00j5J4q6J93j19RJ75k57L09R6n8m34K37o0q6j73L99j51kj91J91J11
4300H0j72O5j23L34k48J07j15o2m3K69Om5M0k30O2j22J93j03L22k91J3J33m5k05
4324a80O3P2Q1k0k08n0J09J28m6J00k92J69j37J8J49O7j1K42j58j63o8K68l1k17
4348a15L77m08J85J31j04n9J66k21j05N8q5J19J27j98J55Nr2J42K06m31j39L68
4370H2J69k42j08K87r9qj63K07k36l5Q6k67J77J45J33R3j86j73Q2J88k34o7k2
$$ plain form
4393 -191 -143 -229 -19 -28 145 -240 -152 -316 117 120 -100 -127 161 -70 36 -78 -6 280 -244 72 -45 -118 -169 -80
4417 -80 -280 -75 -286 80 19 126 241 -65 -94 -239 23 23 -6 81 -116 -25 -7 -50 -162 111 44 49 16 -173 -302
4442 -302 49 142 -49 114 -15 139 259 44 -109 195 30 -95 -123 -188 -16 141 87 100 -28 110 -52 41
4464 41 -144 -44 -59 39 -177 -61 71 -81 -107 -166 37 -102 -117 147 -43 -10 -26 83 -50 25 -60 268 -34
4487 -34 -86 -172 -157 -88 44 139 -2 -390 -107 -230 -114 -2 -111 113 -47 81 -28 207 -107 259 167 40
4509 40 24 -30 112 79 87 26 -61 63 148 141 79 -134 95 28 95 -27 -138 113 -10 -46 -13 47 -84 -17 -54 105
4535 105 -118 -143 -476 9 52 -253 -87 -37 -31 -63 -115 -75 -109 -161 69 -156 10 21 -108 -154 -132 158 -200 57
4559 57 -92 93 -172 61 -225 -265 194 102 -76 93 109 -55 -201 -163 -177 92 77 -89 6 -188 -29 -110 131
$$ packed form
4393a91M8q6K10rJ73l85Q8j64M33Lk20k7K88k31J06j14P2K86n24L16j17p3n1Q9
4417h0k00K05k11L66o1J07J15l06k9j45K62%k9Q7j97R1J8m3j12K73o7Nl3j89j29
4442c02L51R3j91J63j29J54J20k15j53L04j65j25k8o5J72J57n4J3j28J38j62R3
4464D1j85J00j5R8k16J16J32j52k6n9K03j39j5K64j90L3j6J09j33P5q5L28l02
4487c4n2q6J5O9J32R5j41l88K83j23J16J12j09K24j60J28j09K35l14L66r2j27
4509D0j6n4J42l3Qo1q7J24Q5po2k13K29o7O7j22j11K51j23l6L3O0j31O7l7J59
4535A05k23k5l33M85M3l05J66N0Ol2n2M0l4n2K30k25J66J1j29m6K2K90l58K57
4559E7j49J85k65K33k86m0M59r2j78J69J6j64j46L8j4K69j5j66R5j94J59q1K41
$$ plain form
4582 131 15 81 91 -90 253 83 291 107 49 111 -51 -47 87 -299 136 -178 -2 -130 81 112 48 35 14
4605 14 123 -156 -115 -29 -187 -225 -131 -29 9 -69 -221 52 -117 -129 122 -48 -146 -181 143 -47 -41 -85 11 126 -21
4630 -21 -75 14 -115 115 -27 91 216 -111 -277 -171 -83 -97 -130 -91 56 45 170 -185 -88 103 121 38 68 66 71
4655 71 -20 -103 -166 -159 -50 170 -34 43 132 -123 -3 36 48 137 -161 29 -124 120 37 133 137 -127 -50 -187 -149 -257
4681 -257 85 47 97 -38 177 -189 0 -115 70 -57 279 34 -66 -250 9 -140 153 168 58 35 -48 142
4703 142 -34 56 -19 -250 96 -284 -26 -222 -212 -293 -73 18 -33 -57 -120 91 69 123 2 319 134 72 -49 -104
4727 -104 34 190 48 -93 217 66 51 -55 238 79 -251 -3 -35 63 -8 210 -100 -65 176 89 63 -34 -32
4750 -32 -52 -115 -87 -41 -87 -195 268 -47 11 35 -21 90 196 349 135 26 -153 53 44 24 -55 251 -131 -98 75
$$ packed form
4582A31j16O6J0j81L43j70K08j84n8O2j62MJ34l86M35l14J76j28K11L1o4j3k1
4605A4J09k79M1Q6j58l8R4J02L8p8j52K73j69j2K51j70r8l5L24j90Om4R6J15j47
4630b1n4Q9j29K30j42J18J25l27j66J06Q8j4l3L9J47j1J25l55R7J91J8q3L0kN
4655G1r1q3o3PJ09K20k04P7Q9k55J20L9J2Q9k98J90j53K44q3R6Mk64P7j37L8j08
4681b57L42l8N0j35K15l66J89j15J85j27L36k45j00j84K59j49K93J5j10k3q3J90
4703A42j76R0p5k31L46l80K58j96J0q1K20R1n1k4o3K11k2N4j21L17j85o2j21n5
4727a04J38J56j42j41L10j51j5j06K93j59l30K48l2R8p1K18l10L5K41q7k6r7K
4750c2k0o3K8M6m6j08M63l15N8K4n6J11J06J53k14j09j79K06rk0p9L06l82L3J73
$$ plain form
4775 75 -23 44 8 -71 72 94 140 111 11 61 105 45 -44 15 105 -151 -274 249 170 -124 -128 65 34 9 88 189 -168
4802 -168 89 78 11 -68 150 129 27 -77 21 392 -113 -189 -249 -92 -170 -28 109 152 112 238 -19 129 105 -256
4826 -256 158 -310 105 -113 65 35 35 -147 49 185 -101 -105 225 -87 98 -34 237 -97 -101 305 -90 -169 -143
4849 -143 -111 269 35 177 -8 101 -147 -77 76 212 169 -11 -133 -22 -14 82 139 -95 -7 146 -31 120 272
4872 272 -42 -117 29 11 -74 -35 52 172 -85 -172 -150 -72 35 -32 -120 -51 -30 -44 -178 -53 239 48 -218 -98
4896 -98 -244 75 175 -3 238 100 22 205 -32 22 254 -31 250 -276 94 -104 -111 30 182 167 -84 -108
4918 -108 -56 49 -83 23 59 12 34 -120 10 140 -172 40 -55 -167 -85 75 57 65 -93 -168 -293 -148 103
4941 103 -144 -47 10 30 -26 -118 -50 223 106 49 202 107 102 29 -57 -30 -151 33 39 -197 -72 205 177 90 95 -196
$$ packed form
4775G5r8O7l6p9J43K2M6k9j00N0M4o0q9N9R0k56j23N23p9k94mJ93l1k5P9J01l57
4802a68K57j1o7p9K18k1j02j04R8L71n05p6o0J57p8J42J37M3m0J26k57J48k4l61
4826b56M14m68M15k18J78l0%j82J96J36k86mL30l12J85j32K71l34mM06l95p9K6
4849a43L2L80k34J42j85J09k48P0J53J36m3j80j22J11QR6N7k34Q8J53j77J51J52
4872B72l14p5J46j8q5L9Q7J20k57q7K2P8J07o7q8O9K1j4j34J25K92j91k66J20
4896i8j46L19J00j78K41j38p8J83k37N4K32k85K81n26L70j98pJ41J52j5k51k4
4918a08N2J05j32J06L6m7K2j54J30J30l12K12r5j12Q2J60j8Qj58p5j25J45K51
4941A03k47R7N7K0n6r2O8K73j17n7J53r5np3q6K7j21J84Ok36J25K77k8q7Nk91
$$ plain form
4967 -196 92 -33 -59 34 83 -55 317 95 81 97 -168 17 -124 133 -82 4 153 103 171 -60 -76 -36 -173
4990 -173 10 -73 45 68 -15 7 33 29 121 -27 -246 -41 -152 -219 36 179 -33 22 158 0 -105 -223 155
5013 155 -240 -168 -323 -182 -67 167 -67 76 238 195 46 -91 163 -8 96 -79 18 -131 93 28 117 5
5035 5 -13 139 -263 81 69 40 19 92 -267 -64 201 -139 -134 -99 -177 -157 5 138 -11 113 80 -31 59 -177 254
5060 254 66 -105 -41 -118 153 23 107 -142 57 -140 71 26 -69 -81 -38 13 -101 -9 10 88 -290 -104 8 78
5084 78 -59 66 -29 -51 -61 -2 -15 51 6 -59 -264 -55 237 -25 56 -115 -22 -88 230 259 -3 226 50 117 54
5109 54 176 -66 343 -114 45 11 -26 -5 10 -57 -124 -152 16 -61 50 -93 -110 263 -110 -107 45 -156 -61 -257
5133 -257 -67 -47 174 31 -27 -77 47 -41 -123 -132 -96 50 -30 143 -82 -50 -64 78 33 115 143 5 -42 -60 11 -253
$$ packed form
4967a96K88j25k6R3M9j38L72k22j4J6k65J85j41K57k15Q6J49n0O8k31j6M0j37
4990a73J83q3J18K3q3K2K6mR2j48k19K05j11o7K55J43k12N5J36j58j05j18L78
5013A55l95P2j55J41J15K34k34J43J62m3j49j37K54j71J04j75R7j49K24o5Q9j12
5035Ej8J52m02L44j2k9k1P3l59K03K65l40NL5p8K0J62J33j49J24l3j11R0k36M31
5060B54j88j71O4p7K71j30Q4k49J99j97K11m5r5j2M3N1j14R2J9P8l78J86J12P0
5084G8j37J25r5k2j0N9j3O6m5o5k05K09K92k62Q1j71R3o6L18K9k62K29j76O7o3
5109E4J22k42M09m57J59l4l7K1J5o7o7k8J68p7J11j43j7L73l73LJ52k01R5j96
5133b57J90K0K21j43n8n0J24q8q2rL6J46q0J73k25L2j4J42m5Q2K8j38m7j8P1k64
$$ plain form
5159 -253 -127 -6 -113 -425 -127 18 141 87 71 157 -11 -4 90 -269 -66 43 61 13 -147 29 156 32 -115
5182 -115 -122 -12 -20 -161 226 45 97 -159 204 -69 -102 136 -92 266 -211 30 -69 111 -156 -161 -50 -19 -41 -21
5206 -21 -74 29 -144 -124 20 -55 36 301 87 166 -139 -2 77 140 113 -59 -89 -46 -80 17 99 60 -157 123 208
5231 208 152 14 87 -17 -99 -4 169 84 -118 -52 3 -64 52 317 -127 30 -147 -16 -278 -12 276 193 29
5254 29 9 -202 213 -181 81 -22 29 -5 -55 183 113 -179 -149 147 -44 -95 -13 156 -59 54 233 -149 13
5277 13 -64 48 54 191 -182 -236 161 37 20 -144 49 -285 -148 -45 -60 22 -19 -52 -83 115 107 333 -113 -230
5301 -230 139 115 -208 69 -137 -10 130 -8 94 -4 40 99 16 25 -227 -288 35 -196 140 -114 -91 49 -73
5324 -73 94 127 22 -74 -79 4 136 -41 -88 -331 -22 206 -293 0 167 9 83 -12 -29 -15 -65 -50 -2 0 124
$$ packed form
5159b53J26J21j07l12K98J45J23n4j6Q6j68PR4l59K03J09J8m8j60J76J27j24j47
5182a15pJ10qj41L87j81N2k56L63k73l3K38k28L58m77K41r9J80k67nJ11L1k2K0
5206b1n3J03j73K0J44p5R1K65k14P9l05J37P9O3k7j72l0M3l4R7Q2l9k17K80Q5
5231B08n6j38P3j04q2R5J73q5k02O6N5o7J16K65m44J57j77J31k62K66K88q3j64
5254B9k0k11M15l94K62j03N1l4n0K38p0k92L0K96j91n1Q2J69k15J13J79l82J62
5277A3p7J12OJ37l73n4L97j24j7j64J93l34J37J03j5Q2m1l3l1J98qK26m46j17
5301b30L69k4l23K77k06J27J40j38J02r8M4N9q3Rk52o1L23k31L36k54K3J40j22
5324g3J67L3j05r6nQ3J32j77m7k43L09K28m99K93J67j58P4r5j7J4n0J5M8KJ24
$$ plain form
5349 124 107 -151 -108 -6 171 102 60 11 58 -172 -317 -144 -83 -119 -124 -53 102 -179 44 -20 -159 -100 135 43 178
5374 178 127 -129 220 -91 15 -72 -66 -135 -19 -125 -122 -90 -88 -209 188 -203 -125 274 53 -73 -65 175 402 4
5398 4 153 242 63 163 185 140 111 29 -105 -43 -163 55 71 77 -57 -205 -23 139 -27 14 21 41 -105 -93 -42 -33
5424 -33 148 161 124 -266 -208 -6 206 144 38 -150 -186 319 209 102 139 -44 130 69 -9 176 -163 -45 59
5447 59 -318 37 62 -163 77 -149 296 107 -57 92 133 -16 66 3 -60 -6 -159 183 227 -89 -3 -60 -165
5470 -165 -92 168 -83 56 -61 -53 -185 209 5 146 179 -297 -181 33 216 -207 -15 169 102 71 -51 180
5492 180 81 -90 287 -171 58 160 -103 -63 -94 120 -36 102 -92 5 -168 -30 140 -52 7 123 252 58
5514 58 -61 -66 112 157 -72 23 -70 -105 166 -28 200 -229 -67 -117 -27 90 147 -61 -25 6 -27 -63 66 230 -40
$$ packed form
5349A24j7k58M3J02J77o9m2m9M7k30j45J73O1l6nP1J55k81K23o4j39N9K35r2J35
5374A78n1k56L49l11J06q7Oo9J16j06LL2Kj21L97l91P8L99k21j26QK40K27l98
5398DJ49Q9j79J00K2m5k9q2j34O2j20K18J6Oj34j48J82J62j66M1PK0j46J2N1R
5424c3J81J3l7l90N8K02K12o2j06j88l6N05j10j07L7j83J74o1p8J85l39J18J04
5447E9l77L55K5k25K40k26M45j89j64J49M1j49Q2o3o3N4j53L42M4l16Q6n7j05
5470a65P3K60k51J39j17Qj32L94k04J41L3m76J16K14J83m23J92J84o7l1j22K31
5492A80r9j71L77m58K29J02k63M0l1K14j56J38j94R7j73J38J70j92N9J16J29j94
5514E8j19nJ78M5k29R5r3l5K71j94K28m29J62n0R0J17N7k08L6L1l3l6J29J64k70
$$ plain form
5539 -40 108 142 3 -98 357 -50 -92 -71 -75 -105 -37 -167 78 291 -53 60 -151 204 -2 44 52 94 -69 33
5563 33 110 -163 -207 59 -7 137 48 102 -28 125 -201 0 184 110 234 -107 81 30 58 144 68 11 -18 -139
5587 -139 311 72 165 111 -47 67 -71 -91 220 45 157 203 152 -230 -124 78 -140 234 -162 -83 -37 -253
5609 -253 298 136 161 -289 -13 156 -159 86 -123 -10 -1 -161 181 -127 61 103 -11 124 211 -26 37 255
5631 255 -128 190 -21 -284 270 174 -100 -87 26 13 -84 54 -95 -144 -92 -159 -79 -89 -99 89 1 58 23 15 86
5656 86 41 121 -227 -131 -63 -75 84 177 143 131 182 -125 -133 114 16 -38 -63 -78 139 -158 -5 -10 57 25 166 -311 -44
5683 -44 -50 115 -13 93 -124 -146 147 281 141 -41 172 53 -39 6 4 -175 -61 -132 -208 93 -171 -26 238
5706 238 202 45 -111 266 -33 -21 11 -35 -46 -64 -28 178 -2 -165 175 79 169 170 -9 -3 149 -4 -79 -113 -217
$$ packed form
5539d0J48L4j39j01M55m07m2K1ml0O8j30K45K13l44J13k11L55k06M6QM2j63J02
5563C3P7k73m4K66o6J44q9N4j30J53l26K01J84p4J24l41J88n1K8Q6p6n7k9j21
5587a39M50k39R3n4j58J14j38k0L11j75J12M6n1l82J06K02k18L74l96P9M6k16
5609b53N51j62K5m50K76J69l15K45k09J13Rj60L42l08J88M2j14J35Q7k37O3K18
5631B55l83L18k11k63N54r6k74J3J13j3r7J38j49m9N2o7Q0j0j0J88q8N7l5qP1
5656H6m5Q0l48R6O8j2J59R3l4j2N1l07qK47r8n4k5j5K17k97J53nO7l2J41m77K67
5683d4oJ65j28J06k17k2K93J34j40j82K13j19r2M5kj79J14p1p6L01k64J45K64
5706B38l6j57j56L77k99J2L2m6j1j8L6K06j80j63L40r6R0Jj79OJ52j53p5l4j04
$$ plain form
5731 -217 -161 -181 -91 18 -64 131 196 270 -43 -126 160 177 112 112 -173 -178 386 -91 1 -129 -200 -205 -61 -156 200 -288
5757 -288 -3 -101 84 104 -167 71 -18 -291 -63 98 7 196 220 -268 -51 69 45 39 -248 66 -63 139 52
5780 52 -4 112 117 194 -126 70 -120 76 -8 12 36 -29 -44 -256 150 225 58 -44 46 76 92 93 80 -43 -146 -223
5806 -223 86 -215 -107 22 190 139 38 -250 -169 93 -75 140 220 121 -81 -21 48 203 -77 115 5 133
5828 133 123 -220 109 -65 -143 -5 62 -75 30 -17 39 21 53 -102 -153 80 -52 236 5 192 172 34 118
5851 118 83 -79 134 167 -126 226 46 -179 255 -239 184 -100 -71 41 103 8 -3 56 127 -10 42 111 -17
5874 -17 -185 -305 316 19 187 -27 -149 355 139 -72 -65 -27 -3 -198 151 122 66 69 174 -137 -32 -54 141
5897 141 133 -144 -148 155 -32 -220 41 -175 1 8 -126 -20 3 8 -25 -70 -3 23 251 266 -114 -17 56 -42 33 -11
$$ packed form
5731b17N6k0R0J09q2J95O5P4l13q3K86J7o5%k85nN64m77R2j30p1nJ44r5L56m88
5757b88K85r8J85K0k71K38q9k73K28J61r1J89K4m88K17J20k4ok87L14j29K02q7
5780E2n6J16NP7l20J96j90J96q4K0K4o5j5k12M06P5j67j02R0L0J6Jj3j23j03p7
5806b23L09l01J08J29J68n1j01k88Q1K62j68K15Q0r9k02O0O9J55k80J92j10J28
5828A33j0l43L29j74p8J38O7j37J05m7N6j8L2j55n1K33j32K88k31J87k0j38Q4
5851A18l5j62K13L3k93L52j80k25M34m94M23k84K9J12O2r5j1N9P1j37N2O9j28
5874a7j68j20O21k97J68k14j22N04k16k11PL8K4j95L49k9n6LJ05l11J05k2J95
5897A41qk77mL03j87j88K61k16J76Pj34J06K3Nl3m5O7K6K28J5l80R7P3r8P5m4
$$ plain form
5923 -11 0 3 223 125 -104 -134 9 49 46 -104 38 -3 -195 -223 128 -137 0 56 113 -87 118 80 -138 -127 -81
5948 -81 10 -175 -6 44 -129 -252 76 -80 -35 155 168 -32 -82 -72 58 -33 -49 -109 143 -69 -140 18 -164 -139
5972 -139 25 -74 59 98 -58 -154 113 54 -58 249 83 45 -92 -110 -110 -28 -21 26 -72 35 -157 80 -151 -111 122
5997 122 213 -58 64 -114 20 116 -14 -33 192 -29 127 -41 113 -27 -59 24 -142 95 -237 117 -9 357
6019 357 -14 -80 -72 -29 -5 -170 205 -102 37 -67 104 32 -135 123 100 -182 -139 166 -237 124 -206 -95 -2
6042 -2 34 250 -88 -174 261 8 -88 -101 -81 13 169 -220 20 138 -19 -134 54 8 -27 10 -19 -205 -118 -40 -111
6067 -111 -8 -63 -39 -112 -166 138 70 -17 -79 -45 -78 -5 -176 70 78 -119 12 14 -285 -131 -37 249 -60 -85 -43 -105
6093 -105 -231 -79 -48 52 -95 -109 165 -108 -48 175 215 109 100 -167 -26 125 -69 -61 -100 -30 47 -30 37 -95
$$ packed form
5923a1J1LK20r8k29l0J43M0lj50J42m1j92k8L51k65J37N6N7k00K05l8k18J1M6
5948h1R1j85J69N0j73j23L28j56M5J90J3k00n0J0J30r1j6o0K52k12p1J58j82K5
5972a39J64r9J33L9j56r6K67n9j12L07j66l8j37j8%Q2PM7r8J07j92K37k31M0K33
5997A22R1k71J22j78J34R6j30j9K25k21J56j68J54j40l2Q3j66K37l32L54j26L66
6019C57l71o6QM3K4j65L75l07J39j04J71p2j67K58k3k82M3L05m03L61l30J11R3
6042bL6K16l38q6M35k53r6j3K0R4J56l89K40J18j57j15J88m6l5L7k9j86Q7P8p1
6067a11J03n5K4p3n4L04o8q7o2L4l3P3j71K46Qj97J31Kk99J54R4K86l09k5M2o2
6093a05j26J52L1J00j47j4K74k73O0K23M0j06rk67J41J51j94Ql9P0P7p7O7j32
$$ plain form
6117 -95 -6 63 89 -23 -112 4 -175 67 -101 54 289 63 -157 30 169 116 -38 -105 28 -56 -12 -10 -236 -34
6141 -34 127 109 -4 -11 81 175 37 -99 52 -62 211 -57 31 -241 141 -148 22 110 48 37 38 -102 -14 -27 -61
6166 -61 -67 -42 -11 -17 -7 -40 89 310 -74 213 18 22 -141 -202 46 -291 101 154 -82 60 -62 -51 -9 -84 -372
6191 -372 -163 44 -311 112 16 -127 -41 174 -25 46 11 -154 89 125 -256 8 118 202 -138 88 -156 26
6213 26 5 15 177 -9 31 -99 119 -64 150 165 107 97 -19 34 117 -243 42 101 124 -100 51 203 16 138
6237 138 -3 47 -134 11 -224 -175 50 -137 -172 114 15 195 257 -163 -107 102 -106 6 -178 -61 -112 -149 -13
6260 -13 -68 56 18 -147 -63 -98 -44 -143 109 19 169 148 -361 220 120 13 -53 80 9 -71 181 47 -189 119
6284 119 -105 -213 61 106 -14 -45 30 -79 3 -52 -142 -36 201 29 -64 36 202 135 -106 129 -60 26 91
$$ packed form
6117i5Q9O9K6j12q9J16j79K42j68J55K35k26k20J87J39n3j54o7J33q4M4Kk26K02
6141c4J61j8j13pR2R4j38j36J51j14K73k68Q8k72L82k89J70Q8o2j1Jj40Q8j3l4
6166f1oK5L1oJ0l3J29K21l84K87j95Mj63o1K48l37L92N3k36J42j22J1M2p5k88
6191c72K09K07l55M23r6j43Q6K15j99P1l5j65K43L6l81K64J10Q4l40K26k44J82
6213B6k1J0J62j86M0j30K18j83K14J5n8j0j16N3Q3l60K85N9K3k24J51J52j87J22
6237A38j41N0j81J45k35M9K25j87l5K86r9J80O2m20N6K09k08J12j84J17n1l7J36
6260a3n5J24l8j65Q4l5N4r9K52r0J50k1n09N81j00j07o6J33p1q0K52j34k36L08
6284A19k24j08K74M5j20l1P5j09Q2n5r0J06K37j72r3J00J66o7k41K35j89Q6O5
$$ plain form
6307 91 -72 81 -48 99 -92 0 224 -155 -54 -99 18 -42 -48 172 66 -83 143 177 194 -65 49 251 -96
6330 -96 304 -120 -16 175 -101 -11 -118 -56 294 -17 -201 -60 13 -33 -186 10 75 30 -20 1 -198 -70 98
6353 98 -38 -159 86 -41 -242 -72 -18 -63 231 -66 -64 0 124 37 156 122 -107 -49 -90 54 -137 -116 -70 -14
6377 -14 -233 66 -90 -117 157 -200 22 124 27 -78 -104 94 61 69 178 162 -106 -4 -26 -6 5 -208 -40 -62
6401 -62 -3 70 130 70 185 -64 63 -11 0 92 -3 78 69 128 29 -36 75 20 12 -19 21 -4 -146 2 -183 31 -259
6428 -259 124 -227 -3 189 -29 -230 0 232 370 226 -181 243 -51 -116 61 24 31 -174 52 -171 128
6449 128 20 -69 -79 -40 -102 -215 156 -68 118 36 -144 73 44 205 95 88 82 66 -53 -121 -15 120 65 -69
6473 -69 46 -4 106 -248 -150 292 209 -14 85 -83 -131 -3 119 8 193 163 99 -11 173 -53 -63 11 -97
$$ packed form
6307I1j63J53j29J47j91R2K24l79J01m5J17o0oK20j06j49K26L4J7k59J14K02l47
6330i6M00m24J04J91k76R0j07O2L50l11j84J41P3m6j53J96O5m5n0K1j99J28J68
6353I8j36j21K45j27k01J70N4m5K94k97KO4J24q7J19l4k29N8m1J44j91K1M6N6
6377a4k19K99j56k7K74l57K22J02r7j05k6J98l3QJ09j6k68J02k2K0J1k13J68k2
6401f2N9P3O0o0J15k49J27p4J1R2r5Q1rN9r9o5J11n5ql1M0k5j42J48j85K14k90
6428b59L83l51K24J92k18k01K30K32J38j44m07M24k94o5J77l7Pk05K26k23K99
6449A28j08q9j0L9o2j13L71k24J86q2j80K17k9J61j10poj6j19o8J06J35n5j34
6473f9J15n0J10l54R8M42q3k23R9j68m8J28J22j11J85l0o4j10J84k26j0P4j08
$$ plain form
6496 -97 38 -149 -79 2 -124 -125 -44 -74 42 60 188 -130 -178 -141 -184 55 -61 130 -303 -231 67 151 -74 -245
6520 -245 -15 135 68 174 4 39 24 98 -50 -193 169 6 -94 -47 12 -71 127 -265 -113 -15 91 103 78
6543 78 299 -213 -115 -163 65 19 88 -94 -8 184 -16 47 33 -36 -220 -5 -32 -79 67 -47 66 -78 192 -72
6567 -72 219 31 55 113 63 30 -27 -10 -17 297 79 -200 -190 153 -23 -99 -128 -75 234 -51 -61 211 5 3 -77 101
6593 101 57 132 13 -30 -119 -65 73 47 -49 87 23 -10 -3 -93 57 142 102 -113 15 -204 -205 -229 -56 -235 -54 167
6619 167 -258 -8 127 61 -78 -232 -2 -52 -245 265 -154 104 10 41 191 -225 58 -96 46 -75 295
6640 295 -94 -40 -164 -145 93 -56 -7 -97 -151 19 75 -157 70 -35 129 -162 -68 71 -13 116 -280 70 100
6663 100 16 -2 23 -129 -119 -39 -38 -47 -192 68 174 -85 80 166 -121 170 150 -39 -60 120 -153 -73 -214 -85
$$ packed form
6496i7J35j87P0Q1j26jQ1l0J16J8J28l18m8L7m3K39j16J91m33P2K98Q4k25j71
6520b45K30J50o7J06j70L5j5P4j48j43L62j63j00M7N9q3J98l92J52R8J06J2k5
6543G8K21n12R8m8K28m6O9j82Q6J92k00O3j4o9j84K15k7m7J46j14J13j44K70k64
6567g2K91j88K4N8n0l3n7J7pL14k18k79J0L43j76p6k9N3L09k85j0K72k06kq0J78
6593A01m4P5j19m3q9N4J38k6r6J36o4l3Pr0J50Q5m0k15J28k19jk4J73j79J81K21
6619A67m25K50J35o6j39j54K30n0j93N10m19K58r4L1J50m16K83j54J42j21L70
6640B95l89N4j24J9K38j49M9r0n4J70N6k32K27j05J64k91R4J39q4J29l96L50L0
6663A00q4j8K5j52J0Q0Jrj45K60J06k59J65Q6k87K91k0j89k1J80k73Q0j41J29
$$ plain form
6687 -85 -45 140 -11 50 -6 125 80 -245 39 11 162 122 38 -197 -4 -111 57 -30 -48 284 57 137 -142 -55
6711 -55 -68 -124 9 134 56 62 41 79 -215 183 49 65 -4 -218 -77 -97 -15 103 113 91 18 6 69 247 286 -231
6737 -231 38 -27 -7 81 221 -36 61 -48 -3 257 247 -175 241 -85 31 91 81 -150 -50 -10 131 -53 -304
6760 -304 -34 -187 -33 -24 82 -287 218 118 46 -27 69 132 -78 -23 16 316 -137 48 82 -43 65 -186 100
6783 100 -143 161 216 -108 99 -38 -56 193 163 -76 -209 -107 -22 -85 -198 -166 133 234 -148 247 29 -85
6805 -85 105 -27 154 93 99 -6 96 140 -26 7 -34 -99 25 -103 -4 -83 -55 180 -69 -1 -147 -101 -42 17 -19
6830 -19 102 23 106 -94 -49 188 -123 -7 129 -19 57 284 -272 0 11 -2 40 62 -186 -10 26 -213 -64
6853 -64 15 44 -91 241 127 44 81 54 246 104 -332 109 21 255 -42 -276 -14 -178 100 -213 -103 -32 15
$$ packed form
6687h5M0J85j51O1n6J31m5l25K84k8J51m0q4k35J93j07J68q7j8L32k27Q0k79Q7
6711e5j3n6J33J25p8Ok1L8k94L98j34J6o9k14J41k0Q2J18J0k2p3j2O3J78L9n17
6737b31K69o5K0Q8J40k57R7j09M5K60j0m22M16l26J16O0j0k31J00M0J41j84k51
6760c04K70j53J54RJ06l69N05j00p2p3R6O3k10N5L9L00m53J85L4j25J08k51K86
6783A00k43L04N5l24K07j37j8K49l0k39j33J02Q5o3j13L2K99J01l82L95k18j14
6805h5J90j32J81o1Oj05J02M4j66L3m1o5J24j28R9p9K8K35k49O8j46M6N9N9l6
6830a9J21p9Q3k00M5K37l11J16J36j48P6K27n56K72J1j3M2K2k48J76L6k39J49
6853f4P9K9j35L32j14q3L7k7J92j42m36M41q8K34k97k34K62j64K78l13J10P1M7
$$ plain form
6876 15 -62 -103 -179 100 128 255 -34 180 -149 -50 65 -59 101 -92 -147 30 149 189 -175 -128 145 51 75 45
6900 45 -113 192 249 -156 112 -63 4 -202 197 57 104 203 -125 -123 -206 62 -160 -150 -144 34 -1 -74 59 -288
6924 -288 -144 45 145 -119 -153 -54 126 94 88 127 143 -47 73 46 243 59 -49 165 -79 -79 -125 -141 -105 100
6948 100 225 96 41 87 129 78 -220 -121 -113 31 -82 -47 177 52 -142 -208 -66 261 210 -167 25 -107 172
6971 172 90 87 -133 6 103 -60 -171 189 33 -97 -84 55 127 -48 164 116 30 -202 -192 -15 24 91 -218 -100
6995 -100 204 18 37 -273 -136 -120 -44 -112 -37 -22 -89 93 169 -34 94 -33 -192 45 -176 -88 130 -222 -221 127
7019 127 87 141 172 -137 -172 -57 -168 160 41 174 -93 -103 -212 34 -99 -254 148 -71 82 -73 209 -189
7041 -189 74 -48 19 -58 64 3 -9 189 168 -141 62 216 -148 -199 46 182 -84 -59 -83 141 7 79 58
$$ packed form
6876A5p7m1p6K79K8J27k89K14l29R9J15j24J60j93n5J77J19M0l64M7K73r4K4l0
6900D5j58L05N7m05K68j75O7k06L99j40M7R9l28Kq3K68k22J0OJ78l5p3J33l47
6924b88J44J89J00k64l4R9J80l2oL9J6j90J20k7J97j84j08K14k44%m6j6L6K05
6948A00J25j29n5M6M2n1k98R9QJ44j13L5K24j25j94o6J42L27n1l77J92j32K79
6971A72q2lk20J39R7j63j11L60j56j30J3J39P2j75K12m8q6k32J0J77L9O7l09J18
6995a00L04j86J9l10J37J6P6o8P5J5o7J82P6k03J28j27j59K37k21Q8K18l52JL48
7019A27m0N4L1l09l5J15j11L28j19J33k67j0j09K46j33j55M02k19J53j55K82l98
7041a89K63j22O7p7J22o1j2J98k1l09K03J54l64n1K45J36k66K5k4K24j34P2k1
$$ plain form
7064 58 50 -310 88 173 -77 -111 -23 17 -116 24 65 76 -114 112 19 -51 -27 -92 208 80 103 -215 -118 -49 19 194
7090 194 -220 -92 89 81 142 19 55 -159 -233 28 30 68 54 -22 118 -42 41 43 -88 182 3 21 161 9 -155
7115 -155 67 -283 52 -26 -96 84 -286 -24 151 -141 58 85 -24 -148 88 -310 -226 136 124 172 68 40
7137 40 125 -272 -159 162 -6 95 -6 -2 -70 -116 -18 -18 -133 -70 -15 41 -87 42 137 -166 -129 -109 -29 -133 -106 -165
7163 -165 -71 -67 -24 -127 -258 -43 116 -31 208 -4 -47 -207 114 -80 -130 -27 -182 92 29 171 -44 -160
7185 -160 -76 -328 40 323 -120 -159 158 14 -111 -74 -21 52 -59 239 -55 -32 -85 34 -447 -133 216 40
7207 40 43 13 -175 42 21 6 -80 -217 269 75 -122 -88 -128 -20 105 122 7 -94 61 114 -17 -126 -173 55
7231 55 -189 -76 4 -236 147 -31 -236 54 224 91 -129 -57 244 -203 -17 200 -204 0 -11 -97 -27 8
$$ packed form
7064E8ql60L98Q5k50l4Q8M0j33J40M1J1j90K26r3p0K4o5L00j28K3l18R7O9O8J75
7090A94m14J28J81qO1j23L6k14p4K61KL8j4p6J40j60Q3Kj31K70j79J8J40j52j64
7115a55K22l50L35p8p0J80l70K62J75k92J99K7j09j24K36l98Q4L62j2M8j04k8
7137D0Q5l97J13L21j68J01j01Mo8m6R8%j15O3N5N6j28J29R5l03L7K0Q0j04K7n9
7163a65R4MM3j03j31K15J59j47K39k12m3j60L21j94n0J03j55K74o3J42k15j16
7185a60Q4k52L68K83m43l9L17j44j25L7N3P3j11K98k94K3n3J19m81L14L49j76
7207D0Ll0j88K17k1j5q6j37M86j94j97L4m0J08J25J7j15j01J55N3j31j09m7K28
7231E5k44J13Q0k40L83j78k05K90J70j33k20P2L01m47J86K17m04K04j1q6P0L5
$$ plain form
7253 8 -25 63 49 -32 8 90 86 85 25 -197 64 -100 106 213 -36 52 349 20 20 302 -263 105 88 40 7 -122
7279 -122 310 70 139 -122 -58 -13 162 98 -184 -195 28 55 178 -119 -88 -126 98 54 -119 286 112 43 91 -72
7303 -72 -168 -105 -131 -48 -275 -95 138 130 -58 182 365 88 -12 152 74 -192 -287 -143 289 -40 27 104 64 25
7327 25 43 19 -146 118 -52 -75 110 -44 -171 -79 149 -40 181 -5 -157 58 -104 -140 -308 82 5 213
7349 213 71 -2 145 90 -6 95 15 167 205 17 76 -190 63 213 217 36 -91 -23 -119 78 -17 -277 147 -162
7373 -162 -61 141 0 -193 86 -280 -143 82 134 -103 54 38 -42 -34 9 -127 45 96 -1 -56 -374 105 -6
7396 -6 277 274 -27 -26 -306 66 139 -38 -251 52 -238 -95 -90 -112 59 29 132 -54 -27 -145 40 26 -223 -184 114
7421 114 -33 59 -49 -186 -73 43 34 -25 -122 -188 239 191 -293 57 226 -116 -99 -18 40 40 298 -31 117 335
$$ packed form
7253Hl3Q8j4q1M0Q2mjo0k22K61j64K06J07k49Q8K97l29%K82n65L68j7m8l3j29
7279a22M32k40O9k61O4M5J75o4k82j1K23K7J23k97L1l8K24m4j73M05j74o9M8j63
7303g2r6O3k6Q3k27J80K33qj88K40J83k77j00J64p8k66r5J44M32l29O7P7m0l9
7327B5J8k4j65K64j70k3J85j54j27R2K28j89K21j86j52K15j62l6j68L90p7K08
7349B13j42p3J47n5r6J01q0J52L8j88N9k66K53J50Mj81j27O8r6J97r5k60M24l09
7373a62J01K02j41j93K79l66J37K25N2k37J57j6q0QM3j36J72N1r7n5l18M79j11
7396fK83ll01Jk80L72P3j77k13L03k90J43Nk2J71l0J03j86K7j18J85j4k49L9K98
7421A14j47R2j08j37J13J16rn9r7o6M27m8m84L50J69l42J7Q1N8%K58l29J48K18
$$ plain form
7445 335 -40 -242 47 17 -14 -384 -111 160 -45 101 12 -104 -111 -100 18 -76 109 38 -123 -21 21 91 167 -148
7469 -148 240 -131 10 -174 8 -211 48 227 8 -229 130 -19 -208 -117 -2 181 21 -54 111 108 43 -58
7491 -58 -237 36 -82 148 110 -117 -131 -55 -33 227 290 -26 126 -53 -42 -63 -34 -100 16 33 -67 283 -33 -29
7515 -29 -37 -24 -163 -9 -6 162 -166 -163 -216 -159 -27 -105 -212 43 -76 328 -92 -200 -28 102 -72 -85 98 -98
7539 -98 108 116 -17 144 -75 -70 -181 -141 -51 83 -13 -90 -141 286 -25 -310 -13 85 -28 -84 91 13 -289 -166
7563 -166 -146 33 9 -26 -78 97 -90 248 2 -128 43 -37 136 -91 5 -67 -240 -205 -14 -110 25 0 1 102
7587 102 20 -110 292 117 232 64 -26 67 45 20 -38 172 -46 -100 -194 -71 -128 -103 -23 137 198 145 -315 -163
7611 -163 59 -7 -157 98 -12 60 128 42 112 -142 -129 -65 -101 -274 -123 -279 -219 62 -13 -3 131 -133 120 68
$$ packed form
7445C35l75k02K89l0l1l70K73K71k05J46q9j16pJ1J18r4J85p1j61J02M2P0P6l15
7469a48L88l71J41j84J82k19K59J79k19k37L59j49j89R1J15J83j60p5J65lo5j01
7491e8j79K73j18K30l8k27j4P6K2K60O3l16J52j79J1k1K9o6J16J7j00L50l16M
7515b9qJ3j39J54LJ68l28Ln3N7J32p8j07K55j19M04m20j08J72J30j74j3J83j96
7539i8K06Qj33J61k19Nj11M0R0J34r6p7n1M27l11k85K97R8j13n6J75p8l02J23
7563a66K0J79k4l5n2J75j87L38k46j30J71q0J73k27R6p2j73L5J91r6J35k5JJ01
7587A02q2j30M02j75J15j68r0R3k2k5n8K10k18n4r4J23n7K5Q0J60O1n3m60J52
7611a63K22o6j50K55j10P2O8q6P0k54J3O4l6j73J51j56O0K81p5J0J34k64K53n2
$$ plain form
7635 68 96 172 157 -149 50 -170 222 146 -60 366 83 -234 31 71 -14 239 -109 21 -114 71 -104 228
7657 228 175 -7 -20 -70 4 -26 -51 -110 -77 -93 102 89 203 189 65 -45 -56 -51 -164 -128 -93 19 -60 32 173 95
7683 95 181 78 31 178 28 17 40 -52 -114 -99 161 217 58 -21 -42 -81 -56 -400 -28 267 -49 52 -105 -37 -125
7708 -125 -279 -58 141 -88 -404 -198 17 141 263 273 32 -156 -149 32 145 -37 86 -35 -119 18 0 -63
7730 -63 -88 -134 -38 -80 74 -79 17 213 247 -145 -60 52 -99 -210 -58 -129 -141 -48 23 -175 106 151 -2 32 -205
7755 -205 -387 79 -1 34 -1 235 -25 164 138 117 -169 109 79 -120 245 -218 -58 -171 72 203 163 61
7777 61 -64 73 -194 81 179 17 -172 425 76 91 71 -14 162 176 -116 5 47 65 28 -158 -74 109 -70
7800 -70 -77 -14 23 18 -99 -153 -113 -95 195 42 -119 172 -32 -71 -139 248 -6 -308 -373 133 -81 68 -61 -63 -85
$$ packed form
7635F8K8P6j5l06J99k20L92p6k06M26k83l17K65M0q5K53l48J30j35J85j75L32
7657B28n3j82j3n0P4l0k5n9L3j6J95j3J14j4j24j10j1Nj13L6L5J12p9R2J41p8
7683I5Q6j03m7J47j50j1K3r2o2J5K60N6j59p9k1l9K5l44L72K95l16J01j57O8q8
7708a25j54K21J99k29l16K06K15J24J22J0k41j88PJ81J13j82J23j21q4J37j8o3
7730f3k5m6R6m2J54j53R6J96L4l92Q5J12j51j11J52p1j2R3P1j98K81M5j53L4k37
7755b05j82M66q0L5l5K36k60J89k6k1k86K78l0j99L65m63J60j13K43J31m0j02
7777F1j25J37k67K75R8j62j89N97l49J5k0q5J76J4k92J21M2J8l7j86Q4J83j79
7800g0pO3L7nj17n4M0J8K90j53j61K91k04l9o8L87k54l02o5N06k14J49j29kk2
$$ plain form
7825 -85 50 83 93 152 -13 -155 21 3 53 232 -78 108 -203 87 82 -106 108 125 -77 -375 117 -110 36
7848 36 -76 -11 -129 -275 -37 -7 -163 241 -82 165 -171 18 -150 -101 5 -93 132 167 4 8 18 -16 153
7871 153 25 -5 103 51 0 -50 17 28 -10 132 130 179 135 -145 35 -43 -176 142 131 93 -36 -2 60 -227 8
7896 8 56 -187 -57 -137 20 -45 -132 -223 120 1 -143 -16 18 -94 -87 183 229 -119 -55 71 74 138 -42 206 -12
7921 -12 114 -67 -156 -222 -169 -146 -4 64 -183 -171 111 45 -95 -34 -101 105 202 -181 72 -187 138 -138 -98 21
7945 21 -94 44 -27 -12 206 5 -225 154 67 -110 163 16 -210 167 -121 -7 -94 -32 106 -154 47 87
7967 87 90 -103 -373 -81 -165 -131 28 122 197 141 -68 171 -58 117 -60 -233 265 -221 -103 -46 143 -111 140
7990 140 12 -68 18 -16 191 320 22 39 -54 -173 7 40 -36 43 -61 71 -220 -119 38 -78 114 -87 -114
$$ packed form
7825h5J35L3J0N9j65j42J76j8N0J79l10J86l11K90nj88K14J7k02k98M92k27J46
7848C6j12O5j18j46K38L0j56M04l23K47l36J89j68M9J06r8K25L5j63MJ0l4J69
7871A53j28l0J08n2n1n0O7J1l8J42kM9m4k80J80p8j33L18j1l8j29L4O2k87K35
7896HM8k43J30q0J57o5q7r1L43j19j44J27L4j12PK70M6l48O4J26LO4j80K48k18
7921a2J26j81q9o6N3K3J42O8k47J2K82o6j40O1o7K06R7l83K53k59L25k76M0J19
7945B1j15J38p1J5K18k01k30L79q7j77K73j47k26L77k88J14q7O2J38k60K01M0
7967H7Lj93k70K92q4L4J59R4P5n6k09K39k29J75j77j73M98m86J18N7J89k54K51
7990A40j28q0Q6l4K07J29k98J7r3j19J80L3p6P9j04J32k91J01J57j16J92k01k7
$$ plain form
8013 -114 -137 -216 -77 -13 159 -131 -97 177 -165 -21 87 -38 -169 14 -57 -68 -51 -52 146 -99 9 -15 157
8036 157 80 -25 -134 186 32 -59 -60 -255 -8 -87 53 -170 172 93 -97 -48 57 -90 32 -50 -237 174 -10
8059 -10 -7 -188 258 -50 15 63 -69 -68 -263 317 27 -137 -96 -119 1 -314 27 82 87 -71 69 -264 130 158
8083 158 -286 -115 67 -55 -149 22 -2 -37 -224 -84 -82 -168 3 -263 72 -32 30 49 57 196 63 24 -115 264
8107 264 85 -105 49 17 -26 -71 181 194 -117 87 -211 191 159 100 112 -65 -130 113 -347 57 -42 -74 354
8130 354 -28 -84 -80 -4 -81 179 -216 -53 -41 -321 68 113 -66 -129 410 63 118 -323 61 -35 50 -62 -87 198
8154 198 -78 -32 -60 -164 161 24 95 -132 222 29 -130 -170 -165 -104 107 -96 164 189 38 -62 -35 61 336
8177 336 212 -10 -50 -79 -210 27 -185 -311 -161 47 -195 -14 52 -43
$$ packed form
8013a14k3p9J39O4J72k90L4K74l42J44J08j25j31J83p1j1J7jJ98k45J08k4J72
8036A57p7j05j09L20j54r1jj95K47p9J40k23L42p9j90M9J05j47J22q2j87M11j84
8059a0Lj81M46l08O5M8j32Jj95N80k90j64M1k3J20l15L41N5Nj58J40l33L94K8
8083A58m44J71J82j22r4J71k4l5j87J40Kq6J71k66L35j04O2J9QJ39j33l9j39L79
8107B64j79j90J54l2m3m5K52J3l11K04k98M02l2n9J2j77o5K43m60M04r9l2M28
8130C54l82n6MP6p7K60l95J63J2k80L89M5j79o3N39l47N5m41L84r6Q5j12k5K85
8154A98k76M6k8j04L25j37P1k27L54j93j59m0NO1K11k03K60K5j51j00K7R6K75
8177C36j24k22m0k9j31K37k12j26J50K08k42J81O6r5
8191d3
$$ Imaginary data points
##PAGE= N=2
##DATA TABLE= (X++(I..I)), XYDATA
$$ plain form
0 0 0 0 0 0 0 0 0 0 0 0 0 0 0 0 0 0 0 1 -8 8 -8 8 -8 8 -16 16 -16 21 -24 25 -32 33 -40 46 -49 57 -65 72 -80 88
40 88 -100 111 -122 135 -150 165 -183 202 -220 244 -267 297 -325 360 -396 439 -488 543 -607 684
60 684 -775 887 -1029 1215 -1467 1833 -2414 3489 -6138 28855 22739 -24007 7954 14159 -3084
75 -3084 -5848 11202 3192 9594 -177 1351 6474 519 -2781 2992 10445 -130 2624 1866 947
90 947 675 -4194 1538 4312 3061 -6473 5511 -1944 -7549 915 -1937 -1469 1563 -1325 -7567 4234
106 4234 -6761 -9087 3358 -1651 -3705 -2674 -393 -6532 -2345 -6956 -1564 1989 -6803 -916 1497
121 1497 -4132 -9731 4942 -2093 -6894 5142 1758 -5360 -2272 5045 -5372 -707 2798 2349 1681
136 1681 -1870 2672 958 187 -1856 7313 2160 429 4239 405 3443 489 1091 3080 7611 -1781
$$ packed form
0@%%%%%%%%%%%%%%%%%JrJ6j6J6j6J6k4L2l2L7m5M9n7O5p3Q6r5J06j22J37j52J68
40H8j88K11k33K57k85L15l48L85m22M64n11N64o22O85p56Q35r27J031j150J291
60F84j459J662j916K244k682L300m247N903r627L4993o116m6746L1961O205j7243
75c084k764J7050q010O402r771J528N123n955l300N773P453j0575K754p58r19
90I47k72m869N732K774j251r534J1984p455n605Q464k852M68L032k888o242J1801
106D234j0995k326J2445n009k054J031K281o139M187m611N392L553q792N887K413
121A497n629n599J4673p035m801J2036l384p118L088P317j0417M665L505m49o68
136A681l551M542j714p71k043R169n153j731L810l834L038k954O02J989M531r392
$$ plain form
152 -1781 1364 8219 -2184 -631 4012 4448 -1265 4638 1922 -306 2787 -1384 474 2109 3237
167 3237 -3364 1980 1732 -2313 -1733 -1514 2347 -1673 -1772 -1525 2829 -5014 -5041 2778 -2221 -3293 -2118
184 -2118 1070 -3962 -2807 -3357 -1130 -783 -4620 348 -1470 -1673 -4579 -620 -1588 -2197 -313 -1335
200 -1335 1316 -2774 -873 -1516 1110 -1824 -202 3144 -1649 947 472 900 -1101 3175 618 593
216 593 4013 -237 1973 962 2642 65 3136 2501 1645 2652 582 3258 116 2621 1908 3056
232 3056 845 1140 3584 -1158 1385 1110 1850 -667 2221 390 -1017 1067 -1543 905 -988 458
248 458 -1503 630 -1301 -2251 -209 -2250 -180 -2503 -89 -2029 -1825 -2235 -2088 -558 -3620 -184
264 -184 -1907 -1237 -2721 -1106 -1780 -2299 34 -2529 202 -1565 -718 -1580 -273 -763 -1206 1002 -1059
$$ packed form
152a781L145O855j0403J553M643M36n713N903k716k228L093m171J858J635J128
167C237o601N344k48m045N80K19L861m020r9K47M354p843k7P819m999j072J175
184b118L188n032J155n50K227L47l837M968j818k03k906L959r68o09J884j022
200a335K651m090J901o43K626k934J622L346m793K596m75M28k001M276k557k5
216E93L420m250K210j011J680k577L071o35q56J007k070K676l142K505p13J148
232C056k211K95K444m742K543k75P40k517K888j831j407K084k610K448j893J446
248D58j961K133j931r50K042k041K070k323K414j940K04m10J47J530l062L436
264a84j723O70j484J615o74n19K333k563K731j767Q47q62J307m90m43K208k061
$$ plain form
281 -1059 1167 -1245 832 -230 560 714 691 2214 -671 2670 345 1275 742 2084 1361 947 3211
298 3211 345 2762 694 2083 1150 2147 1462 823 2793 -146 2025 269 1620 469 1264 891 -150
315 -150 1641 -1104 927 -342 453 -798 133 -260 -1595 244 -2141 -99 -1715 -712 -1292 -897 -1335
332 -1335 -2030 -455 -2497 -367 -2231 -865 -1928 -1488 -898 -2313 -564 -2311 4 -2144 -515 -1194
348 -1194 -929 -637 -1568 711 -1625 561 -805 312 -250 -180 298 158 1789 -630 1654 216 1212
365 1212 783 887 1750 774 2003 438 3019 444 1339 1378 1573 1616 378 2417 387 1963 435 1262
383 1262 821 731 1380 417 1836 -386 1373 5 687 50 93 120 -735 830 -1699 159 -584 -449 -950
402 -950 -1026 -240 -1620 -573 -2060 -134 -1924 -989 -1148 -1083 -783 -2647 -36 -1394 -1336 -2085 -66 -1000
$$ packed form
281a059K226k412K077j062P90J54k3J523k885L341k325R30n33J342p23m14K264
298C211k866K417k068J389r33R97o85o39J970k939K171j756J351j151P95l73j041
315a50J791k745K031j269P95j251R31l93j335J839k385K042j616J003n80L95m38
332a335o95J575k042K130j864J366j063M40N90j415J749j747K315k148J629o79
348a194K65K92r31K279k336K186j366J117n62P0M78j40J631k419K284j438R96
365A212m29J04Q63r76J229j565K581k575Q95L9J95M3j238K039k030J576j528Q27
383A262m41r0O49r63J419k222J759j368O82o37M3K7q55J565k529J858p43J35n01
402i50p6P86j380J047j487J926j790R35j59O5L00j864K611j358N8p49K019r34
$$ plain form
420 -1000 -1644 -601 -1327 15 -1418 185 -956 -275 -50 -917 161 11 1057 -1206 1357 515 402
437 402 366 320 1792 452 710 200 2574 285 462 1548 1474 1184 -79 2931 875 716 754 2147 726
456 726 275 1459 373 1738 -313 984 659 824 141 -197 974 -207 325 -1153 922 -504 -385
473 -385 -431 -746 437 -1731 -946 -840 433 -2569 -880 74 -1607 -1682 -1509 417 -2429 -1189 -580 -803
491 -803 -1602 -1471 -260 -1631 -155 -2276 -182 -209 -983 -881 -122 94 -1283 796 -432 126 -47 800
509 800 231 -4 1688 -680 320 1188 1523 -852 1379 1952 35 1205 665 2089 358 1357 930
526 930 1094 1012 494 1415 219 1648 -239 1443 865 135 666 165 780 -178 1074 -981 762 0
544 0 -629 -25 -301 349 -1655 121 -320 -480 -1464 -420 -347 -1103 -480 -1860 560 -1107 -1745 -597 34
$$ packed form
420a000o44J043p26J342j433J603j141O81K25q67J078j50J046k263K563q42j13
437D02l6m6J472j340K58n10K374k289J77J086p4k90j263L010k056j59L8J393j421
456G26m51J184j086J365k051J297l25J65o83l38J171j181N32j478K075j426J19
473c85m6l15J183k168P85J06J273l002J689R54j681p5J73J926k846J240O09k23
491h03p99J31J211j371J476k121K094k7p74J02P59K16j377K079j228N58j73Q47
509H00n69k35J692k368J000Q68L35k375K231N73j917J170n40J424j731R99m27
526I30J64q2n18R21j196J429j887J682n78p30N31n01O15r58J252k055J743p62
544@o29O04k76O50k004J776m41j60r84J044P3p56O23j380K420j667o38J148O31
$$ plain form
563 34 -1578 -1734 404 -1415 -996 -1404 35 -1108 -1130 201 -995 -83 -593 99 -972 570 -376 -421
581 -421 678 96 735 -699 1161 489 298 171 1242 631 83 1380 246 1864 86 781 1472 862
599 862 569 590 1712 -90 988 649 1194 366 170 1229 343 838 -160 1085 -133 322 17 -235 104
618 104 -600 749 -952 183 -223 -243 -564 -361 -483 -878 -241 -1229 -166 -1431 -640 -524 -1001 -662 -1299
637 -1299 -401 -1345 -109 -1007 -493 -735 -1095 -305 -1029 117 -1115 93 -672 -240 -363 -376 5 -493 570
656 570 -860 597 125 288 173 447 947 37 1062 431 1392 513 711 991 516 783 396 1350 125
675 125 1170 382 849 888 210 821 615 1165 -144 909 79 509 422 177 516 -467 615 -182 487 -322
695 -322 -141 -21 -649 43 -694 119 -1040 102 -812 -801 -347 -953 -441 -885 -133 -1189 -208 -856 -753 -637
$$ packed form
563C4j612j56K138j819M19m08J439j143k2J331j196R12n10O92j071J542r46m5
581d21J099n82O39j434J860o72j91j27J071o11n48J297j134J618j778O95O91o10
599H62k93K1J122j802J078l39N45q28j96J059q86M95r98J245j218M55l05k52L39
618A04p04J349j701J135m06k0l21K03j22l95O37r88J063j265P91J16m77L39o37
637a299Q98r44J236q98N14k42l60P90p24J146j232J208p65M32j23j3L81m98J063
656E70j430J457m72J63j15K74N00r10J025o31R61q79J98K80m75K67l87R54j225
675A25J045p88M67L9o78O11k06N50j309J053q30M30q7k45L39r83J082p97O69q09
695c22J81J20o28O92p37Q13j159J142r14J1M54o06N12m44P52j056R81o48J03J16
$$ plain form
715 -637 -944 -371 -1285 -173 -822 -175 -901 -247 -331 -748 -2 -798 172 -566 217 -203 -94 278 132 336
735 336 131 754 -202 783 603 407 567 515 977 75 979 431 917 588 845 1092 222 872 568 1335 165
756 165 939 487 411 828 298 781 116 707 -241 557 127 -3 371 -264 118 -534 209 -562 -183 -661 -341
777 -341 -532 -808 -112 -951 -239 -1111 -658 -926 -757 -464 -1008 -106 -1019 -372 -1068 -482 -685 -697 -176 -855 -65
798 -65 -841 -24 -780 -151 -5 -137 34 -512 506 -114 816 -40 530 193 552 759 -54 713 403 848
818 848 244 893 778 658 807 367 926 234 926 376 678 629 431 703 187 249 -235 777 -103 339 24
839 24 72 287 -391 81 -452 238 -601 -88 -135 -522 7 -638 37 -894 -296 -596 -174 -309 -721 -541 -733
860 -733 -106 -1057 -273 -565 -676 -244 -494 -113 -688 -158 -882 109 -940 -296 -161 -426 259 -543 459 -350
$$ packed form
715f37l07N73r14J112o49O47p26O54q4m17P46p96R70p38P83m20J09L72j46K04
735C36k05O23r56R85j80j96J60n2M62r02R04n48M86l29K57K47q70O50l04P67j170
756A65P74m52p6M17n30M83o65N91r48P98m30j30L74o35L82o52P43p71L79m78L20
777c41j91k76O96q39P12q72M53k68J69K93n44R02r13O47o96N86k03j2N21o79P90
798f5p76Q17p56O29J46j32J71n46J018o20R30q56N70l37L59K07q13P67l10M45
818H48o04O49j15j20J49m40N59o92O92n50L02m9j98K72n16O2m84J012q80M42l15
839B4M8K15o78M72n33O90q39N13m7l87N29o45O75r31N98l00M22j35m12J80j92
860g33O27r51P84k92j11M32k50L81n75N30p24R91j049O44J35k65O85q02J002q09
$$ plain form
880 -350 319 -24 428 440 177 554 -174 641 278 705 99 548 697 222 652 373 1049 -93 718 427
900 427 410 532 244 960 242 562 -306 807 117 196 468 151 187 7 257 -140 120 -378 82 -304 -305 -186
922 -186 -853 243 -607 -432 -707 -216 -385 -701 96 -920 -154 -1036 -101 -359 -791 -197 -488 -133 -688 71
942 71 -813 -31 -589 -488 -65 -333 -71 -231 394 -225 249 -175 236 209 -27 440 -406 828 -207 91
962 91 422 289 372 99 823 133 664 440 689 444 174 663 333 659 37 676 170 487 3 563 446
983 446 -250 605 -117 333 -57 441 -213 137 224 -516 203 -483 38 -259 74 -157 -473 50 -516 -95 -706
1004 -706 -125 -801 -147 -327 -591 -247 -680 -253 -734 -242 -750 -223 -389 -264 -315 -675 256 -577 110 -468
1024 -468 77 -133 -125 151 -182 394 -253 489 -271 127 370 239 361 75 453 0 619 -66 753 379 -2
$$ packed form
880c50O69l43M52J2k63L77p28Q15l63M27o06M49J49m75M30k79O76j142Q11k91
900D27j7J22k88P16p18L20q68J113o90P9K72l17L6j80K50l97K60m98M60l86jJ19
922a86o67J096q50J75k75M91j69l16P97j016P66q82R35k58m32N94k91L55n55P59
942G1q84P82n58J01M23k68K62j60O25o19M74m24M11k7k36M67q46J234j035K98
962I1L31j33Q3k73P24o90N31k24K49k45k70M89l30L26o22O39n06L17m84N60j17
983D46o96Q55p22M50l90M98o54L50Q7p40P19o86N21k97L33k31l16N23n66M21o11
1004g06N81o76O54j80k64L44m33M27m81M92n08N27j66J25n1l60R31q33O87n78
1024d68N45k10QK76l33N76o47P42p60L98K43j31J22k86L78m53O19o85Q19l74l81
$$ plain form
1045 -2 669 447 631 -3 766 102 684 298 323 795 111 717 49 239 192 271 193 57 255 -103 467 -407
1067 -407 143 -344 -182 -209 -414 11 -630 -28 -411 -130 -524 33 -536 -681 77 -755 -203 -487 -171 -711
1087 -711 -196 -459 -381 -536 -631 49 -439 -174 -374 -197 -195 -536 73 -591 -103 -236 322 -28 107 345 -17
1108 -17 558 83 534 -17 513 -140 192 572 89 437 152 587 57 473 91 487 464 278 617 206 543
1129 543 142 567 -7 120 48 -103 184 -4 410 -272 302 -77 119 -35 -452 92 -543 99 -599 -89
1149 -89 -421 -213 -243 -251 -151 -679 -113 -600 -118 -297 -423 -291 -379 -215 -418 -156 -445 -111 -231 -375 -130 -158
1171 -158 229 -512 215 -272 5 -10 -76 121 -352 514 -224 339 -42 52 75 117 314 -83 558 -74 326 93
1193 93 609 473 303 494 479 831 -51 376 201 611 250 514 497 59 476 -72 373 22 267 -78 278
$$ packed form
1045bO71k22J84o34P69o64N82l86K5M72o84O06o68J90m7P9p8j36J98l58N70q74
1067d07N50m87J62k7k05M25o41O02l83K81l94N57n69j45P58q32N52k84L16n40
1087g11N15k63P8j55r5O80m88K65k00J77Kl41O09o64M88j33N58l50J35K38l62
1108a7N75m75M51n51N30o53L32L80m83L48k85M35n30M16l82L96k3j86L39m11L37
1129E43m01M25n74J27p2j51K87j88M14o82N74l79J96j54m17N44o35O42o98N10
1149h9l32K08l0qJ00n28N66m87M82j79j26J32q8J64k03K62k89L34j20j44K45k8
1171a58L87p41P27m87K77j5o6J97m73Q66p38N63l81R4K3M2J97l97O41o32M00k33
1193I3N16j36j70J91j5L52q82M27j75M10l61K64j7m38M17n48M45l51K45l45L56
$$ plain form
1214 278 199 -7 110 -27 -7 -201 192 -55 -454 -218 -444 61 -462 -87 -585 -269 -208 -390 80 -538 -238
1235 -238 -710 -163 -535 -97 -284 -341 -222 -270 -179 -448 -49 -157 -97 100 -26 -4 -416 488 -93 275 -187 190
1257 190 106 153 169 169 481 53 590 183 362 383 107 328 195 604 122 451 131 312 48 257 286 91
1279 91 458 130 353 93 390 149 120 115 -241 110 -134 184 -212 -166 -113 -298 -56 -281 -63 -380 -14 -326
1301 -326 -152 -442 -363 -28 -103 0 -523 -95 -529 -289 -151 -643 45 -278 -45 -556 -56 -628 -282 -31 -390
1322 -390 69 -192 307 -270 133 -172 48 43 -326 293 -144 281 146 431 105 87 343 75 384 67 166
1343 166 -52 287 48 122 334 7 471 -86 504 17 290 -41 402 207 -247 326 -179 421 -160 130
1363 130 1 27 -148 -42 -53 -284 57 -413 -174 24 -310 39 -139 -216 -232 66 -224 -132 -566 -522 -61 -266
$$ packed form
1214B78p9k06J17j37K0j94L93k47l99K36k26N05n23L75m98L16O1j82M70o18L00
1235b38m72N47l72M38j87n7J19m8R1k69L99j08O0J97j26K2m12R04n81L68m62L77
1257A90q4M7J6%L12m28N37m07J79K1k76K21j33M09m82L29l20J81k64K09K9j95
1279I1L67l28K23k60K97k41k9nl56L51k44L18l96M6N3j85K42k25K18l17L66l12
1301c26J74k90P9L35p5J03n23M28m34K40J38m92O88l23K33n11N00n72L46K51l59
1322c90M59k61M99n77M03l05K20nl69O19m37M25j35K85l26j8K56k68L09l17R9
1343A66k18L39k39P4K12l27M64n57N90m87K73l31M43j95m54N73n05O00n81K90
1363A30j29K6j75J06j1k31L41m70K39J98l34L49j78p7j6K98k90R2m34M4M61k05
$$ plain form
1385 -266 262 -269 -223 -282 -64 -189 -60 47 -123 97 -381 31 -243 160 57 26 7 -269 156 19 101 -225
1407 -225 158 123 198 82 187 339 72 629 -187 469 38 330 469 325 480 -99 707 79 502 499 173
1428 173 391 149 386 -160 374 -306 239 108 2 68 42 6 -107 -78 -97 -60 -132 -203 -170 -218 226 -472 -18
1451 -18 -324 -87 -223 -42 -114 -537 24 -473 -166 -387 -179 33 -403 -13 -481 -159 -367 106 -104 -7 -102
1472 -102 -238 178 38 26 -3 244 -258 53 155 218 126 177 238 -23 450 131 306 305 205 140 -64 193 -76
1495 -76 215 89 280 101 279 443 160 354 -324 121 -47 20 331 -25 219 10 185 -54 275 -46 175
1516 175 -141 -358 -12 -68 -49 -193 -226 -376 -104 -254 -269 -32 -479 -44 -424 -144 -260 -272 -271 -321 -445 -212 7
1539 7 -154 58 -142 -214 -222 -162 -46 -125 0 -198 40 -344 118 51 -109 -61 -337 361 57 410 -20 198 264
$$ packed form
1385b66N28n31M6n9K18j25J29J07j70K20m78M12k74M03j03l1j9k76M25j37Q2l26
1407b25L83l5P5j16J05J52k67N57q16O56m31K92J39j44J55n79Q06o28M23ll26
1428A73K18k42K37n46N34o80N45j31j06O6k6l6j13K9j9L7p2p1L3m8M44o98M54
1451a8l06K37j36J81p2m23N61m97L07k21K08K12m36L90m68L22k08M73k10R7r5
1472a02j36M16j40j2k9K47n02L11J02O3r2N1O1k61M73l19J75jj00o5k04K57k69
1495g6K91j26J91j79J78J64k83J94o78M45j68O7L11l56K44k09J75k39L29l21K21
1516A75l16k17L46n6J9j44l3j50K72j50j5K37m47M35l80K80j16j2Jn0j24K33K19
1539Gj61K12k00p2qO0J16p9J25j98K38l84M62o7j60M8k76O98l04L53m30K18O6
$$ plain form
1562 264 123 404 -24 387 43 211 138 213 171 161 363 190 190 -119 193 141 410 216 81 85 -43 97 31
1585 31 229 142 -354 -163 -66 62 -90 -91 -135 -144 -395 -68 13 -165 -267 -146 -78 -271 173 0 -250 -238 -229 10
1609 10 -260 0 -193 71 -154 -432 -143 -473 -94 -271 106 -10 -140 -199 -25 -75 -98 -16 -7 133 93 306 -141
1632 -141 42 49 144 -93 202 306 -45 214 202 259 55 196 177 -196 450 -154 265 -97 37 193 -28 173
1654 173 155 261 -38 121 101 57 258 18 -64 -85 -87 113 202 -145 132 3 -122 -232 -305 -20 -505 -121 -352
1677 -352 -132 20 -436 -269 -293 23 -234 -49 -341 -50 114 -252 -41 -264 48 -247 -115 -191 65 -23 -83
1698 -83 -122 -51 447 -81 -163 -33 90 276 263 130 -190 267 -113 296 214 155 233 40 289 154 190 -112 119
1721 119 120 201 -63 -367 87 -146 136 -14 305 18 56 153 233 260 -79 233 104 -89 101 -35 292 -158
$$ packed form
1562B64j41K81m28M11l44J68p3P5m2j0K02j73%l09L12n2K69j94j35Mj28J40o6
1585C1J98q7m96J91R7J28j52jm4rk51L27Q1j78j02J21O8j93M44j73k50J2RK39
1609A0k70K60j93K64k25k78K89l30L79j77L77j16j30n9J74n0k3Q2RJ40m0K13m47
1632a41J83PR5k37K95J04l51K59j2N7k04J41j9l73O46o04M19l62J34J56k21K01
1654A73j8J06k99J59k0m4K01k40q2k1kK00Q9l47K77j29j25j10p3K85m85L84k31
1677c52K20J52m56J67k4L16k57J85k92K91J64l66K11k23L12k95J32p6K56q8o0
1698h3l9P1M98n28q2J30J23J86j3j33l20M57l80M09q2n9P8j93K49j35L6l02K31
1721A19JQ1k64l04M54k33K82j50L19k87L8R7Q0K7l39L12j29j93J90j36L27m50
$$ plain form
1743 -158 -217 -121 -56 -88 -20 -119 -141 39 -468 -119 -349 84 -93 -174 -271 -36 56 -294 36 -324 -91 -175 -24 -6
1767 -6 -346 -187 -144 -74 -123 225 -244 29 82 -7 124 -71 -36 68 195 -2 107 -116 23 456 6 159 143
1790 143 241 168 214 47 -91 53 60 355 98 123 129 294 134 101 143 -201 88 -40 225 -86 -113 28 -133 120
1814 120 -252 -90 -173 99 -17 -43 -24 -239 366 -326 -110 -94 81 24 -237 -258 -137 -164 -266 -28 -362 26
1836 26 -168 -324 -32 -149 -77 -327 -105 -200 20 -162 0 138 -392 -31 64 5 96 -26 -191 56 426 62
1858 62 135 18 274 77 162 37 176 265 356 348 222 304 211 -50 98 8 118 -69 67 68 348 -49 114 81
1882 81 -40 198 -170 24 33 355 92 89 23 -149 -86 -200 93 121 28 -52 -210 63 -55 117 -219 -88 -91 57
1906 57 -209 -291 -147 -184 16 1 -77 -240 209 -88 -79 -119 -171 282 31 304 -218 141 -328 -79 -146 -35 -210
$$ packed form
1743a58n9R6O5l2O8r9k2J80n07L49k30M33j77q1r7K35R2l50L30l60K33q4J51J8
1767fl40J59M3P0m9L48m69K73N3q9J31j95L5J04J27j97J09k23J39M33m50J53j6
1790A43R8p3M6j67j38J44PK95k57K5OJ65j60l3M2l44K89j28K65l11k7J41j61K53
1814A20l72J62q3K72j16k6J9k15O05o92K16J6J75n7k61k1J21k7j02K38l34L88
1836B6j94j56K92j17P2k50K22r5K20j82J62J38n30L61R5n9R1j22j65K47L70l64
1858F2P3j17K56j97Q5j25J39Q9R1qj26Q2r3k61J48r0J10j87J36JK80l97J63l3
1882H1j21K38l68J94RL22k63lo6j72O3j14K93K8r3q0j58K73j18J72l36J31lJ48
1906E7k66q2J44l7K00j5p8j63M49k97Rm0n2M53k51K73n22L59m69K49o7J11j75
$$ plain form
1929 -210 -57 155 57 -4 -130 220 104 -38 71 -71 142 -65 308 341 141 143 35 142 154 215 -75 472
1951 472 145 9 95 -94 52 -67 -6 179 23 132 55 1 -12 30 -103 -80 98 -2 -312 -78 118 -174
1973 -174 -129 -105 114 -247 134 9 -96 -117 -120 -292 -389 -69 -87 75 -43 -41 34 -192 255 -73 -48 -249 79 -75
1997 -75 11 259 7 118 -213 119 -122 168 -55 -95 61 -56 270 -86 160 -69 317 102 143 -56 21 464
2019 464 -68 262 23 150 21 -187 171 119 122 65 137 97 106 -58 -43 173 58 154 -212 -52 -135 110 -99 -27
2043 -27 -65 -29 44 -229 -55 -330 -44 -127 21 -9 -42 -126 120 99 -41 -26 -268 -152 -123 -128 -137 -141 -47 -105 -145 168 147
2070 147 24 -20 94 -41 8 -52 110 66 -122 205 109 291 2 -46 87 309 18 1 98 200 159 -21 299
2093 299 96 -14 -74 -243 289 32 33 -108 171 4 125 52 -141 -135 51 283 -39 94 -56 -58 67 108 4
$$ packed form
1929b10J53K12r8o1j26L50j16j42J09j42K13k07L73L3k00Kj08J07J2O1k90N47
1951D72l27j36Q6j89J46j19O1J85j56J09p7n4j3M2j33K3J78j00l10K34J96k92
1973a74M5K4K19l61L81j25j05k1lj72r7L20j8J62j18KP5k26M47l28K5k01L28j54
1997g5Q6K48k52J11l31L32k41K90k23m0J56j17L26l56K46k29L86k15M1j99P7M43
2019D64n32L30k39J27j29k08L58n2Ln7P2m0Rj64J5K16j15R6l66J60q3K45k09P2
2043b7l8L6P3k73J74k75K86q3J48l0l3q4K46k1j40J5k42J16K9nrmR4n8m0L13k1
2070A47j23m4J14j35M9o0J62m4j88L27r6J82k89m8J33K22k91j7R7J02m1j80L20
2093B99k03j10o0j69N32k57Jj41K79j67J21p3j93OJ86K32l22J33j50kJ25M1j04
$$ plain form
2116 4 -124 -96 -247 -141 -61 -181 150 -12 -138 -237 -108 -75 3 -138 -221 -141 -57 -85 -317 120 -239 -127 67 34
2140 34 -164 -46 150 76 -105 24 -20 -57 165 -217 16 -12 -142 303 -154 198 237 132 -81 -117 -78 281 284
2163 284 208 50 213 163 -39 71 99 133 63 28 465 90 58 57 135 47 -11 234 53 182 97 122 -204 44 -64
2188 -64 56 60 -195 75 -67 -77 235 -155 259 -78 127 -103 -242 287 -26 109 -97 -114 -232 -13 -133 -25
2210 -25 -38 0 29 140 -150 -263 19 -228 -200 -191 -51 -53 -119 -109 45 36 -18 -1 -171 92 320 -19 41 -47 120 36
2236 36 174 138 -33 17 99 59 89 -26 171 180 -1 123 65 76 207 -214 273 -97 -158 257 77 41 102 94 -311
2261 -311 140 -6 79 53 92 52 -224 -138 -301 -121 -286 -75 231 -87 -24 -68 -391 -149 -48 -4 29 -135 -118
2284 -118 -32 -159 264 -235 51 -198 101 -34 -167 -76 -158 4 -68 64 -218 -3 102 20 110 106 240 -118 -27
$$ packed form
2116Dj28K8j51J06Q0j20L31j62j26r9J29L3P8j41q3Q0Q4k8k32M37l59J12J94l3
2140C4j98J18J96p4j81J29m4l7K22l82K33k8j30M45m57L52L9j05k13l6L9L59L
2163B84p6j58J63n0k02J10K8L4p0l5M37l75l2jP8q8n8K45j81J29q5K5l26K48j08
2188f4J20Mk55K70j42j0L12l90M14l37K05k30j39N29l13J35k06j7j18K19j20J08
2210b5j3L8K9J11k90j13K82k47K8RJ40ko6J0J54rn4J7j70K63K28l39O0q8J67q4
2236C6J38l6j71N0Q2m0L0j15J97Rj81J24n8J1J31m21M87l70o1M15j80l6O1qm05
2261c11M51j46Q5k6L9m0k76Q6j63J80j65K11L06l18O3m4l23K42J01M4L3j64J7
2284a18Q6j27M23m99K86k49K99j35j33R1q2J62p2J32k82K15J05q2R0mJ34l58R1
$$ plain form
2307 -27 34 133 176 24 -93 -195 130 -184 100 -6 -122 290 117 69 -78 -35 -158 79 -96 124 137 32
2329 32 -32 162 70 -282 -76 140 -3 -173 63 0 -95 -1 -82 -164 -183 78 -258 -97 274 -101 -240 -140 102
2352 102 -162 -102 -162 -97 28 -337 224 -376 128 -227 -175 145 175 -132 -92 113 -414 17 -195 -212 -156 61 81
2375 81 -6 -29 -251 18 -28 32 -52 71 -124 28 -6 93 124 43 -20 105 82 238 7 336 195 -24 130 106
2399 106 -76 74 130 96 160 13 -4 -29 -231 77 31 111 -135 -18 89 -7 9 -12 -169 37 163 50 46 -244
2423 -244 -241 -105 -179 1 112 -24 -6 -7 -176 213 83 -99 58 170 -1 -153 -295 -250 -39 -12 63 177 -125
2446 -125 26 72 -12 71 347 294 212 30 -102 -55 -170 -14 38 25 112 220 199 2 253 67 94 44 216 153
2470 153 -172 180 99 -120 77 86 -57 137 -131 145 76 -156 55 196 163 237 -199 47 -72 -226 -17 266
$$ packed form
2307b7O1R9M3j52j17j02L25l14K84j06j16M12j73m8j47M3j23K37j75K20J3j05
2329C2o4J94r2l52K06K16j43j70K36o3r5R4q1q2j9K61l36J61L71l75j39J00K42
2352A02k64O0o0O5J25l65N61o00N04l55N2L20L0l07M0K05n27M31k12j7N6K17K0
2375H1q7k3k22K69m6O0q4J23j95J52l4R9L1q1o3J25k3J56k31L29j41k19J54k4
2399A06j82J50N6l4O4j47j7k5k02L08m6Q0k46J17J07r6J6k1j57K06J26j13mk90
2423b44LJ36p4J80J11j36J8jj69L89j30j82J57J12j71j52j42M5K11K7P5J14l02
2446a25J51M6q4Q3K76n3q2j82j32M7j15J56N2j3Q7J08k1j97K51j86K7n0J72o3
2470A53l25L52q1k19J97Rj43J94k68K76o9k32K11J41l3P4m36K46j19j54K09K83
$$ plain form
2492 266 -379 -46 170 64 -364 -213 -24 -174 62 -249 80 203 -21 -4 27 61 24 -85 87 -174 -216 -72
2514 -72 266 -148 218 -165 72 -50 45 -76 -45 -89 11 -66 -114 77 -4 153 -18 58 59 13 -43 175 306 98
2538 98 89 -61 -47 44 112 -53 -153 -164 99 196 -265 31 -66 84 127 -291 115 161 117 229 -344 36 14 98 -73
2563 -73 158 -134 154 -26 -76 182 -29 -30 -155 -110 3 18 -231 22 -59 203 -21 -73 144 -91 -123 -32 -152
2586 -152 -245 13 -80 -250 126 -20 -210 -48 260 91 -4 54 17 -8 -112 99 -317 -21 16 112 220 -194 77
2609 77 223 74 27 90 21 87 -242 339 23 -100 -41 42 -172 -21 26 140 -211 -50 -63 -99 223 34 325
2632 325 -76 -9 -201 299 -76 80 36 59 126 56 -45 52 105 108 98 99 -74 41 -184 135 -192 -30 -219 23
2656 23 -73 144 238 44 78 -289 -49 74 -172 -11 -142 -28 -128 61 43 100 -161 -191 151 -66 -119 -116 -14
$$ packed form
2492B66o45L33K16j06m28J51J89j50K36l11L29J23k24J7L1L4l7j09J72k61m2J44
2514g2L38m14L66l83K37j22R5j21L1m4J00p7m8J91q1J57j71P6Jm6n6K18J31k08
2538I8rj50J4R1O8j65j00j1K63R7m61K96r7J50M3m18M06M6m4J12n73L80k2Q4j71
2563g3K31k92K88j80n0K58k11jj25M5J13J5k49K53q1K62k24n2K17k35l2R1j20
2586a52r3K58r3j70L76j46j90J62L08j69r5N8l7k5j04K11m16K96L7R6J08m14K71
2609G7J46j49m7O3o9O6l29N81l16j23N9Q3k14J51M7J14l51J61j3l6L22j89K91
2632C25m01O7j92N00l75J56m4K3O7p0j01R7N3Lj0Jj73J15k25L19l27J62j89K42
2656B3r6K17R4j94L4l67K40J23k46J61j31J14j00J89j8N7k61l0L42k17n3LJ02
$$ plain form
2679 -14 -8 -65 161 -138 145 -80 -17 276 37 174 17 120 20 224 -143 -112 76 191 -371 125 -161 -68
2701 -68 -30 -114 169 -16 -14 34 -58 73 68 152 17 -63 -88 321 25 -43 36 -269 -21 51 21 -68 -90 102 172 80 270
2728 270 -197 -268 87 89 84 -82 -52 -153 -156 140 -122 302 48 83 46 95 -146 -233 0 151 12 116 6 126
2752 126 69 97 56 -105 -228 70 138 -92 182 -14 -100 151 -39 189 -27 181 36 16 -29 242 -30 -1 -97
2775 -97 -89 -115 -2 187 235 92 124 106 -52 -92 85 -122 -187 -50 198 62 29 122 -186 -126 36 -13 -73 -107 20
2800 20 37 31 9 -156 -190 -96 -210 42 75 -117 56 -357 -54 -92 9 95 -215 -137 -15 -171 125 -125 -53 32
2824 32 25 136 -198 189 -110 27 91 127 -109 -271 187 35 -239 82 253 12 32 209 -116 79 518 91
2846 91 -195 47 -8 210 -48 61 96 139 70 40 43 -1 72 125 27 -417 -93 -123 -38 7 -162 -171 152 277 126 -175
$$ packed form
2679a4On7K26k99K83k25O3K93k39J37j57J03j00K04l67L1J88J15n62M96k86R3
2701f8L8q4K83j85KM8r2J31nQ4j35q0k5M09k96o8P9l05K48P2l0q9k2J92P0r2J90
2728B70m67p1L55Knj66L0j01lK96k62M24k54L5l7M9k41q7K33J51j39J04j10J20
2752A26n7K8m1j61j23K98O8k30K74j96q6K51j90K28k16K08j45k0m5K71k72K9r6
2775i7Qk6J13J89M8j43L2j8j58m0J77k07o5J37K48j36l3R3l08O0J62m9o0l4J27
2800B0J7ok2j65l4R4j14K52L3j92J73m13L03l8J01Q6l10P8J22j56K96k50P2Q5
2824C2pJ11l34L87k99J37O4L6k36j62M58j52k74L21J71k41K0J77l25J95M39m27
2846I1k86K42n5K18k58J09L5M3o9l0Lm4P3N3r8m44L24l0Q5M5j69rL23J25j51l01
$$ plain form
2872 -175 -101 233 -112 -215 157 -205 -117 155 86 31 108 -71 -180 -191 -27 2 -121 48 35 -119 -93 -41 54 -176
2896 -176 -57 304 -138 -13 -141 145 -137 16 -51 -18 228 26 218 -162 142 10 10 -111 -4 -139 -137 129
2918 129 43 20 118 185 63 -30 42 -21 60 118 127 -25 32 -287 3 -92 -221 -45 -87 -35 -116 -32 109 177 108 37 -8
2945 -8 109 -5 -171 337 -181 64 -82 16 -80 -212 -116 62 -103 45 -14 -146 -38 -11 -134 77 46 153 -43
2968 -43 -159 8 253 -69 -1 -99 -142 -130 0 -192 11 132 -108 -60 -52 32 162 -35 -111 135 268 -160 -83 60
2992 60 64 13 -46 -98 -18 -21 101 13 -16 27 30 -42 49 -149 -35 -129 -39 -99 148 94 -49 74 18 -134 10 -128 -295
3019 -295 -82 42 -50 -81 48 -12 118 -61 -275 77 -289 67 135 70 -75 119 168 -62 -166 -220 -27 -337
3041 -337 -76 -328 -176 13 -27 -205 101 -181 11 -48 -211 165 46 93 269 -87 -45 -360 -20 6 9 -20 280
$$ packed form
2872a75P4L34l45j03L72l62Q8K72o9n5P7j79j09j1J64K9j23J69j3j54K6N2R5k30
2896a76J19L61m42J25j28K86k82J53o7L3K46k02J92l80L04j32%j21J07j35KK66
2918A29q6k3R8O7j22r3P2o3Q1N8Rj52N7l19K90r5j29J76m2N2q1Q4J41O8o9p1m5
2945hJ17j14j66N08n18K45j46R8r6j32R6J78j65J48n9j32J08K7j23K11l1J07j96
2968d3j16J67K45l22O8r8m3J2J30j92K03J21k40M8QQ4J30j97p6K46J33m28P7J43
2992F0Mn1n9n2Q0lJ22q8k9M3Lp2R1j98J14r4R0o0K47n4j43J23n6j52J44j38j67
3019b95K13J24r2l1J29o0J30j79k14L52l66L56O8o5j45J94M9k30j04n4J93l10
3041c37K61k52J52J89m0j78L06k82J92n9j63L76j19M7J76l56M2l15L40K6Lk9L00
$$ plain form
3064 280 164 -41 15 11 26 31 96 -81 98 169 90 31 185 30 -30 340 140 153 -100 -24 270 69 200 284 23
3089 23 -107 -180 -80 -112 -52 -249 -165 65 -184 196 -84 150 181 -265 -17 33 3 -102 -59 121 -147 50 160
3112 160 -8 56 66 -44 -137 -71 -121 -28 -60 14 54 -92 0 64 61 15 -24 -81 -240 150 180 14 -272 31 40 48 70
3139 70 -200 60 -85 307 123 -51 -187 64 153 121 -144 137 56 85 -72 -42 103 -13 -356 84 -96 254
3161 254 115 -161 -77 67 -30 -45 -124 -223 -1 23 169 -116 -117 110 -235 -120 -142 48 -78 178 -97 -8 -179
3184 -179 -291 -112 -176 -142 110 -98 0 95 -64 134 19 -44 -72 303 141 -21 -204 -7 124 -212 -57 -161
3206 -161 -48 30 -52 64 153 88 33 -91 235 40 211 355 -122 72 153 127 -81 47 -271 -49 222 -126
3228 -126 -79 258 174 72 237 323 246 -70 -37 69 -115 35 61 79 199 121 -32 -283 -109 65 245 117 180
$$ packed form
3064B80j16k05N6mJ5NO5j77J79P1p9n9J54j55o0L70k00J3k53P6K94k01J31Q4k61
3089B3j30p3J00l2O0j97Q4K30k49L80k80K34L1m46K48N0l0j05M3J80k68J97J10
3112A60j68O4J0j10r3O6n0R3l2P4M0j46R2O4lm6l9n7j59L90L0j66k86L03RQK2
3139G0k70K60j45L92j84j74j36K51Q9l2k65K81q1K9j57L0J45j16l43M40j80L50
3161B54j39k76Q4J44r7j5p9r9K22K4J46k85jK27l45J15k2J90j26K56k75Q9j71
3184a79j12J79o4L4K52k08R8R5j59J98j15o3k8L75j62j62j83J97J31l36J55j04
3206a61J13P8q2J16Q9o5n5j24L26j95J71J44m77J94Q1k6k08J28l18K22K71l48
3228a26M7L37q4j02J65Q6p7l16L3J06j84J50K6J8J20p8j53k51J74J74J80j28O3
$$ plain form
3251 180 16 -285 25 24 -16 53 60 8 -85 77 -91 42 -126 97 26 -194 57 -144 -99 -162 -94 -53 139 108 181
3276 181 102 164 19 75 -6 126 46 341 -209 68 84 -93 252 -12 -69 53 -114 135 -82 103 185 125 -285
3299 -285 -67 65 -46 26 -72 27 65 -134 45 -73 -61 -175 166 -132 116 145 -203 -271 -92 15 -188 22
3321 22 -122 -136 52 -125 -244 -95 65 -216 105 9 -23 67 60 -130 -64 -188 -114 -45 11 -66 -251 -57 -28 -75 81
3346 81 -91 -51 95 20 -113 -18 -29 -140 66 -111 45 110 149 -156 117 -154 -16 103 -353 108 -118 54
3368 54 -79 -212 156 -346 117 22 208 -28 51 -85 -125 -27 39 -196 -62 22 -49 117 80 78 46 -97 113 -80
3392 -80 67 181 -187 50 5 130 162 36 41 23 133 55 111 -74 80 7 112 -84 -239 -243 -241 6 -52 -203 82
3417 82 263 91 62 -82 54 201 18 -71 -143 196 114 -18 -103 20 91 -214 -44 -65 -65 33 50 -59 101 -29
$$ packed form
3251A80j64l01L10jm0O9Pn2r3J62j68J33j68K23p1k20K51k01M5o3O8M1J92l1P3
3276A81p9O2j45N6q1J32q0K95n50K77J6j77L45k64n7J22j67K49k17J85Q2o0m10
3299b85K18J32j11P2r8R9L8j99J79j18J2j14L41k98K48K9l48o8J79J07k03K10
3321B2j44j4J88j77j19J49J60k81L21r6l2R0pj90O6j24P4O9N6p7j85J94K9m7J56
3346H1j72M0J46p5j33R5j1j11K06j77J56O5L9l05K73k71J38J19m56M61k26J72
3368E4j33j33L68n02M63r5J86k36P9j36m0R8O6k35J34Q4p1J66l7kl2j43K10j93
3392h0J47J14l68K37m5J25L2j26Nj8J10p8N6j85J54p3J05j96j55mKK47n8j51K85
3417H2J81j72k9j44J36J47j83q9p2L39q2j32q5J23P1l05J70k1%R8J7j09J60j30
$$ plain form
3441 -29 -60 175 77 0 184 163 -100 -9 -44 166 -80 105 19 -171 -4 257 77 52 -181 76 200 105 -334
3464 -334 -145 76 -161 70 184 324 -178 -32 230 -26 32 62 122 110 -20 356 -70 19 -358 -10 -26 16
3486 16 299 -41 37 -150 -110 -77 99 -128 -43 55 99 -131 300 -23 -145 -145 84 -18 140 214 36 -96 -49 84
3510 84 -106 111 -95 54 56 -37 104 -30 67 116 -66 -18 373 -42 44 259 115 -78 102 -63 -115 -241 -11
3533 -11 177 100 -113 -8 39 -171 50 62 -52 276 64 63 -46 20 59 189 -142 -369 -145 -2 -183 -181 164
3556 164 -94 -173 -134 257 -225 -145 -93 47 -73 53 -164 -200 -111 152 120 83 108 235 22 -2 59 -18 17 10 -42
3581 -42 -154 155 -69 79 23 -144 -41 -177 -209 49 23 -123 143 -84 130 22 -120 8 38 83 157 48
3603 48 24 175 -186 -81 -123 176 -80 37 -30 -179 2 17 109 -127 -35 -222 -34 40 -208 -88 -13 -152 -129
$$ packed form
3441b9l1K35r8p7J84k1k63R1l5K10k46J85q6j90J67K61j80k5k33K57J24r5m39
3464c34J89K21k37K31J14J40n02J46K62k56N8L0O0j2j30L76m26Q9l77L48j6M2
3486A6K83l40P8j87M0L3J76k27Q5R8M4k30M31l23j22%K29j02J58P4j78j32M7J33
3510H4j90K17k06J49Kr3J41j34R7M9j82M8L91m15Q6K15j44j93J80j65n2j26K30
3533a1J88p7k13J05M7k10K21J2j14L28k12jj09O6L9J30l31k27K24J43j81KL45
3556A64k58p9L9L91m82Q0N2J40j20J26k17l6Q9K63l2l7K5J27k13k4O1p7L5pn2
3581d2j12L09k24J48n6j67J03j36l2K58k6j46K66k27K14j08j42J28L0M5P4j09
3603D8k4J51l61J05m2K99k56J17o7j49J81J5R2k36R2j87J88P4k48J20P5j39K3
$$ plain form
3626 -129 -244 -307 -191 1 -253 -90 -59 23 392 58 -115 -44 15 -28 -12 -20 81 -153 -129 -21 -221 37 -129
3649 -129 95 -400 38 43 -17 22 -26 -66 -227 -127 8 -95 250 236 -100 24 126 252 32 18 130 -25 187
3672 187 65 -151 90 -4 29 -14 -29 -129 -65 -76 70 208 72 -108 14 105 -102 -10 140 92 43 182 98 -89
3696 -89 -236 39 -51 -67 96 182 32 46 -119 -150 -244 130 -102 -255 -87 -54 206 -257 -250 -153 -61 54 40 35 -4
3721 -4 56 -455 82 181 -55 -227 -105 -218 -189 360 -83 117 -219 -245 81 -38 19 -80 -110 272 5 51 -57
3744 -57 -201 81 136 -125 185 -161 99 -188 93 64 83 250 83 35 8 23 152 10 75 234 244 -58 21
3767 21 -76 117 -146 -46 344 111 -157 -35 -70 -224 64 -38 3 41 -84 13 -94 -79 59 44 -4 -197 -259
3790 -259 165 166 170 -54 -50 -27 164 150 -223 -14 27 113 -128 -67 54 153 41 -50 78 1 22 -90 -157 45 171
$$ packed form
3626a29j15o3J16J92k54J63L1Q2L69l34j73P1N9m3J6qJ01k34K4J08k00K58j66
3649a29K24m95M38No0L9m8m0j61J00J35j03L45j4l36J24J02J26k20j4J12j55K12
3672A87j22k16K41r4L3m3j5j00O4j1J46J38j36j80J22R1k07R2J50m8m9J39q4j87
3696h9j47K75r0j6J63Q6j50J4j65l1r4L74k32j53J68L3K60m63PR7R2J15j4nl9
3721dO0n11N37R9k36j72J22j13K9N49m43K00l36k6L26j19N7r9l0L82k67M6j08
3744e7j44K82N5k61L10l46K60k87K81k9J9J67j67m8k7J5J29j42O5J59J0l02P9
3767B1r7J93k63J00L90k33k68J22l5j54K88j02M1L8j25R7j07J5J38j5m8j93o2
3790b59M24JMk24MK3J91j4l73K09M1Q6k41O1J21R9j12r1J28p7K1j12o7K02J26
$$ plain form
3815 171 -48 269 134 174 -300 2 -79 11 9 56 104 -195 12 98 -143 -21 43 86 60 -88 316 34 38 14 -57
3840 -57 202 -205 39 -46 76 70 -65 -274 -115 22 75 -53 59 -3 -105 -173 -30 -59 -147 -127 85 -158 159
3863 159 -47 -75 -177 44 -29 -17 -129 49 157 29 67 -102 155 -105 334 -2 143 -102 106 -204 -23
3884 -23 95 192 -24 21 -209 67 57 -86 31 -107 286 168 60 -54 162 -10 27 -82 85 -85 158 186
3906 186 255 244 -37 -52 3 225 241 -181 119 34 24 50 -163 -293 15 107 69 245 -75 -160 -283 -49 29 -190
3930 -190 -14 -213 -45 -90 86 -123 46 -53 15 146 -140 112 -92 40 316 -178 -9 190 -40 -56 234
3951 234 171 -305 -31 -188 -237 -106 0 -86 -188 76 36 -77 53 134 173 31 295 106 129 -64 190 -254
3973 -254 208 -130 30 -51 -5 -182 118 225 -129 -37 201 -166 -143 441 -34 -129 0 45 -37 117 62 68 -54
$$ packed form
3815A71k19L17j35M0m74L02q1R0kM7M8k99K07Q6k41J22O4M3k6j48M04k82Mk4p1
3840e7K59m07K44q5J22oj35k09J59J37N3j28J12o2j02o8J43k9q8K0K12k43L17
3863A59k06k8j02K21p3J2j12J78J08j28L8j69K57k60M39l36J45k45K08l10J81
3884b3J18R7k16M5k30K76j0j43J17j38L93j18j08j14K16j72L7j09J67j70K43K8
3906A86O9j1k81j5N5K22J6m22L00q5j0K6k13j30L08R2l8J76l20q5j23K34P8k19
3930a90J76j99J68m5J76k09J69r9O8J31k86K52k04J32K76m94J69J99k30j6K90
3951B34o3m76K74j57m9J31J06q6j02K64m0j13J30Q1L9j42K64j89K3j93K54m44
3973b54M62l38J60q1M6j77L00J07l54R2K38l67K3N84m75r5J29M5q2J54n5Oj22
$$ plain form
3996 -54 -162 -14 96 -133 -236 -64 -293 -10 62 -122 -4 15 -364 25 208 -119 168 -133 -12 108 -99
4017 -99 5 -184 -72 -160 12 42 6 30 -36 54 73 121 87 29 -88 154 -47 195 242 -57 -14 68 90 89 -327 -20
4043 -20 149 -210 -166 -118 131 155 -5 63 -21 -5 167 -3 135 27 -46 141 136 48 120 -203 -266 -261 -21 146 -193
4068 -193 -29 -125 26 80 -61 -73 189 -123 167 -13 -114 106 -111 -222 12 100 -10 34 -108 122 -198 -93
4090 -93 70 -156 342 103 40 -12 -93 142 -62 156 -45 104 83 -38 -114 -245 94 -58 18 56 79 -100 -65
4113 -65 123 44 156 76 26 -184 30 -100 170 -82 264 -33 262 48 59 99 -223 64 66 -95 -41 111 345
4136 345 48 215 253 -136 122 57 -68 17 -113 -152 44 -64 -141 80 30 137 356 144 -54 -47 -177 83 -268
4159 -268 -149 13 54 42 309 -64 112 -304 -29 321 74 -91 31 46 -38 206 -53 41 99 35 43 -83 114
$$ packed form
3996e4j08J48J10k29j03J72k29K83P2j84J18J9l79L89J83l27K87l01J21J20k07
4017i9J04j89J12q8J72L0l6K4o6R0J9M8l4n8j17K42k01K42M7k99M3Q2K2jm16L07
4043b0J69l59M4M8K49K4j60O8q4J6J72j70J38j08p3J87nq8P2l23o3NK40J67l39
4068a93J64r6J51N4j41j2K62l12K90j80j01K20k17j11K34Q8j10M4j42K30l20J05
4090i3J63k26M98k39o3n2q1K35k04K18k01J49k1j21p6j31L39j52P6L8K3j79L5
4113f5J88p9J12q0n0k10K14j30K70k52L46k97K95k14J1M0l22K87Kj61N4J52K34
4136C45k97J67L8l89K58o5j25Q5j30l9J96j08p7K21n0J07K19k12j98Pj30K60l51
4159b68J19J62M1j2K67l73J76m16K75L50k47j65J22J5q4K44k59R4N8o4Qj26J97
$$ plain form
4182 114 -92 -130 384 73 159 -86 -77 -59 -174 54 -87 -236 -53 -49 -21 26 -91 219 -154 -106 -149 123 -7 -10
4206 -10 142 52 148 52 -219 -24 31 78 147 -312 -22 64 -56 14 -97 -108 -21 -78 26 -282 37 -32 -82 -13 -150
4231 -150 82 85 54 -56 168 43 -22 12 -94 -92 -22 -29 -24 124 21 73 -92 -2 25 18 25 -145 110 66 74 27 11 -142
4259 -142 64 131 -60 209 -190 40 182 78 -53 -36 226 -9 -102 -113 21 79 -27 31 -38 165 -45 64
4281 64 -80 -106 27 191 180 127 6 129 119 -206 -44 58 -164 10 96 -28 222 66 88 130 29 -33 163
4304 163 119 -101 -4 -204 -280 -266 206 380 -115 -62 -73 -70 -23 92 -6 -170 69 -26 -161 -109 -74 326 -105 5
4328 5 -12 -99 -80 81 -55 -7 43 28 42 -68 -59 -234 -75 -141 45 -118 196 -140 133 -125 -1 285 53 -4
4352 -4 -94 200 235 -82 12 -55 -15 14 57 -77 -161 -65 -203 70 -27 -65 -251 -36 -122 -136 136 -62 -140 -92 5 103
$$ packed form
4182A14k06l8N14l11Q6k45RJ8j15K28j41j49J83MK8M7j17L10l73M8m3K72j30l
4206a0J52r0R6r6k71J95N5M7O9m59K90Q6j20P0j11j1Q7n7J04l08L19o9n0O9j37
4231a50K32Ll1j10K24j25o5L4j06KP0pNJ48j03N2j65R0K7pPj70K55m4Qm7j6j53
4259a42K06O7j91K69l99K30J42j04j31J7K62k35r3j1J34N8j06N8o9K03k10J09
4281F4j44k6J33J64j1n3j21J23j0l25J62J02k22J74Q6j24K50j56K2M2j01o2J96
4304A63m4k20R7k00p6J4M72J74m95N3j1LM7J15r8j64K39r5j35N2L5M00m31J10
4328Ej7q7J9J61j36M8N0j5J4j10Rj75J59o6J86j63L14l36K73k58J24K86k32n7
4352dr0K94L5l17R4o7M0K9M3j34q4R6j38K73r7l8j86K15q6j4K72j98p8M8R7R8
$$ [...]
8191A7
##END NTUPLES=NMR FID
##END=
