##TITLE=1H_Pr 5000
 CDCl3, 8 sc, 
 24.9.2020
##JCAMPDX= 6.0         $$ Bruker NMR JCAMP-DX V2.0
##DATA TYPE= NMR FID
##DATA CLASS= NTUPLES
##ORIGIN= UXNMR, Bruker Analytische Messtechnik GmbH
##OWNER= root
$$ XWIN-NMR		Version 3.5
$$ Thu Sep 24 10:59:57 2020 Russian Standard Time (UT+4h)  she@DPX200
##.OBSERVE FREQUENCY= 200.1315066352
##.OBSERVE NUCLEUS= ^1H
##.DELAY= (6, 6)
##.ACQUISITION MODE= SIMULTANEOUS
##.ACQUISITION SCHEME= undefined
##.AVERAGES= 8
##.DIGITISER RES= 18
##SPECTROMETER/DATA SYSTEM= spect
##.PULSE SEQUENCE= zg30
##.SOLVENT NAME= CDCl3
##.SHIFT REFERENCE= (INTERNAL, CDCl3, 0, 15.7039)
##AUDIT TRAIL= $$ (NUMBER, WHEN, WHO, WHERE, WHAT)
$$ ##TITLE= Audit trail, XWIN-NMR		Version 3.5
$$ ##JCAMPDX= 5.01
$$ ##ORIGIN= Bruker BioSpin GmbH
$$ ##OWNER= she
$$ F:/spectra/data/she/nmr/H-F/1/audita.txt
$$ ##AUDIT TRAIL=  $$ (NUMBER, WHEN, WHO, WHERE, WHAT)
(   1,<2020-09-24 10:58:57.84 +0400>,<she>,<DPX200>,
      <created by zg, POWCHK disabled, PULCHK disabled
       configuration hash MD5:
       00 E9 B6 7A A2 85 ED C7 34 08 36 98 17 FE 4E 26
       data hash MD5: 16K
       B7 63 2C FA 60 3B 4F 05 69 82 2C 58 B1 36 13 13>)
$$ ##END=
$$ 
$$ hash MD5
$$ B3 46 B1 81 13 C3 1F 9E 92 6F B7 ED 2F 58 51 3C
##$RELAX= 
##$RELAX= 
##$RELAX= 
##$RELAX= 
##$RELAX= 
##$RELAX= 
$$ Bruker specific parameters
$$ --------------------------
##$DU= <F:/spectra>
##$EXPNO= 1
##$NAME= <H-F>
##$PROCNO= 1
##$TYPE= <nmr>
##$USER= <she>
##$AMP= (0..31)
100 100 100 100 100 100 100 100 100 100 100 100 100 100 100 100 100 100 
100 100 100 100 100 100 100 100 100 100 100 100 100 100 
##$AQSEQ= 0
##$AQ_mod= 1
##$AUNM= <au_zg>
##$AUTOPOS= <>
##$BF1= 200.13
##$BF2= 200.13
##$BF3= 200.13
##$BF4= 200.13
##$BF5= 200.13
##$BF6= 200.13
##$BF7= 200.13
##$BF8= 200.13
##$BYTORDA= 1
##$CFDGTYP= 0
##$CFRGTYP= 5
##$CHEMSTR= <none>
##$CNST= (0..31)
1 1 145 1 1 1 1 1 1 1 1 1 1 1 1 1 1 1 1 1 1 1 1 1 1 1 1 1 1 1 1 1 
##$CPDPRG= <>
##$CPDPRG1= <>
##$CPDPRG2= <>
##$CPDPRG3= <>
##$CPDPRG4= <mlev>
##$CPDPRG5= <mlev>
##$CPDPRG6= <mlev>
##$CPDPRG7= <mlev>
##$CPDPRG8= <mlev>
##$CPDPRGB= <>
##$CPDPRGT= <>
##$D= (0..31)
0 1.2 0 0 0 0 0 0 0 0.06 0 0.03 0 0 0 0 0.0002 0 0 0 0 0 0 0 0 0 0 0 0 
0 0 0 
##$DATE= 1600930737
##$DBL= (0..7)
120 120 120 120 120 120 120 120 
##$DBP= (0..7)
150 150 150 150 150 150 150 150 
##$DBP07= 0
##$DBPNAM0= <>
##$DBPNAM1= <>
##$DBPNAM2= <>
##$DBPNAM3= <>
##$DBPNAM4= <>
##$DBPNAM5= <>
##$DBPNAM6= <>
##$DBPNAM7= <>
##$DBPOAL= (0..7)
0.5 0.5 0.5 0.5 0.5 0.5 0.5 0.5 
##$DBPOFFS= (0..7)
0 0 0 0 0 0 0 0 
##$DE= 6
##$DECBNUC= <off>
##$DECIM= 32
##$DECNUC= <off>
##$DECSTAT= 4
##$DIGMOD= 1
##$DIGTYP= 9
##$DL= (0..7)
0 120 120 120 120 120 120 120 
##$DP= (0..7)
150 150 150 150 150 150 150 150 
##$DP07= 0
##$DPNAME0= <>
##$DPNAME1= <>
##$DPNAME2= <>
##$DPNAME3= <>
##$DPNAME4= <>
##$DPNAME5= <>
##$DPNAME6= <>
##$DPNAME7= <>
##$DPOAL= (0..7)
0.5 0.5 0.5 0.5 0.5 0.5 0.5 0.5 
##$DPOFFS= (0..7)
0 0 0 0 0 0 0 0 
##$DQDMODE= 0
##$DR= 18
##$DS= 0
##$DSLIST= <SSSSSSSSSSSSSSS>
$$ [...]
##$SUBNAM2= <"">
##$SUBNAM3= <"">
##$SUBNAM4= <"">
##$SUBNAM5= <"">
##$SUBNAM6= <"">
##$SUBNAM7= <"">
##$SUBNAM8= <"">
##$SUBNAM9= <"">
##$SW= 16.880792210976
##$SWIBOX= (0..15)
0 0 2 0 0 0 0 0 0 0 0 0 0 0 0 0 
##$SW_h= 3378.37837837838
##$TD= 16384
##$TD0= 1
##$TE= 0
##$TE2= 300
##$TE3= 300
##$TEG= 300
##$TL= (0..7)
0 120 120 120 120 120 120 120 
##$TP= (0..7)
150 150 150 150 150 150 150 150 
##$TP07= 0
##$TPNAME0= <>
##$TPNAME1= <>
##$TPNAME2= <>
##$TPNAME3= <>
##$TPNAME4= <>
##$TPNAME5= <>
##$TPNAME6= <>
##$TPNAME7= <>
##$TPOAL= (0..7)
0.5 0.5 0.5 0.5 0.5 0.5 0.5 0.5 
##$TPOFFS= (0..7)
0 0 0 0 0 0 0 0 
##$TUNHIN= 0
##$TUNHOUT= 0
##$TUNXOUT= 0
##$USERA1= <user>
##$USERA2= <user>
##$USERA3= <user>
##$USERA4= <user>
##$USERA5= <user>
##$V9= 5
##$VALIST= <valist>
##$VCLIST= <CCCCCCCCCCCCCCC>
##$VD= 0
##$VDLIST= <DDDDDDDDDDDDDDD>
##$VPLIST= <PPPPPPPPPPPPPPP>
##$VTLIST= <TTTTTTTTTTTTTTT>
##$WBST= 1024
##$WBSW= 4
##$XGAIN= (0..3)
0 0 0 0 
##$XL= 0
##$YL= 0
##$YMAX_a= 35723
##$YMIN_a= -33583
##$ZGOPTNS= <>
##$ZL1= 120
##$ZL2= 120
##$ZL3= 120
##$ZL4= 120
##$ABSF1= 10
##$ABSF2= 0
##$ABSG= 5
##$ABSL= 3
##$ALPHA= 0
##$AQORDER= 0
##$ASSFAC= 0
##$ASSFACI= 0
##$ASSFACX= 0
##$ASSWID= 0
##$AUNMP= <proc_1d>
##$AZFE= 0.1
##$AZFW= 0.1
##$BCFW= 1
##$BC_mod= 2
##$BYTORDP= 1
##$COROFFS= 0
##$CY= 11.3945322036743
##$DATMOD= 1
##$DC= 2
##$DFILT= <>
##$DTYPP= 0
##$F1P= 16.9975609425685
##$F2P= -3.02152046262296
##$FCOR= 0.5
##$FTSIZE= 0
##$FT_mod= 4
##$GAMMA= 1
##$GB= 0.15
##$INTBC= 1
##$INTSCL= 1
##$ISEN= 128
##$LB= 0.24
##$LEV0= 0
##$LPBIN= 0
##$MAXI= 10000
##$MC2= 0
##$MEAN= 0
##$ME_mod= 0
##$MI= 1.114404
##$NCOEF= 0
##$NC_proc= 0
##$NLEV= 6
##$NOISF1= 3.799351
##$NOISF2= 2.8
##$NSP= 1
##$NTH_PI= 0
##$NZP= 0
##$OFFSET= 15.70392
##$PC= 1
##$PHC0= -9971.032
##$PHC1= 11.6009
##$PH_mod= 1
##$PKNL= yes
##$PPARMOD= 0
##$PSCAL= 0
##$PSIGN= 0
##$REVERSE= no
##$SF= 200.130013532006
##$SI= 16384
##$SIGF1= 3
##$SIGF2= 2
##$SINO= 400
##$SIOLD= 16384
##$SREGLST= <1H.CDCl3>
##$SSB= 0
##$STSI= 0
##$STSR= 0
##$SW_p= 3612.71676300578
##$SYMM= 0
##$S_DEV= 0
##$TDeff= 0
##$TDoff= 0
##$TI= <>
##$TILT= no
##$TM1= 0
##$TM2= 0
##$TOPLEV= 0
##$USERP1= <user>
##$USERP2= <user>
##$USERP3= <user>
##$USERP4= <user>
##$USERP5= <user>
##$WDW= 1
##$XDIM= 8192
##$YMAX_p= 0
##$YMIN_p= 0
$$ End of Bruker specific parameters
$$ ---------------------------------
##NTUPLES= NMR FID
##VAR_NAME=  TIME,          FID/REAL,        FID/IMAG
##SYMBOL=    X,             R,               I
##VAR_TYPE=  INDEPENDENT,   DEPENDENT,       DEPENDENT
##VAR_FORM=  AFFN,          ASDF,            ASDF
##VAR_DIM=   8192,          8192,            8192
##UNITS=     SECONDS,       ARBITRARY UNITS, ARBITRARY UNITS
##FACTOR=    0.000296,      1,               1
##FIRST=     0,             0,               0
##LAST=      2.424536,      0,               0
##MIN=       0,             -33583,          0
##MAX=       2.424536,      35723,           0
$$ Real data points
##PAGE= N=1
##DATA TABLE= (X++(R..R)), XYDATA
0 0 0 0 0 0 0 0 0 0 0 0 0 0 0 0 0 0 0 0 0 0 0 -8 8 -8 8 -8 8 -13 16 -16 16 -24 24 -28 32 -36 40 -46 51 -56 63 -70
42 -70 78 -86 97 -108 118 -131 144 -160 175 -192 214 -234 258 -284 314 -350 388 -432 487 -549 626
63 626 -720 841 -1005 1236 -1597 2279 -9899 35723 1963 -28930 11758 11326 -12316 -2238
77 -2238 9535 2341 -46 -6872 12466 4983 -3636 -2624 12382 5613 -4371 10344 2270 -1
91 -1 6216 8786 2623 7895 823 -191 14221 -2266 5423 7163 571 3681 6417 -2122 3662 7867
107 7867 -6786 7305 2290 -3908 -31 3128 -187 -2695 3069 -4208 386 -2119 -3603 -2133 2819
122 2819 -5046 -8008 4747 -8606 -4022 499 -4560 -6135 -2291 -5305 -4565 489 -8580 65 -2379
137 -2379 -3781 -2677 -3769 -2447 -2286 385 -4773 -205 -3122 -1101 -1223 562 1153 -3363 2589 -1587
153 -1587 3039 934 -1088 2860 4622 -647 936 7080 -2628 3807 5481 3182 1105 2120 5605
168 5605 2605 3632 2112 5530 0 2881 4278 2146 1858 799 5487 -409 1501 1648 1719 740
184 740 1892 576 -1746 2162 -2862 1429 -496 -1426 -1358 -2375 -785 -2115 -1140 -4106 46 -4045
200 -4045 -2426 -1971 -3530 -2074 -3542 -700 -4631 -2376 -3693 -2365 -3040 -2346 -1371 -3420 -693 -4287
216 -4287 -196 -2219 -1558 -177 -1181 -986 -1639 1322 -1667 1526 -643 1387 514 -89 2726 310
232 310 2993 881 3289 631 2562 2446 1674 3561 1454 3876 887 4307 1642 2738 3156 1925
248 1925 2944 980 3889 419 2941 1086 2460 1326 -108 2387 -483 1871 -780 1967 -940
263 -940 -326 42 -921 102 -2336 389 -3033 -633 -2859 -1348 -1718 -3021 -794 -4025 -1536 -3681
279 -3681 -1126 -3344 -1891 -2144 -3864 -701 -3852 -1475 -3066 -908 -2986 -1668 -1127 -2577 -22 -2162
295 -2162 1014 -2038 652 -1011 -133 854 -790 2177 -539 1990 -173 1983 655 1487 2060 781
311 781 3426 532 3182 1279 2727 2007 2410 2797 1117 3525 665 3368 1023 2634 1665 1491 2089
328 2089 471 3033 -416 1838 74 1498 -36 392 1005 -1604 977 -1562 457 -1655 -369 -1240
344 -1240 -1532 -749 -2535 -538 -3159 -948 -2878 -1390 -2231 -2522 -1445 -3102 -923 -3363 -865 -2755
360 -2755 -1566 -1874 -2339 -1193 -2570 -245 -2772 80 -1894 -620 -910 -589 362 -1099 1318 -1038
376 -1038 1105 50 932 728 1029 1535 -75 2759 248 2181 1390 1938 1730 1277 2716 1287 2876
393 2876 718 3109 1465 2433 1602 1154 2796 549 2654 919 1595 -37 1700 1209 420 815 -801
410 -801 1513 -1106 895 -604 -281 -399 -1326 -297 -1148 -683 -2961 3 -1640 -1738 -1742 -2287 -695 -2927
428 -2927 -1226 -2180 -1558 -2588 -1443 -1583 -1862 -1581 -2837 728 -2695 -1627 -1232 -653 -1339 -1306 1 -892
446 -892 -221 -1389 1667 -699 -191 675 -96 1846 -158 1358 1005 1976 527 1757 1663 1084 2439 720
464 720 3054 717 1918 1808 2159 1914 1298 2038 1665 2569 -344 2710 1244 867 1448 514 1619 -381
482 -381 978 472 907 -1314 396 463 -740 138 -1996 924 -1606 -1186 -528 -1129 -1964 -1344 -574 -2025
500 -2025 -690 -3231 -341 -2096 -1948 -803 -2286 -1246 -1923 -889 -2138 -1048 -2460 -597 -713 -1829
516 -1829 261 -2563 403 -201 -446 -851 -178 291 -138 988 -499 1433 -746 1767 827 242 1662
533 1662 131 2271 1181 1436 681 2704 416 1859 2694 30 2576 746 2346 686 1603 1245
549 1245 1234 1262 1109 1295 -863 2521 -246 646 734 -448 885 9 532 -628 253 -1215 530 -937
567 -937 -1139 -8 -1717 303 -2414 -830 -1294 -1273 -1670 -893 -1612 -2457 -490 -2391 -245 -2806 -1483
584 -1483 -1071 -1683 -736 -1399 -843 -1462 -391 -1337 88 -1496 -922 1146 -1268 805 -638 28 237 728
602 728 506 431 611 176 2229 -404 1768 909 1103 1937 945 1627 676 1471 1026 2273 304 1738 1503
621 1503 682 2099 263 1631 595 1080 903 695 205 695 748 -361 1178 -761 508 -563 -48
638 -48 -23 -1171 -134 -708 -428 -1696 -202 -1718 -713 -907 -1659 -877 -2152 -472 -1492 -1056 -1988 -850
656 -850 -1384 -1349 -674 -2153 -503 -1585 -172 -1210 -1098 -750 -1045 -401 -621 127 -997 404 -471 505
674 505 541 -362 855 24 1087 253 1181 433 1138 1012 852 1599 444 1777 923 1697 806 1495 1380
693 1380 961 1637 740 1683 261 1836 1002 953 991 269 1180 -95 1188 -74 611 -175 452 -92 -549
712 -549 114 -986 222 -1077 -210 -669 -709 -609 -1408 -318 -1369 -319 -1705 -662 -1302 -800 -876 -1611
730 -1611 -725 -1544 -427 -1521 -614 -1089 -1137 -719 -1210 -4 -1377 110 -1012 -141 -500 -270 287 -293
748 -293 811 -463 782 -157 812 97 828 1099 130 1340 175 1555 454 1328 791 1155 1337 843
766 843 1847 436 1889 421 1121 716 879 1205 390 1410 60 1185 -36 899 352 453 457 -532
784 -532 654 -713 430 -668 99 -479 -594 -270 -1124 -184 -1559 -108 -1432 -589 -1084 -1123 -806 -1714
802 -1714 -612 -1702 -612 -1422 -682 -1137 -1216 -543 -1221 -145 -1232 -307 -858 -175 -652 -748 504 -655
820 -655 370 -692 687 -68 517 365 60 624 -266 1369 -103 1145 391 864 1278 654 973 569
838 569 1484 650 1399 455 1051 1116 485 1544 234 1304 214 1246 613 390 799 439 971 -312 944
857 944 -378 415 -70 -215 -59 -808 -128 -931 -266 -1057 -393 -971 -718 -576 -1017 -223 -1235 -502 -1309 -774
877 -774 -911 -1131 -888 -1173 -436 -1515 -373 -1388 -292 -767 -871 -405 -688 -679 -905 279 -553 151 -369
896 -369 154 164 -326 542 -465 701 230 817 568 701 459 587 973 409 1571 766 968 762 584 1041
916 1041 759 1057 784 1198 703 1153 208 542 970 223 924 418 752 46 687 263 488 -8 -230 395
936 395 -696 305 -1092 -507 -262 -655 -351 -844 -589 -1355 -21 -1215 -421 -1242 -1068 -279 -1280 -564
954 -564 -1448 -779 -849 -413 -1083 -497 -642 -1110 253 -1098 -76 -740 -191 -62 -151 -236 -465 462 -502 1053
974 1053 -369 410 161 265 962 90 728 243 751 630 1147 412 683 984 605 1317 11 1216 660
993 660 1110 834 708 639 835 1190 6 1207 -316 610 476 159 384 -299 315 -236 182 -560 271 -544
1013 -544 -239 -266 -1049 243 -1132 -120 -795 -647 -791 -794 -404 -909 -402 -1522 -14 -1211 -642 -599 -1480
1032 -1480 -508 -770 -210 -934 -499 -1241 68 -419 -400 360 -803 449 -305 263 -146 59 207 169 478
1051 478 -51 794 -218 1193 278 366 955 367 931 440 993 372 1130 219 1020 726 252 1222 272 1261
1071 1261 268 902 353 698 589 235 235 31 840 -251 260 -341 -185 324 -545 114 -499 -290 -412 -5
1091 -5 -673 -544 -106 -851 -73 -1166 -399 -889 -701 -714 -649 -723 -1180 -362 -838 -21 -978 -237 -760 -688 -301 -650
1113 -650 -348 -694 174 -525 144 -377 -19 245 -533 674 -169 294 282 785 55 485 718 435 821 -83
1133 -83 1116 389 750 689 965 712 612 1024 370 996 294 794 553 612 732 71 703 -73 660 111 390
1154 390 79 294 109 36 439 -340 166 -483 -44 -533 -369 -404 -727 -233 -1018 -411 -1011 -412 -720 -849 -479
1175 -479 -582 -124 -718 -125 -1168 -555 -670 -382 -491 -831 41 -781 -63 -461 -108 -300 -209 -103 -179 291
1195 291 -420 416 -20 339 156 81 433 -23 651 86 828 430 853 404 673 925 331 1025 245 925
1215 925 415 976 723 490 611 261 882 128 838 -10 588 367 266 467 217 606 -97 250 -217 9
1235 9 -320 -418 189 -534 -11 -788 -93 -559 -215 -620 -826 -451 -879 -309 -858 -63 -742 -445 -561 -679 -421
1256 -421 -1034 -385 -586 -231 -753 -288 -166 -626 109 -437 185 -736 111 -165 280 172 159 488 -216 570
1276 570 -174 907 45 263 477 275 653 365 808 142 1042 434 733 775 504 802 227 847 285 581
1296 581 205 413 404 287 684 -107 413 -304 254 -194 -68 245 -366 244 -535 295 -531 -161 -396 -364 -312
1317 -312 -997 -212 -781 -161 -647 -479 -513 -862 -490 -759 -277 -957 -225 -801 -344 -611 -374 -320 -598 -115 -552
1338 -552 -96 -488 -147 -99 -177 -26 -344 386 -210 114 79 492 153 299 363 231 817 67 958 194 781
1359 781 583 408 641 217 743 219 787 296 624 429 645 658 73 623 121 693 9 430 84 49 185
1380 185 64 353 -414 560 -203 -28 -156 -375 -342 -435 -55 -628 -21 -589 -96 -579 -314 -254 -965 -288 -719
1401 -719 -349 -802 -401 -646 -593 -282 -764 -183 -759 -163 -450 -392 -385 -291 -58 -178 75 -457 257 -165 314 137
1423 137 33 459 129 589 79 335 375 652 175 699 551 18 924 170 745 199 562 375 540 540 248
1444 248 722 -128 721 82 567 329 18 546 169 290 -10 519 -29 40 -245 -322 226 -511 390 -493 -185
1465 -185 -385 -113 -297 -672 -562 -762 -282 -628 -205 -808 -319 -401 -411 -240 -790 -265 -224 -387 -687 -426 -494
1486 -494 -468 118 -813 184 -538 228 55 -203 -55 149 177 -83 394 -212 448 -52 409 536 -18 562 202
1507 202 590 414 599 193 401 718 74 924 -82 617 429 241 472 311 354 323 561 66 622 -285
1527 -285 644 222 -111 203 169 256 -340 127 -484 115 -320 -69 -61 -445 -105 -708 -265 -552 -450 -723 -531
1548 -531 -392 -740 -309 -715 -300 -744 -214 -359 -524 -43 -516 -11 -530 -116 -366 -211 -229 -191 -177 -91 350
1569 350 -257 234 -222 18 127 268 170 44 513 -16 448 79 644 217 445 669 601 688 319 665 285
1590 285 431 201 385 407 229 561 158 400 352 179 120 114 154 71 356 -196 182 -158 -43 208 -105 46
1612 46 -378 -67 -535 -45 -656 -273 -358 -451 -172 -528 -232 -633 -300 -533 -354 -522 -485 -194 -722 -311 -571
1633 -571 -84 -298 -119 -218 -242 -248 -604 82 -348 -123 -252 -90 41 13 306 40 384 161 550 382 321 282
1655 282 89 526 247 634 72 507 415 244 360 388 704 293 577 220 616 281 369 162 204 253 69 424
1677 424 55 342 12 108 -74 -271 171 -345 -172 -447 -112 -583 -337 -330 -345 -201 -434 29 -763 -55 -748
1698 -748 -254 -338 -668 -29 -492 -388 -285 -306 -538 -212 -191 -400 -26 -572 -108 -212 168 -49 -127 180 -251
1719 -251 92 -158 399 -16 484 36 386 528 -17 316 122 448 -24 497 150 196 366 86 390 90
1739 90 711 105 429 301 294 380 103 360 -91 339 -83 285 164 -48 285 -333 150 -181 56 -122 -7
1760 -7 -261 -157 -113 -544 -78 -560 74 -438 -280 -363 -459 -87 -477 -129 -633 -150 -589 -203 -350 -260 -81 -737
1782 -737 -217 -505 -146 -376 -74 -222 -111 15 -482 275 -184 267 -115 183 -145 -122 386 -68 407 152
1802 152 556 53 230 398 188 589 190 493 255 490 168 658 396 255 451 186 497 -20 238 209
1822 209 318 253 153 348 -61 361 -219 474 -384 56 105 -296 -93 -233 -50 -263 -63 -491 -108 -128 -224
1843 -224 9 -420 -78 -414 -225 -582 -437 -446 -303 -251 -482 30 -276 -129 -175 -156 -80 -506 2 -91 348 -307
1865 -307 -10 -301 156 4 -62 130 -23 174 74 95 397 86 458 384 126 338 662 255 572 595 134
1886 134 349 278 486 280 310 203 428 264 469 360 -126 397 -12 188 37 460 66 292 3 -79 115
1907 115 -363 -129 -12 -58 -329 -358 -383 -358 -494 -393 -108 -637 -210 -281 -298 -291 -322 -302 -453 -22 -380 -236 -150 -86
1931 -86 -127 -385 -260 -168 150 -480 -28 -167 -187 18 -167 -129 -67 372 -141 295 38 75 478 55 281 109
1953 109 382 234 431 46 515 229 243 467 87 442 179 206 233 261 95 127 152 -17 312 -76 260 165
1975 165 -99 257 -53 39 -213 29 -170 -10 -187 69 127 -440 218 -373 -155 -310 -125 -491 -142 -250 -585
1996 -585 209 -648 -164 -566 -265 -86 -257 -18 -125 17 -500 13 -355 -26 -90 -216 -192 -232 145 -76 96
2017 96 -45 65 18 92 15 249 256 116 522 144 157 305 435 506 54 98 -9 289 350 442 244 241 400 195
2041 195 526 25 311 210 421 246 181 70 -263 406 -156 374 -94 67 -14 -95 44 -104 180 -167 142
2062 142 -142 14 -155 -229 -95 -432 -239 -181 17 -467 -396 -106 -214 -79 -514 -204 -147 -266 -280 -253 -190 -204 -3
2085 -3 -253 -128 -321 -235 -189 141 -64 -220 235 -210 363 304 27 182 212 1 80 254 161 163 -71 188 254 229
2109 229 297 149 252 127 550 -187 407 224 356 564 122 216 106 409 46 127 -7 79 174 -57 135 121
2131 121 47 -266 -70 -185 -194 -269 -269 -184 -287 -10 -262 -136 -191 -217 -228 -156 -164 -318 -11 -541 -187 -392 -409 4 -55
2156 -55 29 -294 -150 -450 -111 -106 -244 92 -247 80 -181 167 -77 136 17 -14 498 -148 339 37 385 280
2178 280 119 95 -27 496 139 403 41 372 76 195 329 116 387 158 185 43 418 -123 425 58 35
2199 35 -82 20 152 -99 43 -132 83 -85 76 -94 -144 41 -248 112 -315 -170 -329 -306 -3 -165 -90
2220 -90 -463 45 -465 85 -340 -149 -129 -489 -36 -249 -74 -304 -41 -31 -27 -263 -363 191 -21 353 133 -92
2242 -92 176 28 323 -148 314 64 248 118 259 23 70 324 -33 422 74 575 -35 78 286 179 393
2263 393 376 489 85 332 127 319 183 158 258 183 238 -223 225 169 176 32 -121 -76 -58 161 -30 210 -204
2286 -204 -208 -107 45 -154 -439 -7 -321 -186 -305 -258 -37 -480 -45 -62 -140 -238 132 -96 14 -88 -323 29
2308 29 -273 312 -96 271 -77 4 24 97 234 -385 146 -30 378 177 141 106 153 46 20 350 19 188 64
2331 64 233 110 325 162 298 421 217 444 198 310 296 31 284 -129 51 139 359 191 128 -113 198
2352 198 200 51 156 -77 176 -51 -160 55 -56 -117 -232 -93 -145 -317 -114 -260 -293 -184 -229 -321 -142 -214 -86
2375 -86 -315 -319 -144 -220 129 -435 11 -201 -141 -154 -252 -222 85 84 -121 166 -102 130 49 56 310 31 254 39
2399 39 310 191 132 16 116 362 206 413 85 272 173 249 350 185 129 -30 332 191 525 306 325 -47
2421 -47 88 120 -242 372 -240 -10 -100 131 262 -13 35 -92 181 -268 -266 -249 105 -176 -82 -162 -276 -134 -349
2444 -349 -210 -275 -193 -153 -231 -212 -365 -212 -276 -24 -265 1 -137 108 -1 -364 229 -49 46 -81 99 -19
2466 -19 46 146 -254 108 -53 215 -223 131 231 110 442 247 195 24 220 -88 359 293 117 164 73 436
2488 436 145 176 26 249 389 -180 155 104 223 -74 167 -165 97 138 -185 233 0 -119 -1 27 62 -201
2510 -201 -21 -124 -114 -164 99 -293 -86 -2 -181 -343 -193 -157 -241 -17 -400 66 -299 -169 -36 -239 -225 40
2532 40 -110 -81 -37 -75 -55 -124 -215 15 -178 -22 -79 132 -13 -209 149 35 315 94 36 -200 292 175 25
2555 25 321 180 198 -30 -103 126 237 223 109 120 -135 253 92 377 74 79 189 -64 232 -61 108 -75
2577 -75 133 -25 -20 -116 -171 239 -117 -51 -197 -104 17 -180 -89 65 117 -185 -51 -73 -146 -370 -157 -122 -58 -53 -75
2602 -75 -51 -137 23 -83 -116 72 -84 -36 -98 133 53 116 -140 -100 142 -7 -37 -12 184 285 228 186 290 -36
2626 -36 106 256 169 225 157 314 -26 36 349 24 311 -224 243 202 87 116 464 454 115 265 8 235 29
2649 29 310 188 34 -233 20 -16 -76 -4 -146 273 243 -109 -127 -212 153 -380 24 -175 -191 -416 -85 -51 -239
2672 -239 -7 -144 -101 -31 -8 -358 -356 -181 -390 -47 -138 -13 -217 17 -75 -99 247 -136 64 150 145 -49 13 -36
2696 -36 300 87 0 399 -157 368 73 251 401 219 102 95 -106 126 151 -132 247 45 3 108 208 72
2718 72 -81 116 -123 145 196 90 -87 139 72 -41 209 -62 -129 59 -36 24 -269 -53 -187 -220 -264 -221 -382
2741 -382 -83 -59 -258 -155 -256 14 -1 -55 -176 77 -322 -81 120 -412 -226 -153 68 12 -8 -98 -106 306 -252
2764 -252 -23 4 8 82 49 -82 4 305 37 180 30 534 255 -11 283 21 184 94 248 182 413 209 276
2787 276 222 -39 322 96 218 21 251 -147 55 71 3 36 -77 166 -107 31 -6 -135 -22 -94 227 117
2809 117 -166 50 -91 -188 -102 -96 -182 -34 -262 137 -151 -322 -321 -69 -150 16 78 -165 -150 -393 -98 -329 -176
2832 -176 -114 -39 -205 -209 -202 -217 98 44 111 213 -263 91 89 -47 -125 103 29 161 81 72 74 56 241 263 117 0 309
2859 309 124 148 242 -26 435 5 231 -121 198 14 42 54 -55 44 -1 38 -142 -4 -39 -185 377 -87 -129
2882 -129 -207 -262 -73 -108 -23 -190 187 -296 -279 11 -11 -54 -163 -182 -135 -193 186 -73 -353 -24 -187 -214 -255 -366
2906 -366 111 8 203 -213 -222 -103 -21 -181 -133 87 -28 395 -77 261 160 176 97 46 159 126 346 61 375
2929 375 -32 205 148 -88 291 329 214 106 -47 231 114 252 -97 213 301 64 -109 59 46 -113 304
2950 304 -28 137 -262 349 -139 -244 -214 122 -59 -188 -220 -276 171 -192 -273 -246 -122 -213 -123 73 -105 -217
2972 -217 -266 -231 -40 29 -94 -142 -80 -254 6 -299 82 135 -43 -236 -125 1 -188 24 -20 -49 10 -43 143
2995 143 -172 317 53 111 -149 202 -98 120 70 0 121 227 -11 30 225 373 -59 -120 361 19 67 197
3017 197 43 39 120 76 209 6 209 -273 155 -87 -334 63 -89 367 62 -42 -122 142 -173 -291 -129 -229
3039 -229 65 40 -24 -375 73 -50 -215 -219 -137 -104 -234 97 -348 -230 -391 -504 -169 -345 -53 -230 -146 -50 93
3062 93 212 -12 294 -107 223 -44 -119 46 -78 272 28 120 -205 147 48 30 128 115 70 298 132 -127 276
3085 276 31 130 70 125 248 1 90 -50 364 67 130 167 146 -76 70 340 -83 154 -98 112 -255 -186 -34
3108 -34 -55 -84 -151 88 -184 66 -566 -258 -340 -163 54 -178 -197 -352 35 149 -25 -250 -211 74 -180 44
3130 44 -162 -162 -165 -138 89 18 -28 -103 409 6 60 -91 61 359 41 232 205 388 28 139 -140 18 46 308
3154 308 321 142 -26 88 290 108 207 200 -87 213 33 259 253 125 90 268 230 57 -82 -181 7 -157 26
3177 26 -27 173 65 -3 -144 -22 -336 -124 -66 -351 -205 247 -253 27 -208 -179 -129 47 0 -287 -203 -313 -33
3200 -33 -308 253 -157 -24 -183 27 -124 114 260 -28 127 -322 -99 76 -168 144 -53 252 93 124 -24
3221 -24 -169 88 64 23 -47 -31 224 144 -40 -43 278 0 -25 85 378 45 -204 78 46 203 149 268 -71 335
3245 335 59 130 75 291 157 -51 -142 -395 17 -229 132 -65 58 -94 -174 -117 -225 109 -209 -17 17 -91
3267 -91 -125 -90 -93 -43 -291 -385 229 -229 24 -256 -175 -50 -185 115 -121 -111 -110 178 -119 108 15 58 161 80 297
3292 297 -117 237 191 -7 48 -82 123 45 90 2 110 204 127 248 286 -26 396 169 115 167 -11 92 161 -37
3316 -37 35 89 211 95 255 71 -110 153 96 205 -89 -188 -61 -6 77 -157 57 -362 -48 -113 -85 -227 -86
3339 -86 46 -336 -84 -48 198 -166 -30 -239 -65 -285 -88 -116 -131 39 -183 -7 64 -290 -19 55 69 5 104
3362 104 -58 153 -101 184 67 -109 285 -111 36 83 207 32 71 -115 92 155 -86 76 -131 33 94
3383 94 -36 160 71 -104 -47 -43 55 111 -82 175 231 153 -55 80 221 97 137 16 -66 -106 -122 -13 -300 -154
3407 -154 -159 -411 7 -155 -78 -85 -119 -121 -97 -340 166 -220 -371 56 76 -103 -108 -53 -179 -103 -14 163 -149 -53 -14 -9
3433 -9 -78 -235 -22 68 52 6 68 226 -115 30 -80 169 -98 -241 172 391 64 -98 139 151 -3 192 44
3456 44 109 104 209 -80 -30 242 98 31 67 125 -17 102 -144 229 90 43 77 89 4 -15 215 -295 -106 -91 175
3481 175 121 -82 -21 -223 109 -41 86 -74 -216 -189 -322 146 -113 177 104 -111 59 -200 -225 64 -52 -212
3503 -212 -114 -112 158 -258 -82 -183 56 32 251 -40 -91 322 -68 -150 110 66 -55 -10 -59 75 58 260 195 214
3527 214 316 228 472 155 50 266 29 219 63 -31 151 -15 -44 -153 135 184 -7 36 151 -97 83 127
3549 127 -45 155 27 -2 7 115 -103 53 -162 -54 -96 -4 -244 90 -161 -188 -81 -65 7 -64 -71 -11 -142 -130
3573 -130 103 -11 18 43 -216 -3 16 27 52 134 -137 173 -159 -77 56 56 13 -30 62 -32 34 59 158 -3 -64 -65
3599 -65 206 -98 4 223 456 213 149 32 -23 270 205 -117 244 12 138 -1 176 -55 49 27 -20 233
3621 233 -158 -23 -125 -120 1 18 100 57 108 133 -40 -5 -32 -57 -93 -54 -83 106 68 87 74 -255 74 -50 258
3646 258 -188 -71 -204 89 -52 -240 56 51 39 -43 148 -388 -134 9 -30 199 -25 -46 -14 97 93 113 29 -27
3670 -27 -46 -18 205 -54 304 79 132 119 206 186 60 138 68 319 164 78 136 21 142 92 141 105 152 -88 -46
3695 -46 97 -7 90 56 17 59 125 -1 -15 25 -71 -182 -28 -150 -173 158 -30 -152 -240 -125 -40 14 52 -334 13
3720 13 -28 -126 -50 -337 240 147 111 -250 -205 124 -198 65 -171 191 -98 -87 -308 138 -96 -141 309 209 72
3743 72 -65 357 -92 199 213 6 -39 150 156 113 162 345 -8 -75 68 329 120 23 199 109 66 124 -150 26
3767 26 91 1 96 45 -122 227 31 8 -37 -185 -54 -18 34 -6 -123 -24 163 -47 -139 -97 -40 -111 -327 173 -203
3792 -203 -281 -146 17 -74 -104 40 133 267 -34 -48 15 -73 -179 -96 -238 5 -243 -69 12 54 135 -159 -80 -114
3816 -114 -241 -6 -38 -240 30 129 79 180 84 239 6 408 -34 220 70 62 121 4 -26 77 302 -15 87
3839 87 -23 10 270 147 91 43 320 62 -128 -63 -49 23 -80 42 -78 -201 -122 -109 3 -65 119 18 -2 87
3863 87 85 -147 -61 105 -174 32 -188 280 -60 -30 7 -104 158 -203 -153 160 -99 131 -67 -3 -50 -23 -219
3886 -219 156 74 -40 171 -13 144 -20 -35 61 180 79 -4 -280 156 59 -143 -13 236 -18 -76 25 11
3908 11 102 1 207 31 239 97 -137 -96 -229 6 -122 -94 145 108 223 -373 50 -177 79 66 -186 6
3930 6 -175 9 -76 -141 -272 -29 -219 -150 -109 -249 152 -342 -193 -254 -135 9 13 -3 -31 -99 -242 -118 -57 228
3954 228 -63 -110 -9 -267 82 79 -24 -108 26 76 -119 116 -28 411 166 62 54 187 157 -6 -19 -197 305
3977 305 -14 -6 154 4 187 -133 58 66 90 -29 187 33 61 92 39 206 60 -25 -67 246 -14 34 -131 41
4001 41 110 -29 -340 -4 -82 96 -86 84 -381 12 103 -36 -68 17 -184 -191 -33 -92 -30 -126 -32 -77 -144 -215 -130
4026 -130 -225 -57 -146 -118 -141 -150 -53 47 100 -114 -153 212 -27 262 12 39 68 115 159 87 -83 72 555 243 125
4051 125 -150 68 20 -124 -35 62 113 -37 -72 -26 -35 -18 -69 -291 56 68 -229 105 39 213 104 -186 137 168
4075 168 42 172 -136 213 26 48 -30 -132 -321 -116 -312 -269 58 -92 -160 -26 22 -113 190 0 -62 -125
4097 -125 -7 -7 -301 -90 151 -72 -125 27 -1 -73 -52 -5 -96 -69 -34 -62 7 -80 68 -1 -206 66 135 45 100 49
4123 49 58 213 230 28 339 -18 -87 20 -8 -70 -117 -8 272 321 69 163 -43 118 -394 71 98 -57 139 -153
4147 -153 160 -75 -298 48 -64 -49 18 -83 -201 -141 -115 172 -27 -54 -37 -85 16 -30 -147 -254 -96 -29 -103
4170 -103 -206 -149 188 -90 32 144 -82 -97 40 49 63 183 -18 53 -81 81 35 -58 131 48 108 120 146 38
4194 38 -134 -153 -328 194 274 225 33 208 -168 71 324 5 103 -104 15 -14 207 202 -45 60 100 246 -294
4217 -294 -85 220 -255 19 196 -83 -388 -230 -172 50 27 51 -121 -54 27 -176 98 -189 -151 138 37 47
4239 47 -22 -65 -137 183 -262 49 -453 68 66 -315 121 -75 141 -336 -106 -239 113 -226 107 36 -45 108 -85
4262 -85 33 -172 115 172 192 178 103 187 -28 127 115 128 84 269 329 -222 75 -117 226 214 156 -70 -238 206
4286 206 187 15 -162 48 -64 115 -188 -160 115 -145 121 20 -115 -25 -56 12 -212 136 -140 7 -303 -117
4308 -117 -87 -77 -125 -155 -75 -139 56 -52 -30 -239 -2 -78 -155 -400 -147 58 -379 2 -334 -31 50 -57 -22 -74
4332 -74 147 123 261 -177 68 16 -84 -71 -181 47 -57 -46 43 191 -60 -57 -159 156 -27 -85 321 -39 182
4355 182 268 209 77 234 177 278 17 29 206 -72 57 255 68 149 116 -7 14 -179 107 -14 -258 -152
4377 -152 1 -90 -47 -351 66 -47 30 -171 44 -208 -296 113 -84 24 83 25 -177 -261 -189 -119 -116 -35 -258 -173
4401 -173 -34 10 -128 91 15 114 33 280 -306 0 114 2 37 63 96 96 66 23 150 127 138 436 -10 121
4425 121 37 105 1 40 -79 164 231 84 402 90 92 76 77 122 -42 -43 182 -146 -93 -266 98 -93 -105 -34 189
4450 189 -97 -77 -19 -139 119 -204 197 -26 -82 -56 -150 34 -120 -83 -145 -181 -149 -54 -46 232 -28 -242 -10 56
4474 56 -94 115 -109 74 -8 -68 56 -258 -12 226 -50 218 143 72 154 -286 -72 -225 260 -132 95 -69
4496 -69 87 289 -106 372 -7 278 202 148 -263 120 29 45 50 246 -172 -65 -47 -194 211 195 143 -56 -118 -106
4520 -106 -53 113 188 41 89 -95 169 -181 119 40 -10 -137 104 -215 111 -37 -158 -164 20 -79 -189 94 22
4543 22 -143 -244 -302 190 27 20 -5 178 -131 -297 155 -97 250 68 -18 -216 -70 4 -233 77 -190 -68
4565 -68 -50 93 239 173 -195 -199 -105 -113 30 -103 313 20 80 23 230 145 -30 235 175 117 96 -81 231 131 99
4590 99 -65 54 -43 81 -25 51 -207 -54 32 -67 109 -126 43 -173 -118 58 -142 -268 -160 113 161 174 -37
4613 -37 70 61 108 -137 -30 126 16 -271 -130 -158 -179 74 -64 -34 -74 -81 -81 152 -12 -32 -338 61 99 236 -50
4638 -50 30 112 3 201 86 1 52 44 63 65 118 162 218 -102 278 -3 29 -16 265 128 252 199 212 -67 -14 92
4664 92 -100 13 -153 5 -221 17 -89 116 -116 -109 67 112 1 -200 -20 0 -230 61 231 183 -106 -116
4686 -116 149 -214 -146 -105 -5 -307 -212 -40 -333 -141 -162 140 87 547 -340 24 81 137 -346 -147 -36 130
4708 130 60 120 -44 114 -102 92 -71 -22 -16 37 -112 71 352 -74 233 368 66 76 40 -33 57 -23 103 182
4732 182 -211 -42 66 153 -169 -199 224 -102 106 127 -104 -25 104 -232 89 -233 23 -13 -222 -161 63 -40
4754 -40 -125 54 119 -60 -220 -367 -132 -293 109 -537 -18 50 -20 -90 55 -114 -12 -32 -251 -227 13 -202 20
4777 20 -5 113 -179 202 -98 97 2 -35 131 -126 251 -31 45 124 70 118 256 309 9 106 -45 194 224 -77
4801 -77 -162 216 98 192 317 110 154 -165 -326 58 -67 187 29 134 57 -64 -140 73 15 64 168 -230 443
4824 443 -135 59 53 -126 -150 -288 -176 40 -90 -42 5 -53 -94 -300 -102 -62 -250 -109 -101 -17 7 79 -127 39
4848 39 39 -53 122 -138 22 77 -204 -199 -200 285 168 316 -7 227 99 -75 -139 46 206 -90 202 -258 -66
4871 -66 91 396 30 8 170 -130 24 -146 109 135 115 377 32 122 86 -74 167 -105 -12 -302 89 -140
4893 -140 -39 88 48 -66 -11 -86 60 -261 -173 46 -54 -173 -246 -12 -112 -107 -102 -135 47 -91 -118 -31 -121 163
4917 163 -38 74 -87 -160 -78 51 -251 11 -86 58 -122 116 135 28 40 115 58 -95 -111 84 -233 -122 50
4940 50 -130 54 -36 -112 65 -54 12 33 -15 -25 168 121 24 59 84 -228 31 -131 121 36 -108 -21 75 221 -134
4965 -134 -192 -33 79 74 -165 -184 -60 -47 207 -48 30 -79 24 -127 -11 -164 -104 -16 -92 -180 -34 -102 -70 -151
4989 -151 -136 -52 106 -128 -328 -112 -68 31 27 -96 -11 -33 -156 168 -178 43 32 210 39 -105 97 77 81 47
5013 47 -163 -72 177 77 179 -63 20 -167 -11 112 69 80 -76 135 17 88 76 -136 -121 -12 -302 -10 99
5036 99 84 -4 246 -16 226 -6 -75 -38 -129 195 -2 -158 5 -136 -181 -105 -170 78 -111 -61 -358 -114 39
5059 39 -403 -29 -51 -184 31 -122 -163 -113 -9 14 61 -22 183 -61 -169 -217 -77 -34 110 -65 16 -66 103 75
5083 75 -68 -77 38 84 -85 -85 15 20 67 74 157 -63 174 12 108 274 -208 138 -31 123 198 242 224 79 65 37
5109 37 280 141 -163 32 37 -190 -207 99 -74 -12 -297 -120 -151 40 1 -74 -237 -155 -123 -175 -91 144 -109 -69
5133 -69 -32 -200 -103 -21 19 -243 -226 -189 117 -178 98 -36 -222 -11 223 116 -84 -2 -46 -50 -21 14 -22 57 -134
5158 -134 146 197 -156 -72 104 112 50 72 -21 80 116 107 82 -79 96 176 136 92 12 198 -221 43 30 -65 252 133
5184 133 -25 76 230 29 -60 -171 -4 240 52 -152 22 11 -101 84 86 -116 -174 -7 -245 -350 52 -280
5206 -280 145 -306 -177 -290 -38 -84 -2 -302 -192 -25 -115 -6 96 91 -104 -63 -169 -8 -358 -190 -192 -280 -83
5229 -83 134 -38 -3 -28 61 19 95 60 37 -139 65 118 36 -46 -53 164 10 224 -29 -35 262 62 68 -161 149 72
5255 72 53 106 19 199 -32 333 44 -154 -257 31 -226 -37 -45 27 116 -289 5 -139 -34 -107 -159 47 -103
5278 -103 199 -87 -77 -176 -35 -175 -203 -154 -209 -62 -51 -14 -17 -88 -98 -20 74 -44 219 -195 -246 62 -180 239 69
5303 69 93 39 -100 218 -35 98 78 -29 107 283 24 211 317 3 277 -101 -348 89 195 20 47 -19
5325 -19 172 112 195 123 68 26 158 103 205 112 117 -24 136 8 -185 -103 103 -344 13 -16 -209 -129 -37 -37 38 88
5351 88 26 -64 -66 -143 -120 47 -102 -189 -42 -51 -141 12 -94 -164 -198 6 -60 -22 -34 -48 -2 -88 19 -268 70 -9 -96
5378 -96 210 55 -208 120 245 226 -61 -124 28 -4 -39 209 155 223 128 72 48 54 127 11 83 -14 21 -79 -72 -143
5404 -143 87 -71 170 184 229 -48 -49 -76 -94 23 -61 -20 295 -49 -224 300 -67 -198 16 -267 -10 -158 100
5427 100 103 -160 85 -13 68 -107 -368 -230 -76 -160 -244 124 -254 12 -116 -321 255 -85 -67 50 197 -186
5449 -186 -45 -33 -173 -231 -13 -104 -76 152 31 45 33 196 98 31 149 -162 -50 -39 -14 37 66 253 21 158
5473 158 -14 252 -21 72 70 113 -53 57 259 -86 40 -37 63 -100 -283 -117 60 12 23 -205 -136 181 240
5496 240 -100 158 -61 -194 -167 -6 198 -210 -153 55 -28 84 1 -226 -16 -26 -72 -21 -101 -178 -143 -161 -298 65
5520 65 -71 -217 44 -74 71 64 29 -220 14 83 14 196 -58 41 -155 52 -4 140 46 -115 -37 82 340
5543 340 38 177 36 108 63 115 261 -19 -10 1 160 106 -139 257 -108 -69 -64 8 139 43 -91 81 271 -201
5567 -201 0 -143 100 -194 -46 39 -107 -75 -219 45 -64 -19 -238 -27 -17 -129 -129 -22 -114 -161 -36 -10 -53
5590 -53 -239 -367 -52 -76 -40 -51 34 -117 233 -98 153 167 -25 29 -55 61 -67 69 56 30 -241 20 147
5613 147 191 187 -62 177 117 16 35 91 -124 -89 182 284 234 30 -13 63 -20 15 -55 342 60 51 125 178 -28 142
5639 142 164 25 -200 -233 -140 9 -42 -174 -40 62 -190 -155 -40 -145 -88 -9 9 -36 -40 21 -58 -181 -274 -186 -104
5664 -104 -264 20 -123 -130 18 -405 -31 -256 -87 -50 -10 -137 -181 211 8 -46 -123 56 166 111 88 363 151
5687 151 -3 122 248 207 148 -93 295 -98 173 104 170 122 -50 12 -59 63 -56 170 91 -114 -211 13 -35
5710 -35 -143 142 -19 -35 -209 0 -172 15 -168 126 -295 -143 76 -158 -144 -2 -167 -233 -158 -206 -75 18
5732 18 22 -61 -312 -112 -14 -50 74 -187 76 33 -8 -242 349 -55 154 -55 -147 48 -319 140 -102 71 191
5755 191 -124 58 40 261 47 16 192 144 -33 -127 18 224 48 198 258 105 -11 61 153 40 -177 -40
5777 -40 -37 205 -26 -93 -52 14 -6 -295 77 -119 -52 180 -187 -179 -117 61 -7 80 1 -83 -28 -107 -23 -243 -107 -258
5803 -258 -51 48 172 -215 27 270 55 35 30 28 -94 -52 174 -196 -90 -104 -106 -156 289 -4 -43 -153 62 -7
5827 -7 -272 95 -170 -6 -105 158 75 80 41 -15 46 -27 134 -129 71 80 11 235 -38 224 -220 -53 -136 138 57
5852 57 43 171 164 52 57 23 -106 39 86 -89 155 -32 64 166 14 -226 94 -18 -206 -171 -40 -18 -24 -20 -211
5877 -211 19 -150 -34 -72 -81 159 -94 -195 -154 179 63 215 -126 -135 -64 -148 -58 -2 87 -92 29 -87 135 5
5901 5 -25 18 186 79 -75 56 112 188 -57 -43 -5 -204 24 203 48 -156 114 91 184 123 74 95 153 46 -29
5926 -29 33 5 66 28 117 37 33 60 -73 -283 76 -129 98 -200 -99 -272 -235 -100 122 -21 -34 53 60 -6 28 -247
5952 -247 38 -140 -107 -101 193 -55 -157 36 110 19 -162 101 -160 238 -157 118 178 -180 -125 6 -117 26
5974 26 156 4 -17 -5 -259 169 37 104 33 -120 30 173 200 215 169 -153 -11 128 119 -36 46 24 210 108
5998 108 -74 -20 -77 186 -81 -68 -109 -311 -1 -47 79 -63 57 75 50 -109 -43 -10 -105 33 -44 183 -124 -36
6022 -36 34 -252 61 -291 -90 -139 34 -106 -12 -146 207 159 0 3 -151 28 -182 -240 121 39 -110 110 -307
6045 -307 -167 -65 -143 -15 53 193 -125 18 327 -66 -179 -60 -126 152 19 205 -90 -4 -182 49 77 150
6067 150 -138 221 207 -47 262 210 123 -88 62 -26 156 32 -65 -122 6 -22 -67 173 -33 7 -69 -104 -46 -5
6091 -5 -63 37 38 -192 -212 -100 -387 239 -219 -73 79 -35 -7 -15 74 -299 -46 -36 -127 -107 -200 -46 198 -110 -86
6116 -86 -77 -87 -83 204 -177 5 -15 55 -236 126 45 166 161 72 -93 -31 -34 -4 99 43 55 203 33 -107 136 185
6142 185 51 -87 82 -19 162 -61 69 -47 245 142 -39 41 -142 15 -128 -122 -207 131 -18 -13 29 -360
6164 -360 -114 -108 -52 -70 -120 -39 -41 -54 -256 106 46 32 -235 -88 -75 88 -15 -36 -282 -113 -129 -122 8 -48 10 -27
6190 -27 -26 -210 93 -154 13 99 -115 212 27 56 -34 -7 273 167 260 -301 183 -2 128 153 48 105 -37
6213 -37 150 90 137 247 86 -158 52 267 90 47 82 307 114 73 -83 54 124 -54 -7 -34 -27 184 -206 20
6237 20 211 175 -318 148 -38 45 -163 54 -7 -88 65 -66 82 -55 -51 -388 -259 -227 -9 -105 -18 27 -216 -137
6261 -137 -159 -109 92 82 129 -188 -17 -87 31 -70 83 -8 106 67 18 166 70 177 -192 134 -23 -96 -32 49
6285 49 122 -54 230 139 -50 101 166 45 105 -130 -72 -74 138 -341 -78 -240 -26 92 178 -154 58 68 102 260
6309 260 -261 109 -255 166 -168 -38 177 -334 -206 -117 -222 -64 -175 -85 7 -218 -130 -278 -151 -246 -255 -226 -3
6332 -3 50 -71 184 -176 -226 48 101 24 -139 -64 118 -2 -31 -98 245 -112 -44 -65 193 -181 -68 -20 -83 -59 -54
6357 -54 -251 -7 75 -7 322 167 249 90 -11 143 29 174 -150 127 24 138 269 -154 121 -216 88
6378 88 49 147 33 -31 235 206 -15 -87 -19 -134 -128 31 -127 -15 -20 157 -254 -221 -123 -71 -87 -147 -21 -117 22 110
6404 110 -173 11 -213 45 -22 137 -259 -10 -149 -68 -62 -267 -36 72 137 -74 -87 155 -137 -152 3 -67 -122
6427 -122 155 141 132 -128 69 119 40 75 145 -107 212 79 -96 -49 199 241 105 -22 211 -117 95 -12 56
6450 56 2 17 259 100 64 288 97 -11 63 -215 249 -64 85 143 -129 -74 9 -13 -26 -195 -103 77 -47 169
6474 169 197 -86 -4 -82 -175 -145 71 -52 -50 -271 80 -138 302 40 6 -160 -240 -90 14 30 -58 -182 -127 -159
6498 -159 137 9 -99 -77 53 1 37 -42 -127 109 -212 37 -1 -307 168 30 10 282 -256 112 -172 140
6520 140 -202 105 96 -81 116 -122 210 286 -54 61 -37 23 -117 117 -109 119 18 -64 -130 105 -10 -127
6542 -127 -154 -136 -188 153 119 -81 -53 -109 -184 -185 -194 -196 -196 -78 88 28 121 -76 -16 -254 109 -97 -52 5 35 62 -201
6569 -201 95 23 -78 -5 42 40 1 188 6 107 -222 149 -95 -64 67 223 194 -71 174 19 300 -136 92
6592 92 6 106 -138 48 123 170 108 -140 -157 -66 -102 7 -32 -106 -118 78 -16 -25 17 9 41 0 -41 -224 201 -27 -77
6619 -77 -126 -225 -177 -199 117 -24 -55 23 294 -29 -104 -190 -29 221 73 42 60 143 61 193 -16 77 95 72 27 -72
6645 -72 -13 -272 -301 129 25 141 -32 -25 -60 38 330 -86 223 190 -121 -17 192 -136 13 176 31 207 12
6668 12 -14 -52 -267 32 -159 -88 -94 6 -98 -137 -195 -118 -142 -132 -45 -20 -115 -295 238 -241 86 150 -58 99 4
6693 4 167 37 208 -268 42 -212 -193 -167 -18 87 -58 27 -84 179 84 -112 -84 82 -74 -141 74 -215 -139
6716 -139 -217 216 21 -31 -196 -68 168 -59 -76 -16 -31 69 96 19 108 271 34 232 118 29 189 -113 173
6739 173 -65 134 -104 55 136 -25 37 -56 218 186 -111 -176 -24 -96 -4 -9 -245 -88 52 6 -172 200 -92
6762 -92 187 14 62 46 -20 -138 99 45 -74 -9 -90 -163 78 -28 79 4 -58 115 -166 86 -208 -11 -127
6785 -127 51 -112 -89 -132 -43 -34 -65 62 183 135 88 -134 228 -101 63 -100 206 -60 18 -44 129 124 -185 0
6809 0 -169 111 -127 29 -89 17 0 142 33 -83 -60 -3 -13 -31 6 -141 56 -207 -217 -100 -15 -134 41
6832 41 38 183 100 80 -44 137 -153 -247 241 -183 12 17 -66 -46 146 -195 -68 0 0 -217 -85 8 -274 -101 294
6857 294 116 -5 92 83 -106 213 -186 -221 -103 -62 95 1 -49 72 137 -71 330 324 -89 199 105 105 -6 -1 101
6882 101 -33 -102 -163 16 83 87 138 78 -178 -212 113 31 -157 237 -38 -59 -202 -88 6 -38 195 29 -151 -105
6906 -105 72 -236 -61 -136 -112 -54 129 -60 31 -40 -41 43 2 -134 13 25 -72 -45 115 -9 -223 -113 -10 28
6930 28 137 -236 -75 -86 -103 -131 -17 -138 0 -26 -50 162 -226 -159 179 -33 -39 224 97 -117 -89 140 125 27
6954 27 -20 -120 67 108 -171 -39 -109 -156 -114 39 104 213 165 61 107 249 79 71 33 22 -74 225 -19 53 -203
6979 -203 145 -86 -41 16 -92 16 142 -340 93 -301 -114 101 -61 -91 -16 171 -30 23 12 -43 -256 -51
7001 -51 -120 -34 -66 -114 92 -92 -74 -10 -38 -17 -39 -110 165 -10 -230 58 -114 228 61 184 71 381 -58 21
7025 21 -22 32 -116 338 236 203 287 32 141 -74 -35 -163 80 -121 -46 120 5 103 -50 -117 -8 -166 285
7048 285 64 134 198 50 85 110 -272 138 -180 -298 -155 -218 -245 -70 19 -8 54 -287 44 -226 217 56 -14
7071 -14 -28 -185 66 19 -12 -297 -78 99 -1 98 80 -63 -255 -69 -27 -86 -234 -134 69 218 115 -35 100
7094 100 -103 115 41 46 -149 -59 303 152 -107 34 146 -160 -38 222 183 -113 279 -137 44 49 -74 38
7116 38 279 28 142 -85 122 37 -113 -137 155 73 95 69 -213 68 232 -89 -55 -112 34 155 -37 34 12
7139 12 82 -86 97 -230 2 -30 -249 -133 7 0 -221 -39 -239 -62 51 -34 -44 -121 166 -276 -57 -218 82
7162 82 -193 230 83 47 -179 -25 39 42 29 -181 107 42 54 92 24 -136 -21 -50 125 -96 -161 -268 13 -329
7186 -329 14 -38 -86 -99 62 74 102 184 73 67 -146 15 77 51 -25 -87 -5 -80 20 59 72 47 67 -61 42 -13
7212 -13 -213 -219 -230 -42 -44 0 7 -175 -85 67 117 -101 -164 -166 -171 38 220 -46 -3 -137 -17 -117 -200 150 69 31 -56
7239 -56 -5 -52 -102 -143 -15 -105 -109 74 -78 -147 149 -320 58 61 15 275 144 115 31 155 24 155 -77 -149 17
7264 17 -46 -48 69 15 -51 -22 163 -24 20 -76 -57 -199 -29 -267 2 -217 147 -210 -93 284 -12 31 -87 39
7288 39 -12 -69 49 -85 -67 69 41 72 182 13 -100 -156 -29 74 23 -69 26 68 -114 18 -65 -65 44 -160 88
7313 88 -2 -51 205 141 67 4 55 118 100 -96 124 155 127 73 3 -141 62 -9 94 -169 151 -78 -93 164 -220
7338 -220 101 327 43 -143 7 -24 -31 -36 -28 66 124 -58 -97 328 -215 -194 88 35 36 89 -39 48 7 -210 31 72
7364 72 42 -158 5 -258 183 111 -239 15 -46 -146 -39 -37 15 -298 -81 -195 162 -289 104 -164 -399 287
7386 287 -89 -127 -98 -104 167 166 -56 -33 59 289 -11 281 -59 -25 171 85 -90 -36 101 -15 34 45 -125 -168 -110
7411 -110 251 82 -45 139 2 125 67 -89 74 -282 -89 -126 69 26 166 85 -239 -195 84 24 14 -114
7433 -114 -155 -89 207 114 -2 -57 28 2 147 101 5 26 -2 -175 27 -302 23 -217 83 135 -136 -3 -252 143
7457 143 120 -37 13 -91 171 -4 132 -54 -172 18 -104 -37 -34 63 -21 59 19 220 187 201 -96 -189 -53 -100
7481 -100 0 -2 -98 -20 15 -38 -104 -16 -276 70 78 88 -3 -42 1 -101 50 46 99 -132 79 31 18 -9 -215 222 171
7508 171 -1 -7 0 -47 -25 -37 -196 -49 -104 83 -50 177 188 116 18 135 92 188 -217 30 -44 -186 30 138 181
7533 181 97 -54 157 -194 -160 21 117 -15 -30 7 -51 8 47 169 -112 -146 168 100 62 -103 -14 -207 161 -64
7557 -64 116 162 70 261 -247 95 -28 -19 35 112 -343 80 27 -140 207 -53 313 -78 -39 -37 90 19 -160 -60
7581 -60 -12 -40 -135 13 211 -81 100 112 -112 -120 -143 -102 76 -107 201 -108 210 -236 -73 -211 -84 -115 -78 49
7605 49 -11 -39 70 -6 -215 36 6 138 -29 364 117 -21 85 24 42 62 -3 -26 -31 -34 130 -156 22 184 -10
7630 -10 70 -33 23 149 224 5 13 -36 116 185 144 -91 241 31 -119 30 -20 -49 -85 -189 -105 38 -46 -235 -187
7655 -187 -55 9 62 -176 153 -79 -92 -14 122 75 86 -136 78 -144 86 -131 125 -79 130 -3 40 77 180
7678 180 -172 -234 -260 111 69 -1 -81 111 -19 78 30 -9 113 -173 -137 2 -41 -134 -7 147 209 218 -116 27 212
7703 212 -55 275 -184 178 38 25 -70 -109 98 105 131 55 129 -14 29 149 61 40 -223 106 -13 60 -66 -111
7727 -111 17 -187 98 45 -201 49 -271 -66 -83 -119 -144 40 -125 12 -19 -112 -26 179 119 -120 46 57 -30
7750 -30 -229 -55 -57 -26 211 -99 84 293 114 87 -43 -177 292 -231 -83 -199 197 241 -104 2 65 -5 12
7773 12 74 -173 35 94 -95 -34 17 -146 54 -51 -18 -203 78 -44 168 -20 -117 -251 269 13 -75 -55 -7
7796 -7 -97 -50 -35 -123 -104 -135 63 103 206 -180 -123 57 -69 -43 117 -95 -73 -195 98 60 -64 -122 1 39 -132
7821 -132 25 -5 -170 -123 -45 85 76 79 18 -59 -17 -58 -4 -197 -139 -108 39 -300 -109 -60 -236 100 -134 117 -3
7846 -3 -290 -32 -301 -39 -81 -51 138 -89 137 -406 84 103 18 73 94 25 197 -21 26 -24 -271 54 108 57
7870 57 224 -200 -298 -28 -68 185 -121 45 -173 -74 -139 -182 70 126 -20 -18 193 13 -73 184 -9 -94 -307 -32
7894 -32 -68 201 -131 -200 230 -211 -221 118 -66 -84 -60 23 -207 29 -69 -109 1 80 -106 -39 5 -68 151 -41
7918 -41 20 187 50 86 42 152 43 85 -85 13 132 62 26 70 -4 -112 216 221 371 19 -119 98 40 60 -262
7943 -262 190 -56 -43 -54 -165 79 123 11 -24 -48 62 258 -5 100 376 -177 240 -205 -167 -12 -40 -183
7965 -183 -36 -135 -109 274 -119 97 -131 -67 -78 -3 -131 -46 112 -5 -154 -10 -245 -259 -33 -61 -98 -33 -209
7988 -209 84 204 228 118 73 -32 98 296 -149 -24 -56 182 175 0 52 133 -184 102 -226 -29 -55 -9 -94
8011 -94 -179 -184 -51 50 -50 94 40 30 -190 5 200 77 -267 -160 174 119 -23 -35 133 -115 -240 -12 160
8034 160 71 -85 -4 -37 -16 100 204 -114 204 -65 22 -16 -146 157 -59 -51 -228 -69 -87 98 -6 32 -85
8057 -85 39 162 -24 74 -53 24 -16 -91 -161 158 50 67 87 -38 172 108 120 -81 145 83 10 165 140 14
8081 14 -68 159 223 -253 -335 -60 128 -60 8 -69 32 222 40 126 183 -51 -69 -107 -69 -37 -40 154 -9 88 165
8106 165 -295 -50 -3 -68 118 -42 -145 -3 -22 -115 15 -98 -193 70 -151 195 -25 -78 222 30 -54 145
8128 145 -157 -10 60 30 104 -72 189 -212 -79 162 165 25 158 37 -46 39 -220 -11 158 -81 86 -63
8150 -63 149 86 -34 108 56 -143 -39 149 -277 -36 -71 23 -108 -67 137 -22 83 145 96 62 -178 79 -122
8173 -122 76 -14 191 -305 -12 278 220 -63 -49 -166 -116 101 -197 -72 -16 -100 29 12
8191A2
$$ Imaginary data points
##PAGE= N=2
##DATA TABLE= (X++(I..I)), XYDATA
0 0 0 0 0 0 0 0 0 0 0 0 0 0 0 0 0 0 -2 8 -8 8 -8 8 -11 16 -16 16 -24 24 -32 32 -40 46 -48 56 -64 72 -80 90
38 90 -102 113 -127 140 -156 172 -190 210 -232 256 -281 311 -343 376 -415 459 -507 559 -621 692
58 692 -774 873 -990 1132 -1315 1552 -1875 2345 -3091 4466 -7841 34622 27863 -33583 16306
73 16306 21908 -4690 -3023 18903 3164 2712 -2712 11646 10085 -4379 254 9941 9406 -7035
87 -7035 6253 5416 -3979 4424 5486 131 -1590 1284 -7200 8124 -2828 -6111 4386 -5777
101 -5777 -3431 -68 -4965 -5659 4056 -9935 -3775 1803 -10961 -3156 -1207 -1942 -7862 -1186 -4626
116 -4626 -4977 -1593 -5600 -1963 -667 -2858 -9814 4339 -2612 -6953 3890 -2801 -3698 -34 1188
131 1188 -2511 4733 -2535 688 5330 -2019 3040 605 2843 2314 4347 575 1907 3526 1316
146 1316 5362 2654 5588 -15 4584 3665 2995 5316 20 4315 4632 1455 -833 7076 -104 159
162 159 6333 -293 100 -553 3898 289 -416 -682 216 -1416 -2893 2505 -2828 -1577 -2804 591 -2830
179 -2830 -4534 -921 -3151 -2017 -3160 -1958 -5685 -1403 -3727 -3507 -575 -4998 -1785 -4175 -1601
194 -1601 -2800 -1689 -2848 -913 -1146 -3712 565 -2670 160 -1575 676 -799 -998 1388 -144 1918
210 1918 234 2685 -143 2202 1320 2196 3433 419 4109 1383 2854 1699 4101 2335 2325 3631
226 3631 1722 4025 542 4282 1755 2463 2440 1998 2244 177 3095 19 2571 244 1400 -201
242 -201 256 1316 -1762 1312 -2000 -25 -2252 -350 -1644 -2027 -820 -2882 -647 -4203 -728 -2865
258 -2865 -2047 -2791 -2564 -2116 -4416 -924 -3403 -1475 -3360 -1508 -2400 -2924 -915 -3087 -122 -3088 39
275 39 -1906 -604 -364 -868 499 -1029 1929 -1861 1947 -151 708 1517 950 2029 360 3553 164
292 164 2995 1717 2605 2243 1711 3291 770 3899 1001 3495 1518 2109 2327 1563 3050 525 3364
309 3364 289 2695 490 1123 1350 -39 1631 -753 1322 -1484 835 -1095 -461 -172 -1838 123
325 123 -2565 -211 -2817 -617 -2320 -2160 -1302 -2861 -1340 -3614 -598 -3494 -1476 -2478 -2539 -1594 -2947
342 -2947 -774 -3157 -280 -2971 -853 -1614 -1324 -545 -1791 316 -2043 654 -1212 878 -212 287
358 287 1123 -325 2066 -191 2147 536 2097 1341 1446 2586 819 2963 823 3255 1025 2471
374 2471 2102 1678 2644 1183 2860 1055 2445 536 2364 1372 689 2068 292 1864 -289 1814
390 1814 -64 568 -201 -11 508 -1175 -123 -2387 645 -1706 -811 -1131 -1901 -1700 -1792 -217 -2603 -1194
408 -1194 -2529 -931 -1894 -2208 -1210 -2963 -1173 -2643 -932 -2029 -1413 -2509 -898 -200 -2477 -466
424 -466 -1622 301 -1332 -233 -116 -619 79 -321 1294 -322 1360 -570 2150 1226 -276 2270 1184
441 1184 2050 727 2757 1443 1864 1457 2254 2269 369 2900 1067 2509 1158 1378 1923 1768 1449 952
459 952 2512 -147 1784 -90 1187 421 -508 1070 -400 528 -1094 115 -586 98 -1861 -967 288
476 288 -2546 -178 -1904 -751 -1951 -1786 -1043 -1657 -2495 -2415 117 -2730 -899 -2721 -1127 -1193 -2637
493 -2637 -168 -1815 -1587 -1639 469 -1501 -796 -1330 -179 929 -1549 852 -1162 345 604 806 245
510 245 230 727 961 2643 -272 2192 652 1687 2843 601 1506 1390 2431 1069 2570 787 1877
527 1877 1320 1397 2773 -284 2183 350 1837 1451 433 492 1084 944 -670 1965 -1491 358 217
544 217 -53 -108 -1442 244 -1179 -141 -1386 -423 -1988 -326 -925 -2603 -167 -2524 -596 -1756 -1445
561 -1445 -1648 -1418 -1413 -1181 -665 -3025 37 -1754 -585 -1167 -1743 203 -1151 17 -417 175 -1491 868
579 868 -118 156 659 -928 1944 58 1277 572 1058 1162 1199 1470 1009 1654 79 2864 370 1445
597 1445 1716 891 2037 1084 1846 602 1738 570 1972 586 425 1688 -136 1925 4 678 238
614 238 387 222 169 -353 -681 700 -1454 427 -1195 -888 -477 -1190 -302 -1427 -1082 -1698 -527 -2098
632 -2098 -1210 -1714 -1604 -544 -2110 -556 -2079 -1157 -1164 -926 -1504 -1256 -1064 -1549 -3 -1506 16 -1168
650 -1168 -230 158 -413 42 -70 691 -297 1355 -228 628 779 531 1407 163 1719 455 1684 966
668 966 1379 961 1250 1658 770 2134 656 1681 1119 1329 1275 945 1492 591 1293 256 1276 -79 730
687 730 627 -180 470 -506 701 -740 207 -577 -285 -837 -791 -63 -1322 -384 -1562 -441 -1412 -1069 -836
706 -836 -1369 -712 -1671 -483 -2042 -491 -1446 -927 -1157 -1287 -623 -1500 -39 -1489 -255 -1122 -340 -432 -660
725 -660 -92 -647 412 -697 580 49 541 424 209 937 87 1388 277 1221 484 1056 1236 595 1596
744 1596 811 1788 564 1704 986 1137 1097 1000 1608 365 1654 162 1288 513 648 818 391 776 -201
763 -201 839 -447 781 -395 -189 -122 -673 136 -1409 29 -1235 -413 -870 -1130 -618 -1496 -368 -1604
781 -1604 -434 -1669 -667 -1203 -1232 -723 -1467 -535 -1401 -127 -1428 -422 -1196 -835 -270 -1032 -56 -1050
799 -1050 262 -899 102 -315 -88 245 -221 775 -391 1067 -236 757 699 511 957 354 1425 403
817 403 1601 926 1277 800 686 1131 600 1485 281 1138 571 1047 638 716 1007 -58 1224 -5 859
836 859 7 790 192 -217 370 -502 577 -1073 271 -831 -176 -609 -818 -176 -1293 -375 -1266 -114
854 -114 -1462 -748 -1005 -1205 -460 -1556 -602 -1684 -633 -1126 -969 -755 -922 -345 -1158 -111 -1077 -231 -615
873 -615 -248 262 -475 203 -472 382 -270 807 -55 551 588 264 1123 152 1256 493 1060 597 1019 904
893 904 867 1307 446 1377 257 1391 745 823 1045 394 1140 379 1203 189 1120 -50 647 847 -109 865
913 865 -237 515 -380 35 -480 -155 -178 -247 -136 -955 -68 -1040 -469 -782 -1061 -920 -1050 -494 -1260 -741 -1571
934 -1571 -161 -1097 -853 -540 -1540 -269 -1196 -398 -730 -140 -1168 -5 -307 -642 92 -743 461 -360
952 -360 123 -289 28 502 94 517 -82 858 -146 1438 387 519 851 695 1482 383 1032 482 1454
971 1454 415 1093 868 389 1266 258 1302 -42 467 706 848 473 250 481 -104 929 -339 543
989 543 -104 97 488 -504 83 -711 -72 -621 182 -1202 -617 -448 -1099 136 -1473 -338 -1145 -710 -592
1008 -592 -782 -921 -906 -305 -1055 77 -1396 -380 -659 -733 -120 -957 -334 -695 279 -670 116 -522 66 333
1028 333 -599 881 -257 532 488 477 414 582 575 636 1238 -68 1279 216 943 1068 337 949 170 1218
1048 1218 576 1285 113 1004 547 422 1062 -202 1082 95 628 183 210 42 258 434 -296 353 -822
1067 -822 334 -214 -350 -132 -646 2 -911 -416 -984 -341 -999 -180 -591 -984 -583 -1342 -154 -1182 -557
1086 -557 -887 -808 -781 -527 -610 -1311 128 -1113 -63 -376 -407 -176 -481 78 -231 57 -386 521 -73 424
1106 424 210 -45 939 86 846 208 514 544 624 742 357 900 177 1196 352 759 626 576 762 432 712
1127 712 269 752 -30 850 175 247 244 -130 746 -184 484 -202 -36 -238 -321 -324 -336 -223 -686 317 -814 -435
1149 -435 -573 -629 -345 -523 -412 -743 -465 -1249 -349 -881 -704 -313 -887 -510 -1078 -429 -694 -382 -646 -565 -404
1170 -404 -451 61 -697 37 -520 32 58 247 310 -219 469 -125 837 224 860 330 454 541 156 1091 275
1191 275 1057 272 820 602 561 942 440 1028 245 976 451 879 231 391 494 -175 663 -277 618 -62
1211 -62 270 201 7 41 -468 334 -364 153 -715 49 -318 -296 -475 -638 -114 -887 -234 -909 -362 -719 -634 -365
1233 -365 -1059 -427 -679 -55 -918 -405 -883 -570 -319 -675 -50 -957 96 -381 -205 -436 -120 -53 -287 309
1253 309 -330 431 -150 246 101 468 604 163 623 348 1039 226 747 680 516 820 215 1082 419 894
1273 894 393 833 756 457 835 428 857 88 473 305 610 -126 -84 525 -196 628 -258 391 -271 -48 -250
1294 -250 -460 -207 -732 163 -798 -68 -701 -304 -523 -834 -212 -1013 -338 -848 -352 -545 -608 -341 -645 -311
1314 -311 -838 -129 -749 -104 -535 -253 -208 -401 53 -427 181 -591 533 -154 84 342 155 441 138 710
1334 710 -144 514 356 533 332 333 814 193 910 360 847 582 705 589 448 847 248 691 69 734 228
1355 228 237 395 286 438 33 330 43 -80 -175 186 -217 -447 -44 -514 92 -629 -143 -253 -384 -303 -645
1376 -645 -418 -684 -239 -1006 -293 -1060 -611 -383 -745 -321 -869 -431 -423 -254 -642 -138 -542 -421 -252 -623 88
1397 88 -457 60 3 -255 -82 -165 438 100 388 -42 610 241 362 490 89 684 209 566 356 586 167
1418 167 727 623 139 666 190 887 312 353 489 382 283 242 343 118 540 -16 330 215 54 188 -357
1439 -357 171 -199 -146 -616 -51 -533 -189 -204 -631 52 -636 -149 -592 -610 -650 -705 -507 -586 -251 -955 -233 -812
1461 -812 -268 -509 -789 -298 -484 -141 -662 -195 -417 113 -177 72 1 -441 546 -287 176 -189 147 300
1481 300 219 330 -18 389 -41 671 214 293 455 305 822 36 481 158 779 113 883 381 406 522 302
1502 302 579 182 342 272 226 289 161 216 14 167 -288 120 -225 60 93 -312 -296 -576 -181 -546 -96 -656
1524 -656 -395 -467 -337 -55 -854 -257 -864 -285 -514 -607 -600 -610 -248 -535 -9 -956 -265 -643 -199 -181 -414 -212
1546 -212 69 -35 -336 87 -293 207 147 -165 488 -175 649 253 319 226 181 182 225 580 -94 692 124 656
1568 656 405 441 632 345 376 145 674 212 501 239 300 410 36 435 -95 238 -64 -122 -44 81 -32 -337
1590 -337 79 -532 126 -432 -196 -286 -283 -272 -347 82 -385 -242 -585 -29 -461 -503 -515 -858 -110 -561 -255 -536
1612 -536 -470 -760 -277 -428 -332 -54 -703 -148 -218 -133 -114 8 327 -254 293 -82 230 12 255 158 276 523
1634 523 86 773 51 461 241 434 387 669 438 152 734 72 647 360 568 349 210 471 320 352 192
1655 192 448 113 326 44 154 100 113 194 -1 178 -167 -173 -104 -262 -151 -583 -121 -645 -309 -421 -112 -238
1677 -238 -386 -131 -808 -52 -397 -140 -608 -419 -249 -414 -252 -559 67 -292 -131 -363 -191 -79 -326 62
1697 62 -58 11 -40 17 33 252 49 26 288 107 609 169 425 173 473 277 222 460 101 495 368 610
1719 610 445 432 290 288 731 99 688 -88 513 182 50 288 235 148 -70 268 -163 216 -111 155 -223 -53
1741 -53 16 -286 121 -526 35 -364 -418 -127 -397 -90 -665 -189 -717 7 -260 -224 -214 -398 -292 -422 -23 -339
1763 -339 -149 -493 -287 -188 -282 -46 -105 195 -137 165 13 -18 60 93 113 97 391 -143 489 246 395 159 -76
1786 -76 660 207 658 236 544 269 157 334 401 702 306 532 93 520 209 343 121 37 349 -166 278
1807 278 -158 365 -36 -225 94 -156 103 -280 331 -170 9 -195 -368 -306 -246 -120 -512 -214 -337 -171 -548
1828 -548 -508 -169 -548 -255 -434 -185 -329 -398 -303 -383 -364 -439 -236 -305 128 -164 -185 -19 -207 -57 -141 147 -259
1851 -259 118 -42 220 157 85 292 -26 390 -18 436 221 264 371 249 409 258 568 70 469 25 292
1872 292 370 459 428 297 326 150 517 -187 19 45 -148 156 -194 99 7 -213 -349 240 -324 -59 -285 -131
1894 -131 201 -798 -132 -459 -281 -357 -240 22 -369 -115 -520 1 -404 -173 -360 -451 -249 -425 -149 -257 48
1915 48 -516 -304 -156 -329 -70 -186 72 -223 50 14 97 20 -54 181 -23 427 -4 587 -70 245 194 136
1937 136 359 166 507 196 454 116 316 248 247 164 -207 436 -41 455 88 132 487 -29 200 148 307 -90
1959 -90 142 -35 -28 5 -115 188 -437 -232 -298 42 -35 -136 -297 -492 -113 -393 47 -514 -253 -396 -597 -263
1981 -263 -252 -259 -497 -5 -820 -230 -297 -253 24 -281 -7 -241 -59 -331 277 -194 259 64 -133 92 -218 276
2003 276 -177 257 224 192 218 190 230 164 580 -97 217 213 314 491 37 256 33 487 98 376 -27 311 284
2026 284 -166 310 -94 143 43 157 103 -17 -79 -6 106 44 161 -147 43 -80 -339 55 -314 -245 -164 -178
2048 -178 -603 -49 -326 -549 -57 -447 -44 -542 39 -198 -291 -229 -229 -180 -443 55 -348 -113 -165 -235 -216 -16 66
2071 66 -200 -54 -43 226 -129 124 223 -14 152 -190 142 33 167 55 148 58 40 -60 86 267 -57 176
2093 176 95 296 356 93 497 101 475 111 397 199 328 156 9 144 -222 107 -182 412 -36 63 -202
2114 -202 -137 116 -200 179 -436 -187 -312 -373 37 -352 -172 -337 -193 -226 -44 -579 -424 -557 -385 -161 -411
2135 -411 -20 -297 -195 -282 -299 -92 -83 -199 41 124 -46 91 -120 420 -51 -96 340 121 324 64 62 179 305
2158 305 126 162 326 137 526 225 290 35 453 160 56 211 -180 84 -109 427 58 146 23 94 203
2179 203 151 285 85 244 -62 133 92 -54 61 -158 74 -166 73 -143 -220 -118 -231 -133 -527 -177 43
2200 43 -305 -122 -331 139 -253 -204 -33 -29 -507 -132 -312 -49 -343 -167 -36 -312 34 -316 37 -298 -180
2221 -180 -134 -130 64 -168 203 -55 -4 140 255 196 -14 157 9 377 229 207 138 139 395 132 558 319 341
2244 341 123 230 167 102 130 15 330 -96 395 -28 129 73 173 3 13 93 -151 273 -144 -270 8 -270
2266 -270 80 -155 147 -369 -264 -202 -82 -48 -103 -178 -593 -100 -380 -56 -372 -339 42 -184 -190 -177 -267 -327 -146
2289 -146 -179 -15 -151 -196 -21 -244 306 -93 327 22 76 86 -62 63 56 348 -76 132 186 228 240 319 255 -39
2313 -39 185 -62 145 -12 358 271 52 172 281 304 -2 364 211 349 363 -105 91 74 149 -227 104 -42
2335 -42 97 84 -238 -157 -198 256 -168 -163 -255 50 38 -163 4 -219 -49 -121 47 -27 -29 -146 -353 -207 -470 -263
2359 -263 -236 -51 -22 18 -219 -393 81 -245 258 -87 26 -9 -16 49 -64 46 15 131 5 285 -2 184 443
2382 443 153 314 206 386 -156 142 163 56 361 277 279 355 294 132 313 226 -67 154 200 32 -72 271 -78
2405 -78 356 167 -59 212 -219 31 -137 -170 -146 -109 -138 30 -27 -192 -25 -242 45 -236 -1 -84 -187 -334
2427 -334 -92 -44 -346 -39 -288 -88 -267 -140 -264 -81 -54 -138 -170 -119 38 -208 -27 -8 -268 254 -160 365
2449 365 27 167 285 393 -42 -58 436 69 365 154 296 47 -5 182 181 344 174 351 105 501 99
2470 99 352 185 -120 411 -1 126 -72 42 35 161 101 -74 -38 -108 251 -122 -12 -12 -183 91 -243 -134 -49
2493 -49 -25 19 -135 19 -291 -178 -246 45 -142 9 -319 -42 -11 -72 -119 -111 -52 -96 -137 -488 -98 28 -155 -249
2517 -249 -98 186 -113 134 -120 -205 18 -51 124 248 158 -109 -122 87 346 -42 71 132 79 133 -100 133
2539 133 126 274 263 67 280 35 349 -123 327 49 201 276 27 135 -122 145 118 299 -41 83 118 -1
2561 -1 24 -214 51 -83 -125 -91 4 -45 -201 -8 -175 -115 -33 -214 -317 -172 -14 -167 -54 -269 34 -354 -154
2584 -154 -326 -210 -321 -23 -161 -187 39 -330 17 -113 -262 -202 54 -118 45 175 -88 203 195 197 59 41
2606 41 77 -153 26 -162 62 -33 290 94 225 229 175 378 34 292 149 -20 284 154 305 246 212 -295 72
2629 72 -65 281 145 27 180 -82 48 -141 -94 -52 147 -113 -292 -216 -189 -131 12 26 -330 -30 -166 -228 75
2652 75 -362 -130 -288 -71 -387 -182 -184 -91 -138 -226 94 -192 34 104 -428 79 -61 43 -163 -29 -106 117 62
2675 62 -124 -14 135 374 48 272 183 203 183 327 246 84 159 0 88 188 239 227 -25 180 59 133 194 179
2699 179 109 -4 236 -16 -263 51 327 130 222 -21 62 -129 -197 -13 -250 -9 79 -80 48 -87 -276 -291
2721 -291 -177 7 -66 -146 35 -195 -182 -41 -62 35 4 -98 -455 -184 -445 -115 -168 -139 -175 -169 -199 -45 74 -144
2745 -144 160 -67 -83 349 -19 -8 93 66 138 145 310 -106 3 358 47 231 172 -105 179 60 -132 179
2767 179 200 75 58 150 -48 133 -18 1 215 -77 159 172 44 123 68 172 -10 81 11 -3 -186 -34 -268
2790 -268 -3 -9 -170 79 -297 202 -320 -187 -308 83 -339 -317 -30 -45 -4 -296 -86 -312 -83 -161 -226 43
2812 43 -280 140 -164 67 -149 -42 22 -88 295 -157 58 124 348 93 58 51 284 606 -87 559 3 149
2834 149 60 236 145 251 472 264 290 109 -55 142 99 -24 -126 36 14 282 -11 157 226 168 79 16 -17
2857 -17 -213 94 40 -134 84 6 -97 -169 -21 -233 -83 -289 112 -315 -84 -25 -262 -51 -252 -137 -158 -183
2879 -183 -104 -331 -134 -221 -37 -172 -415 -55 -227 69 -85 -110 -22 75 -78 41 -58 225 -35 33 92 -310 50
2902 50 -19 330 -41 288 185 106 221 102 193 -135 159 -189 226 176 241 397 53 369 225 418 30 39 108
2925 108 -47 112 -104 40 176 175 59 23 -42 -109 -121 40 -24 -158 83 -327 -110 234 54 -20 -236 62 -239
2948 -239 -221 -30 -20 -49 -47 -129 -327 -261 -226 -469 -149 -169 1 -167 -65 -328 -260 -178 -79 -273 7 -185 9 -109
2972 -109 -14 364 -43 -10 -54 -37 40 222 -112 122 329 16 238 223 171 -68 -36 38 -140 275 15 246 265
2995 265 297 127 -109 139 26 383 -121 109 -27 68 -129 -119 204 -20 43 -130 61 -345 48 -40 -43 17 -163
3018 -163 -165 -208 -273 -204 -196 -139 -253 187 -327 -76 -205 -103 -32 85 -238 6 43 -473 -30 -94 -46 -142 -5 -84 -134
3043 -134 -116 103 129 -209 122 92 10 193 -102 252 186 158 134 15 -25 -38 74 171 223 277 338 113 -149 390
3067 390 319 425 -30 87 190 66 -39 75 18 -51 148 -234 299 25 37 -97 175 205 29 -113 -81 -108
3089 -108 -336 15 -93 -173 -4 -333 -81 82 -140 -260 23 -276 -139 103 -143 -179 -384 74 -120 -99 -146
3110 -146 -383 69 -135 -108 -229 89 -147 169 -86 -109 -205 7 -127 -12 236 -242 152 -93 117 259 -40
3131 -40 251 -61 84 -142 197 -106 112 122 258 349 132 34 25 259 129 -225 -25 -37 162 94 36 -181 -11
3154 -11 -66 -90 103 46 129 -202 276 -199 217 -28 -62 -204 -181 42 -99 68 -216 20 -8 -262 -33 -224 -257
3177 -257 -426 -146 -147 -275 -142 23 -59 98 -55 -104 41 -98 -167 -29 10 49 -55 86 -132 218 195 345 49
3200 49 -70 244 98 63 13 74 -129 149 -101 -9 352 41 81 75 453 112 265 128 114 131 98 -35 -16 173
3224 173 43 274 238 280 192 -41 9 222 134 36 118 -93 -10 102 -125 70 -73 -161 -121 83 -176 -67 -141 -103
3248 -103 -72 -95 -186 -156 -72 -203 -259 -175 -347 -217 -272 121 -139 241 -161 143 -71 -152 -69 -40 38 78 328 145
3272 145 50 180 -39 -294 66 171 13 -46 -36 -13 143 17 152 319 203 211 202 202 310 246 -7 16 130 47
3296 47 45 66 59 79 -19 8 -22 -93 131 -136 4 -113 -36 -127 -73 63 32 -18 -299 -37 11 -58 -53 -237 -196 5 -43
3323 -43 -97 -83 -208 -90 -94 -107 165 -155 -289 -38 154 -23 -2 -191 -186 -106 -182 76 -168 -80 87 -198 78 -166
3347 -166 -50 -285 128 123 -47 71 -18 97 -62 38 47 173 109 133 157 176 49 -106 -45 219 164 236 106 110 22
3372 22 306 33 273 -20 109 -111 159 361 -29 -118 -94 -38 -298 -227 72 -164 -34 -158 -83 -74 28 -109 -43
3395 -43 -405 -149 -138 -7 -112 -391 -84 -252 10 -24 33 -125 -14 -3 -94 -13 -280 37 17 75 41 -60 331
3418 331 -23 -30 -114 -180 -49 18 11 -34 10 258 223 0 41 56 22 229 17 359 -40 236 52 243 -53 32 29
3443 29 117 170 14 106 -115 100 -233 31 103 -117 -3 -90 -45 -108 133 64 -172 -153 -197 -245 -127 -177 93 -39
3467 -39 -130 -96 -318 -165 -55 -135 -127 -238 -76 -13 -114 -101 -329 -82 -45 145 -71 -30 -119 -203 -77 -306 189 20
3491 20 240 102 -101 22 -111 148 -133 -125 -282 289 -3 235 26 80 248 0 201 57 368 -257 -59
3512 -59 115 189 117 -92 136 209 372 93 -12 -23 -4 232 -15 82 160 54 140 99 -81 -124 75 -71 203 -118
3536 -118 15 -146 -225 106 -118 30 82 -93 130 188 -98 -178 -118 -64 -30 -101 18 -117 -218 -160 -12 -59 -162
3559 -162 -189 -405 44 -206 -19 -129 -60 242 -56 294 -54 330 -110 105 58 -48 48 110 2 40 65 79 361
3582 361 18 -83 -47 133 -3 113 245 46 297 97 109 24 -178 114 -106 131 -41 155 -211 79 301
3603 301 57 -39 91 -54 -105 46 132 -5 -220 -242 0 -119 -220 -243 63 -212 2 -213 -48 -52 -265 -146
3625 -146 -356 -65 -118 -200 -76 -123 -137 -315 108 -232 269 -175 -173 -26 142 98 -26 -42 7 97 -25 83 -113
3648 -113 0 -99 -74 447 303 -107 -5 152 195 120 3 8 208 41 80 340 -95 115 -35 17 -78 169 -74
3671 -74 125 -139 -123 103 -129 280 -110 -78 40 -152 81 74 30 -58 113 -44 76 -18 -182 15 -49 12 -328
3694 -328 2 -165 22 -138 -120 -199 -7 -67 -202 96 -186 -7 -293 13 -249 -148 182 -135 155 -227 158
3715 158 -63 129 -20 -318 46 -140 145 165 55 -114 29 81 112 375 -9 137 194 213 213 -161 -101 109 330
3738 330 19 150 98 -41 -122 6 274 83 116 12 347 98 5 126 -189 -158 67 -36 -135 101 -181 -20
3760 -20 -51 135 -153 70 62 -157 88 -2 -17 163 157 34 -4 -78 -73 -206 -156 33 -131 78 132 140 -79 117 -151
3785 -151 -126 -16 -124 -162 188 -98 -122 -266 102 118 239 -60 -165 -21 132 60 -122 145 29 23 58 125 -228
3808 -228 179 14 77 -173 -105 44 94 136 109 -24 169 148 -18 -37 309 206 257 -178 -83 162 118 99 -84 -228
3832 -228 -117 -57 -125 -66 -94 -334 -13 -116 -221 6 -157 -9 -123 -355 -124 -186 7 -102 39 -83 48 -183
3854 -183 -123 -103 -246 -41 40 -129 11 54 -73 241 -209 12 100 2 -340 -114 -7 -21 232 104 216 180 83
3877 83 -189 141 270 66 -38 -11 88 72 184 -48 128 147 15 183 -51 -65 -27 -59 -40 -26 236 211 -146 -45
3901 -45 46 -212 77 114 28 62 202 -182 -270 38 -223 -17 -163 56 38 -298 -96 -142 -17 -207 4 -158 -233
3924 -233 25 114 51 -271 -18 -385 -42 32 -112 43 -167 76 -241 -185 -56 23 109 -147 64 17 216 289 -11
3947 -11 -27 59 14 34 111 -27 72 236 168 -89 -84 316 248 238 426 168 -1 43 -110 66 46 55 33 16 405 -183
3973 -183 117 159 212 -113 -142 69 57 74 -46 -139 -300 102 -109 48 20 -171 -167 20 -171 -53 -144 -9 -240
3996 -240 195 -138 -154 -276 5 -195 -88 -128 -165 84 61 246 -82 -5 -174 -276 -185 -283 -76 32 -49 165 76
4019 76 -267 107 -39 80 157 95 71 112 -43 186 35 120 -117 79 136 64 167 97 105 78 67 145 206 57 289
4044 289 -125 122 -177 387 192 -69 -54 -235 42 -163 104 -227 30 -26 -12 -142 65 -292 172 53 56 76
4066 76 19 -304 124 -133 -87 -60 17 -177 -128 -7 133 80 -25 13 -227 211 -33 35 -115 13 13 -79 -42 17 150
4091 150 -188 -58 -78 141 129 137 346 -30 100 -95 -101 77 162 187 80 39 28 269 -4 90 -19 133 321 38
4115 38 134 -189 -153 185 75 339 219 166 51 -54 204 202 110 -2 69 -135 121 -101 -75 5 109 -64 -136 -124
4139 -124 -45 -118 58 71 -164 -10 -190 63 62 -226 33 -219 -111 -205 -187 62 -285 -263 -11 -13 -92 -134 -83 87
4163 87 124 -191 118 -61 29 95 -26 59 -31 126 -21 -84 -43 171 314 265 -90 126 153 84 177 98 219 -72
4187 -72 198 74 192 83 39 62 63 4 83 334 -90 -26 -151 238 3 -35 404 -252 -86 -65 -14 -119 87 -116
4211 -116 -117 92 24 -119 -150 -176 -179 -146 -198 -376 -117 -100 -42 -188 224 -14 -128 98 25 -100 -77 11 -11 -97 165
4236 165 -342 -105 32 -59 -14 157 -71 12 104 85 115 -11 187 7 224 292 -92 -179 47 128 10 -59 -43 76
4260 76 69 -32 40 -66 58 -8 116 -198 336 160 -21 74 -88 -48 -148 211 -84 95 -263 -175 36 53 133
4283 133 -160 72 -191 -208 -303 -80 -37 -120 -122 -210 -60 92 -31 -125 162 -99 -260 -4 -83 -262 -6 157 18
4306 18 -185 -4 -85 8 -131 142 -78 268 156 134 -49 -106 76 124 118 40 89 42 55 7 14 -8 4 273 157 1
4332 1 39 -118 265 236 156 -26 139 89 -28 46 206 168 20 320 29 119 -269 -92 40 -96 42 -181 44
4355 44 -87 20 7 69 -160 0 -55 -52 -170 -169 -151 -72 30 -152 -121 116 -156 -185 -140 139 -377 -126 -70 75 -98
4380 -98 -80 56 -23 157 -258 -76 -25 -67 115 350 -74 -175 52 54 -5 160 -98 172 34 246 70 315 135
4403 135 79 237 225 96 4 139 -39 29 326 44 -4 169 79 -24 145 136 103 -315 -154 101 -153 -139 -142 -220
4427 -220 -7 263 53 398 153 10 153 -59 188 -65 64 -123 72 -215 34 -210 -44 -180 -162 3
4447 3 -270 50 -177 170 -1 68 -16 -166 21 -57 -143 95 -225 198 -15 275 79 -193 86 -137 310 44
4469 44 183 161 -53 187 203 135 -266 -40 107 -247 141 111 63 30 -35 238 -15 -106 -99 -79 -129 107 90 71 -131
4494 -131 41 -133 101 -171 110 89 52 -74 63 -230 13 114 -66 13 -91 32 -61 -24 -134 72 -87 -132
4516 -132 288 -92 159 -165 28 -210 7 143 -359 115 -14 -124 34 -47 -172 -234 54 -344 145 -142 3
4537 3 60 18 295 91 206 322 -72 -127 -29 205 57 129 -34 -84 231 5 -68 42 -20 -12 86 -5 266 66 -86
4562 -86 204 129 98 265 177 -85 254 -54 99 -167 60 -76 -36 60 -263 260 -97 69 113 55 -227 -91 123
4585 123 48 -57 54 -108 26 -174 -148 -147 -33 -140 171 -67 71 -75 -87 131 45 -13 132 90 -332 94 -274
4608 -274 86 -97 36 180 -124 62 155 -79 33 -229 -46 75 216 236 179 54 21 104 141 194 301 80
4630 80 123 138 53 53 20 82 207 26 307 125 107 97 159 131 280 3 132 250 -230 -36 119 -27 -117 -59 177
4655 177 -51 97 -318 -3 -271 -126 15 -107 -207 -92 -79 -375 151 -95 -77 -282 -75 -108 19 -270 17
4676 17 6 -89 27 -160 -159 -259 -82 -181 25 -167 161 -11 -230 60 8 157 -20 -84 113 11 103 162 190 160
4700 160 107 164 250 68 67 20 -91 -51 95 33 11 -29 118 178 32 43 40 -96 -67 75 84 80 122 8 26 52 70 143
4728 143 141 -94 121 -269 33 -122 -36 -100 -47 0 -94 -26 -117 -88 -149 141 150 -16 -129 174 -95 37 -25 -189 187
4753 187 -148 -67 41 15 -97 13 90 91 -162 -44 94 156 -42 144 -148 -120 58 26 -29 35 198 93 372
4776 372 -209 330 43 -72 96 67 147 -36 293 103 -49 105 23 69 104 184 -85 153 54 13 -96 -19 53
4799 53 -300 -110 99 126 -141 -7 193 -37 22 -65 -176 -155 146 -115 -222 91 -170 -88 -155 -21 158 16
4821 16 -125 -156 53 10 114 151 -1 15 -33 -225 52 -17 -103 82 -185 50 68 -13 -1 -51 92 -9 126 -54
4845 -54 431 -8 153 -384 -305 151 301 62 49 236 -84 -144 15 86 44 127 -211 45 204 93 105 -76 31
4868 31 -155 94 109 33 -80 -65 64 -132 -9 68 -9 -142 117 -101 19 -36 17 -312 -294 -253 -2 -445 -40
4891 -40 11 39 4 -117 229 47 102 -138 -225 -69 89 -124 45 -40 97 -2 3 261 -48 285 26 0 -79 48
4915 48 -31 32 100 124 116 210 -73 178 -91 -68 48 65 3 218 99 73 165 90 -24 33 126 -13 -43 66 -80 -54
4941 -54 79 -109 55 -80 87 95 149 235 19 -189 126 -139 -76 -273 57 -116 -33 -55 -62 -163 -319 178 19
4964 19 -20 -315 -136 -127 -36 -186 -174 136 59 -274 -254 -11 -85 -279 -6 216 -145 -48 128 71 -106 223 -21 -2
4988 -2 70 213 30 20 -106 -127 123 -49 24 150 -8 17 128 144 107 130 14 222 -27 118 -321 -64 389
5011 389 57 118 113 175 -142 -27 89 81 -113 339 -64 4 26 -73 -6 -148 4 -27 128 -125 175 -195 -145 -251
5035 -251 -355 250 -80 -235 -1 -90 107 -70 -45 -71 -2 9 -63 31 -30 -78 -27 -172 43 105 -178 2 -77 -6
5059 -6 99 175 92 242 -285 68 62 -81 -127 -129 165 0 242 93 145 114 -4 -119 -39 11 143 206 -59 285 17
5084 17 44 92 127 -8 76 168 85 -82 -143 -185 23 55 -128 157 -212 85 -204 17 83 66 -26 -90 43 106 -7
5109 -7 -98 -241 -33 -107 -228 -128 -144 -127 -141 18 -280 13 -380 185 134 -186 -53 208 131 -159 175 -165 -46
5132 -46 47 -178 -167 107 6 93 127 60 127 25 194 5 -37 206 -130 93 106 57 57 205 246 9 106 216 198
5157 198 -18 216 122 -121 -174 197 57 -32 48 -98 94 -179 -27 33 -11 14 125 116 -223 -118 4 -132 -3
5180 -3 14 -307 82 -47 -112 -128 -13 -223 15 -170 -102 214 85 -425 -52 -178 -143 19 -167 80 -123 2
5202 2 -37 239 -13 178 -232 -132 -26 36 -115 82 148 122 -47 271 -28 41 233 225 -135 161 287 137 208
5225 208 133 263 -131 118 -77 89 163 65 -87 280 33 133 -67 -6 9 -357 -99 21 -46 -7 52 11 -1
5248 -1 -117 -54 -148 -95 46 40 -151 157 -67 -34 274 -51 14 -152 -305 -125 -105 -76 35 -138 -132 -236 -78 -68 -128
5273 -128 65 -74 278 -253 -192 144 -138 -41 -342 2 -122 -112 89 62 117 154 172 -85 163 59 63 21 56 -111
5297 -111 324 154 196 155 -192 289 79 235 131 40 166 148 47 64 262 166 164 22 -32 30 -222 -94 7
5320 7 -120 168 63 178 137 -130 -27 28 -120 44 -51 -11 -36 -179 -130 -115 13 46 -30 -22 -79 -71 -82 -112 -59 -66 -43
5347 -43 -119 -196 -180 -95 -183 -36 15 46 144 1 -277 90 258 -146 -144 4 252 -72 144 74 143 -73 -55 -55 -153 411
5373 411 135 26 47 -25 53 57 81 160 227 150 56 187 -43 15 -72 128 -31 61 -101 14 178 -150 -24 -75 -18
5398 -18 -140 120 -7 -268 56 -138 -61 -12 -170 68 -87 -30 -207 -150 51 -53 -256 -108 -216 75 -88 -198
5420 -198 0 -7 -14 54 -143 10 -50 10 -103 -95 116 130 5 99 128 183 85 100 46 -66 43 62 5 -96 -37 -110 185
5447 185 -82 91 -37 248 84 -66 192 -153 369 144 -34 29 20 167 37 73 392 39 -247 -105 159
5468 159 -168 70 -104 -26 -66 67 72 -214 107 -129 97 -138 -140 -211 -68 -142 10 93 -71 46 -102 -54 150
5491 150 -255 -214 -298 137 41 263 94 203 -288 16 -130 -240 58 244 -143 -292 -69 -61 1 40 103 -211 -8
5514 -8 -51 -185 -5 105 -10 192 -28 59 -428 228 -75 250 -71 -19 163 32 297 173 -17 -49 206 155
5536 155 147 79 -158 -95 -135 -102 79 -81 16 -212 188 -21 -152 207 203 -65 -28 -183 28 -139 -69 -129 273 -2
5560 -2 -138 227 -92 21 -27 -71 -216 -212 -94 -253 75 -34 67 146 -57 -137 56 -1 -28 170 120 81 319 73
5584 73 99 12 132 135 39 94 123 -48 -16 173 -57 162 195 37 4 78 132 5 -27 57 39 -7 -145 169 110 -72
5610 -72 -21 156 -106 -106 34 174 26 103 -94 -236 35 96 -128 -189 -238 -189 -34 48 92 64 -78 19 -194 -24
5634 -24 -40 -300 -53 -217 36 -6 -124 -178 47 -87 5 -16 -124 -182 -229 -19 -251 -227 176 -43 -113 -50 13 -94
5658 -94 -110 -40 125 146 5 87 -136 123 63 14 29 44 183 40 78 -69 285 13 125 30 147 127 84 219
5682 219 -122 151 -9 134 159 36 -61 128 155 206 190 41 -96 -32 -98 -240 28 -267 -81 371 2 259
5704 259 -85 150 -56 -124 43 -47 -70 -184 -137 -159 -174 -43 -97 41 -308 -57 -118 -54 -3 -180 -208 88 -61 -2
5728 -2 21 -148 -58 115 -116 -59 1 89 123 54 -7 148 85 87 87 -3 124 83 139 12 -200 233 91 67 107 -135 50
5755 50 4 178 89 24 -88 -101 208 -62 274 -54 -49 52 188 -313 -7 -130 -60 -98 30 -265 -274 24 -116 -52
5779 -52 -185 -130 27 23 12 -191 -132 -122 -232 29 20 -68 -298 -70 -34 -105 -190 -16 -362 194 -473 45 -134 8
5803 8 256 97 101 -191 -191 -82 15 -43 102 -167 108 253 -36 102 90 -21 136 181 103 305 17 -61 -95 20
5827 20 357 -127 132 -52 195 -99 -22 521 -95 160 -98 -38 -10 74 127 -200 183 -41 160 -41 164 -125
5849 -125 88 12 -111 -22 -150 -15 -108 -42 -107 199 -26 -186 1 -19 81 -173 -52 90 -56 -131 -111 184 -170
5872 -170 -59 -20 -87 -74 -22 -81 106 136 20 226 2 138 -44 -4 84 2 332 -301 249 65 80 205 102
5895 102 -63 137 152 185 117 -9 46 212 11 38 -167 173 63 205 108 72 -126 -35 211 -255 103 -47 -5
5918 -5 -163 -153 181 -122 -264 -228 -198 -191 -109 -85 -22 -50 -158 -344 -170 -174 -195 19 54 -152 -151 -245 66 -82 -64 -50 -24
5945 -24 169 102 -102 84 -84 -103 187 -17 208 -60 -120 22 267 219 77 61 -53 -102 212 -15 21 -4 292
5968 292 94 -28 -11 -18 57 94 66 -104 35 10 -148 -14 -69 -7 141 26 41 -11 32 234 -7 55 74 19 63
5993 63 -85 -45 -75 57 102 82 -23 -275 -105 -9 -42 -158 144 -119 65 6 -72 -45 -97 40 -187 -123 77 72 -189
6018 -189 281 -46 102 120 14 26 -116 23 157 -62 -118 -126 -60 18 52 15 -54 -60 241 228 148 59 -253 48 -27
6043 -27 17 75 34 -149 28 -128 136 279 47 279 -52 56 152 193 35 60 178 180 -9 185 68 157 12
6066 12 292 -82 58 48 -44 301 100 -85 -90 -79 -160 125 -193 165 -31 -32 -11 -221 117 -225 -196 92 -254 72
6090 72 -35 23 -63 174 -132 0 -12 -144 -147 -57 327 33 61 -118 -97 141 156 37 -145 -143 64 48 141 151 267
6115 267 36 -26 188 -19 -151 17 57 37 -145 -10 242 105 -156 -8 143 177 297 113 203 94 13 211
6137 211 -92 -120 35 -49 -84 34 -39 105 21 -137 -32 17 -112 37 -86 -188 -206 -152 -182 28 -106 -237 97
6160 97 -172 -125 -119 159 186 -22 -77 -37 67 35 85 58 -98 -91 -61 82 136 43 -84 88 -268 -129 261 148 -73
6185 -73 80 -52 12 221 227 82 177 156 40 109 77 136 21 -91 72 107 148 -38 21 98 52 378 210 208 51
6210 51 184 82 183 61 143 61 97 -46 123 -28 -291 87 98 -258 -49 -51 -191 -152 107 -33 -199 -88 -67
6233 -67 -12 -74 19 -19 -7 -34 97 -4 -183 75 -128 39 271 -17 -235 -172 -53 260 77 -84 -83 255 -205
6256 -205 73 -19 210 70 71 -70 -21 -58 284 236 95 372 75 8 81 218 233 323 6 -53 180 12 23 97
6280 97 -55 -176 163 -6 45 158 -65 45 136 -46 -177 7 72 18 78 -106 -15 8 -75 -29 106 -195 -135 -8
6304 -8 -105 113 -103 -26 71 -154 -41 33 302 -16 27 -257 29 -162 -56 22 7 -76 -79 148 -121 -103 97 155 -124
6329 -124 192 -8 106 -56 1 -213 81 -16 208 -12 -11 362 298 129 94 58 241 -172 71 168 -26 64 -79
6352 -79 240 -116 130 -31 -20 135 138 46 -188 112 -355 89 -12 -334 80 97 30 -114 105 -49 13 -194 -53
6375 -53 68 -153 -89 -112 -100 -122 30 15 -26 -77 96 142 -202 74 178 77 -247 187 -101 -57 -56 -165 2 -186
6399 -186 81 187 -93 -193 16 -138 111 95 -185 122 -13 19 69 41 220 120 2 -55 154 -221 105 64
6421 64 -319 15 119 94 -208 -216 42 215 220 19 -99 122 64 92 -231 211 -63 131 -102 -183 135 33 -161
6444 -161 -31 -17 -99 176 181 60 229 258 -93 144 -280 38 -144 29 62 -62 -11 -175 -65 118 -137 274
6466 274 124 -329 13 -91 -177 -30 56 187 -38 -77 -42 8 64 -82 -132 51 -73 105 -62 107 170 72 34
6489 34 -35 142 28 -198 -36 200 -132 -17 -223 -97 -100 140 184 -191 82 -205 36 176 78 98 -132 20
6511 20 207 108 -29 -132 -64 171 -46 -169 70 -48 123 -322 49 69 -38 155 -81 -30 -78 65 -235 -96
6533 -96 -27 -29 -134 -130 96 -247 43 -26 99 194 -84 281 -42 170 -219 -36 103 62 -180 -92 71 27 -108 -136
6557 -136 146 -99 102 66 136 -159 -85 89 53 387 31 142 333 228 292 -165 -1 331 35 -117 -87 -53
6579 -53 -206 144 75 54 162 170 -228 40 37 -236 62 -57 266 -76 0 -13 133 119 67 142 -408 -154 -78 208
6603 208 -260 -22 -129 -53 -38 -206 -76 -1 -108 177 117 -108 -275 106 -127 -30 -38 -173 37 200 -6 -97 93
6626 93 -28 -19 -271 -74 -40 6 -50 53 264 -218 120 -50 -75 -43 151 -26 95 250 203 386 -32 62 -72
6649 -72 286 -206 -58 -59 169 74 1 -51 -71 19 43 -85 104 13 -18 197 129 72 5 -77 170 -163 195 185 -108
6674 -108 -152 -140 73 17 71 164 57 -114 15 31 -123 51 -211 -50 154 -44 54 139 -76 -182 -144 -16 -168
6697 -168 -52 -149 8 -244 115 -63 120 -6 206 148 -76 -29 114 68 130 58 -138 -54 109 211 83 145 192
6720 192 -17 276 387 119 -85 -113 330 29 242 1 165 -84 -9 232 28 113 155 -189 -88 -267 160
6741 160 363 -97 125 74 -122 73 -118 -101 225 -4 -65 -120 -6 -136 -52 -198 168 -48 -116 75 -98 -122
6763 -122 -29 -195 -505 59 103 48 192 16 75 -55 101 155 7 45 164 34 34 95 63 120 178 157 112 207 -155
6788 -155 -58 -15 2 83 3 12 -8 16 137 70 29 70 103 136 -60 -31 -150 3 -96 51 -116 215 -71 -244 -103
6813 -103 -71 65 -100 55 -129 50 -290 -196 -114 127 -244 -27 -12 -75 71 12 56 -55 17 -88 224 96 -241
6836 -241 -59 -4 -100 -139 26 -8 -195 41 -142 13 -168 87 -24 21 111 -265 28 65 -4 -33 94 29 184
6859 184 118 10 -99 -26 73 30 199 111 43 -51 91 113 176 -142 233 -162 -63 47 106 -183 -119 11 169 83
6883 83 78 -13 95 114 157 37 -148 11 10 -39 -138 47 132 -80 -114 -2 120 83 -93 28 -125 -114 -34 -51 -120 -250
6909 -250 16 -90 278 23 -14 223 -157 25 44 120 15 -119 -183 78 -69 -66 64 -134 -136 -119 -23 66 95 -53
6933 -53 128 28 99 80 241 311 -47 81 -4 -131 238 132 -8 -124 137 -81 91 -22 -9 -176 -47 -160
6955 -160 39 -44 -66 99 -245 -63 -108 -276 2 -31 2 156 -82 144 5 16 71 93 -86 -4 -81 -56 -204 17
6979 17 -176 184 -103 -218 82 -18 -157 50 -87 -56 -204 -27 21 157 -138 -79 193 -280 -77 -24 99 -198
7001 -198 275 -106 300 -72 -5 -161 54 52 -145 177 109 249 -194 158 190 51 18 37 7 -86 -187 141 70
7024 70 169 27 -5 127 -68 -117 79 -47 285 77 -134 60 -179 127 11 114 -128 -104 -36 32 -80 -89 7
7047 7 -56 69 -139 -143 -51 -84 -86 -99 7 121 40 85 -59 -126 53 151 74 -93 8 166 146 225 -86 186 -80 15
7073 15 -21 -181 58 -41 32 -135 203 73 -98 68 -26 93 160 119 -62 53 -3 136 3 -67 183 -148 -58
7096 -58 128 78 69 -73 -27 -140 228 18 -14 32 64 81 -138 -158 -8 -87 248 186 -202 -259 13 -187 -63 12 -28
7121 -28 38 -3 -268 -135 -133 -7 -95 -134 -382 -90 58 -127 56 -8 -243 -86 -43 -65 31 35 -166 63 152 97 -83
7146 -83 -38 15 -72 1 0 23 -77 -130 -7 104 47 54 110 13 121 16 57 87 17 6 199 -15 -33 124 148 -1 -15
7173 -15 41 395 109 54 -81 14 29 14 -22 149 -193 74 115 36 -405 125 -52 113 101 14 -152 210 -150 -208
7197 -208 -63 -247 -92 -195 -226 98 193 -80 50 48 -171 -124 -128 -51 -122 -220 -88 32 -72 -104 119 104 -92 46
7221 46 25 58 -20 154 4 -4 203 81 -242 -83 -176 154 64 -10 154 -43 -78 126 214 15 -137 -70 -50 -16 33
7246 33 -8 -34 220 262 -223 105 -183 181 130 -16 -181 -51 -66 248 3 -118 81 -9 30 -23 348 -23 -106
7269 -106 -185 24 165 -206 -70 -63 -69 70 -153 44 -175 -151 -102 -145 52 -144 -169 -86 82 -8 210 -155 84 24
7293 24 -19 -207 100 -44 44 -15 -5 -83 -60 173 -99 -176 -89 203 -128 67 101 244 158 104 -5 68 31 272 112
7318 112 129 112 -127 -34 256 84 95 -56 172 8 227 63 -122 159 12 -131 -381 -27 4 45 -100 218
7340 218 -99 -147 78 39 -23 58 -56 -222 -36 9 105 -56 -147 -40 167 43 -79 187 -140 27 -42 110 -111
7363 -111 -136 124 97 -38 -119 -18 -67 133 -173 -193 52 -59 -20 97 -55 83 118 53 -57 -71 -79 144 85 47
7387 47 6 308 0 53 -71 16 257 -61 33 -16 48 -7 -156 -65 84 -134 -2 -140 58 -25 -143 174 -66
7410 -66 75 -116 -10 -45 45 -3 -88 221 -235 -91 -23 98 197 55 -118 -351 -20 52 7 -267 -108 44 136
7433 136 -17 173 9 11 17 63 134 -172 -73 -89 -68 -1 201 80 -11 -59 95 16 -244 0 173 57 -47 96
7457 96 -163 -402 155 -59 -37 -39 116 116 50 147 213 -168 107 57 85 20 -214 46 -109 228 -169 -118 169 -127
7481 -127 171 -20 -48 -275 81 251 71 8 39 165 59 -7 -63 71 -384 -152 31 -287 -77 -135 -264 -48
7503 -48 -69 50 -20 41 -119 79 62 28 -169 108 -187 -70 -93 -148 -95 -39 174 -111 7 -1 -25 50 -41 200 -97
7528 -97 -73 -1 -32 41 -239 107 47 -69 400 188 77 103 182 274 144 -110 19 -158 -122 -89 219 148 146 -57 33
7553 33 183 124 128 -88 43 -108 54 -183 -161 -183 19 167 -106 249 -93 -80 -213 -82 0 -29 -70 -233 181
7576 181 60 -97 -83 -82 39 -33 -30 -110 -9 -28 85 -257 -91 132 -163 55 -177 245 254 73 -38 -93 24 134
7600 134 -56 13 -6 120 20 149 -69 -127 38 132 187 -10 295 -30 63 3 -41 -104 32 -50 -158 176 48
7623 48 291 -70 252 -7 -62 -137 -55 162 174 -166 16 116 40 106 124 -66 -162 128 187 -86 314 -24 -57 70
7647 70 -95 -120 -148 -104 -26 -12 58 46 -126 207 -89 -170 202 -39 14 -53 -51 53 -60 209 96 -103 0 -116
7671 -116 -35 -9 173 -238 158 98 -5 18 202 -20 218 84 92 11 136 -45 298 -132 77 45 -226 238 -20
7694 -20 30 -58 105 70 13 130 234 -210 -116 -255 -94 -175 -5 69 -42 128 231 -45 77 25 -3 45 19 143
7718 143 -132 -3 -135 -187 -82 -34 -128 -62 13 104 64 -109 99 0 315 94 130 -204 -123 117 -19 -47 -300 158
7742 158 81 -33 193 149 40 -131 -124 -85 71 99 -169 -216 214 109 78 -91 72 66 152 -210 115 94 -179 77
7766 77 107 -13 -97 328 27 111 0 -98 -256 -25 171 -42 69 -56 134 -85 34 -219 -19 -92 16 158
7788 158 -10 -71 104 91 -18 1 -82 -28 171 -101 -72 -293 7 121 -69 96 -9 24 216 -32 -103 -101 35
7811 35 -105 -199 -107 135 -164 -45 12 28 155 -361 -246 0 -69 -118 9 168 98 -108 26 -121 22 94 65
7834 65 -181 58 78 -63 -23 -55 -68 51 244 144 290 178 201 65 -109 -47 -181 -12 -8 131 113 134 -156 -97
7858 -97 -43 -165 -53 28 -164 46 -324 -184 29 18 97 -152 -99 -76 131 96 -69 68 -318 99 -171 323 -133
7881 -133 28 16 94 -72 0 134 -99 23 19 159 -93 300 -127 5 1 -211 -115 -60 -2 176 32 -174 -89 119
7905 119 -245 -21 -89 62 92 -90 196 -114 -107 -78 219 -88 32 24 -74 142 -141 14 91 -43 -109 -13 -25 -70
7929 -70 131 -37 -95 -78 118 -279 -217 284 -22 118 4 93 -384 -11 85 24 -197 -83 105 -112 -13 -169 43
7952 43 -326 -56 -7 -174 84 -182 -224 -349 -126 132 52 20 251 159 -207 81 193 116 -49 67 -141 -145 -14
7975 -14 77 -209 169 389 -46 -24 23 -110 -156 160 202 93 -105 -264 46 271 141 -43 -78 -184 -48 -167
7997 -167 -43 87 -52 -11 67 -275 -106 -166 193 -62 -138 65 -101 218 -136 -56 -203 172 187 32 -20 -175
8019 -175 83 66 -40 48 58 98 137 -10 -55 113 13 -136 -96 -120 -126 -106 -60 -291 -190 107 -226 -148 -125 -126 -40 -113
8045 -113 320 -50 106 2 -5 172 -46 126 -84 -91 89 29 131 2 -133 -28 140 -63 135 -201 -84 77
8067 77 11 -15 24 176 -93 -135 -123 -44 172 -57 -24 6 -254 142 192 148 185 133 31 -23 -51 -140 188 0 27 -40
8093 -40 -133 57 -34 -37 163 110 20 180 -259 -105 -25 -165 -63 -27 -122 -124 -166 278 -137 7 -70 -117 -193 -135 -69 -178
8119 -178 -18 2 -231 -192 -38 98 76 177 103 225 44 83 149 139 29 -24 -104 117 -106 -20 48 60 -205 -113
8143 -113 39 -59 -31 -26 -83 93 72 205 82 -93 84 -175 -40 -41 -235 24 213 -29 188 -199 32 -51 -217
8166 -217 -60 18 14 109 -33 -99 51 -153 -94 76 -19 60 -34 22 -265 69 -119 130 -105 -6 -185 101 109 -95
8190 -95 157
8191A57
##END NTUPLES=NMR FID
##END=
