##TITLE=1H_Pr 5000-29
 CDCl3, 8 sc, 
 29.9.2020
##JCAMPDX= 6.0         $$ Bruker NMR JCAMP-DX V2.0
##DATA TYPE= NMR FID
##DATA CLASS= NTUPLES
##ORIGIN= UXNMR, Bruker Analytische Messtechnik GmbH
##OWNER= root
$$ XWIN-NMR		Version 3.5
$$ Tue Sep 29 09:59:26 2020 Russian Standard Time (UT+4h)  she@DPX200
##.OBSERVE FREQUENCY= 200.1315066352
##.OBSERVE NUCLEUS= ^1H
##.DELAY= (6, 6)
##.ACQUISITION MODE= SIMULTANEOUS
##.ACQUISITION SCHEME= undefined
##.AVERAGES= 8
##.DIGITISER RES= 18
##SPECTROMETER/DATA SYSTEM= spect
##.PULSE SEQUENCE= zg30
##.SOLVENT NAME= CDCl3
##.SHIFT REFERENCE= (INTERNAL, CDCl3, 0, 15.7039)
##AUDIT TRAIL= $$ (NUMBER, WHEN, WHO, WHERE, WHAT)
$$ ##TITLE= Audit trail, XWIN-NMR		Version 3.5
$$ ##JCAMPDX= 5.01
$$ ##ORIGIN= Bruker BioSpin GmbH
$$ ##OWNER= she
$$ F:/spectra/data/she/nmr/H-F/1/audita.txt
$$ ##AUDIT TRAIL=  $$ (NUMBER, WHEN, WHO, WHERE, WHAT)
(   1,<2020-09-29 09:58:29.18 +0400>,<she>,<DPX200>,
      <created by zg, POWCHK disabled, PULCHK disabled
       configuration hash MD5:
       00 E9 B6 7A A2 85 ED C7 34 08 36 98 17 FE 4E 26
       data hash MD5: 16K
       8F 2E CD 80 2E 3E C2 7E 61 2F C9 B6 35 62 CF 17>)
$$ ##END=
$$ 
$$ hash MD5
$$ CB 6D DF 9A FC 41 31 58 97 D0 EC 81 63 B0 9A 21
##$RELAX= 
##$RELAX= 
##$RELAX= 
##$RELAX= 
##$RELAX= 
##$RELAX= 
$$ Bruker specific parameters
$$ --------------------------
##$DU= <F:/spectra>
##$EXPNO= 1
##$NAME= <H-F>
##$PROCNO= 1
##$TYPE= <nmr>
##$USER= <she>
##$AMP= (0..31)
100 100 100 100 100 100 100 100 100 100 100 100 100 100 100 100 100 100 
100 100 100 100 100 100 100 100 100 100 100 100 100 100 
##$AQSEQ= 0
##$AQ_mod= 1
##$AUNM= <au_zg>
##$AUTOPOS= <>
##$BF1= 200.13
##$BF2= 200.13
##$BF3= 200.13
##$BF4= 200.13
##$BF5= 200.13
##$BF6= 200.13
##$BF7= 200.13
##$BF8= 200.13
##$BYTORDA= 1
##$CFDGTYP= 0
##$CFRGTYP= 5
##$CHEMSTR= <none>
##$CNST= (0..31)
1 1 145 1 1 1 1 1 1 1 1 1 1 1 1 1 1 1 1 1 1 1 1 1 1 1 1 1 1 1 1 1 
##$CPDPRG= <>
##$CPDPRG1= <>
##$CPDPRG2= <>
##$CPDPRG3= <>
##$CPDPRG4= <mlev>
##$CPDPRG5= <mlev>
##$CPDPRG6= <mlev>
##$CPDPRG7= <mlev>
##$CPDPRG8= <mlev>
##$CPDPRGB= <>
##$CPDPRGT= <>
##$D= (0..31)
0 1.2 0 0 0 0 0 0 0 0.06 0 0.03 0 0 0 0 0.0002 0 0 0 0 0 0 0 0 0 0 0 0 
0 0 0 
##$DATE= 1601359108
##$DBL= (0..7)
120 120 120 120 120 120 120 120 
##$DBP= (0..7)
150 150 150 150 150 150 150 150 
##$DBP07= 0
##$DBPNAM0= <>
##$DBPNAM1= <>
##$DBPNAM2= <>
##$DBPNAM3= <>
##$DBPNAM4= <>
##$DBPNAM5= <>
##$DBPNAM6= <>
##$DBPNAM7= <>
##$DBPOAL= (0..7)
0.5 0.5 0.5 0.5 0.5 0.5 0.5 0.5 
##$DBPOFFS= (0..7)
0 0 0 0 0 0 0 0 
##$DE= 6
##$DECBNUC= <off>
##$DECIM= 32
##$DECNUC= <off>
##$DECSTAT= 4
##$DIGMOD= 1
##$DIGTYP= 9
##$DL= (0..7)
0 120 120 120 120 120 120 120 
##$DP= (0..7)
150 150 150 150 150 150 150 150 
##$DP07= 0
##$DPNAME0= <>
##$DPNAME1= <>
##$DPNAME2= <>
##$DPNAME3= <>
##$DPNAME4= <>
##$DPNAME5= <>
##$DPNAME6= <>
##$DPNAME7= <>
##$DPOAL= (0..7)
0.5 0.5 0.5 0.5 0.5 0.5 0.5 0.5 
##$DPOFFS= (0..7)
0 0 0 0 0 0 0 0 
##$DQDMODE= 0
##$DR= 18
##$DS= 0
##$DSLIST= <SSSSSSSSSSSSSSS>
$$ [...]
##$SUBNAM2= <"">
##$SUBNAM3= <"">
##$SUBNAM4= <"">
##$SUBNAM5= <"">
##$SUBNAM6= <"">
##$SUBNAM7= <"">
##$SUBNAM8= <"">
##$SUBNAM9= <"">
##$SW= 16.880792210976
##$SWIBOX= (0..15)
0 0 2 0 0 0 0 0 0 0 0 0 0 0 0 0 
##$SW_h= 3378.37837837838
##$TD= 16384
##$TD0= 1
##$TE= 0
##$TE2= 300
##$TE3= 300
##$TEG= 300
##$TL= (0..7)
0 120 120 120 120 120 120 120 
##$TP= (0..7)
150 150 150 150 150 150 150 150 
##$TP07= 0
##$TPNAME0= <>
##$TPNAME1= <>
##$TPNAME2= <>
##$TPNAME3= <>
##$TPNAME4= <>
##$TPNAME5= <>
##$TPNAME6= <>
##$TPNAME7= <>
##$TPOAL= (0..7)
0.5 0.5 0.5 0.5 0.5 0.5 0.5 0.5 
##$TPOFFS= (0..7)
0 0 0 0 0 0 0 0 
##$TUNHIN= 0
##$TUNHOUT= 0
##$TUNXOUT= 0
##$USERA1= <user>
##$USERA2= <user>
##$USERA3= <user>
##$USERA4= <user>
##$USERA5= <user>
##$V9= 5
##$VALIST= <valist>
##$VCLIST= <CCCCCCCCCCCCCCC>
##$VD= 0
##$VDLIST= <DDDDDDDDDDDDDDD>
##$VPLIST= <PPPPPPPPPPPPPPP>
##$VTLIST= <TTTTTTTTTTTTTTT>
##$WBST= 1024
##$WBSW= 4
##$XGAIN= (0..3)
0 0 0 0 
##$XL= 0
##$YL= 0
##$YMAX_a= 220738
##$YMIN_a= -176066
##$ZGOPTNS= <>
##$ZL1= 120
##$ZL2= 120
##$ZL3= 120
##$ZL4= 120
##$ABSF1= 10
##$ABSF2= 0
##$ABSG= 5
##$ABSL= 3
##$ALPHA= 0
##$AQORDER= 0
##$ASSFAC= 0
##$ASSFACI= 0
##$ASSFACX= 0
##$ASSWID= 0
##$AUNMP= <proc_1d>
##$AZFE= 0.1
##$AZFW= 0.1
##$BCFW= 1
##$BC_mod= 2
##$BYTORDP= 1
##$COROFFS= 0
##$CY= 11.3945322036743
##$DATMOD= 1
##$DC= 2
##$DFILT= <>
##$DTYPP= 0
##$F1P= 16.9975609425685
##$F2P= -3.02152046262296
##$FCOR= 0.5
##$FTSIZE= 0
##$FT_mod= 4
##$GAMMA= 1
##$GB= 0.15
##$INTBC= 1
##$INTSCL= 1
##$ISEN= 128
##$LB= 0.24
##$LEV0= 0
##$LPBIN= 0
##$MAXI= 10000
##$MC2= 0
##$MEAN= 0
##$ME_mod= 0
##$MI= 1.114404
##$NCOEF= 0
##$NC_proc= 0
##$NLEV= 6
##$NOISF1= 3.799351
##$NOISF2= 2.8
##$NSP= 1
##$NTH_PI= 0
##$NZP= 0
##$OFFSET= 15.70392
##$PC= 1
##$PHC0= -9970.306
##$PHC1= 11.00089
##$PH_mod= 1
##$PKNL= yes
##$PPARMOD= 0
##$PSCAL= 0
##$PSIGN= 0
##$REVERSE= no
##$SF= 200.130013532006
##$SI= 16384
##$SIGF1= 3
##$SIGF2= 2
##$SINO= 400
##$SIOLD= 16384
##$SREGLST= <1H.CDCl3>
##$SSB= 0
##$STSI= 0
##$STSR= 0
##$SW_p= 3612.71676300578
##$SYMM= 0
##$S_DEV= 0
##$TDeff= 0
##$TDoff= 0
##$TI= <>
##$TILT= no
##$TM1= 0
##$TM2= 0
##$TOPLEV= 0
##$USERP1= <user>
##$USERP2= <user>
##$USERP3= <user>
##$USERP4= <user>
##$USERP5= <user>
##$WDW= 1
##$XDIM= 8192
##$YMAX_p= 0
##$YMIN_p= 0
$$ End of Bruker specific parameters
$$ ---------------------------------
##NTUPLES= NMR FID
##VAR_NAME=  TIME,          FID/REAL,        FID/IMAG
##SYMBOL=    X,             R,               I
##VAR_TYPE=  INDEPENDENT,   DEPENDENT,       DEPENDENT
##VAR_FORM=  AFFN,          ASDF,            ASDF
##VAR_DIM=   8192,          8192,            8192
##UNITS=     SECONDS,       ARBITRARY UNITS, ARBITRARY UNITS
##FACTOR=    0.000296,      1,               1
##FIRST=     0,             0,               0
##LAST=      2.424536,      0,               0
##MIN=       0,             -176066,         0
##MAX=       2.424536,      220738,          0
$$ Real data points
##PAGE= N=1
##DATA TABLE= (X++(R..R)), XYDATA
0 0 0 0 0 0 0 0 0 0 0 0 0 0 0 -8 8 -8 8 -16 16 -20 24 -31 33 -40 48 -57 68 -78 89 -104 119 -136 159 -179 202
35 202 -230 259 -291 325 -362 406 -452 505 -560 618 -684 755 -835 919 -1014 1116 -1230 1355
53 1355 -1493 1645 -1818 2010 -2229 2478 -2766 3105 -3506 3995 -4603 5383 -6425 7898 -10145
68 -10145 14149 -42289 220738 10345 -132953 107362 33543 12831 10798 5049 27873 -63657
80 -63657 -73656 85918 9829 -20020 -15278 42151 67939 -17962 35752 31331 -36573 31465 43389
93 43389 -22543 33198 -3018 -10185 84143 -31465 12693 42573 -42443 38361 23408 -59514
105 -59514 33456 21483 -45205 46813 7113 12103 33803 -16797 18093 1750 -5763 -23695
117 -23695 -10862 15494 -34189 -20973 58959 -14846 -51417 38819 -26105 -16839 4420 -45001
129 -45001 -9081 -8126 -10421 18600 -9302 -39020 17004 -9564 -21987 -3000 -45565 -13581 4459
142 4459 3295 -9728 -11890 10709 4284 378 16030 -2078 -22083 13620 -2430 14856 -5954
155 -5954 -40627 37120 12592 -18799 19460 7347 -3247 20696 6155 8367 11691 -11154 23320
168 23320 11764 6661 12674 -1894 19523 7928 -1041 8807 2468 -1633 16837 1875 8846
181 8846 17195 -12338 21870 3924 -18023 9448 -3697 -6945 486 -7121 5970 10060 -17640
194 -17640 8215 1443 -12553 4089 -17262 -3183 -10456 -16709 911 -10407 -14211 -2833 -8789
207 -8789 -7063 2855 -19602 -973 -5045 -12773 6202 -14448 -5355 -471 -5513 374 -283 -12336
221 -12336 -451 -1267 -13849 4793 -11167 896 6081 1458 14289 4993 8296 9696 5414 540
235 540 6588 -8361 1257 7256 -4316 13120 2369 14765 13267 7928 13322 6675 4930 4067
249 4067 6984 -2426 8899 678 7747 5997 358 13146 -5376 5026 1801 -2184 -1109 1543
263 1543 -86 1929 5092 -4099 9748 -7544 -107 -2284 -12582 -4529 -12919 -6649 -12200 -6683
277 -6683 -8810 -2450 -7751 -1530 826 -10451 4332 -10933 -2845 -7282 -10129 -4809 -8430 -4476
291 -4476 -5109 756 -7956 2833 -7343 -2294 -3268 -10461 4504 -7058 5886 5380 8571 8746 8950
306 8950 5481 2360 1560 -10028 4323 -9712 2010 6080 3346 15183 8638 14916 10293 9721
320 9721 2767 9521 -625 924 7485 -3620 8991 -174 7970 5179 3762 7372 4281 3741 220
335 220 4888 -6034 2670 -5231 -1469 345 -6221 6098 -4754 -960 -2473 -3602 -8089 -4316 -7519
350 -7519 -8705 -573 -9096 2627 -6323 -3161 -2872 -8898 -4275 -8141 -5454 -8006 -1907 -6439 -440
365 -440 -6146 -6748 -627 -10323 -1243 -4499 -857 742 2789 2424 2690 2936 -4225 2369 -5340 376
381 376 -319 1626 6777 4488 10481 6798 9138 4085 5116 2154 1677 2485 220 6164 1138 7579
397 7579 7798 10008 7029 5132 9637 3790 4724 -1441 251 -770 160 -48 47 3779 -1501 5171 2515
414 2515 686 -3217 -4789 -1040 -3602 -1666 -4089 -374 -1703 1757 -2455 -6498 -5691 -12841 -4477
429 -4477 -7134 -9670 -8059 -2554 770 -3659 -2778 -3395 -1061 -8625 -2723 -2090 -5257 -4245 -4971 4157
445 4157 -2500 -5733 -2603 2403 -2527 -3956 4144 172 2356 1173 7155 2632 381 7609 4877
460 4877 1911 819 8202 835 3072 -396 973 7973 85 6062 6705 8522 5382 9545 7768
475 7768 4038 2083 -2024 7781 -755 411 -1206 -1874 5464 3178 -3388 -2828 4874 -3406 7321
490 7321 747 -4456 3540 -1215 1849 -6679 -7055 -6503 -7007 -7631 212 -7558 -9870 4623 -5482 2655
506 2655 -5090 -8522 940 -2986 -3942 -3921 -5426 -7397 4520 -5667 -4433 -4932 -4365 5431 -9709 -1686
522 -1686 2335 -3453 -2741 6092 142 -27 2755 191 13391 -5074 169 7267 -960 4159 695
537 695 240 3239 5858 3191 11296 -2334 4582 15561 -952 4251 1100 5034 3690 867 2458
552 2458 3955 -185 1279 9423 -3251 3140 -941 1125 5480 -2263 563 -2123 489 2337 2117
567 2117 -9060 -1377 -683 -4557 454 -10406 -732 -2765 -3447 -1030 -2976 -5113 -3063 -517 -6590
582 -6590 -2754 -7488 -2069 -5568 -3728 568 -8361 -1913 -1789 399 -3553 -3999 -2889 2023 -358 -6262
598 -6262 2983 -1168 2364 -70 804 3668 49 2527 2865 2364 -1677 4900 2228 2216 2632 3662 7415
615 7415 -966 7423 5826 620 2364 4105 4849 1478 -412 2800 8863 -900 3782 5283 2018
630 2018 5532 686 2425 63 -797 -206 -1060 -3925 -655 75 -4410 2535 -1632 641 15 -3147
646 -3147 877 -3490 -5673 -4530 -3803 -5407 -2080 -6673 -2975 811 -6399 36 -4513 -4235 -161 -4305
662 -4305 -4238 -2025 -2450 -2483 -530 -4860 579 -1993 -2758 1506 -2010 988 -1701 334 1342 463 -581
679 -581 1702 2153 1483 5418 -492 4576 3981 1506 4639 1159 2001 2605 3342 1664 4678 2383 4750
696 4750 4926 1200 7229 1333 3352 1814 2351 2753 -387 529 823 1672 -1862 3223 -808 570 1593
713 1593 -1202 1150 -2790 -71 -3199 -2143 -2054 -796 -1459 -2976 666 -3752 -1071 -5915 -3531 -4006
729 -4006 -5795 -2623 -4280 -1311 -2996 386 -2284 -391 -2817 -3174 -2132 -5864 -279 -4749 -1011
744 -1011 -1469 -592 1204 -177 1663 -615 2257 -1918 2140 -1085 721 2279 -79 4396 855 4572
760 4572 1337 3768 2520 2597 2957 1125 3930 -18 5135 1144 3501 3425 2533 4178 1223 3470 -100
777 -100 3116 -182 2412 963 718 2922 -708 3569 -1768 1225 -896 -874 -478 -1352 -571 -2913 640
794 640 -4046 -11 -3525 -2667 -1772 -4584 -825 -4173 -1234 -3263 -1505 -3192 -2267 -2990 -4301 -848
810 -848 -5595 -478 -3648 -1348 -782 -1843 106 -1481 -114 -2473 509 -3165 47 -1202 -1183 1967
826 1967 -1370 3581 782 2991 2248 2405 1906 1438 1894 24 4090 -565 3931 3000 3112 4611 1937
843 1937 4109 1752 2731 689 2679 333 2142 2385 1283 4787 685 3626 1697 977 384 -332
859 -332 -33 -1805 -132 -2165 1032 -954 -183 147 -1072 -215 -2901 -538 -3392 -2934 -3599 -2125 -1706
876 -1706 -3236 -1219 -2299 -748 -3033 -1420 -3374 -3780 -2264 -3766 -1331 -3476 -1298 -747 -876 -465
892 -465 -1263 -1284 -1946 226 -2095 73 -1346 -287 2605 462 2655 824 1633 1651 2150 565 23 1068
910 1068 1440 3648 -160 4393 3288 1950 4274 2532 2675 748 1659 1727 3132 -858 1899 3777
926 3777 1051 3504 -70 2573 1499 -610 838 -570 -1482 179 1475 -2327 871 -1681 716
941 716 861 -4285 -347 -2445 -1960 -1924 -1707 -3287 -1525 -2709 -1576 1112 -5905 -1524 -2229 -1083 -1849
958 -1849 -5097 -2577 -1488 -1263 -2616 -394 -3684 1080 -178 -1157 1034 -3923 855 271 543 -983
974 -983 -646 0 1642 2159 -417 2108 -1221 4276 1915 1088 1731 -478 3897 2898 2460 -692 3603
991 3603 3514 3277 1555 654 4401 262 3576 690 2167 1065 -93 3578 1137 83 -1025 3484
1007 3484 71 1282 -892 -552 1591 -2040 1926 -3089 -2160 -543 277 -1312 -2980 -1813 -331 888
1023 888 -5456 -99 -3148 -2891 -905 -4192 -835 -3820 -2355 -941 221 -3075 -480 -1458 -1630 1710
1039 1710 -5174 -1202 -2544 -1195 441 -2867 -1238 2056 1631 -351 2919 -1947 2554 731 -1779
1054 -1779 2610 -1991 1251 2675 1802 1749 2992 1285 3426 2694 -312 3843 -1849 2790 3674 306
1070 306 1735 1943 3688 3431 1077 -563 3972 -790 138 1318 -2054 1796 -515 1306 1587 -434
1086 -434 598 2067 -536 -1145 -80 -4484 -298 -2805 -1836 -1305 -4137 295 570 -1374 -2463 -1043
1102 -1043 -1965 -631 -3241 -3235 -1016 -3371 147 -1640 -1629 -355 -1426 -963 -1344 -1627 -2302 -852 -2020
1119 -2020 646 136 -1235 1579 1323 2516 392 853 968 1153 516 -493 29 136 2368 665 3010
1136 3010 2284 2795 4255 1779 2702 1356 1710 745 701 972 1390 1377 1145 3233 982 1467 607 791 1523
1155 1523 -949 428 34 949 -71 256 -243 -210 -81 -1244 -132 -2794 -1042 -1872 -2029 -1563 -1728 -601
1173 -601 -1684 -297 -731 -408 -2442 -1268 -966 -3258 -1745 -3470 -1020 -2129 -1387 -886 -1072 -513 -964
1190 -964 100 -1768 370 -1549 93 -637 -658 1529 -757 975 171 1667 144 906 991 588 1922
1207 1922 283 2762 780 2443 1177 1741 2057 1142 2315 334 2076 528 2381 844 1477 2351
1223 2351 1045 2186 393 2180 270 700 109 -27 449 -659 738 -1081 1067 -876 574 -226
1239 -226 -830 113 -2003 -263 -2395 -397 -2080 -1104 -1344 -1685 -745 -2397 -565 -2781 -821 -2301 -1586
1256 -1586 -1327 -2124 -244 -1761 31 -1787 -30 -1287 -1335 -635 -1848 -170 -1513 550 -1036 730
1272 730 287 39 1176 -23 1508 326 2044 17 1784 1111 607 1923 294 1570 58 1785
1288 1785 562 1542 2087 1932 2981 1688 3233 1175 2093 717 798 418 -552 391 -554 1055 -410
1305 -410 1122 590 659 1198 109 716 -1027 -297 -1174 -701 -1469 -1294 -474 -965 254 -2000 -649 -2217
1323 -2217 -2250 -2328 -2791 -1843 -1822 -408 -615 1071 -752 -164 -274 -1872 -1325 -3176 -2603 -2784 -1576 -1343 -24
1342 -24 158 838 2043 428 1723 -145 581 362 -1322 250 -21 250 1003 1970 636 2238 1826 1208
1360 1208 2161 -263 1171 762 825 1982 1309 2002 2975 2621 1719 1973 -527 533 -325 -1544 615 -844
1378 -844 1174 2291 1685 1190 1341 230 621 -444 -2602 -577 -2193 -784 -31 -1387 -293 -964 -196
1395 -196 -156 -1766 -2877 -593 -1881 -1574 -1218 -2922 66 -888 -486 -360 -1540 -1123 -848 -988 -2107 -1723
1413 -1723 -2556 466 -838 -75 1161 -581 2023 517 -75 -644 -1270 -312 1011 64 -513 1672 1065
1430 1065 3425 561 709 1750 464 2071 335 791 1073 1778 1608 2499 235 291 1907 450 2629
1447 2629 -470 578 2154 1790 1752 196 -371 287 836 -1602 230 -2499 -726 1759 -1258 816
1463 816 -1211 199 1263 -378 -1329 -431 -2250 -2216 -31 -3408 -796 -2973 -1203 1897 -2143 -1173
1479 -1173 -748 -789 -407 -1322 -3802 177 -1247 -1498 1523 -2936 573 67 -956 -130 -1627 -1646 870
1496 870 -467 -354 2460 -1302 2953 2225 230 2445 -1430 860 1814 -449 -488 1416 -481 2707
1512 2707 1660 -597 3519 161 2649 1889 -423 1874 1283 199 1652 940 -532 2215 -952 1225
1528 1225 789 -2766 1243 -311 -857 437 -640 51 1929 64 503 180 -2280 1202 -2158 -2559
1544 -2559 -1646 -2629 -327 -1420 -1805 140 70 -1660 840 -1504 -1610 -476 -2670 337 -1401 -1912 -266
1561 -266 -427 -510 242 -1345 -1002 -17 -1476 312 -1525 -597 1878 157 987 1377 1193 1664 821 -270
1579 -270 660 -513 -700 1288 -365 1381 1104 1598 2721 1492 1893 1592 955 1086 1407 -670 471
1596 471 697 726 1316 -112 1298 1604 254 602 -76 -102 25 -223 -337 529 -893 333 40 -805 -24
1615 -24 -1613 -1001 -1055 -1192 -1102 -1053 -1267 -237 -128 -1833 -577 -1464 -775 -1519 -2159 -335 -1244 -758 -692 -452
1635 -452 -678 -176 -1007 -921 -284 -1370 216 -750 -236 348 -136 479 126 962 258 493 6 1011 7
1654 7 286 1192 653 1860 759 1585 1566 1136 916 584 339 -348 1377 155 1388 1294 1574 1815 844 1350
1674 1350 502 269 -525 433 -12 246 195 -86 986 -1143 240 -823 -804 -863 -681 -143 -711 435 -470
1693 -470 794 -835 -215 -1126 -1883 -1478 -2509 -1100 -2335 -1567 -1216 -177 -182 -175 713 -437 696 -963
1711 -963 -453 -1524 -1284 -1072 -1488 -129 -488 761 -199 1103 330 337 432 -450 736 -370 840 408 1870
1730 1870 1172 1256 1347 446 752 -470 928 -496 900 705 1136 1804 1159 2239 1100 1752 598 1147
1748 1147 583 40 87 -762 548 -665 408 -424 388 313 -224 720 -335 119 -751 73 -967 -480 -510
1767 -510 -1229 -298 -1672 -940 -1352 -1156 -1360 -1291 -814 -880 -50 -776 520 -938 -440 -649 -1483 -733 -1384 -884
1787 -884 -679 -152 -874 333 -328 -325 2 -747 250 -407 17 570 661 788 860 664 592 912 -404 1312 326
1808 326 39 994 28 1224 1017 701 1153 1531 672 1331 985 319 1134 -504 543 147 -17 563 319
1827 319 475 607 453 138 903 -776 9 -156 -1189 212 -856 -307 -286 -1023 -563 -482 -1119 -851 -623
1846 -623 -1255 -289 -906 -567 59 -1328 -292 -1071 -1677 -1327 -1073 -973 -311 -694 -570 317 -706 391 -61
1865 -61 -78 222 -602 -159 -429 -423 -448 461 185 821 871 739 1768 151 1218 593 324 622 469 707 396
1886 396 885 506 1619 255 1144 689 363 1167 90 863 684 829 927 1011 414 828 746 -144 474 -727
1906 -727 -11 -618 -521 51 -872 420 -20 -34 -204 110 -772 -195 -587 -1060 -275 -1881 -699 -849 -1099 -761
1926 -761 -1105 -643 -599 -623 -900 136 -1400 170 -128 -628 748 -754 122 -177 -685 -388 -81 -1267 -424
1945 -424 185 -537 913 -72 1310 1289 309 1471 541 350 272 690 -26 1104 -123 905 1031 -162
1963 -162 1576 230 743 1130 106 297 1003 642 961 1188 -423 1440 -131 -81 80 -832 336 -340
1981 -340 -553 -108 202 -642 620 -601 -346 718 -1106 400 -847 -277 -315 -1217 -1056 -806 -883 -1306 -539
2000 -539 -1423 111 -763 -798 185 -847 -134 -645 -576 -489 -450 -1041 -643 -706 -435 631 -1079 332 419 672
2020 672 929 38 394 387 -23 -200 429 -168 801 667 835 1618 255 1076 1139 575 356 -58 527 776 774
2041 774 354 1010 361 1228 796 73 652 369 641 207 44 478 463 -598 213 -54 -405 415 -334 257
2061 257 -303 -965 -402 -853 -898 -401 -534 -721 198 -323 -212 -665 -1287 -147 -1206 -1120 -577 -728 -441 -902
2081 -902 -298 -504 -337 -861 -171 -450 -204 240 -361 252 -26 99 -276 -466 -278 229 -107 19 1125 170
2101 170 641 309 724 917 243 670 529 613 360 1099 611 822 921 371 679 21 704 496 3 594 718
2122 718 1044 242 649 261 376 -193 -20 -4 -393 -130 -973 -242 -536 38 -382 -23 -61 -283 110 -772 -71
2143 -71 -857 -695 -791 -665 -270 -859 -451 -757 -299 -740 -855 -774 -854 -388 -856 257 -349 494 -104 -40 -305
2164 -305 -300 -175 -727 -131 -790 203 -79 103 617 296 633 272 1036 318 898 71 456 545 67 604 133
2185 133 982 784 907 522 511 503 286 643 267 643 99 588 185 454 769 -3 637 -486 417 -658
2205 -658 -224 -147 -135 129 -261 438 -339 141 -803 -472 -678 -686 -368 -868 -403 -819 -560 -549 -248 -271 -677 -119
2227 -119 -1041 -475 -612 -456 -320 -365 -180 -173 -186 -388 123 -557 -36 -414 -302 136 -380 779 153 574 216
2248 216 280 274 692 111 102 697 72 790 348 826 753 270 1020 645 889 387 795 165 400 321 199 1088
2270 1088 -102 451 472 355 342 653 182 296 -51 -210 238 -359 -15 41 -343 -15 -438 -242 -331 -370 -537
2291 -537 -226 -556 -534 -201 -824 -262 -578 -488 -379 -256 -599 -439 -392 -479 -174 -684 -404 -622 -489 -74 -424
2312 -424 -46 -332 32 35 -112 -118 297 302 226 240 -31 245 -45 226 382 379 476 556 844 746 699 329 388 538 157
2337 157 289 -51 386 634 659 911 283 711 689 499 34 -100 -174 287 -59 -64 335 12 438 323 -231 -56
2359 -56 -509 -15 -476 -457 -703 -313 -320 39 -6 -624 22 -678 -85 -822 -595 -784 -923 -678 -603 -217 -715 453
2381 453 -138 -33 -251 -487 -21 -680 -232 -283 75 30 188 304 307 469 -79 550 -222 83 10 102 576 401
2403 401 344 471 898 241 777 327 497 149 72 532 248 497 527 872 472 689 467 128 633 -271 172
2424 172 -479 -210 133 130 -135 -127 384 123 238 -403 -241 -420 -622 -313 -800 -427 -741 -79 -543 -249 -296 -582
2446 -582 -97 -571 -321 -912 -496 -415 -189 -395 -620 -193 -269 39 -635 -33 -200 -105 69 -405 -284 -422 305
2467 305 56 101 115 175 164 -10 643 -42 274 79 757 316 418 356 498 1066 116 483 379 303 763 504
2489 504 734 367 288 254 617 -279 135 312 72 395 322 204 -87 199 123 52 -558 -293 -79 -537 105 -382
2511 -382 -47 125 -395 -83 -600 -370 -287 -213 -770 -446 -310 -529 -191 -893 -32 -418 -460 -172 -305 -523 -75
2532 -75 -204 -224 323 -526 -108 -198 -41 -78 -407 -129 -81 193 94 -86 310 566 436 -6 521 149 410 332
2554 332 443 508 361 325 437 518 372 479 461 322 422 111 579 152 285 295 80 374 65 412 -126 249
2576 249 -342 388 -97 -219 -108 -186 -251 -344 -139 -200 -94 -290 -265 -118 -530 -408 -587 -317 -577 -433 -581 -434
2598 -434 -235 -228 116 -401 173 -415 -105 -463 -479 -128 -459 -1 -99 171 -49 -35 177 -39 84 -197 100 -137
2620 -137 218 -31 87 579 169 520 225 477 397 386 85 7 415 97 390 75 631 626 448 559 245 424
2642 424 60 100 -464 241 -114 192 119 205 618 231 255 -167 243 -297 -165 -195 -361 -365 -405 -119 -528 -220 -436
2665 -436 -340 6 -462 -107 -716 -502 -567 -262 -415 -289 -1 -359 -18 -518 101 -261 -524 -115 -90 -136 -481
2686 -481 171 -203 202 -119 200 -36 -53 443 71 293 13 348 107 275 323 464 418 7 303 -67 398
2707 398 450 597 316 230 562 237 615 447 260 184 622 608 75 373 177 327 43 -300 116 -153 156
2728 156 -426 -153 -285 -16 -39 93 -206 -330 -182 -478 -236 -491 -329 -420 -396 -276 -447 -81 -247 -90 -393
2749 -393 -278 -364 -477 -419 -192 -172 70 78 -47 101 -37 -219 134 -313 66 -212 -154 20 158 318 487 102
2771 102 -137 241 332 535 23 -54 443 190 258 157 265 147 441 342 499 -36 178 666 -102 348 44
2792 44 29 425 104 437 188 40 -4 178 -204 -35 -269 -248 191 -76 -207 232 -82 -105 -316 -325 -270 -247 -552
2815 -552 91 -737 -413 -212 -397 -71 -305 -319 -243 -146 -252 -284 -455 -343 -160 -147 170 -296 -220 76 -404 14
2837 14 -224 168 -223 75 53 54 94 626 643 61 503 118 76 170 -10 404 18 405 317 341 269 278 416 144
2861 144 399 54 271 81 263 218 334 241 281 247 288 138 -117 355 -192 -338 -148 -183 6 -227 22 -193
2883 -193 23 -310 -37 -516 -491 -263 -598 -24 -430 -443 -267 -372 -47 -364 -401 -523 -357 -620 -253 -508 -245
2904 -245 63 -290 -67 -245 -52 -102 -32 -47 126 -140 -74 452 52 406 -28 290 570 25 260 127 345
2925 345 463 387 258 466 301 267 584 -95 650 -68 -4 314 40 107 624 404 12 856 -229 366 134
2946 134 -110 411 -224 18 103 119 -25 -155 -47 49 -66 -627 -12 -446 -164 -99 -289 179 -188 85 7 -365
2968 -365 -794 -340 -857 -326 -400 -471 -243 -231 259 173 167 -122 24 -244 -485 -304 -437 57 -22 -170 224 -77
2990 -77 194 240 68 126 42 -71 191 -3 490 504 170 537 224 157 281 -92 -5 244 0 -155 344 344 566
3013 566 227 284 670 356 304 257 -125 -305 -106 -68 54 76 6 259 -66 -106 21 -434 -140 -359 -112 -59 -149
3036 -149 -34 130 -271 -219 -356 -363 -575 -804 -538 -537 -302 -172 -72 -68 18 -309 -378 -25 -260 -291 -317 -444 25 -347
3060 -347 -149 -1 -110 66 -116 27 18 149 174 26 -173 364 380 2 533 128 245 62 154 68 261 233
3082 233 267 727 252 656 486 513 380 77 166 -38 287 51 190 111 313 100 80 373 -277 44 -338 -113
3104 -113 11 -244 -189 -35 -293 -218 53 -226 -322 -460 -356 25 -313 -235 -339 87 -151 64 -41 -45 -144 -349
3126 -349 -140 -770 -20 -437 -143 -213 47 276 -55 189 -117 192 -120 12 -30 -367 -72 -33 213 135 379
3147 379 198 275 204 261 254 142 143 176 293 75 379 166 148 551 215 280 -89 312 39 189 418 268 416
3170 416 211 420 70 245 -76 -94 148 -180 -266 -702 -103 -271 65 -280 -12 142 -94 67 -323 -308 -123
3191 -123 -410 -189 -275 -270 -368 -220 -322 -261 -288 -360 -212 -205 -98 -49 182 -212 19 -73 -160 92 -220 -67 -298 -188
3215 -188 -163 158 444 301 337 455 408 56 480 -41 149 188 -4 340 343 -37 154 489 258 169 424 181
3237 181 210 -13 158 283 353 304 85 112 199 85 46 330 -375 19 -114 1 142 -257 32 140 10 -31
3259 -31 -30 -243 227 -131 -398 -68 -585 -85 -91 -587 -356 -334 -311 20 -215 -132 52 -312 -116 186 0 78 16
3282 16 -74 -96 -398 172 165 -138 275 294 -111 290 101 -145 207 -466 348 323 122 143 338 263 225 368 466 351
3306 351 -15 257 64 122 125 -217 293 104 466 372 180 22 27 103 -196 122 -196 138 -123 138 96 18 -151
3329 -151 -262 35 -179 -155 -478 -348 -26 -187 -108 -340 216 -30 -244 -265 -424 -238 -430 -161 -256 -120 -211 -122
3351 -122 -58 -492 43 -350 -284 25 -28 -229 310 -165 120 129 -31 134 -117 102 313 -89 114 -198 -225 150
3373 150 123 221 676 112 290 491 -34 221 23 85 -60 197 -58 431 49 201 428 -108 373 -155 395
3394 395 117 -215 248 173 188 -184 -72 -534 154 -368 -168 6 -413 265 -105 -102 -154 -330 -253 -35 -160 -532
3416 -532 -19 -204 25 -267 -100 -61 -342 14 -262 -157 5 -119 13 152 99 107 354 -260 224 -119 -39 -44
3438 -44 -179 -255 175 3 269 366 391 307 296 318 752 -61 -7 312 87 405 199 156 216 160 -83 48 93 481
3462 481 80 172 353 260 197 323 51 -21 -66 -99 145 -87 -87 78 -103 -2 -109 -16 209 -325 13 -57 -222
3485 -222 -85 -52 -378 -159 -263 -362 -253 -310 26 -337 -52 16 -273 -113 -81 -352 -12 -299 -168 221 33 -343
3507 -343 16 -16 -48 113 -126 -3 22 -112 -132 125 -6 292 137 190 195 385 185 121 105 292 88 177 395
3530 395 168 129 309 15 399 8 245 -74 68 203 183 236 -68 321 -27 151 29 -29 266 -265 127
3551 127 -126 -36 -410 -49 -129 -102 101 -130 -32 -82 -51 -271 -190 70 -276 -65 -17 8 -123 110 -444 -262 -352
3574 -352 -184 21 -311 -56 -176 223 -104 -120 119 198 95 -93 48 -108 -201 17 -30 99 -101 -48 -178 169
3596 169 11 218 477 320 113 -102 154 359 221 230 251 274 -2 196 -22 254 30 71 41 98 83 39 176
3619 176 -157 152 -134 -184 -33 -39 -101 -296 29 -244 5 -191 -208 -418 -66 119 -52 145 -210 -27 -243 -76
3641 -76 -246 -274 -326 -499 -85 -432 -122 -55 -239 165 193 28 53 -216 -262 93 -304 -137 -31 47 39 29 389 -13
3665 -13 53 -64 440 110 -170 261 -117 255 183 470 252 2 232 41 84 36 -5 -147 131 148 -227 458
3687 458 349 243 509 275 317 93 172 -127 70 -270 -155 -161 223 -100 -157 -313 -124 38 -233 252 -146 71
3709 71 -417 62 -308 -259 -210 -184 -135 -160 34 -222 -123 -133 -234 -152 4 -188 -271 -253 63 -252 68 -132 -205 -24
3733 -24 -251 -53 203 114 -221 212 52 204 251 -184 264 23 381 187 230 90 209 226 178 17 43 315
3755 315 -104 171 463 80 153 35 -74 -124 -113 151 159 -95 252 117 2 71 -41 24 12 64 1 -65 -143 -121
3779 -121 10 -169 -37 -117 12 -141 -230 34 -308 -247 -275 -265 -274 -129 -101 -1 -4 -348 -146 -503 -46 -202 -216 66
3803 66 -179 34 118 23 -44 277 -115 277 157 -191 10 -22 10 100 342 113 198 289 331 260 -4 175 286 420
3827 420 226 118 406 61 186 122 202 96 233 159 64 250 -105 244 19 168 183 215 280 54 40 66 9
3850 9 101 162 -189 -228 -210 -133 -176 -126 -108 -113 -208 -182 -269 -278 -374 -48 -360 -127 -315 -25 0 -278 -50 -96 -189 -312 -51
3877 -51 -217 78 -12 -60 106 34 108 -50 52 -108 45 150 -57 37 53 140 46 2 -20 247 34 100 101 121 39
3902 39 255 286 -67 94 78 131 470 -178 262 232 90 237 311 43 9 -126 -34 49 36 -17 26 49 54 -151 -155 52
3928 52 0 -196 43 -29 131 -133 5 -19 -30 -111 -220 -107 70 -31 -166 -385 -172 -54 -460 53 -117 -86
3950 -86 35 137 30 -196 -160 -67 123 77 37 -279 -149 -6 113 39 202 61 -25 103 143 -156 144 179 44
3973 44 286 401 -4 21 157 272 88 -88 183 244 -77 41 28 243 343 234 314 89 69 44 109 -16 34
3996 34 -216 132 -90 156 -30 -284 171 -145 -264 -272 -96 -209 -83 9 -247 63 -32 -156 -266 -213 -246 -80
4018 -80 -135 -278 -234 -236 -87 -78 -3 86 -165 200 215 -179 92 -86 -99 -65 43 -115 49 150 14 140 -189 109
4042 109 53 45 12 64 91 130 191 42 106 189 177 134 64 474 332 -120 181 118 162 -41 -26 258 161 18 39 17
4068 17 32 170 -165 -128 87 31 72 59 -6 -33 31 -201 -133 -335 -290 63 -141 -128 -147 -42 -16 -52 101 -190 -37
4093 -37 -257 -95 -282 36 -236 -250 -119 68 -55 -326 34 -306 72 -202 94 -191 27 263 -155 -31 80
4114 80 122 93 241 278 231 210 -228 166 -60 396 51 198 342 47 115 82 125 -157 175 -96 97 170 -191
4137 -191 -167 117 105 -58 63 52 37 248 -196 -33 42 12 -145 -89 -104 -236 91 94 -299 -315 39 -106 -110 -216
4161 -216 -220 -102 -317 -241 -268 -366 -18 -152 27 -247 128 -85 28 -171 -94 -61 -355 56 155 -3 -172 79 -123
4184 -123 158 179 152 21 -2 177 64 -127 101 99 152 34 -165 163 179 188 1 38 107 -46 168 169 66 141 35
4209 35 114 226 250 211 110 146 -153 -25 -42 -96 160 136 43 144 151 -19 -9 -310 -159 -92 59 -90 14 206
4233 206 -344 -102 -138 -120 78 -413 -228 -216 -39 -367 -252 -161 2 -23 33 -13 -268 -126 -55 -212 162 -115 117
4256 117 -47 -82 8 -212 157 115 225 -102 302 99 -287 130 240 -38 -65 55 20 215 84 132 17 147
4278 147 -112 18 16 -35 57 71 204 2 -31 125 115 188 -393 87 -165 -29 116 81 250 65 -48 244 32
4301 32 -202 -78 -198 53 52 -185 -23 -220 -81 -37 -254 -224 -364 -32 -143 -99 -146 -7 -138 14 -31 43 111
4324 111 -151 -45 43 -18 -29 -158 -25 -175 280 86 -143 76 -91 173 -111 71 86 95 12 161 -137 -84 39
4347 39 120 99 -214 261 112 -24 94 270 169 108 257 -4 251 151 -60 180 63 16 -22 139 131 109 13
4370 13 155 137 128 -165 -125 219 -46 -410 -148 -206 -102 -238 -119 -114 -277 -136 -288 -142 63 75 -228 -19 -140
4393 -140 30 66 99 -58 -199 -151 -128 2 -163 167 39 60 -60 35 -18 -38 -3 -80 -30 94 -77 -33 121 121 97
4418 97 165 362 -24 201 42 -48 212 18 -66 73 102 268 188 10 147 -17 -27 141 -31 2 74 63 334
4441 334 144 314 224 -301 226 -146 12 -188 -133 28 130 -60 -29 56 323 159 -209 27 -165 -82 -79 -72 -345
4464 -345 -54 -301 -21 -196 -115 -108 -137 -182 -238 -160 7 -119 -96 -145 -23 -91 -152 90 -77 -325 -308 116 91 16 -22
4489 -22 -20 17 -54 197 238 235 53 66 131 88 -108 174 -92 40 84 123 283 243 84 -133 149 -335 205 195 164
4514 164 -181 246 -16 58 66 -191 29 -80 -116 18 -322 135 -157 -30 -213 126 263 -81 62 17 11 114
4536 114 -58 -166 -61 -41 -163 56 -124 41 -183 -126 -30 78 -33 58 -32 83 22 -210 -157 -74 177 188 -67
4559 -67 173 119 128 -135 146 63 140 -129 -64 106 30 138 -48 105 0 116 25 205 242 248 174 95 58 77 -72
4584 -72 118 126 159 25 279 176 44 -88 419 255 -267 350 -24 64 -90 -124 259 -172 -207 -247 -226 -287 -182
4607 -182 193 65 -309 80 -170 -75 70 -164 -169 -96 -141 -155 17 -136 -141 -98 -161 -31 -176 -235 -117 -94 17 -286
4631 -286 67 46 73 -74 82 160 70 173 -92 4 19 -18 17 -7 239 343 67 397 270 250 -14 6 223 47
4655 47 -157 210 -20 -52 123 79 118 -8 90 69 195 170 157 50 38 169 -120 190 262 -192 37 101 -64 -20
4679 -20 37 -103 -62 -85 -52 129 1 -133 -287 -47 13 -57 142 -75 -234 -307 -190 -82 -90 18 -123 132 -73
4702 -73 86 -40 -276 -55 49 -54 27 39 -11 55 -297 186 21 199 52 330 -43 7 101 90 41 -39 -42 -36 -19
4727 -19 6 135 147 27 -21 191 -114 325 47 -25 213 87 89 128 140 -90 -6 -52 -118 -129 -210 -281 51 -2 146
4752 146 -26 -96 2 -254 98 -34 -107 -150 -23 -289 -234 -128 -247 0 -263 -98 -90 -67 103 -235 -163 -150 -81 -233
4776 -233 187 -96 94 -250 33 -69 -65 -126 139 195 195 311 -37 144 194 130 179 -60 -90 195 -49 168 156 9
4800 9 100 147 185 167 123 240 143 -86 13 -179 304 -60 207 -76 -158 314 123 142 42 13 -149 -58 205 -62
4824 -62 -84 -50 -65 -221 -191 22 -129 -130 -109 8 -403 32 -128 -55 58 -175 -347 -112 24 -216 65 -176 64
4847 64 -114 -165 -265 -106 141 -95 133 22 0 -33 -15 -29 -132 -160 191 86 -136 116 255 -119 187 234 -6
4870 -6 -116 46 4 243 105 212 -1 106 134 66 163 -114 154 -10 107 94 255 113 139 79 297 0 -159
4893 -159 229 266 4 9 90 -17 82 -263 -108 -273 110 -56 -2 170 -252 -160 -122 14 -284 -44 0 18 -18 -276
4917 -276 -345 -151 -259 27 -301 -156 105 11 168 131 -101 33 144 -212 -27 -234 -57 199 136 59 -149 42
4939 42 241 -35 -111 118 -103 218 296 331 284 -53 148 6 53 -59 105 -78 -96 166 -185 211 38 304
4961 304 305 59 226 -40 -5 137 145 -31 -214 -193 -110 -25 -38 205 -110 -89 -324 74 223 -342 -204 -216 124 -111
4985 -111 -67 -155 -22 -176 -211 -226 -312 -46 -193 -86 -163 -70 -330 -255 -203 63 -138 -279 226 8 64 105 -29 252
5009 252 -169 288 31 97 -88 100 225 -93 128 -159 125 -30 199 -71 145 92 284 26 -240 248 -66
5030 -66 179 -143 56 5 -168 -15 79 157 -163 53 14 16 -121 153 133 184 257 137 73 -196 23 -158 45 1
5054 1 -55 -49 -87 -93 -104 -45 -116 -34 8 109 88 -11 -105 -126 -42 11 85 -83 -223 -12 -350 28 -52 99 51 135 147 -117
5082 -117 173 -59 -85 -5 84 75 -147 1 -20 130 309 -164 196 193 63 9 345 -105 -178 170 -178 168 -62
5105 -62 114 109 -69 54 77 -118 -68 49 72 138 55 72 190 63 229 -50 -105 -37 -244 -9 -75 -93 -323 123
5129 123 -140 75 24 -196 -67 41 -158 117 -105 -38 -232 132 -14 -154 -207 152 -60 -214 -63 -117 19
5150 19 133 -19 -86 49 -62 -145 -225 39 -93 128 -113 -195 -21 -23 88 -62 -55 5 -21 -21 -65 9 -125 118 101
5175 101 -112 269 -102 222 115 4 250 154 138 71 -174 -133 75 -100 80 161 3 377 54 156 22 -51
5197 -51 -171 -31 -252 13 4 -107 -64 -88 -38 -138 -67 -130 -120 112 -31 20 -542 -85 -145 80 72 -99 -77 -141 -48
5222 -48 -72 80 -252 92 -290 54 -122 -305 -67 -145 -68 396 -111 1 84 -9 -4 31 -129 116 124 19 -81 21
5246 21 -12 84 75 211 -46 49 -61 78 -128 51 -77 134 -88 -124 -100 253 -78 96 -37 95 54 -61 -115
5269 -115 -27 -35 123 23 86 -28 -3 210 -31 30 40 -275 -56 114 -109 147 57 4 58 108 -16 69 -185 -51
5293 -51 -41 27 -300 -28 -250 87 23 -210 -16 -174 -140 -24 -200 141 61 19 69 15 78 -95 -192 -66 105 118
5317 118 -213 39 77 21 -69 89 66 122 -1 100 217 -135 190 121 274 292 21 131 81 -83 56 30 131
5340 131 -210 119 -57 88 -78 -59 -66 151 78 -44 51 -215 74 -133 -159 -304 -28 14 -187 -155 -120 -47 15 91
5364 91 -94 -64 -282 -30 -18 -97 -192 -101 14 -34 -228 -171 -153 49 -23 148 -135 -187 -165 -36 -270 -80 -200 144
5388 144 235 -3 -209 55 82 462 18 40 77 36 -119 -29 132 17 198 140 -156 -87 -52 177 110 -268 144
5411 144 -58 260 37 109 174 213 56 -70 -314 -74 30 79 33 70 65 -100 -187 -127 39 -121 -306 -118 -11
5434 -11 -68 -127 132 -139 2 -116 97 34 -104 -159 50 -160 47 189 94 -86 91 -528 -141 61 -42 -31
5456 -31 -176 2 -23 48 283 -56 -8 -43 -168 -120 135 80 70 81 134 58 -9 137 93 180 46 61 -166 488 15
5481 15 292 51 16 -163 -177 -149 55 93 188 -11 -51 197 112 -35 77 11 -160 -166 -14 54 -74 -68 24 -47 -24 -33
5507 -33 -205 -102 -6 -345 -79 -12 4 -159 109 -24 -121 -71 -327 58 -265 -17 -134 -99 -325 -31 259 -256
5529 -256 48 -197 -119 -198 174 -95 -316 32 155 3 -80 43 -137 151 297 85 -120 -50 -140 6 271 274
5551 274 208 51 -60 394 11 191 -4 -72 -125 -155 -133 178 -22 206 -100 92 -29 -261 96 53 124 39 -129
5574 -129 -128 -140 -43 16 -40 224 29 102 -343 17 -146 -139 -54 7 -20 -24 212 -25 -14 -118 91 -107 -22 -134 11
5599 11 -86 -21 46 111 -54 -60 -24 172 16 -152 124 194 116 101 62 -126 -15 148 142 227 161 -102 20 -194 104
5624 104 210 47 15 225 -205 -58 5 211 26 18 -52 104 87 -164 299 76 -109 30 -4 108 194 -132 -88
5647 -88 85 -198 45 -88 60 -17 81 -91 -200 182 -19 -58 -47 -319 -248 -189 -87 -338 -166 -66 -176 -243 -126
5670 -126 -93 -154 -68 -106 -21 -259 -136 19 -59 136 57 -25 -115 -96 -157 -68 -25 -171 179 219 104 -18 -86 36 17
5695 17 98 62 -62 -5 115 260 7 7 -124 31 187 -41 -47 84 89 -54 89 104 -17 247 -9 -18 165 -142
5719 -142 -19 -85 -65 152 -4 79 -256 210 0 -14 120 -98 -75 6 111 -13 82 -78 129 91 27 127 -86
5742 -86 44 -362 -289 -342 250 -278 -85 63 -107 -146 -222 23 -11 -101 -82 129 182 -83 157 142 243 142 225 -43
5766 -43 -22 179 25 68 64 103 13 213 220 45 184 186 104 303 -137 -212 14 -2 299 183 -57 156 24 -21 73
5791 73 77 -42 -39 186 85 244 -106 190 -156 95 21 -94 -108 -366 43 -158 259 -321 106 62 185 -157 -254
5814 -254 -1 -20 142 -242 26 -180 -276 36 139 -28 -20 187 63 -104 -56 -138 -178 -1 -45 18 37 -180 176
5837 176 59 -39 114 -103 168 60 247 209 223 -131 238 -183 -25 40 235 -153 297 124 179 91 61 -99
5859 -99 30 57 51 -7 93 -50 30 63 -48 200 193 -43 94 -19 -114 59 -317 -51 -146 -69 -64 -324 -130 -5 -298
5884 -298 250 -27 73 -371 -330 71 147 47 -86 133 -80 -38 -52 -98 280 -231 -195 -175 -40 -37 60 -172 -131 53
5908 53 -38 -336 46 -63 -26 -147 -66 29 -89 202 80 255 195 20 -97 -61 182 97 223 133 -60 100 -24
5931 -24 128 -101 187 32 342 -35 50 -14 182 220 117 55 36 13 -221 -40 180 -111 42 135 -66 -120 143
5954 143 -113 106 167 -15 314 -96 -113 -232 -300 50 -66 -153 -150 20 -62 -79 16 -56 -53 -223 -176 -85 12 -53 55
5979 55 52 67 -242 44 8 -99 21 -228 -146 114 60 151 74 222 26 94 66 307 39 95 148 69 97 63 36 -7
6005 -7 11 -41 12 -49 99 46 -122 268 -177 -254 85 94 -149 324 15 -61 132 -143 -18 -152 55 32 31 -11 -130
6030 -130 -37 -49 -55 173 -93 13 19 -307 -206 217 -158 -78 -146 -179 -33 39 -54 13 -197 20 -215 -68 278 58
6054 58 106 -178 39 212 -37 -190 -77 -57 182 -2 65 14 287 181 -5 -227 -4 166 179 225 39 120 -26
6077 -26 245 179 -44 251 -135 -161 -15 -139 34 127 369 -37 -84 34 -15 210 66 -259 -97 -241 -136 -184
6099 -184 38 111 -192 -43 -78 180 -4 88 32 -260 14 -83 -172 13 57 -24 -204 53 -82 70 -12 -268 34
6122 34 44 -133 6 -16 30 -163 152 82 157 -29 -136 77 -121 168 -274 172 -27 -49 60 160 60 223
6144 223 -56 -23 265 69 278 277 108 -11 282 -93 26 149 227 -123 -106 -137 68 281 229 -55 78 -140
6166 -140 -19 -282 -44 159 -294 -96 43 -46 -48 -130 -71 270 84 -8 -104 -74 89 32 -4 421 -84 -210 -174 -135
6190 -135 29 -46 -369 -1 -179 -38 51 96 78 2 -32 -284 66 -162 -207 -235 -15 -161 149 -37 -300 71 15
6213 15 13 -136 132 344 181 9 189 133 32 48 -268 -17 -56 174 237 151 224 296 262 75 24 121 109 58 -5
6238 -5 36 -47 -45 -194 -57 57 238 20 68 13 -10 -19 56 -68 96 -28 -144 236 -184 70 7 -98 -205 17
6262 17 152 42 -138 -31 -75 -52 105 83 -124 -82 91 185 -28 -7 -78 -36 101 -98 72 -74 243 -248 103
6285 103 -144 23 64 35 -24 82 91 -122 232 -30 23 33 188 237 -10 163 -81 121 -9 75 21 -23 -20 96
6309 96 1 100 202 -53 45 -71 33 48 -85 -82 -45 50 -325 -221 82 119 -88 -9 135 -133 -129 -264 -229 70 47
6334 47 -49 -180 26 -130 135 109 -35 -133 -189 -260 -94 157 -37 -44 -158 95 -136 60 94 53 49 -364 142 176
6358 176 -134 88 163 -8 -48 -27 -89 21 124 268 19 75 57 176 246 -97 -209 170 184 228 17 164 109
6381 109 82 -107 151 157 195 151 95 118 -6 46 264 141 -25 39 -143 103 -14 -93 -92 6 91 -82 -171 61 -177
6406 -177 -130 33 76 -92 -145 186 -179 -4 -263 126 -80 102 253 -248 -261 -11 -94 -13 -35 -32 224 40 -151
6429 -151 -257 -83 127 20 81 226 -42 42 126 -128 160 110 137 127 127 -41 -17 -172 33 23 63 27 -59 -10 235
6454 235 142 -205 -243 -85 -104 -135 19 166 26 250 40 -38 -57 -137 45 185 108 -39 236 -157 140 -65 37
6477 37 49 -93 -175 -381 -61 -237 -52 -208 -261 -104 -62 235 -80 -58 117 -82 -218 -158 -94 57 -73 24 -281
6500 -281 -10 -96 -66 -222 98 -149 113 51 60 80 -114 -22 -96 68 -75 -47 -155 103 55 159 95 151 139 -136
6524 -136 298 123 370 177 93 97 220 134 165 149 -158 23 57 83 121 23 -16 -15 70 283 73 140 -224 9 -137
6549 -137 -138 -95 -25 -44 -206 -281 -119 -131 9 24 -73 73 92 -35 -195 18 99 -85 -133 -102 -51 -72 -195 23 23 -191
6575 -191 -101 12 -101 103 49 223 -87 10 83 -50 224 -170 144 -36 190 -234 3 225 162 92 -34 -59
6597 -59 33 216 -75 -32 -33 85 32 269 181 163 81 147 2 109 125 -293 42 42 -189 -6 -93 247 17 99 -178
6622 -178 -182 218 -9 -99 -83 -205 34 -36 20 -113 -98 -107 -136 51 -87 -274 -78 83 -121 -51 9 -147 140 -268
6646 -268 2 -85 -387 142 -163 122 -307 -209 -84 -120 8 -100 64 56 -128 -42 -187 243 -191 130 247 358
6668 358 -84 -175 11 -27 53 196 38 -119 -20 57 70 11 156 35 57 247 7 85 -241 17 -70 -92 -1 -36
6692 -36 -8 230 -42 55 341 6 121 -174 127 -188 -113 -58 174 -134 -170 226 -1 -198 -75 -35 197 214 85
6715 85 -31 -111 -127 -15 -27 -100 -36 -291 182 1 -117 -107 -169 -175 -70 55 145 171 146 7 96 37 52 -97 161
6740 161 18 -133 244 211 76 -63 96 190 269 175 246 363 105 -62 109 -40 99 -61 -90 -203 73 58
6762 58 215 222 -52 -32 34 -43 -81 179 -85 -187 -114 -105 17 264 -316 218 -4 -136 -352 -136 -226 -33 -77 -2
6786 -2 13 11 71 -187 -57 -20 -163 45 -76 -105 126 25 127 41 -66 -371 145 -80 72 -48 -99 -32 184 -200
6810 -200 -20 161 -50 159 -113 -126 210 260 198 46 173 20 47 132 -211 9 108 -52 25 58 -155 -132 -208
6833 -208 -39 11 147 63 157 203 166 63 -95 27 225 130 3 -135 0 -30 -98 -160 38 -160 -102 -20 157 -39
6857 -39 125 89 -204 -31 -284 102 20 10 81 -18 224 -109 -114 -194 -57 -125 -38 207 66 33 -204 -35 73 -12
6881 -12 192 284 77 -75 -97 -78 116 99 42 160 -14 71 126 48 -10 371 87 -92 -226 157 -136 167 49
6904 49 90 99 89 129 -54 -137 8 -18 38 84 -127 38 -252 159 151 58 19 37 -24 130 -202 -5 247 -67 -165 50
6930 50 -214 -215 -145 38 -146 -97 34 60 48 18 -189 -92 -30 39 86 -305 -39 -222 -101 20 -154 19 -199 -32
6954 -32 -19 125 257 -185 -9 36 -56 -154 128 317 193 137 -71 118 -57 12 -23 62 -85 277 -73 -193 -121
6977 -121 -3 180 140 54 -88 91 -153 -321 286 -81 12 -129 -185 40 169 -89 -2 -176 -30 83 -156 15
6999 15 -174 71 -440 -118 -75 34 5 47 -80 -34 -311 -16 -58 80 -208 -176 -67 -182 46 143 59 76 -87
7022 -87 -206 -288 -6 -58 -13 216 -69 -7 -98 -81 119 -209 196 122 19 179 -43 152 176 102 119 93 -7 33
7046 33 339 84 24 77 145 18 152 -68 109 157 -28 -16 118 187 -71 74 -4 -181 4 -14 -180 229 -54
7069 -54 134 -141 -204 -82 179 247 46 -15 -208 -146 -49 26 -273 52 272 68 -16 -529 47 -130 108 -226 -75
7092 -75 -234 -196 23 -299 -26 233 7 -209 149 161 -210 60 -305 -353 162 44 4 171 30 93 108 71 -22
7115 -22 158 90 18 -4 75 154 50 193 277 19 152 30 148 65 -83 217 123 -133 65 86 33 -10 77 -153
7139 -153 -120 -12 10 -170 15 33 69 -112 -154 247 -98 78 60 -39 -48 -330 125 -17 197 -193 -151 -142 22 123
7163 123 -112 24 -80 6 -108 -190 -85 41 -38 -51 106 196 -244 -173 -286 38 -112 -260 118 -309 -107 -9
7185 -9 -123 177 60 77 -257 100 -22 -240 -23 183 161 -37 138 -142 211 -21 -79 5 -139 49 223 -218
7207 -218 309 227 -91 -39 230 -40 169 -19 -237 -76 -72 -70 220 -190 15 25 -45 -88 51 -47 -32 -352 -213 35
7231 35 -86 -100 -90 -54 -127 121 -156 -123 0 -66 -174 -346 -153 101 -166 -84 21 137 -148 125 32 109 -19
7254 -19 82 -114 -4 53 -35 144 -50 -12 147 -64 100 41 -27 -18 75 -164 90 168 -70 71 -46 -96 -171 102
7278 102 243 -15 -54 87 113 -69 -123 41 -59 24 176 49 -76 98 -33 -93 -156 -127 -71 -131 -64 14 -115 96
7302 96 -122 -270 -49 86 16 -123 -144 -51 -27 -246 -71 12 126 7 -101 -98 64 20 70 -277 -3 62 -229 -21
7326 -21 -215 -35 -92 62 91 -12 230 9 65 8 20 75 73 20 -10 141 55 61 101 -33 216 107 167 136 52 -36
7352 -36 -35 180 107 252 46 233 -17 116 195 -11 194 -123 -161 -187 121 195 -85 317 -71 -262 -273 -207 -11
7375 -11 -73 -1 -173 -133 -349 51 22 125 -20 40 -178 -217 -487 -63 2 -161 -52 -117 -48 -13 246 59 -33 -140
7399 -140 -202 -67 292 -60 25 -134 228 -150 222 148 91 -9 41 224 342 -14 -73 -75 156 69 150 13 -35 148
7423 148 -120 -103 -57 239 135 -90 91 -176 45 38 -162 96 117 237 -65 164 2 39 -179 -51 57 -26
7445 -26 -137 -62 -56 -76 -34 -54 -94 230 -250 -202 -109 27 41 218 -189 36 -195 -26 143 -21 -24 64 -138 -302 -74
7470 -74 187 -207 -41 34 88 -267 0 131 262 11 40 18 129 33 156 33 160 -198 91 -22 -38 154
7492 154 141 349 220 113 -62 108 202 -49 25 91 42 -17 142 14 -78 127 -171 -48 25 -151 -200 -72 -22
7515 -22 -75 -101 -132 -9 -59 -33 -235 78 -73 -110 -251 -313 -208 -92 -129 -65 11 45 -86 -62 -158 71 75 85 -5 82
7541 82 144 -204 -85 -71 -1 1 183 19 -166 -92 47 -66 62 154 18 -23 98 120 21 4 76 274 224 92 343
7566 343 -50 100 103 129 -174 5 28 39 -11 -1 165 192 -65 23 -16 69 -60 93 -7 106 -47 -324 -152 -167
7590 -167 152 -26 -41 58 19 -62 178 -192 -218 -167 -114 112 -82 -268 -91 5 -1 -413 -65 -334 -73 58 -101
7613 -101 5 -48 -40 106 -2 70 -46 25 50 -27 171 -36 -146 109 -50 -22 110 -17 210 371 37 192 -24
7636 -24 285 126 -84 70 -18 77 177 -147 1 -15 318 253 138 -40 68 62 -64 68 59 -3 92 62 -142 -63
7660 -63 21 36 -139 156 152 19 91 136 131 -25 87 -133 -100 5 -89 -97 -152 -90 -169 -339 -199 -72 96 -20 -145
7685 -145 -111 49 203 202 -56 -302 -10 -85 -7 117 201 124 70 -304 -180 -32 23 60 124 100 349 -182 305 -193
7709 -193 123 -76 47 136 145 -19 39 103 136 -96 -224 -163 69 63 172 158 -79 9 68 116 158 -27 -37 189 111
7734 111 -175 -52 117 -31 149 -57 64 21 -25 -286 291 133 87 14 -100 17 -105 -245 -331 -214 37 59
7756 59 117 -12 -45 -22 -66 -255 20 -250 -15 -157 97 -93 -282 -164 -71 257 348 -169 -218 -263 146 -192 75
7779 75 -37 -146 16 -8 -255 131 -234 -182 134 -138 189 -45 -30 -4 -23 9 -179 -21 -10 -69 -6 146 102 -3
7803 -3 49 -88 -75 106 -48 205 -130 -16 60 101 -126 -17 289 279 -113 116 -75 -25 -93 78 115 37 49 54 -388
7828 -388 -295 -93 -126 81 -59 51 -128 8 54 -216 -405 26 -1 -9 2 108 177 17 -38 -158 -53 57 320
7851 320 23 -156 84 -14 37 94 44 115 -16 -22 136 -9 -122 216 187 248 -177 -75 95 17 164 -243 181
7874 181 290 -34 233 191 256 -128 130 11 61 107 106 131 -23 12 -20 -100 -125 60 -167 -89 -77 -61 -4 -114 142
7899 142 -53 25 -35 17 -64 -269 2 -278 -209 40 -55 82 -301 -124 39 -147 -152 -35 28 287 -128 -29 -194
7922 -194 -36 112 120 114 160 253 -11 102 68 192 136 86 358 0 254 -53 -131 -78 64 75 -166 235 135 -92
7946 -92 110 137 102 26 66 22 55 127 11 -222 -83 -25 60 43 -189 -1 -18 -18 -30 -104 30 -162 -53 168 16
7971 16 12 218 -129 -91 7 -232 -106 -202 55 -183 -231 75 -221 62 -31 -347 81 0 94 -13 176 28 -115
7994 -115 190 -177 -173 -41 -19 62 3 341 -155 -115 80 98 -26 -15 26 -15 43 121 62 -103 179 -271 142 -89
8018 -89 58 121 -50 -33 126 -46 45 -66 120 62 10 -92 137 -178 35 44 124 218 123 -91 -91 233 32 -226
8042 -226 -43 -184 92 -199 -74 2 -70 27 -312 -93 -165 -143 129 118 -203 130 11 232 -52 -77 -4 -296 -146
8065 -146 -90 213 76 -43 -129 235 106 -61 21 -21 1 52 -131 -37 206 48 124 -93 -107 274 161 78 -73
8088 -73 -112 99 40 250 -31 -50 54 345 -46 -60 143 -100 -9 186 149 75 194 231 -72 58 75 270 59
8111 59 -121 -8 -179 114 -146 197 92 -125 78 -419 -127 -30 -261 -173 -7 -148 -102 -68 -180 -80 -71 227
8133 227 30 47 -149 119 -14 -73 -45 -59 7 -184 71 1 131 -132 84 24 9 189 -61 180 77 63 -51
8156 -51 85 8 4 148 82 -117 53 124 -167 -5 -60 69 74 -273 182 -7 184 -50 142 286 102 235 136
8179 136 -31 60 226 60 107 153 65 87 166 -136 63 201
8191B01
$$ Imaginary data points
##PAGE= N=2
##DATA TABLE= (X++(I..I)), XYDATA
0 0 0 0 0 0 0 0 0 0 0 0 -8 8 -8 8 -16 16 -24 32 -32 40 -48 59 -72 83 -96 113 -134 152 -176 202 -232 264
32 264 -299 339 -380 428 -483 540 -603 671 -748 829 -920 1018 -1127 1242 -1370 1513 -1665
49 -1665 1834 -2019 2225 -2451 2705 -2989 3311 -3676 4098 -4588 5169 -5865 6724 -7808 9228
64 9228 -11171 14005 -18524 26872 -47330 200254 197820 -176066 135179 87270 -14706 1034
76 1034 -1234 -315 -16928 -58804 103121 52202 -37537 13763 38458 64375 -22650 -14843 34473
89 34473 -43731 3907 44132 -29783 -8343 20649 -38247 54771 -16155 -50224 43998 -47068
101 -47068 -9851 31544 -63560 -808 44225 -53021 16377 26556 -33835 17320 -36335 -18572
113 -18572 -6408 -31806 -22429 -20844 12736 -18288 -26339 41032 796 -73583 24178 3010 -43858
126 -43858 18801 -28014 -6051 21143 -1672 15695 2792 -33035 12781 17661 -27786 11177
138 11177 -12750 1926 37912 16516 8446 945 22786 17679 3761 11655 6627 -17350 15574
151 15574 16775 592 11884 -27625 32077 38733 -24897 15383 19196 -6649 14332 10327 -6117
164 -6117 10156 -10194 9037 16643 -11948 5349 -9122 2243 3453 -15377 -2320 -1684 -9093
177 -9093 4580 804 -11898 6999 -20200 -5599 3259 -33989 -1948 -2106 -16373 -2190 -5117
190 -5117 -3568 5719 -19002 -8705 6109 -23348 -2383 -11515 -11520 988 -14425 5639 541 -8904
204 -8904 3519 3976 -3064 8872 -5687 -2064 13130 -7875 12268 1324 -2693 13320 2637
217 2637 5556 6480 -1519 2571 13395 -3922 11993 10033 4873 22312 6568 15785 7927 2409
231 2409 6452 877 -2842 1654 -1347 -2859 15576 -1257 10529 8347 3457 11398 -5447 1969
245 1969 -4583 -6035 -5862 -1713 -7594 -2235 -249 -6523 2563 -11832 1443 -10039 -10340 -861 -11691
260 -11691 -4773 -4812 -2352 -6640 -172 -10752 -3413 -8213 -15130 -1909 -17991 -5098 -7755 -5247
274 -5247 -2153 -1783 2302 1330 3908 -1738 8571 -7350 3354 -405 -5801 4757 -6122 6099
288 6099 1622 5604 4670 8195 2527 5176 6280 -1056 10640 -1462 13916 8752 9159 16317 6557
303 6557 9528 2068 2571 -4433 366 -7617 4082 4140 1376 17729 4003 13817 5980 3644 1497
318 1497 -3628 -5501 -4820 -2876 -10897 4429 -7161 275 151 -3883 2366 -7522 -636 -6268 -5705
333 -5705 -9949 -4495 -10287 -8283 -3780 -10209 1273 -9796 522 -4747 -8312 -3030 -7694 -6063
347 -6063 -6155 -912 -6679 4157 -2700 1154 1573 -6074 3032 -6274 560 -1124 843 1225 3808 3793
363 3793 1835 4590 -2294 8746 615 5184 8808 5521 9767 6380 7535 2758 5210 -1535 3749
378 3749 2869 2614 9489 4789 11444 5742 7590 4661 1623 35 -2744 102 -3709 1724 -1515 3959
394 3959 1183 1660 5313 -75 375 -5836 -637 -5621 -7492 -7807 -8441 -3660 -5150 -1909 -4423 -147
410 -147 -4569 -2883 -1579 -7775 -6954 -9436 -2286 -4362 -3551 -3329 -2366 -1165 -3225 -3354 -10315 -4659 -7864
427 -7864 -1953 2219 -3369 1713 4481 8095 940 658 1247 2354 -1033 302 6740 -294 3223 2778
443 2778 8590 5136 -1821 4794 7364 5735 267 9315 6657 4928 5947 5861 5775 -1268 6842 3959
459 3959 -17 -684 5006 1713 -2370 2221 -1226 7510 769 1092 4920 1511 -24 -1591 -123 -7663
475 -7663 -5047 -8669 -452 -3514 -8804 -1869 -5833 1389 -1810 -6912 -6980 2316 -3611 -2616 678 -12414
491 -12414 -695 -4684 -5669 -7826 -10141 -3455 -3938 -2336 1241 1215 -7211 8525 2011 -1510 2514
506 2514 -7754 5073 1965 -1414 -212 1040 -1185 7271 3583 -3753 5468 253 10486 44
520 44 -329 11450 2544 2917 8758 7267 -440 7856 1651 9757 891 -5979 11057 -764 2079
535 2079 2585 497 3700 6113 1726 4380 -197 -5081 11717 -5870 -6321 -559 -2728 723 -5425
550 -5425 -1855 -1794 -2374 -5099 4054 -6085 -6649 -785 -6476 2094 -6873 -5020 -4120 -3608 -1814 -3199
566 -3199 -9188 -6685 2826 -7326 -673 -6537 -2923 3301 -3869 1248 -1838 -1934 -1760 2590 -3416 -1061
582 -1061 -283 104 3240 -1204 6724 -1836 1853 5955 3108 2641 -22 4022 5139 5811 -1752 6261
598 6261 6045 2861 5460 1433 6108 1756 2891 3407 2474 -162 3596 4856 -114 3880 1287 5536
614 5536 -1573 793 4656 -4782 -1417 335 923 -2406 -2728 -797 4642 -2828 -4705 2723 -4787 -1579
630 -1579 -4444 -5388 -3850 -6338 -3728 -4425 -4727 -3389 632 -4757 -438 -508 -4208 -683 -5903 -2002
646 -2002 -3689 -6391 -3207 -1100 -2042 46 -354 -1747 5531 -2504 291 1952 -2676 3890 266 -463
662 -463 2667 2624 1592 3554 864 3065 4837 -273 5460 2499 3173 3627 2015 5210 2744 2579 2936
679 2936 4743 2223 4929 1605 1328 5186 -1201 2478 266 -193 1519 1322 236 1154 1185 -616 2229
696 2229 -3601 659 -1672 -4499 -1159 -3973 -1005 -4863 -3212 -2192 -2060 -3949 -1686 -925 -5107 -348
712 -348 -4838 -2171 -4336 -3387 -2646 -4151 -1167 -2547 -701 -3974 198 -2710 -2693 -2548 -3827 1092 -2472
729 -2472 1880 849 2316 1516 1655 1771 -206 1776 -1996 2658 -746 3440 2964 1828 5927 2353
745 2353 5685 2031 3576 1428 3433 1694 1888 3781 199 5859 620 4549 2408 2404 2655 830
761 830 2769 -916 2116 -1986 2028 -875 1076 1235 -1981 1752 -2530 141 -3002 -1281 -2881 -2403
777 -2403 -1569 -3183 -207 -4419 101 -4252 -1488 -3080 -4155 -1465 -5140 -1418 -3928 -1402 -4052
792 -4052 -1188 -2978 -2832 -615 -4443 696 -3364 794 -913 -565 339 -1434 349 -1338 1541 -1858
808 -1858 2831 -124 1660 3057 456 4467 654 3551 1096 2428 883 2110 2123 1050 4376 757
824 757 5595 1868 4160 3880 1946 3500 870 2376 362 2050 -169 2904 903 578 3368 -403
840 -403 2442 -1167 206 -953 -1461 -1154 -1456 -378 -2139 825 -2207 562 -2090 -2565 -1276 -4585
856 -4585 -2572 -4217 -2616 -3972 -1871 -2586 -1517 -1128 -2915 -399 -3568 -1598 -3302 -2100 -2092 -3221
872 -3221 -915 -1152 911 -1776 353 -30 41 -534 -1083 591 -1682 1719 393 2132 1735 1253 3351
889 3351 1774 2568 922 1514 1004 2887 1940 2021 3092 1948 5307 2246 2398 2423 1007 2073 1325 1150
907 1150 -76 2637 1416 3075 619 1422 3413 -1336 1386 -501 -1083 -1598 -1042 -415 1 -1644 -1901
924 -1901 2609 -2471 -916 -2082 -2815 -677 -4243 -2036 -2661 -2858 -1753 133 -3489 -2458 -1411 -3265
940 -3265 258 -5301 -1992 -1437 -2374 -1451 -1267 -1188 -1317 479 -1399 2203 -3147 -1739 1807 -331 1271
957 1271 -2617 698 2358 2306 610 2181 1533 2047 4732 -461 3343 -556 2088 4033 1016 1922
973 1922 807 3422 2400 3816 91 2352 1047 2355 3740 -1146 2066 -547 3014 2301 -116
988 -116 -985 562 2968 -940 -113 -2657 1975 -1411 -1049 -323 -2757 -185 -3183 687 -1469 -3095
1004 -3095 -3310 88 -937 -3534 -1671 -4170 246 -3415 -1663 -2640 -4442 264 -1155 -1119 -3463 -927
1020 -927 -685 726 -3965 -1769 1089 -3253 1649 -1713 659 712 -287 2285 2452 57 -275 2722 -858
1037 -858 3290 -1544 -514 3434 801 4150 629 1850 4381 4269 310 2802 521 507 3815 -2320
1053 -2320 3189 928 1045 4523 1846 1378 1825 1062 236 1866 -2807 1029 -1451 -1154 3621 -2367
1069 -2367 -722 288 716 -544 -2467 -4034 -199 -1370 -4596 323 -3497 -538 -298 -1740 87
1084 87 -2883 -1860 -721 -2236 -4143 -1715 -4306 -1908 -516 -2814 720 -2148 716 1993 -1428
1099 -1428 -1685 -575 -156 -676 -639 -1976 2047 380 1449 1819 -241 2112 641 970 993 1035 709 2341
1117 2341 2264 2365 3708 628 3299 2802 2371 988 -29 1698 852 654 3 1149 1219 2841 1746
1134 1746 1706 2523 634 1894 -623 -1059 -639 -1379 -758 -1247 156 -288 -320 -916 397 -1005 -2082 -1188
1152 -1188 -2208 -433 -3181 -1438 -965 -1145 -1071 -1910 -1155 -2184 -1307 -2619 -1672 -2706 -1943 -541 -2213
1169 -2213 -66 -1030 163 -707 131 309 -586 -1005 -1578 897 -1753 175 -69 939 1824 828 2380
1186 2380 896 1983 1098 1804 927 1683 1497 561 2554 823 3122 936 1390 2104 1561 1568 699 2416
1204 2416 633 2116 501 1757 1345 463 1741 -425 1404 -811 760 -653 -98 -12 -459 269 -1429
1221 -1429 832 -1669 -497 -1840 -1257 -1102 -2537 -1091 -2722 -470 -2273 -828 -1580 -927 -849 -2234
1237 -2234 -626 -2951 -539 -2520 -1069 -1748 -1316 -156 -1829 266 -1258 429 -1177 109 -412 -345
1253 -345 627 -587 1727 -131 1610 956 1075 1034 563 1587 -308 1850 -99 2025 1266 2003 2306
1270 2306 1546 2798 906 2739 975 2031 1100 1389 1456 477 1553 -503 1316 -321 614 409 568
1287 568 1514 87 1572 143 1243 -773 248 -1000 -1974 -1196 -2563 -1174 -2353 -611 -1164 -358
1303 -358 -567 -1006 134 -1408 -237 -2467 -1495 -2363 -1872 -1438 -1887 -1074 -1766 144 -1589 -16 -1494
1320 -1494 -1680 -978 -1823 -303 -954 514 689 1419 1172 1477 598 -710 658 -1602 -666 -872 -146 1179
1338 1179 1532 2734 2604 3015 2084 3135 1104 1012 784 -187 1324 -648 990 1725 1343 1799 2324 1207
1356 1207 1182 1408 -467 1040 -819 -379 878 -436 1178 536 469 845 220 -1628 -1461 -2414 -2299 -801
1374 -801 -2546 -243 21 -111 1629 -371 -1289 -1662 -1757 -2499 -1975 -3742 -1166 -987 -1620 1020 -1265 -664
1392 -664 -429 -519 -173 -1605 -2045 -91 341 -1327 730 -892 1137 1498 -302 1415 -627 11 612
1409 612 543 -283 663 851 2168 2891 618 2926 644 1873 1621 -415 53 -410 1333 1932 1863 342
1427 342 2524 2105 1870 938 -1142 1405 -144 868 -18 -317 714 513 402 -87 -341 -1760 1066
1444 1066 -964 208 -580 -2176 1275 -644 -920 -2059 -2474 -1630 -659 -2398 -1732 -1018 -2056 1979 -1385
1461 -1385 -724 -609 -1374 668 -1539 -2506 -1475 -1178 -2364 629 -1625 -505 708 -600 3368 -778
1477 -778 -889 913 447 161 91 -1714 1098 2413 -511 3026 -244 554 2593 -617 1311 258 496
1494 496 2661 2382 504 3643 656 1247 3709 -1152 1399 -681 -516 1930 -211 -1090 1153 410
1510 410 820 2233 -2238 1517 765 -554 1437 -2474 -160 224 -1542 -794 -211 -2483 -296 -1115 -2267
1527 -2267 407 -3743 -398 154 -1895 69 -613 -514 790 -1140 -2347 -673 -3656 -710 -1082 -3668
1543 -3668 -130 -1161 860 803 -407 1063 1476 -915 283 475 -1787 1088 -747 925 1021 -547
1559 -547 1594 1424 754 1033 343 -17 1962 627 1307 1714 549 3703 1319 921 1807 829 570 228
1577 228 -651 -164 321 -562 1836 696 1125 2051 489 1801 430 -803 -381 -1087 -1017 -440 -1841 -1249
1595 -1249 459 -710 141 -1257 -988 343 -1686 -1355 -1221 -1426 -979 -1013 -1461 -370 -1233 -1340 -189 -2108
1613 -2108 -666 -1650 -1542 -387 -716 -112 -293 -337 -28 611 -1401 -503 1 -587 277 -634 906 807 622
1632 622 1026 733 439 426 802 147 1300 336 1086 1460 723 2144 1097 1386 753 1374 908 841 382 962
1652 962 1297 -220 1818 710 1003 778 94 502 -630 4 -837 -290 -754 293 145 166 803 -418
1670 -418 397 -1273 -777 -1237 -1531 -1302 -1120 -538 -1101 -194 -1217 -143 -1445 -1533 -1090 -1507 -542 -1015 -215
1689 -215 -800 511 -588 -550 -986 -1489 -474 -1999 -375 -1314 -199 296 367 1735 1037 1702 495 1625
1707 1625 189 239 -496 -800 -9 -234 1511 597 1835 1388 1908 1668 1040 1491 148 900 -116 1347
1725 1347 676 904 1424 1202 1548 17 570 -813 -211 -739 -198 616 371 1347 202 1391 262 217
1743 217 -443 -1106 -731 -1709 -875 -1736 -728 -1353 -803 -719 -866 -19 -738 99 -1157 -530 -1010 -915 -1193 -810
1763 -810 -671 -1511 -126 -1458 -254 -1105 -957 -80 -494 -45 -451 562 491 705 400 534 -21 -410 498
1782 498 -716 370 270 722 967 1142 991 1161 1340 319 1282 160 831 1322 627 1633 899 969 634
1801 634 798 -297 525 -128 -56 999 -430 838 367 386 984 192 171 134 -250 -337 -100 -1331 -415 -1007
1821 -1007 -1069 -178 -1329 16 -151 -614 -271 -730 -1265 -488 -1042 -1382 -124 -1489 -410 -432 -1363 -428 -1127
1840 -1127 -761 -289 -466 -746 103 -472 -16 281 -517 790 -777 -129 64 -737 170 439 493 875 1386
1859 1386 257 1709 522 690 1449 9 724 43 327 463 475 745 1371 1181 930 1575 224 1318
1877 1318 232 198 705 -510 508 182 321 72 396 204 714 35 -638 152 -716 190 -794 -506 -178
1896 -178 -957 196 -631 -640 -987 -565 -1690 -829 -1440 -1341 -360 -1441 -41 -654 -462 -65 -592 -372 -659 -748
1916 -748 -1323 -50 -1452 -59 -1002 -576 742 -747 583 -192 383 260 515 102 961 89 534 1623
1934 1623 -169 964 161 171 1086 -221 291 684 436 569 1959 584 1468 1206 1053 1949 -467 953
1952 953 314 -34 -44 230 52 354 407 -32 1424 -626 663 263 -709 631 -486 -309 -233 -264 -634 370
1972 370 -1604 -487 -442 -1711 -156 -1275 -665 -366 -806 -313 -142 -714 -455 -115 -1333 476 -1483 -684
1990 -684 -370 -1453 -68 -1124 -792 -168 245 -550 564 78 485 580 -475 1224 -111 9 292 -130
2008 -130 173 145 289 221 990 196 1430 420 942 1838 338 1148 225 598 400 -33 126 976 503 467
2028 467 1329 260 1033 -72 26 195 -525 -357 -300 148 244 572 -364 137 -214 -314 -121 -1039 -406 -788
2048 -788 -543 -543 -788 -382 -352 -868 -513 149 -1032 -538 -616 -877 -358 -1283 -657 -512 -544 -129 -129 -391 444 -34
2070 -34 -524 249 -417 342 -290 -396 858 275 448 379 564 502 685 112 653 881 259 1085 840 773 827
2091 827 472 656 208 641 645 971 415 1016 971 514 791 273 786 259 111 746 411 385 -66 208 -379
2112 -379 -36 -661 -39 -267 -395 306 -552 -27 -326 22 -831 -482 -674 -619 -1064 -1064 -378 -916 -460 -569 -520
2133 -520 -112 -452 -122 -420 -114 -727 -727 -923 -597 -391 -600 73 -318 294 -39 160 -86 193 -116 -281 435
2154 435 170 775 170 545 755 384 429 -35 314 60 560 104 501 559 698 1211 814 1080 517 960 275
2175 275 528 76 -91 439 -19 523 -81 310 60 327 142 -207 445 -379 162 -783 -162 -429 -161 -108
2195 -108 -558 30 -637 57 -1087 -481 -865 -656 -567 -868 -202 -708 -47 -537 -215 -481 -536 -407 -865 -210
2215 -210 -925 -40 -804 17 25 -103 322 -174 285 -83 587 -171 369 466 311 719 220 649 291 586 222
2236 222 533 575 344 977 217 996 566 779 579 534 538 552 613 190 582 -25 541 265 290 387 -29 746 187
2259 187 -3 -106 63 -436 -612 -523 -596 -1 -733 -145 -581 -422 -223 -414 -358 -713 -537 -857 -817 -600 -454
2280 -454 -662 -836 -271 -728 -367 -599 -955 -535 -613 -330 -335 -243 -656 157 -377 -156 -6 -72 271 158 187 70
2302 70 314 100 530 197 335 532 62 507 371 696 668 410 473 693 466 519 522 164 525 405 259 837
2324 837 534 958 296 661 657 309 27 -56 -260 -228 30 -219 -79 -139 117 290 -59 78 -371 -286 -182 -736
2346 -736 -753 -728 -269 -171 -102 -475 -153 -239 -390 -136 -818 -490 -965 -451 -235 -96 -621 -64 261 -314 35 -463
2368 -463 -201 -51 -186 -232 -528 -45 -209 245 262 327 515 766 635 68 434 -332 375 263 212 253 563 814
2390 814 698 891 109 695 219 527 352 -142 425 174 798 210 393 426 427 346 101 301 -456 471 -283
2411 -283 196 -149 -206 126 -56 80 -150 31 -564 -329 -823 -641 -349 -785 81 -439 -237 -471 3 -248
2431 -248 -536 -579 -987 -357 -670 124 -536 -70 -159 -25 281 -363 83 -589 167 -193 35 -149 -76 453 327
2452 327 213 -148 757 540 455 424 335 486 638 629 339 279 227 779 498 302 290 368 696 252 581 232 187
2475 187 344 293 473 -189 231 -61 423 53 -232 138 96 201 -276 -308 -630 -33 -302 -256 -435 -647 36
2496 36 -439 -89 -617 -613 -191 -506 -403 -415 -684 -827 -156 -593 -419 -373 -590 15 -573 -100 -662 -157 -84 -63
2518 -63 -167 -262 279 -23 262 7 78 359 135 268 236 288 149 395 279 400 66 91 634 165 496 169
2540 169 397 457 456 394 423 490 401 453 107 490 224 55 257 -8 418 25 -9 203 131 61 -204 70 -263 -174
2564 -174 -378 -145 -505 -380 -78 -394 -371 -411 -155 -777 -526 -197 -437 -294 -814 -535 -511 -167 -566 -93 -74
2585 -74 -629 -211 -186 -212 -292 -335 -259 -148 215 -33 192 -176 482 169 239 12 14 301 -400 203 32 229 82
2608 82 407 519 211 552 233 457 345 91 22 91 290 277 565 434 647 260 471 247 -15 151 -139
2629 -139 -34 -176 251 194 348 303 268 40 -412 1 -722 -283 -524 -649 -292 -357 22 -226 -82 -251 248
2650 248 -418 -362 -444 -687 -495 -769 -298 -490 -197 -274 -198 -218 -173 -139 -505 69 -430 -108 -222 -61 -63 -90 464
2673 464 -119 339 -105 73 -119 135 380 3 361 8 503 277 580 415 620 708 104 567 120 438
2693 438 183 275 346 413 467 121 454 -23 326 88 409 -56 -197 233 151 179 -282 14 -333 6 70 -330
2715 -330 -195 -229 131 -471 -180 -311 -349 -370 -498 -241 -602 -83 -402 -222 -197 -153 -175 -220 -209 -433 -298 -802 -502
2738 -502 -407 -452 -136 -381 112 -35 89 93 89 264 -105 269 -127 330 136 369 99 196 636 273 163 237 296
2761 296 -27 566 558 425 506 611 902 293 352 245 332 282 261 9 -14 355 -21 106 277 47 24 71 247
2784 247 147 -103 -147 124 -264 24 -41 -272 -124 -424 -473 -256 -524 -425 -459 -393 -165 -119 -229 80 -271 -192 -154
2807 -154 -469 -107 -316 -407 -201 -285 -517 -314 -130 -632 176 4 307 313 -102 127 128 342 57 271 143 345
2829 345 -32 108 64 -161 498 -168 75 314 218 598 434 430 351 537 341 774 -282 167 158 -100 317 -264
2851 -264 143 -8 319 239 125 -54 -44 230 -513 -10 -499 -457 -127 -143 -111 -506 -152 -197 -122 -533 -254 -452
2873 -452 -30 -382 -577 -67 -551 13 55 -510 -251 -388 -500 -52 -211 -440 -94 -200 90 -9 -234 28 -387
2894 -387 220 -207 -106 99 129 -124 201 433 21 646 34 677 223 44 249 84 191 350 206 206 306
2915 306 384 20 284 -76 730 -60 199 501 279 376 285 24 -129 188 -307 277 -364 -85 13 -293 53
2936 53 134 92 155 149 -258 35 -252 -481 172 -1012 -53 -528 -340 123 -383 -328 -592 -579 -466 -64 -671 -69
2958 -69 -295 -168 159 -323 147 -197 -656 -269 -240 -580 -297 -196 -173 209 19 678 556 302 332 71 79 -68
2980 -68 39 -336 468 216 423 741 261 665 290 387 257 5 331 289 -248 365 338 431 483 146 239 238 -422
3003 -422 -125 -264 110 -125 44 -37 314 66 -17 201 -138 20 -286 -308 -452 -355 -72 -463 -317 -203 -70
3024 -70 -347 -257 -376 -320 -409 -324 -274 -74 -130 -48 -146 -160 -206 -272 -302 -104 -379 -86 -48 65 306 175 263 34 588
3049 588 250 133 161 113 -150 95 128 313 472 430 230 258 64 290 107 197 283 398 160 140 440 258 573
3072 573 23 155 -29 209 319 26 221 -95 352 161 31 165 -100 132 -360 -111 -697 -304 -178 68
3092 68 -84 -86 -229 -264 -123 -355 -142 -659 -641 -27 -444 -205 -249 337 -364 -40 -254 -237 -338 -210 -181 -523 189
3115 189 -145 55 3 89 90 153 171 77 11 -125 190 13 -33 307 320 658 331 422 100 312 162 -55 131 -20
3139 -20 186 46 335 398 280 291 234 515 23 200 185 148 65 211 28 -235 392 109 122 -190 12 67 73 -48
3163 -48 145 -60 -288 184 -411 41 -214 -207 -314 -343 -342 -457 -308 -456 29 -192 77 58 -150 -200 -284 16 -390
3186 -390 -196 -444 -218 -207 -249 86 -38 117 -24 255 -89 52 209 121 231 127 175 187 454 255 -23 85
3208 85 5 129 -119 117 204 104 536 216 819 367 609 117 257 82 192 -78 -227 138 -47 68 113
3229 113 127 249 197 -93 -252 -50 -329 -54 -317 0 -77 -300 25 -153 -144 -406 -111 -253 -317 -564 -163 -331
3251 -331 -485 -163 -361 -109 -18 -147 -207 -323 -397 -25 -193 -239 72 71 -90 267 -304 158 235 -6 294 -28
3273 -28 -51 421 250 40 278 -162 90 218 87 224 -75 275 478 254 281 276 304 349 70 158 334 -103 -108
3296 -108 423 -261 114 178 251 247 88 -90 -40 -449 -232 78 -314 162 -59 -50 159 -178 -171 -134 -133 -307 -118 -358
3320 -358 253 -336 -48 366 -174 158 -287 -168 -119 -336 -682 -479 -135 -3 10 -93 -79 79 -301 309 -185
3341 -185 50 -122 160 33 108 77 135 101 35 488 6 304 365 145 212 20 116 292 224 258 467 7 181
3364 181 187 167 192 8 265 -275 45 436 366 218 437 356 -2 6 -191 119 -253 -458 123 16 -122 39 -74
3387 -74 160 78 -257 -139 -108 -391 -199 -621 -60 -537 -425 -301 -453 -335 -135 -58 -345 95 -143 157 -176
3408 -176 -370 -56 -264 -24 -176 96 -77 130 105 22 185 -35 160 42 14 234 109 271 554 180 249
3429 249 548 1 328 138 193 457 -113 340 50 141 290 226 338 508 163 107 439 -110 392 -62 116
3450 116 99 29 203 83 -309 52 142 -210 128 -147 15 92 -93 -86 -361 -150 40 -41 -239 -373 -552 -385
3472 -385 -170 -131 89 -164 -86 -19 -201 -7 52 -152 -220 -319 -78 -206 -363 -144 16 -526 76 33 -53 161 -47
3495 -47 136 172 -96 61 282 127 174 29 25 386 392 42 264 -13 198 219 198 189 335 154 405 336 214 219 101
3520 101 112 -71 221 76 162 177 43 59 -17 214 79 17 -274 -85 221 -313 -347 41 -227 -96 -108 -29 -162
3543 -162 -119 -166 35 -318 -152 -390 -192 -149 -289 -116 -259 -100 -262 -105 -271 -68 118 -84 -99 -87 119 18
3565 18 -154 156 18 -256 -129 24 -294 176 -58 232 -48 291 272 116 154 144 506 -44 336 188 157 225
3587 225 -75 81 162 207 201 212 264 278 219 -86 211 332 442 51 -23 -161 -251 -15 -180 -83 -99 95 -227 35
3611 35 -66 -118 93 -194 53 -270 -95 -331 -266 -92 -208 -412 -206 -275 -174 -294 -130 -143 28 -136 -85 92
3633 92 12 -216 115 -29 -159 86 -119 -224 -175 -12 -20 -51 122 195 117 178 371 379 -18 148 38 146 30 -57
3657 -57 51 527 215 293 51 411 240 24 58 77 40 -98 154 143 313 316 -49 174 -14 22 -102 -225 -266
3680 -266 94 -238 5 38 41 179 -17 -73 -77 -281 -365 -256 -507 -86 -239 -215 -39 69 -75 -131 -338 -144 -444
3703 -444 -202 -108 -203 -232 -48 -92 -57 167 -202 129 -11 -118 -35 -186 142 199 187 175 27 215 87 322 1
3726 1 223 87 135 179 0 243 60 90 339 -47 278 96 51 151 -66 124 233 123 193 136 70 256 203
3749 203 176 -111 232 -59 120 -16 93 42 -226 73 -305 -127 -120 -17 -208 -298 -78 -38 12 -396 -67 -221
3771 -221 -178 49 -109 -234 -367 -181 -249 -248 -25 -76 -199 -221 38 -35 -112 -2 51 192 152 108 -151 70 -1 303
3795 303 -84 147 -118 110 253 85 122 175 217 290 389 77 309 340 -157 327 -74 197 51 120 437 193
3817 193 337 181 213 17 206 110 236 136 -105 216 -110 -160 -16 23 4 -194 -158 -177 -369 -146 -38 -462
3839 -462 -126 273 25 -208 -22 -116 -324 -202 -341 -307 -345 -9 90 -427 154 -249 8 148 -224 0 30 122
3861 122 -218 167 -354 174 -13 5 186 -158 164 7 116 -204 67 232 130 210 29 143 -74 343 452
3882 452 234 45 -43 111 72 -5 105 84 54 36 119 188 204 249 8 20 85 26 99 48 3 73 69 -54 -135 88 -35
3909 -35 8 -10 -188 -177 -122 -18 -185 8 -244 -96 -81 -294 -55 -177 -190 -367 51 -204 -220 -96 -30 -105 -43 -29
3933 -29 -75 -58 48 271 87 -99 -31 -46 202 170 344 66 87 113 97 77 -115 91 -59 33 103 288 303 245 -94
3958 -94 47 -8 132 111 140 224 -137 44 -60 112 133 199 214 101 386 150 134 71 85 -127 -20 -249 47 -158
3982 -158 -100 -102 -82 135 79 -187 -75 7 -314 -193 -296 -268 -120 -201 70 0 -59 -259 48 -158 -76 -263 -345 -329
4006 -329 -157 -98 32 -68 -219 -139 3 73 -164 -135 -259 -138 -75 44 -116 -8 13 131 237 55 6 -17 104
4029 104 3 99 -29 63 115 131 193 309 192 41 -196 67 -53 -74 203 198 48 53 197 27 34 0 -58 -138 93
4054 93 -121 -278 -392 51 -234 191 -229 42 77 -281 190 -257 -150 -114 -120 -61 -53 161 97 -9 -235 -33 -255
4077 -255 188 -19 -178 -27 -277 19 -129 56 -157 57 57 -375 -318 3 -31 -64 -5 134 -147 -82 134 281
4099 281 -26 126 -107 -29 136 114 172 -88 230 171 169 -63 236 -20 -245 165 131 73 21 104 178 19 162 117
4123 117 291 113 -72 -78 100 96 162 106 -321 -38 150 -332 -151 -45 -14 -59 -133 -375 -228 -214 -81 -142 -17 -214
4147 -214 -216 -131 -85 -74 -2 4 36 -204 -137 36 -85 -224 -79 -36 75 -169 -68 -9 -237 134 66 148 89 -129 7
4172 7 158 -23 46 322 203 134 56 243 -37 -15 110 296 84 -148 26 336 -18 184 42 275 32 84
4194 84 119 215 183 131 239 -174 229 43 146 -69 -92 95 -77 -174 -88 -64 -58 -21 67 -124 -32 -270 -122 5 -164
4219 -164 -305 -300 -125 -20 -70 -107 -39 -102 -180 -140 -132 51 137 9 -101 158 -254 22 -98 16 -108 -143 -147 -55 134
4244 134 -32 79 -15 127 -38 17 32 105 214 157 322 106 187 213 114 59 -18 83 95 4 122 82 -123 74
4268 74 117 221 154 205 100 -116 -224 -157 -112 31 -280 63 112 -28 84 -42 -62 -30 136 -200 -77 -89 52
4291 52 100 -102 -82 3 -88 -202 -129 -35 -117 -12 -343 -37 68 -223 -172 34 -135 -45 -21 -106 40 -238 47 -113
4315 -113 106 -121 -33 174 15 368 113 84 -314 22 -11 122 267 358 208 -78 172 83 -67 242 108 141
4337 141 92 -51 181 217 149 -9 183 191 -6 9 179 -124 127 -107 139 159 -51 67 -234 -55 -97 -20 -152
4360 -152 45 -49 -348 0 36 -117 -258 -201 84 -292 -322 -221 18 -67 34 -135 -103 57 -303 -161 -147 -89 -59
4383 -59 156 -204 44 -105 68 -5 -269 125 -85 92 -114 -32 182 -298 -2 98 398 276 50 230 -3
4404 -3 301 -152 206 43 278 6 114 98 88 26 114 300 230 301 95 -32 20 -25 -39 64 36 -189 -55 -170
4428 -170 -6 23 -1 57 -392 57 38 -54 106 -162 -122 -294 -134 -16 -217 -47 -219 -258 -239 -65 -385 -16 -72
4451 -72 151 -223 178 -10 -508 -167 -264 99 -88 -64 -9 259 154 12 -49 -21 89 0 -64 98 -132 81 486
4474 486 32 -124 91 342 -146 3 186 11 -92 52 152 127 -224 192 239 9 91 210 -119 38 87
4495 87 95 0 166 -114 193 197 -119 339 -17 -171 -46 -19 -1 -157 110 -67 -189 -95 170 -40 26 -63 -288 48
4519 48 -296 -59 -24 -70 -128 207 -104 -122 102 -221 -415 -270 -122 94 -31 88 79 147 13 13 50 226 -77 100
4543 100 51 -5 124 -273 211 7 336 65 97 -64 130 152 -140 117 -2 315 -79 340 116 291 8
4564 8 296 232 167 198 -206 -5 -85 114 186 4 -121 -86 -15 -18 52 -100 -55 66 -70 -69 7 56 -383 -137 -193 -295
4590 -295 -195 -106 -107 -72 -57 -67 45 -79 -112 -130 -126 -75 -192 -210 190 -5 161 -174 -48 49 108 0 210 -27 -237
4615 -237 3 -311 -196 152 212 -35 -28 208 181 124 -44 -257 213 65 245 291 267 270 395 134 281 73 45
4638 45 187 158 271 85 170 196 341 101 209 -170 61 -211 -375 -60 -228 -146 -70 90 11 -57 55 -25 -201
4661 -201 -176 -106 18 -202 -7 -40 -176 74 -97 4 -4 -109 -327 -186 -89 -119 -29 74 -269 -45 -70 92 100 145
4685 145 -115 -85 -46 -95 -94 -51 31 -27 -55 44 13 186 294 -24 263 -39 31 -51 -25 239 -96 -6 2 49 -33 56 -28
4712 -28 -187 198 81 102 200 129 80 -1 -88 117 -363 199 268 -166 114 -131 103 99 -165 -122 -65 -448 -218 -48
4736 -48 -190 54 -289 -14 -52 -284 91 -128 -309 -158 65 -124 -179 -251 -49 69 -201 50 -13 4 -242 -143
4758 -143 270 68 18 -53 47 84 171 38 -98 109 -78 3 -107 -72 204 62 -93 233 -198 57 128 112 318
4781 318 66 7 147 151 296 -28 206 412 319 73 158 94 -156 108 -133 169 -180 -54 0 -79 0 -193 13
4804 13 -283 -94 -457 107 152 -325 211 -82 -115 26 133 -109 30 -247 -81 -69 -161 -321 80 -259 66 -149
4826 -149 -33 -125 54 231 -99 -136 197 -77 61 115 57 -92 -5 -139 -69 128 104 -23 -197 184 74 16 34
4849 34 42 142 130 120 8 258 198 17 83 -132 200 85 182 321 -58 103 158 -49 10 -52 -52 144 -27 12 187
4874 187 -2 130 81 105 108 -225 -73 -25 -87 -201 -53 -1 39 -4 -42 -68 -97 1 -84 -65 -101 -100 4 -319 63 101
4900 101 45 87 162 -9 -51 105 -45 56 -117 -72 7 -102 -371 41 -265 -17 -32 -175 -83 139 167 358 8
4923 8 106 22 98 -21 144 171 89 84 -108 279 -159 33 213 76 159 128 75 104 131 346 311 -168 304 188 -287
4948 -287 -2 -120 12 -130 10 -137 -23 -50 15 110 190 -91 -301 24 -61 -179 36 -245 -25 46 -261 -153
4970 -153 182 -424 -19 95 -226 -64 -208 -174 -90 -60 219 83 -158 -225 -49 -181 -140 -186 41 -161 34 150
4992 150 1 -18 207 -76 -169 185 0 255 151 -98 131 100 200 174 337 266 -70 94 -2 15 -80 208 71
5015 71 -6 175 76 175 -55 251 92 -68 -20 -55 157 -51 154 46 23 103 -100 -143 -268 -178 -194 32 -205 46
5039 46 -255 -106 -3 12 -298 222 38 -158 -32 31 -196 -27 -270 5 -113 -136 66 -378 -6 52 175 251
5061 251 -40 130 228 36 -22 -120 -92 8 -270 -150 -21 -56 235 162 132 -125 149 128 224 82 89 154 2 28
5085 28 32 -137 145 18 93 181 126 -34 12 241 14 55 189 -83 9 11 1 143 100 -64 -71 -87 -243 38 24 -154
5111 -154 -92 24 221 2 279 -190 -182 -92 -181 -182 -106 -76 -138 75 -8 -81 116 -98 99 100 -45 176 3 15 288
5136 288 -142 -430 -16 -155 -164 323 16 -100 -82 329 68 -25 -41 144 -1 -64 200 112 57 -25 -45 154 54
5159 54 201 156 156 193 35 154 -37 77 189 -19 -62 133 177 25 -38 245 54 -163 -157 -123 55 -61 49 -163
5183 -163 -96 31 82 100 2 -182 -141 -179 -232 -66 -264 11 -133 106 123 -208 -254 151 -56 -197 -78 -92 -33 56
5207 56 -98 113 -65 81 -79 -235 157 -135 -171 23 -33 149 -20 55 -49 104 43 157 288 -123 284 171
5229 171 153 80 67 -93 128 175 160 36 143 167 -106 103 -5 -31 217 395 112 270 199 279 309 -12 -88 7
5253 7 115 71 -25 -121 61 -96 -7 31 167 -192 55 143 -153 -207 -112 -113 -404 -81 7 -119 -258 -82 148 -146
5277 -146 -174 -252 -186 -304 -94 -77 -9 -133 221 54 -15 39 -420 -80 -171 104 -52 17 -64 -162 29 -39 259 30
5301 30 -62 182 168 161 -90 107 227 166 118 91 247 -188 72 -161 62 239 90 -24 38 92 -86 28 39 105
5325 105 -163 -56 9 -166 70 177 -280 -125 -280 -216 -214 -140 -181 159 -65 74 -164 -99 -17 -188 320 -94 -105
5348 -105 -340 6 -326 117 -66 -203 -284 95 -19 -91 92 -128 143 208 -118 157 104 93 185 140 113 -192 -71
5371 -71 172 -43 221 -82 151 -34 -121 85 -164 148 116 79 109 290 43 65 275 92 -77 -34 95 19 -51
5394 -51 -62 -31 140 -124 -51 -79 171 -91 -146 -93 -68 -113 120 -304 -303 -97 73 136 -136 -187 -139 -68 135 -24 311
5419 311 -73 -53 -343 -67 -26 -24 -49 -16 47 -152 16 -99 -69 -140 -45 -148 191 -44 14 210 -174 -93 -34 -96 1
5444 1 2 7 87 0 289 6 269 209 294 -106 175 83 102 89 139 170 88 249 159 196 111 -9 96 246 -294 -182
5470 -182 29 19 -9 -6 -132 156 -84 12 -46 86 -191 38 -59 123 -22 -90 -64 -326 30 -111 -65 -98 60 -198
5494 -198 -23 139 -138 -68 -195 141 -274 216 -87 59 -10 -198 -123 -91 162 -211 147 42 13 34 -146 12
5516 12 -87 -52 76 118 96 -259 135 -39 -109 12 102 21 99 37 -56 57 -20 -2 276 34 -89 171 276 -31
5540 -31 -111 108 -66 -12 -137 122 -142 -44 35 97 -235 20 225 -74 -16 -131 -137 64 22 -20 12 -57 -18 18 -135
5565 -135 -28 -23 13 -264 41 -44 -17 -66 41 32 -159 113 44 121 -76 -249 23 24 -33 20 -101 -91 24 -245 128
5590 128 -188 -290 230 106 165 -88 -74 -107 160 -61 -324 117 0 132 289 123 109 126 138 97 -59 230
5612 230 79 -68 67 92 32 101 55 160 134 -34 130 31 -127 -196 2 79 -101 -193 -38 131 -270 62 -104
5635 -104 -115 -66 11 -164 -141 -29 -370 78 -51 -3 -104 105 -122 59 -104 88 56 -158 -30 -215 151 263
5657 263 38 153 74 -283 -52 -8 56 21 57 -149 -65 218 -33 57 5 130 277 124 -144 111 74 209 -221
5680 -221 214 114 83 245 -104 111 -67 170 264 -77 -135 -221 25 -186 -49 -24 22 -39 125 67 26 -80 116
5703 116 -153 -13 70 51 -6 142 56 85 -226 -202 -48 -86 36 -103 80 -222 -38 -251 -60 -37 -198 77 -127
5726 -127 -279 -329 4 -239 50 206 24 -223 -7 -53 71 165 -90 -53 7 -6 -134 -30 -24 -86 -27 -111 163 -102
5750 -102 -44 112 128 169 -2 263 -51 -24 140 -45 49 -149 78 -67 21 208 234 164 -27 298 -23 289 241
5773 241 3 -183 -60 56 18 180 -264 136 -160 -221 162 101 -2 -132 -65 -260 -111 -55 48 178 50 52
5795 52 73 -130 -58 71 4 -340 -287 -99 -316 41 -75 -43 -82 13 -131 -221 6 -126 -112 124 60 10 -266 27
5819 27 85 131 -184 86 67 132 136 -56 -82 -27 -76 -7 205 214 108 6 -72 31 81 -25 147 -144 21 -12 3 47
5845 47 -9 95 -173 1 45 60 -51 -72 -108 232 -257 -104 -162 -10 94 72 -176 117 -140 -201 -10 -383 7
5868 7 -178 7 21 -208 -283 18 -153 -33 -143 -11 121 -61 -35 -127 -111 -335 -139 73 -117 36 64 -41 -104
5891 -104 -141 109 -84 156 135 75 27 127 90 178 134 188 174 -218 270 -159 -117 54 -91 99 30 -37 287 62
5915 62 113 26 209 -24 -66 44 186 -116 -121 114 -88 -46 -6 -194 -5 -1 10 -40 -31 -289 131 -17 -7 -41 -21 63
5941 63 -344 -73 -258 33 -48 -217 60 73 -175 -210 108 -105 -138 20 -21 87 -133 -172 -180 -19 23 -151 74
5964 74 15 -2 17 101 72 -7 -85 63 11 121 -84 76 33 -134 -52 50 195 100 136 -33 25 -287 172 73 12
5989 12 0 -100 -124 -188 -246 0 49 184 -45 232 53 237 -156 213 -33 -34 -149 57 -39 23 -44 -214 66 -325
6013 -325 -122 72 -10 259 -483 -61 -59 61 -139 -174 10 -131 -59 -37 93 -52 19 216 91 -128 -36 -348 99
6036 99 166 -92 -17 -30 112 223 135 -44 109 -64 72 48 -192 -141 -30 64 471 201 141 259 91 64 -171
6059 -171 262 317 256 -25 -34 27 -23 352 306 156 -8 -9 86 -79 8 25 -73 -72 -147 -322 -246 -33 -247 -61 0 214
6085 214 -114 219 -29 84 -153 42 -120 -8 -353 -265 -184 -77 189 -2 -30 -198 139 40 171 50 -1 -49
6107 -49 -59 -158 -36 -55 -60 -73 -84 68 93 39 101 14 122 26 274 2 180 -124 93 235 -77 -369 -4 222
6131 222 140 -20 44 68 23 49 68 137 -100 92 77 -205 45 -131 55 -24 -244 109 -239 -134 -61 -192 -46
6154 -46 109 30 -194 -100 7 -237 -35 -57 -131 81 -334 -71 -155 -211 -130 -11 7 123 -160 -48 -130 18 7 229
6178 229 -59 3 -98 238 -209 133 60 -13 -97 -97 -226 -65 -66 23 -171 88 71 97 -32 -231 -21 -120 -45 -132 145
6203 145 -72 110 14 326 -271 -93 235 -42 19 11 -26 -92 396 200 174 -100 144 256 -84 12 -124 60 36
6226 36 64 164 257 -171 173 -8 30 -143 -191 -11 -110 -117 -99 41 14 49 29 127 92 -89 -125 -92 -11 -73 -188 -156
6252 -156 142 -180 -46 -40 13 -63 -37 -95 37 -22 126 89 80 120 -268 114 -45 -192 -70 157 105 388 6 -255
6276 -255 -18 -15 -33 268 73 -7 -159 75 183 -237 -83 -71 169 248 265 117 170 251 -56 126 -8 79 -34
6299 -34 -126 -235 -183 29 -9 -132 -49 -10 -251 65 213 -66 -255 20 178 97 -268 -29 -53 -116 -321 -238 -142 6
6323 6 -219 0 -213 -214 111 -29 146 45 22 289 -153 -56 190 -160 93 123 -177 -1 -142 -33 -33 223 -67
6346 -67 -150 -79 54 64 201 86 28 105 24 199 -92 -40 57 41 189 288 66 84 -275 332 147 -64 84 34
6370 34 133 -43 -198 56 -190 -63 -131 -98 108 -189 -38 3 57 118 -101 -183 -50 84 124 -261 8 -74 -78 146
6394 146 -52 -161 -121 139 -56 109 -273 -41 -79 -176 124 88 -111 -106 -18 -164 45 -176 -344 242 141 122 131
6417 131 -141 -105 -68 17 -43 241 96 -119 143 221 238 263 188 115 238 155 91 -253 53 -203 129 98 57 76 -150
6442 -150 52 79 -45 6 -21 122 -137 65 -73 138 -250 -114 20 -17 -220 -72 -192 1 137 -120 -62 -146
6464 -146 -344 33 -147 -37 -67 183 -424 -248 -213 -40 -165 -201 -6 -127 -44 -117 7 -42 87 45 51 -14 22 -57
6488 -57 -52 -113 213 50 -128 113 -66 -20 133 123 173 225 47 20 -8 -152 136 -64 -30 138 34 43 52 -189 -71
6513 -71 151 236 -108 55 185 -48 -32 149 50 34 58 7 117 -101 140 -92 -195 28 231 -38 -5 42 -161
6536 -161 -20 -132 -234 -168 -56 -57 34 -269 -65 -78 -262 80 -15 -176 16 144 -281 -183 -16 -94 -128 -74 -1 -164
6560 -164 -168 -165 -111 98 177 95 58 49 -84 -33 14 -7 275 41 157 61 -75 104 147 114 192 11 -71 81 9 29 200
6587 200 52 -97 122 81 -83 231 3 24 71 -161 238 -18 -112 7 152 184 164 12 -180 -132 76 -134
6609 -134 91 -12 89 -215 87 -14 -51 -142 -151 -78 151 -178 -315 65 116 -84 34 -228 -63 -142 -3 -174
6631 -174 -177 -103 -133 -87 133 -71 139 36 151 162 -121 68 -43 93 -27 109 -4 34 61 55 166 83 162 -2
6655 -2 72 99 165 123 134 39 -15 271 -74 123 -98 -49 -18 89 37 -8 54 -85 -18 66 -107 62 56 83 53 -41 -55
6682 -55 58 -190 -165 105 -95 106 -403 120 -154 -244 -62 -29 33 -158 -115 -197 -367 -178 -148 -292 8 100 -94
6705 -94 -189 29 -388 123 -71 -52 -99 -116 -102 256 105 -204 -18 -138 110 178 -122 -90 96 149 14 155 245
6728 245 119 170 -57 255 65 33 230 212 89 46 -57 113 -162 91 48 221 -149 -106 -69 -152 57 -82 -150
6751 -150 13 -232 287 -294 -211 -66 -79 -84 2 47 152 73 -69 -221 -217 108 134 -64 -38 -319 156 -92 -79 -112
6775 -112 -164 212 75 -71 -154 -54 12 28 25 94 22 -34 -10 -275 147 -25 -2 -96 323 33 148 169 18 84 25
6800 25 156 75 -114 106 190 -112 141 466 -216 130 34 186 -18 -312 -14 -108 -94 169 68 68 -138 -71 -4
6823 -4 15 89 53 -172 109 71 27 54 -40 299 95 -38 23 -385 -190 118 -74 30 37 9 -131 -98 79 -280 110
6848 110 126 -316 52 177 23 -198 -65 -264 76 -164 90 16 -128 137 -120 -41 156 13 7 54 190 162
6870 162 113 -42 63 247 -51 -72 104 362 58 -143 228 231 106 9 42 127 35 250 53 65 -182 189 -142
6893 -142 -62 216 136 -209 -138 -188 -107 -40 -182 24 -92 259 -107 18 -163 11 31 -95 -35 -43 -132 -87 -4 -83 -95
6918 -95 -96 -86 -136 -138 -283 269 -161 -93 -50 79 -177 21 10 -237 264 -316 167 13 31 159 294 77 53 -120
6942 -120 21 -71 -188 -141 216 -57 -75 -8 -29 234 -150 72 -184 -77 127 3 19 103 -77 105 1 86 -229
6965 -229 181 27 -35 33 -142 -148 30 272 -64 -50 93 -14 74 -94 64 26 -49 -328 -177 -121 59 41 144
6988 144 35 -72 -112 143 -66 19 96 -18 -19 -89 -16 -374 114 -3 -76 11 76 -78 106 -73 63 22 -9 9
7012 9 45 42 72 310 -7 81 153 21 104 -49 81 139 182 -188 -18 320 -37 209 21 79 138 -7 -18 -24 223
7037 223 172 -163 219 86 -6 126 -116 150 -108 96 60 102 28 28 -41 -295 40 -147 28 -152 -94 -86 -135 -72
7061 -72 -188 39 -146 -277 -208 -118 -3 -129 -76 -81 -92 -194 96 -177 -168 50 -96 -101 -97 73 -37 6 -99 -67 102
7086 102 220 -57 -129 -1 -31 38 -121 -112 -42 -12 -123 -22 16 14 190 41 -31 241 -194 141 -88 81 -155 -22
7110 -22 -12 139 107 56 -62 173 132 140 238 85 19 88 68 -90 138 -14 -239 -96 1 -72 104 -27 -53 -102 -119
7135 -119 -161 -34 -253 -338 68 -37 -37 -242 -94 -59 -37 106 -61 -50 130 -24 -89 -188 -58 -105 -174 55 -6 -29
7159 -29 65 47 -182 34 -92 -73 78 67 -93 181 4 -61 -67 284 91 -46 222 15 270 -11 20 -83 264
7182 264 178 136 165 -23 -61 286 -82 111 -41 -58 137 210 12 -44 -113 -21 97 238 19 8 -9 -144 100 -26
7206 -26 58 -62 -69 -13 -78 -124 -268 -241 -198 -184 -14 -53 -125 -79 -168 -37 2 -9 -126 19 -179 -9 -146 44 -10 -80
7232 -80 -127 241 8 166 1 -148 120 36 136 -286 138 155 -8 -29 -59 252 29 217 271 -69 -154 -53 204
7255 204 135 151 152 335 199 -74 -17 -15 27 219 26 8 -187 35 261 2 76 -43 -104 11 -176 -9 -231 158
7279 158 -164 -5 -82 -48 -44 -78 -21 -144 -306 -13 -253 -40 95 -100 -43 -44 77 152 43 -194 37 51 19 -61
7303 -61 198 83 41 -109 91 151 -108 245 206 -19 -105 241 266 141 13 106 82 -87 -38 125 -92 -137 92
7326 92 -38 -35 105 97 197 138 251 115 80 65 -43 -301 -35 -162 -22 39 130 116 -223 -38 -132 -220 -192 147 -82
7351 -82 -156 -230 -146 84 -104 64 -87 -34 -54 60 58 -59 158 -48 43 164 -91 -283 -276 -112 97 -156 -98 2
7375 2 -87 -119 -122 51 -91 194 -1 -55 134 -54 41 -116 -16 20 -25 168 154 43 161 62 131 92 107 -19 -72
7400 -72 -142 -82 242 298 138 216 215 45 -66 -208 94 -9 274 -55 -123 281 -15 -40 89 -170 -88 -52 -45 -30 -69
7425 -69 -44 68 -119 -43 -31 15 -19 -21 9 81 186 -124 -164 -242 159 -30 195 -123 -355 32 -129 -87 -313 86
7449 86 -95 79 60 -306 94 -76 -78 16 200 -139 123 7 -199 -92 -238 -140 -215 145 39 13 -120 -23 17
7472 17 190 247 -28 110 48 31 -138 -69 145 89 16 277 42 147 15 -137 224 -20 -33 132 204 61 -56
7495 -56 39 -43 -167 27 -142 -312 -82 1 238 -300 -175 -166 -263 -198 -103 -8 -197 23 128 11 221 75 -158
7518 -158 -231 36 208 -101 -78 -117 51 -2 20 -3 93 -40 -48 -102 41 55 120 247 76 182 -25 243 -426 92
7542 92 145 48 146 -36 165 85 -254 109 77 218 207 247 -2 116 89 -199 53 -31 73 76 63 163 170 30 73
7567 73 -23 80 -69 211 51 23 40 65 42 -68 58 53 153 49 -30 -40 -54 -333 124 29 208 -103 -89 -37 -158
7592 -158 108 -162 44 -114 126 -47 -257 -141 121 99 -361 -108 -410 -56 -79 255 100 -126 14 -121 146
7613 146 90 234 274 -20 65 169 -140 111 34 -104 -9 82 -52 -82 63 132 9 142 236 176 -79 -1 30 -165
7637 -165 208 76 -105 -160 -251 222 93 92 -260 48 129 10 -68 -43 236 89 -47 -170 -42 162 101 191 113
7660 113 -211 -83 -159 -318 48 -118 -85 76 41 296 -91 86 84 -213 -454 -71 -123 132 -86 83 -128 3
7682 3 60 14 86 112 121 -61 163 74 -133 83 -90 -244 113 61 199 35 -2 -13 130 -223 49 -3 50 -11 238
7707 238 64 -20 107 54 -47 -39 106 -2 75 -130 102 230 -93 -23 64 196 -158 -132 9 99 -251 -292 -59
7730 -59 -8 -109 71 83 -36 26 -223 -112 95 235 -197 63 -89 -221 -276 -260 -348 332 12 -4 -212 222 -142
7753 -142 -35 -63 45 -19 -21 216 -54 -48 -108 125 -50 -209 195 -104 309 100 49 26 86 67 93 237 0 -148
7777 -148 -25 75 66 -64 124 120 55 -102 3 -181 -86 110 23 -110 212 -67 197 -106 -5 55 -154 -189 -89
7800 -89 -219 -57 -237 -50 -119 -313 -190 189 -165 -141 -238 -91 112 -37 91 -116 161 -88 -151 -93 102 93 -195
7823 -195 -119 30 242 147 50 -134 100 117 -114 96 160 -21 -200 61 -100 -23 118 124 160 48 267 14 16 -72
7847 -72 30 10 29 -73 -43 85 113 248 37 118 30 -215 70 -293 -43 -200 -122 -58 -106 46 40 -1 140 -34
7871 -34 -72 104 9 -23 -120 -167 -138 52 -109 -54 -55 -161 -38 -223 -67 -50 -7 103 -134 -35 -94 -55 -95 29 -15 -29
7897 -29 -49 143 249 27 -69 -113 148 56 128 -124 -56 108 47 -148 -79 13 -60 53 139 -194 -258 249 301 113 103
7922 103 160 -5 25 193 30 116 15 31 273 110 -53 -1 78 90 100 273 149 85 326 -86 15 74 64 53
7946 53 -32 -87 -186 -14 80 180 -106 -36 192 -37 159 -232 -64 -118 -271 20 -172 9 -206 1 -134 147
7968 147 149 -39 -221 37 -56 11 -108 -89 64 62 -22 29 -20 -112 29 -205 21 155 61 32 -126 -192 156 -14 -170
7993 -170 23 79 -21 198 51 -52 215 -20 70 160 -50 -66 125 86 138 -73 155 -177 -12 158 90 128 -170
8016 -170 138 169 211 -3 12 141 60 -145 -233 -135 120 -124 1 -50 -284 83 -181 -52 125 -139 -57 102 -207
8039 -207 -76 -129 -82 20 65 -131 100 -141 106 18 -78 135 -175 -117 -51 -87 45 138 149 68 -75 -63 122 140
8063 140 0 -43 -208 134 57 -63 -201 133 229 266 24 2 41 -114 -7 20 -30 47 124 191 75 37 -55 111
8087 111 41 171 24 -48 -172 165 -64 92 279 -30 -125 -118 101 -26 61 -92 -168 62 -223 -155 66 -157 -335
8110 -335 -25 81 -100 167 -41 139 -261 -42 32 -63 -45 -10 125 -47 -13 15 -69 77 127 -118 -246 193 -228
8133 -228 -46 101 51 48 -192 222 131 375 -36 71 -9 303 341 -22 -7 -45 -47 -205 180 92 -134 109 -27 230
8157 230 -22 46 -91 42 -196 -46 -112 -13 -1 -117 24 80 66 -156 124 135 -94 -58 -76 146 60 -209 -37
8180 -37 -79 -116 77 -27 -256 -97 -86 -372 -13 72 -41
8191d1
##END NTUPLES=NMR FID
##END=
