##TITLE=1H_Pr 5000-28
 CDCl3, 8 sc, 
 28.9.2020
##JCAMPDX= 6.0         $$ Bruker NMR JCAMP-DX V2.0
##DATA TYPE= NMR FID
##DATA CLASS= NTUPLES
##ORIGIN= UXNMR, Bruker Analytische Messtechnik GmbH
##OWNER= root
$$ XWIN-NMR		Version 3.5
$$ Mon Sep 28 12:53:08 2020 Russian Standard Time (UT+4h)  she@DPX200
##.OBSERVE FREQUENCY= 200.1315066352
##.OBSERVE NUCLEUS= ^1H
##.DELAY= (6, 6)
##.ACQUISITION MODE= SIMULTANEOUS
##.ACQUISITION SCHEME= undefined
##.AVERAGES= 8
##.DIGITISER RES= 18
##SPECTROMETER/DATA SYSTEM= spect
##.PULSE SEQUENCE= zg30
##.SOLVENT NAME= CDCl3
##.SHIFT REFERENCE= (INTERNAL, CDCl3, 0, 15.7039)
##AUDIT TRAIL= $$ (NUMBER, WHEN, WHO, WHERE, WHAT)
$$ ##TITLE= Audit trail, XWIN-NMR		Version 3.5
$$ ##JCAMPDX= 5.01
$$ ##ORIGIN= Bruker BioSpin GmbH
$$ ##OWNER= she
$$ F:/spectra/data/she/nmr/H-F/1/audita.txt
$$ ##AUDIT TRAIL=  $$ (NUMBER, WHEN, WHO, WHERE, WHAT)
(   1,<2020-09-28 12:52:01.93 +0400>,<she>,<DPX200>,
      <created by zg, POWCHK disabled, PULCHK disabled
       configuration hash MD5:
       00 E9 B6 7A A2 85 ED C7 34 08 36 98 17 FE 4E 26
       data hash MD5: 16K
       D6 5E 18 8C 99 6C 60 B8 52 F3 11 9F C5 76 3B 83>)
$$ ##END=
$$ 
$$ hash MD5
$$ 9E 3B E8 DE 3E 52 0D C7 70 AA 00 83 E0 EB 69 0E
##$RELAX= 
##$RELAX= 
##$RELAX= 
##$RELAX= 
##$RELAX= 
##$RELAX= 
$$ Bruker specific parameters
$$ --------------------------
##$DU= <F:/spectra>
##$EXPNO= 1
##$NAME= <H-F>
##$PROCNO= 1
##$TYPE= <nmr>
##$USER= <she>
##$AMP= (0..31)
100 100 100 100 100 100 100 100 100 100 100 100 100 100 100 100 100 100 
100 100 100 100 100 100 100 100 100 100 100 100 100 100 
##$AQSEQ= 0
##$AQ_mod= 1
##$AUNM= <au_zg>
##$AUTOPOS= <>
##$BF1= 200.13
##$BF2= 200.13
##$BF3= 200.13
##$BF4= 200.13
##$BF5= 200.13
##$BF6= 200.13
##$BF7= 200.13
##$BF8= 200.13
##$BYTORDA= 1
##$CFDGTYP= 0
##$CFRGTYP= 5
##$CHEMSTR= <none>
##$CNST= (0..31)
1 1 145 1 1 1 1 1 1 1 1 1 1 1 1 1 1 1 1 1 1 1 1 1 1 1 1 1 1 1 1 1 
##$CPDPRG= <>
##$CPDPRG1= <>
##$CPDPRG2= <>
##$CPDPRG3= <>
##$CPDPRG4= <mlev>
##$CPDPRG5= <mlev>
##$CPDPRG6= <mlev>
##$CPDPRG7= <mlev>
##$CPDPRG8= <mlev>
##$CPDPRGB= <>
##$CPDPRGT= <>
##$D= (0..31)
0 1.2 0 0 0 0 0 0 0 0.06 0 0.03 0 0 0 0 0.0002 0 0 0 0 0 0 0 0 0 0 0 0 
0 0 0 
##$DATE= 1601283121
##$DBL= (0..7)
120 120 120 120 120 120 120 120 
##$DBP= (0..7)
150 150 150 150 150 150 150 150 
##$DBP07= 0
##$DBPNAM0= <>
##$DBPNAM1= <>
##$DBPNAM2= <>
##$DBPNAM3= <>
##$DBPNAM4= <>
##$DBPNAM5= <>
##$DBPNAM6= <>
##$DBPNAM7= <>
##$DBPOAL= (0..7)
0.5 0.5 0.5 0.5 0.5 0.5 0.5 0.5 
##$DBPOFFS= (0..7)
0 0 0 0 0 0 0 0 
##$DE= 6
##$DECBNUC= <off>
##$DECIM= 32
##$DECNUC= <off>
##$DECSTAT= 4
##$DIGMOD= 1
##$DIGTYP= 9
##$DL= (0..7)
0 120 120 120 120 120 120 120 
##$DP= (0..7)
150 150 150 150 150 150 150 150 
##$DP07= 0
##$DPNAME0= <>
##$DPNAME1= <>
##$DPNAME2= <>
##$DPNAME3= <>
##$DPNAME4= <>
##$DPNAME5= <>
##$DPNAME6= <>
##$DPNAME7= <>
##$DPOAL= (0..7)
0.5 0.5 0.5 0.5 0.5 0.5 0.5 0.5 
##$DPOFFS= (0..7)
0 0 0 0 0 0 0 0 
##$DQDMODE= 0
##$DR= 18
##$DS= 0
##$DSLIST= <SSSSSSSSSSSSSSS>
$$ [...]
##$SUBNAM2= <"">
##$SUBNAM3= <"">
##$SUBNAM4= <"">
##$SUBNAM5= <"">
##$SUBNAM6= <"">
##$SUBNAM7= <"">
##$SUBNAM8= <"">
##$SUBNAM9= <"">
##$SW= 16.880792210976
##$SWIBOX= (0..15)
0 0 2 0 0 0 0 0 0 0 0 0 0 0 0 0 
##$SW_h= 3378.37837837838
##$TD= 16384
##$TD0= 1
##$TE= 0
##$TE2= 300
##$TE3= 300
##$TEG= 300
##$TL= (0..7)
0 120 120 120 120 120 120 120 
##$TP= (0..7)
150 150 150 150 150 150 150 150 
##$TP07= 0
##$TPNAME0= <>
##$TPNAME1= <>
##$TPNAME2= <>
##$TPNAME3= <>
##$TPNAME4= <>
##$TPNAME5= <>
##$TPNAME6= <>
##$TPNAME7= <>
##$TPOAL= (0..7)
0.5 0.5 0.5 0.5 0.5 0.5 0.5 0.5 
##$TPOFFS= (0..7)
0 0 0 0 0 0 0 0 
##$TUNHIN= 0
##$TUNHOUT= 0
##$TUNXOUT= 0
##$USERA1= <user>
##$USERA2= <user>
##$USERA3= <user>
##$USERA4= <user>
##$USERA5= <user>
##$V9= 5
##$VALIST= <valist>
##$VCLIST= <CCCCCCCCCCCCCCC>
##$VD= 0
##$VDLIST= <DDDDDDDDDDDDDDD>
##$VPLIST= <PPPPPPPPPPPPPPP>
##$VTLIST= <TTTTTTTTTTTTTTT>
##$WBST= 1024
##$WBSW= 4
##$XGAIN= (0..3)
0 0 0 0 
##$XL= 0
##$YL= 0
##$YMAX_a= 321116
##$YMIN_a= -307093
##$ZGOPTNS= <>
##$ZL1= 120
##$ZL2= 120
##$ZL3= 120
##$ZL4= 120
##$ABSF1= 10
##$ABSF2= 0
##$ABSG= 5
##$ABSL= 3
##$ALPHA= 0
##$AQORDER= 0
##$ASSFAC= 0
##$ASSFACI= 0
##$ASSFACX= 0
##$ASSWID= 0
##$AUNMP= <proc_1d>
##$AZFE= 0.1
##$AZFW= 0.1
##$BCFW= 1
##$BC_mod= 2
##$BYTORDP= 1
##$COROFFS= 0
##$CY= 11.3945322036743
##$DATMOD= 1
##$DC= 2
##$DFILT= <>
##$DTYPP= 0
##$F1P= 16.9975609425685
##$F2P= -3.02152046262296
##$FCOR= 0.5
##$FTSIZE= 0
##$FT_mod= 4
##$GAMMA= 1
##$GB= 0.15
##$INTBC= 1
##$INTSCL= 1
##$ISEN= 128
##$LB= 0.24
##$LEV0= 0
##$LPBIN= 0
##$MAXI= 10000
##$MC2= 0
##$MEAN= 0
##$ME_mod= 0
##$MI= 1.114404
##$NCOEF= 0
##$NC_proc= 0
##$NLEV= 6
##$NOISF1= 3.799351
##$NOISF2= 2.8
##$NSP= 1
##$NTH_PI= 0
##$NZP= 0
##$OFFSET= 15.70392
##$PC= 1
##$PHC0= -9968.453
##$PHC1= 9.000898
##$PH_mod= 1
##$PKNL= yes
##$PPARMOD= 0
##$PSCAL= 0
##$PSIGN= 0
##$REVERSE= no
##$SF= 200.130013532006
##$SI= 16384
##$SIGF1= 3
##$SIGF2= 2
##$SINO= 400
##$SIOLD= 16384
##$SREGLST= <1H.CDCl3>
##$SSB= 0
##$STSI= 0
##$STSR= 0
##$SW_p= 3612.71676300578
##$SYMM= 0
##$S_DEV= 0
##$TDeff= 0
##$TDoff= 0
##$TI= <>
##$TILT= no
##$TM1= 0
##$TM2= 0
##$TOPLEV= 0
##$USERP1= <user>
##$USERP2= <user>
##$USERP3= <user>
##$USERP4= <user>
##$USERP5= <user>
##$WDW= 1
##$XDIM= 8192
##$YMAX_p= 0
##$YMIN_p= 0
$$ End of Bruker specific parameters
$$ ---------------------------------
##NTUPLES= NMR FID
##VAR_NAME=  TIME,          FID/REAL,        FID/IMAG
##SYMBOL=    X,             R,               I
##VAR_TYPE=  INDEPENDENT,   DEPENDENT,       DEPENDENT
##VAR_FORM=  AFFN,          ASDF,            ASDF
##VAR_DIM=   8192,          8192,            8192
##UNITS=     SECONDS,       ARBITRARY UNITS, ARBITRARY UNITS
##FACTOR=    0.000296,      1,               1
##FIRST=     0,             0,               0
##LAST=      2.424536,      0,               0
##MIN=       0,             -307093,         0
##MAX=       2.424536,      321116,          0
$$ Real data points
##PAGE= N=1
##DATA TABLE= (X++(R..R)), XYDATA
$$ [...]
$$ plain form
2134 800 1250 508 669 360 -181 346 -248 -527 -88 -613 -468 -546 -1009 -964 -993 -1391 -937 -1395 -1669 -1284 -1596
2155 -1596 -1572 -1328 -1772 -1736 -1473 -1852 -1105 -1521 -1380 -1079 -1653 -949 -958 -1205 -981 -773 -982 -280 -764 -496 122
2176 122 -67 -42 111 162 408 741 414 892 774 654 1675 763 1329 1415 1127 1388 1591 1246 1979 1620 1258
2197 1258 2186 1207 1602 1479 1199 1558 1289 686 1619 1022 621 1174 301 724 758 -128 824 195 -662 297
2217 297 -372 -617 -420 -954 -543 -342 -1885 -513 -936 -1594 -966 -1471 -1400 -898 -2049 -1205 -525 -2434 -1353
2236 -1353 -1232 -1685 -824 -1632 -1169 -492 -1734 -996 257 -1913 -719 -266 -714 483 -621 -251 1035
2253 1035 -476 15 1326 -403 1331 485 197 2289 245 738 2578 557 967 1966 633 2023
2269 2023 1051 717 2940 601 443 2378 688 924 1374 139 2169 767 -413 2453 532 -265
$$ packed form
2134H00M50p42J61l09n41N27n94k79M39n25J45p8m63M5k9l98M54m58k74L85l12
2155a596K4K44m44L6K63l79P47m16J41L01n74P04rk47K24K08k09P02m84K68O18
2176A22j89K5J53N1K46L33l27M78j18j20J021r12N66Q6k88K61K03l45P33l59l62
2197A258R28r79L95j23k80L59k69o03R33n97m01N53q73M23L4q86R52o29q57R59
2217B97o69k45J97n34M11K01j543J372m23o58O28n05P1N02j151Q44O80j909J081
2236a353J21m53Q61q08M63O77j242P38J253k170J194M53m48J197j104L70J286
2253A035j511M91J311j729J734q46k88K092k044M93J840k021M10R99j333J390
2269B023r72l34K223k339j58J935j690K36M50j235K030j402j180K866j921p97
$$ plain form
2285 -265 1035 -46 660 437 -1228 939 -190 -1989 748 -562 -831 -195 -1683 64 -858 -2691
2301 -2691 -306 -637 -2279 -724 -1608 -1459 -959 -2710 -442 -492 -2931 -774 -420 -1902 -679 -1753 -698
2318 -698 125 -2351 -221 617 -1592 -154 122 -703 565 -984 103 1835 -910 -8 1936 175
2334 175 812 846 595 2168 216 313 2905 596 356 2240 657 1712 889 389 2982 837 -451
2351 -451 2493 679 431 1645 -30 1880 742 -1055 2460 498 -1456 1723 -45 -100 375 -1725
2367 -1725 1244 53 -2539 785 -611 -1868 246 -2041 -522 -451 -3013 174 -307 -3079 -243 -1128
2383 -1128 -1472 -144 -2685 -437 123 -3110 -253 -114 -1979 -65 -1173 -427 506 -2356 151 1140
2399 1140 -1928 275 265 -645 1036 -821 319 1888 -890 748 1956 -207 1108 749 739 2314
$$ packed form
2285b65J300j081P06k23j665K167j129j799K737j310k69O36j488J747r22j833
2301b691K385l31j642J555q84J49N00j751K268n0k439K157L54j482J223j074J055
2318f98Q23k476K130Q38k209J438K76q25J268j549J087J732k745R02J944j761
2334A75O37L4k51J573j952R7K592k309k40J884j583J055q23n00K593k145j288
2351d51K944j814k48J214j675J910j138j797L515j962j954L179j768n5M75k100
2367a725K969j191k592L324j396j257K114k287J519P1k562L187m81k772K836q85
2383a128l44J328k541K248N60l233K857J39j865J914j108P46R33k862K507R89
2399A140l068K203j0r10J681j857J140J569k778J638J208k163J315l59j0J575
$$ plain form
2415 2314 -394 979 2386 241 1263 1547 780 1630 602 583 2269 -27 304 1967 674 273 563
2432 563 352 1251 -86 -332 1251 156 -607 382 -49 -350 -307 -614 10 -535 -1718 -60 -248 -1776
2450 -1776 -717 -1155 -959 -654 -1758 -1039 -471 -2103 -724 -809 -1649 -795 -1176 -870 -532 -1809 -701 168
2468 168 -1382 -234 -300 -830 399 -713 -154 851 -770 91 1060 -362 859 434 23 1571 -20
2485 -20 458 1748 205 1059 1353 337 1472 915 609 2269 318 784 1910 603 1213 927 392 1718
2503 1718 714 253 1381 -85 377 941 -181 767 92 -590 609 -478 -764 132 -823 -158 -260 -1315
2521 -1315 -268 -862 -1018 -296 -1252 -1251 -588 -1077 -970 -1293 -1361 -503 -1013 -1324 -648 -860 -1073 -822 -977 -871
2541 -871 -759 -843 -505 -528 -560 -348 -194 -156 -35 98 161 393 104 409 562 307 442 895 562 751 892 751
$$ packed form
2415B314k708J373J407k145J022K84p67Q50j028j9J686k296L31J663j293m01K90
2432E63k11Q99j337k46J583j095p63R89m31l01M3l07O24n45j183J658j88j528
2450a776J059m38J96L05j104P19N68j632J379q5q40Q54l81L06L38j277J108Q69
2468A68j550J148o6n30J229j112N59J005j621Q61R69j422J221m25m11J548j591
2485b0M78J290j543Q54K94j016J135n57l06J660j951M66J126j307O10k86n35J326
2503A718j004m61J128j466M62N64j122R48o75o82J199j087k86Q96r55O65j02j055
2521a315J047n94j56P22r56JO63m89J07l23o8Q58n10l11O76k12k13K51j55J06
2541h71J12q4L38k3l2K12J54L8J21J33O3K32k89L05J53k55J35M53l33J89J41j41
$$ plain form
2563 751 1258 864 870 1236 602 1027 1002 967 921 993 845 1187 905 766 863 774 522 566 233 461 420 62 431
2586 431 -120 44 226 -168 -152 -349 -488 -353 -376 -675 -590 -771 -685 -399 -1131 -728 -969 -994 -730 -807 -1202 -791
2608 -791 -892 -952 -743 -977 -813 -597 -802 -671 -712 -546 -372 -455 -449 -9 -346 -99 -40 -93 297 167 220 535 236
2631 236 344 600 218 850 1012 484 1220 755 990 1029 676 965 1161 886 918 918 676 1058 590 808 734 345
2653 345 830 509 241 400 319 42 235 98 -62 279 -504 147 -203 -578 -458 -472 -464 -587 -706 -753 -451 -1171
2675 -1171 -910 -849 -1078 -644 -1123 -937 -449 -1075 -892 -339 -1054 -707 -629 -728 -729 -582 -805 -11 -615 -838 -35
2696 -35 -460 -278 -92 -388 380 -115 -216 855 145 228 737 410 834 741 302 1314 488 192 1078 689
2716 689 659 828 515 1259 1100 396 1639 770 135 1004 476 407 1012 266 875 680 -430 699 426 -33
$$ packed form
2563G51N07l94OL66o34M25k5l5m6P2j48L42k82j39R7q9k52M4l33K28m1l58L69
2586D31n51J64J82l94J6j97j39J35k3k99Q5j81Q6K86p32M03k41k5K64p7l95M11
2608g91j01o0K09k34J64K16k05J31m1J66J74q3OM40l37K47N9n3L90j30N3L15k99
2631B36J08K56l82O32J62n28P36m65K35L9l53K89J96k75L2%k42L82m68K18p4l89
2653C45M85l21k68J59q1k77J93j37j60L41p83O51l50l75J20j4Qj23j19m7L02p20
2675a171K61O1k29M34m79J86M88o26J83N53p15L47P8r9jJ47k23P94o04k23Q03
2696c5m25J82J86k96P68m95j01J071p10Q3N09l27M24r3m39J012q26k96Q86l89
2716F89l0J69l13P44j59p04J243q69o35Q69n28o9O05p46O09j95j110J129k73m59
$$ plain form
2736 -33 338 -460 55 30 -1157 -74 209 -1263 -186 -425 -533 -423 -1257 -671 -309 -1499 -835 -262 -1281
2755 -1281 -637 -909 -798 -60 -1612 -595 -37 -1390 -934 -416 -936 -6 -463 -327 392 -839 -282 248
2773 248 -538 -208 346 -52 777 33 -48 1350 -106 309 915 370 855 508 248 1390 755 202 1689
2792 1689 996 444 1067 477 1263 725 -66 1375 1068 -61 1086 423 370 717 -263 677 564 -705 703
2811 703 515 -789 61 -455 -151 435 -1258 -329 309 -1399 -95 -610 -1404 -540 -1142 -856 206 -2045
2829 -2045 -832 95 -1647 -554 -936 -940 -126 -1312 -891 624 -1421 -434 371 -1103 -77 -555 -551 767
2847 767 -870 -214 1002 -392 213 420 -305 1031 141 -1 1426 35 192 1399 80 817 716
2864 716 123 1867 458 79 1361 264 448 1252 161 815 601 86 1383 321 -85 677 328 479
$$ packed form
2736c3L71p98N15k5j187J083K83j472J077k39j08J10q34N86L62j190O64N73j019
2755a281O44k72J11P38j552J017N58j353M56N18n20R30m57J36P19j231N57N30
2773B48p86L30N54l98Q29p44q1J398j456M15O06n45M85l47k60J142o35n53J487
2792A689o93n52O23n90P86n38p91J441l07j129J147o63n3L47r80R40j13j269J408
2811G03j88j304Q50n16L04N86j693R29O38j708J304n15p94Q64o02K86J062k251
2829b045J213R27j742J093l82mQ14j186M21J515k045R87Q05j474J026m78MJ318
2847G67j637O56J216j394O05K07p25J336q90j42J427j391J57J207j319P37j01
2864G16n93J744j409l79J282j097J84Q04j091O54k14n15J297j062m06P62l49J51
$$ plain form
2882 479 256 -358 607 -31 -703 338 -104 -208 -227 -714 -345 -343 -916 -10 -375 -897 -553 -411 -738 -536 -737
2903 -737 -656 -606 -852 -769 -172 -1076 -749 -416 -874 -440 -616 -541 -33 -646 -741 -70 -605 13 145 -549 307 -209
2925 -209 -133 959 152 2 482 301 267 497 315 915 267 154 1063 233 538 1008 363 1102 756 -44
2945 -44 1025 732 273 1149 476 584 697 30 867 511 -295 856 -219 -286 632 -394 189 38 -618
2964 -618 85 -259 -591 -196 -661 -665 -2 -1151 -212 -394 -938 -289 -602 -765 -528 -864 -410 -615 -1146 -709
2984 -709 -398 -1025 -406 -628 -571 -161 -604 -239 -261 -575 25 26 -227 66 -105 81 381 155 256 424 195
3005 195 282 218 582 765 573 746 679 495 608 632 870 427 883 437 603 516 618 616 498 647 559 338 333
3028 333 706 266 328 539 -99 156 197 -295 -164 -321 -309 -32 -203 -265 -397 -702 -735 -382 -627 -568 -724 -808
$$ packed form
2882D79k23o14R65o38o72J041m42j04j9m87L69Kn73R06l65n22L44J42l27K02k01
2903g37Q1N0k46Q3N97r04L27L33m58M34j76P5N08o13r5O71n35O18J32o94Q56n16
2925b09P6J092q07j50M80j81l4K30j82O00o48j13R09q30L05M70o45P39l46q00
2945d4J069k93m59Q76o73J08J13o67Q37l56q06J151j075o7R18j026N83j51o56
2964f18P03l44l32L95m65mO63j149R39j82n44O49l13j63K37l36M54k05n31M37
2984g09L11o27O19k22N7M10m43L65k2l14O00Jk53K93j71J86L00k26J01J68k29
3005A95Q7o4L64J83j92J73o7j84J13K4K38m43M56m46J66q7J02kj18J49q8k21n
3028C33L73m40O2K11o38K55M1m92J31j57J2K77j71o2j32l05l3L53k45N9j56q4
$$ plain form
3050 -808 -354 -734 -573 -643 -816 -591 -483 -747 -316 -651 -598 -22 -657 -242 -219 -470 -204 -263 -380 17 -249
3071 -249 -154 12 3 195 343 159 714 64 218 623 306 369 490 621 863 586 646 729 521 587 609 367 614
3094 614 881 407 884 361 521 549 276 398 605 272 401 63 -39 88 109 -129 189 -281 -529 -228 -213
3115 -213 -275 -331 -652 -456 -176 -489 -393 -549 -467 -303 -914 -638 -493 -915 -410 -633 -832 -186 -621 -853 -47
3136 -47 -622 -668 -166 -361 -309 -568 -328 -4 -254 -291 226 1 -192 402 20 431 271 194 454 467 272 693
3158 693 229 425 713 357 772 679 253 660 324 515 918 450 908 1010 288 663 631 113 659 376 183
3179 183 418 -16 184 614 -634 22 185 -311 35 -486 -118 -83 -662 -254 -246 -657 -536 -384 -555 -303 -807
3200 -807 -814 -318 -967 -541 -297 -570 -477 -350 -782 149 -540 -631 66 -407 -388 -263 -411 19 -177 -349 278 11
$$ packed form
3050h08M54l80J61p0j73K25J08k64M31l35N3N76o35M15K3k51K66n9j17L97k66
3071b49R5J66rJ92J48j84N55o50J54M05l17O3J21J31K42k77O0Q3k08O6K2k42K47
3094F14K67m74M77n23J60K8k73J22K07l33J29l38j02J27K1k38L18m70k48L01J5
3115b13o2n6l21J96K80l13R6j56Q2J64o11K76J45m22N05k23j99O46m35k32Q06
3136d7n75m6N02j95N2k59K40L24k50l7N17k25j93N94l82M11j60p7K60J3j95M21
3158F93m64J96K88l56M15r3m26M07l36J91M03m68M58J02p22L75l2n18N46k83j93
3179A83K35m34K00M30j248O56J63m96L46n21L68L5n79M08Qm11J21J52j71K52n04
3200h07pM96o49M26K44k73R3J27m32R31o89r1O97m73J9J25j48M30j96j72O27k67
$$ plain form
3222 11 -268 129 214 237 355 102 874 527 -179 1166 506 191 732 323 695 664 298 718 769 289 892
3243 892 706 421 672 274 658 536 -142 500 626 106 428 150 196 293 -205 500 580 -341 -128 223 -143
3264 -143 -203 -435 -510 99 -687 -462 90 -953 -575 -225 -1005 -282 -687 -787 429 -1039 -787 -174 -884 -351
3284 -351 -526 -531 -22 -705 -840 271 -797 -575 218 -472 -43 -136 -161 717 162 -191 677 153 216 412 45
3305 45 656 295 -26 1045 602 57 952 436 795 833 63 1352 721 -96 923 355 396 963 238 814
3325 814 589 -684 838 362 -186 424 44 134 128 -376 83 28 -681 128 7 -788 -42 -588 -35 -191 -848
3346 -848 -300 58 -634 -600 -492 -712 -389 -716 -357 -367 -871 -478 -199 -783 -730 -424 -530 15 -311 -180 85
3367 85 -149 -362 58 -76 -36 188 -283 144 135 -286 725 241 -112 401 184 482 772 367 730 412 -68
$$ packed form
3222A1k79L97Q5K3J18k53P72l47p06J345o60l15N41m09L72l1l66M20N1m80O03
3243H92j86k85K51l98L84j22o78O42J26n20L22k78M6R7m98P05Q0r21K13L51l66
3264a43o0k32p5O09p86K25N52j043L78L50p80P23m05j00J216j468K52O13p10N33
3284c51j75nN09o83j35J111j068K22P93o90M29r3k5Q78n55l53Q68n24O3J96l67
3305D5O11l61l21J071m43n45Q95n16L59L8p70J289o31q17J019n68M1N67p25N76
3325H14k25j273J522m76n48O10l80R0on04M59n5p09Q09j21p95P46n46N53j56o57
3346h48N48L58o92L4J08k20L23l27L59j0n04L93K79n84N3L06j06N45l26J31K65
3367H5k34k13M20j34M0K24m71M27rm21J011m84l53N13k17K98K90m05L63l18m80
$$ plain form
3388 -68 747 486 429 680 481 543 603 -11 615 856 -25 474 727 122 727 212 179 224 -302 255 188 -388
3410 -388 229 -177 -290 373 -495 -133 -13 -742 -368 -255 -721 -202 -643 -432 -266 -594 -297 -177 -823 -308
3430 -308 -574 -697 -84 -708 -332 -286 -577 -68 -262 -343 -381 -672 -45 117 -317 -254 210 -101 244 -41 -117 361
3452 361 174 182 521 202 322 460 533 697 352 365 745 415 663 606 489 551 560 488 406 531 270 722 308
3475 308 292 314 249 149 9 -47 104 73 -166 -1 -176 -84 -74 -2 -243 -391 -256 -422 -425 -566 -599 -316 -495 -482
3499 -482 -701 -589 -291 -461 -628 -600 -407 -450 -162 -568 -385 -36 -450 -220 -556 -511 -401 -379 -113 88 -187
3520 -187 178 162 169 48 104 110 -68 -86 289 390 208 446 367 740 192 522 582 499 298 510 604 303 476 557
3544 557 623 227 422 605 446 277 379 192 143 485 172 194 312 23 39 147 -469 -93 -157 -295 -129 -342
$$ packed form
3388f8Q15k61n7K51j99O2O0o14O26K41q81M99K53o05O05n15l3M5n26N57o7n76
3410c88O17m06j13O63q68L62J20p29L74J13m66N19m41K11J66l28K97J20o46N15
3430c08k66j23O13o24L76M6k91N09j94q1l8k91O27J62m34O3M64l11L45k85p6M78
3452C61j87QL39l19J20J38P3J64l45J3L80l30K48n7j17O2Rp2q2J25k61M52m14
3475C08j6K2o5j00j40n6J51l1k39J65j75R2J0P2k41j48J35j66lj41l3K83j79J3
3499d82k19J12K98j70j67K8J93m3K88m06J83L49m14K30l36M5J10K2K66K01k75
3520a87L65j6Pj21N6Oj78j8L75J01j82K38p9L73n48L30O0q3k01K12R4l01J73Q1
3544E57O6l96J95J83j59j69J02j87m9L42l13K2J18k89J6J08o16L76o4j38J66k13
$$ plain form
3566 -342 -503 -224 -324 -274 -307 -432 -737 -556 -691 -183 -574 -482 -319 -622 -534 -643 -621 -352 -280 -370 -424 -150 -219
3589 -219 -178 -239 -156 -247 -159 -72 -174 -152 170 150 61 170 167 319 510 183 402 513 305 329 460 446 554 403
3613 403 446 818 496 820 598 320 480 439 235 510 265 146 627 -31 90 159 143 263 65 105 180 -116
3635 -116 -91 -6 -571 -285 -423 -415 133 -313 -703 -9 -489 -626 -412 -600 -288 -602 -802 -77 -261 -648 -223
3656 -223 -510 -337 -243 -498 -1 -431 -445 -284 -382 -216 -143 -416 94 121 -360 449 102 -472 275 -46 264 224
3678 224 -145 281 594 -2 521 447 278 551 356 737 816 103 603 596 286 556 425 422 659 204 415 495
3700 495 -76 375 593 157 369 185 53 362 -54 -230 113 -296 -448 131 -292 -176 -114 -622 -2 -650
3720 -650 -649 -151 -696 -299 -446 -486 -348 -505 -752 -80 -429 -624 -349 -501 -253 -651 -758 -168 -264 -473 -184
$$ packed form
3566c42j61K79j00N0l3j25l05J81j35N08l91R2J63l03Q8j09K2K69P2r0n4K74o9
3589b19M1o1Q3r1Q8Q7j02K2L22k0q9J09lJ52J91l27K19J11k08K4J31j4J08j51
3613D03M3L72l22L24k22k78J60m1k04K75k45j19M81o58J21O9j6J20j98M0P5k96
3635a16K5Q5n65K86j38QN48m46l90O94m80j37K14j88L12l14k00P25j84l87M25
3656b23k87J73R4k55M97m30j4J61r8J66P3k73N10K7m81Q09l47n74P47l21L10m0
3678B24l69M26L13n96N23p4j69K73j95L81P9p13N00pl10K70j31lK37m55K11Q0
3700D95n71M51K18m36K12j84j32L09m16j76L43m09j52N79m23J16O2n08O20o48
3720f50JM98n45L97j47m0J38j57k47O72l49j95K75j52K48l98j07N90r6k09K89
$$ plain form
3741 -184 -80 -327 3 -256 -31 480 -343 6 317 -381 286 212 42 891 92 497 680 -163 695 830
3761 830 132 683 507 323 729 6 413 654 75 500 451 32 470 83 24 599 -219 86 423 -84 218
3782 218 -224 -59 324 -158 -372 260 -339 -282 -36 -507 -59 -409 -512 36 -714 -604 -70 -306 -630 -390
3802 -390 -516 -426 -548 -528 -205 -615 -443 -105 -551 -299 -389 -293 48 -248 -392 -16 -311 -131 -64 33 197 66
3824 66 47 188 61 -124 -16 470 307 434 259 172 649 270 358 691 279 401 400 365 405 476 393 728 318
3847 318 345 604 223 352 199 82 356 206 47 554 147 -24 193 -143 -237 -266 -428 -89 -527 -407 204
3868 204 -355 -473 -212 -806 -126 -366 -551 -65 -543 -578 -189 -585 -177 -265 -816 -75 -370 -472 117 -543 -336
3889 -336 -122 -280 96 -218 -133 -10 -23 -168 6 -114 -123 76 -113 233 138 156 478 272 372 566 286 629
$$ packed form
3741a84J04k47L30k59K25N11q23L49L11o98O67p4j70Q49p99M05J83q43Q58J35
3761H30o98N51j76j84M06p23M07K41n79M25m9m19M38l87n9N75q18L05L37n07L02
3782B18m42J65L83m82k14O32n99N7K46m71M48l50j03N48p50J10N34k36l24K40
3802c90j26R0j22K0L23m10J72L38m46K52r0R6L41k96j44L76k95J80O7R7J64j31
3824F6j9J41j27j85J08M86j63J27j75q7M77l79Q8L33m12J22jl5M0P1q3L35m10
3847C18K7K59l81J29j53j17K74j50j59N07m07j71K17l36r4k9j62L39m38J20O11
3868B04n59j18K61n94O80k40j85M86m78l5L89l96M08q8n51P41k95j02N89o60K07
3889c36K14j58L76l14Q5J23j3j45J74j20rJ99j89L46r5J8L22k06J00J94k80L43
$$ plain form
3911 629 547 92 665 404 65 633 405 518 517 371 464 -7 17 340 248 265 329 293 329 43 -10 -20 142 -94
3935 -94 138 111 -236 -308 -234 -83 -315 -348 -321 -495 -183 -408 -457 -285 -450 -317 -263 -451 -192 -369 -440 -270 -730
3958 -730 -301 -245 -411 -311 -326 -110 -28 -227 -408 -218 -74 -209 -148 -97 158 6 -21 310 -53 349 94 312
3980 312 236 105 221 461 160 129 321 186 403 75 155 632 249 447 349 324 180 106 11 519 253 95
4002 95 430 -119 347 22 164 163 -2 -39 -2 -45 -4 -232 -84 -127 -212 -332 -71 -307 -318 -233 -565 -476 -299 -483
4026 -483 -354 -322 -339 -248 -506 -288 -444 -456 -149 -266 -201 -224 -220 -332 -234 -45 -150 84 -214 -167 -10 -101 -74 183
4050 183 42 112 -51 -56 467 223 344 87 370 474 106 460 500 480 329 548 213 412 438 539 342 223
4072 223 232 266 464 329 361 174 132 307 61 189 183 -119 -113 45 -23 52 -120 -291 -342 -390 -142 -140 -251 -102 -308
$$ packed form
3911F29q2m55N73k61l39N68k28J13jj46R3m71K4L23r2J7O4l6L6k86n3j0J62k36
3935i4K32k7l47p2P4J51k32l3K7j74L12k25m9J72j65J33N4j88K59j77p1J70m60
3958g30M29N6j66J00j5K16Q2j99j81J90J44j35O1N1K55j52k7L31l63M02k55K18
3980C12p6j31J16K40l01l1J92j35K17l28Q0M77l83J98r8k5j44p4r5N08k66j58
4002I5L35n49M66l25J42jj65l7L7m3M1k28J48m3q5j20K61k36j1Q5l32Q9J77j84
4026d83J29L2j7R1k58K18j56j2L07j17O5k3Mj12R8J89j05K34k98M7J57r1K7K57
4050A83j41P0j63nN23k44J21k57K83J04l68L54M0k0j51K19l35J99K6J01j97j19
4072B23RL4J98j35L2j87m2J75k46J28ol02OJ58o8P5j72j71n1m8K48Kj11J49k06
$$ plain form
4097 -308 -285 -432 -329 -315 -219 -404 -284 -211 -714 -546 -419 -373 -255 -367 -375 -201 -388 -145 -251 -183 -263 -359 -129
4120 -129 308 -343 54 57 -193 97 51 173 120 105 82 339 151 162 418 346 646 292 46 515 137 280 514
4143 514 283 356 101 74 298 15 -72 309 282 174 290 214 290 250 216 141 141 -290 103 -105 -117 95 -313 -101
4167 -101 -1 -409 -187 -138 -648 -257 -459 -574 -155 -451 -54 -203 -658 -143 -259 -355 -329 -423 -325 -193 -500 -76
4189 -76 91 -339 -90 25 -60 -136 50 -232 -50 -272 12 128 87 212 372 262 275 73 -21 419 152 -145
4211 -145 420 415 385 276 374 673 263 171 634 237 184 423 179 317 259 272 409 415 -192 262 49 -141 161
4234 161 -18 192 14 -231 65 -113 -303 112 -149 -47 -159 -568 -43 14 -490 -262 -555 -406 -269 -381
4254 -381 -249 -260 -788 -88 -150 -606 -458 -466 -555 -119 -537 -13 -32 -344 -25 -270 -228 -208 -191 82 257 23 116
$$ packed form
4097c08K3j47J03J4R6j85J20P3n03J68J27M6J18j12qJ74j87K43j06O8q0r6K30
4120a29M37o51L97Lk50K90m6J22n3j5k3K57j88J1K56p2L00l54k46M69l78J43K34
4143E14k31P3k55k7K24k83q7L81k7j08J16p6P6m0l4p5%m31L93k08j2K12m08K12
4167a01J00m08K22M9n10L91k02j15M19k96L97j49m55N15j16r6K6r4R8J32l07M24
4189g6J67m30K49J15q5p6J86k82J82k22K84J16m1J25J60j10J3k02r4M40k67k97
4211a45N65nl0j09R8K99m10r2M63l97n3K39k44J38n8J3J37Oo07M54k13j90L02
4234A61j79K10j78k45K96j78j90M15k61J02j12m09N25N7n04K28k93J49J37j12
4254c81J32j1n28P00o2m56J48qq9M36m18N24j9l12L19k45M2K0J7K73J75k34R3
$$ plain form
4277 116 228 -72 456 57 162 133 245 168 311 150 179 367 1 273 168 242 442 167 25 301 414
4298 414 123 452 395 358 307 -24 225 253 36 96 172 -138 4 15 15 162 -381 -189 -178 -171 105 -112 -284 -312
4322 -312 -81 -231 -111 -604 -184 27 -508 -424 -437 -650 -237 -109 -415 -322 -521 -72 -36 -361 125 -468 -185
4343 -185 68 -206 -341 16 -1 197 107 23 175 -102 142 93 21 42 390 168 121 -16 156 416 330 125 445
4366 445 -78 441 129 434 436 50 360 367 144 140 231 327 215 137 21 275 243 -201 193 57 -128 -103 -105 -112 140
4391 140 -411 138 -305 -192 -35 81 -183 -210 -180 -305 -297 -569 -474 -307 -315 -442 -347 -312 -415 -537 -266 -377 -173
4414 -173 -351 -210 -309 -271 -303 -97 -27 -273 -90 -157 -12 -152 211 76 -118 195 1 56 141 114 365 211 364
4437 364 194 218 309 470 272 454 260 187 234 401 516 512 160 124 374 132 243 196 78 100 25 -11 69 -137
$$ packed form
4277A16J12l00N28l99J05k9J12p7J43j61K9J88l66K72j05P4K00k75j42K76J13
4298D14k91L29n7l7n1l31K49K8k17O0P6l10J42J1%J47n43J92J1PK76k17j72k8
4322c12K31j50J20m93M20K11n35Q4j3k13M13J28l06R3j99M49L6l25M86n93K83
4343a85K53k74j35L57j7J98r0q4J52k77K44m9p2K1L48k22m7j37J72K60q6k05L20
4366D45n23N19l12L05Kl86L10Pk23mR1R6j12p8j16K54l2m44L94j36j85K5kpK52
4391A40n51N49m43J13J57J16k64k7L0j25Qk72R5J67qj27R5L5j03j22K71j11K04
4414a73j78J41r9L8l2K06P0k46J83o7J45j40L63j35j94L13j94N5Q5k7K51j54J53
4437C64j70K4R1J61j98J82j94p3M7J67J15ml52l6K50k42J11m7j18K2p5l6Q0k06
$$ plain form
4461 -137 -32 -99 -56 89 -285 32 -188 -374 -286 -7 -412 -69 -299 -288 -95 -331 -223 -86 -247 -160 -342 -323
4483 -323 -50 -343 -192 -16 -279 -187 -402 -420 -176 -85 -358 -334 -13 -113 -100 -141 1 51 9 71 251 -65 305
4506 305 438 219 60 176 -15 135 391 285 492 70 426 368 213 209 273 536 429 145 226 348 340 189
4528 189 291 55 153 233 113 119 -66 170 191 45 83 -44 48 159 -62 -54 -120 -205 -452 -92 -274 -256 -220 -114
4552 -114 -142 -313 -174 25 -618 -488 -268 -381 -294 -265 -166 -119 -202 -529 -12 -313 33 -126 -172 82 -145 -105 -155
4575 -155 231 70 41 -110 -8 341 80 278 265 224 286 195 466 265 208 300 242 238 150 202 129 340 175 363
4599 363 326 83 512 241 134 292 181 147 270 68 37 99 33 117 54 -1 -4 -185 -132 -326 -417 -175 -167 30 -240
4624 -240 -342 -375 -130 -373 -458 -222 -469 -311 -137 -490 -193 45 -329 -247 -194 -195 -229 -75 -374 -64 -92 -72 -41
$$ packed form
4461a37J05o7M3J45l74L17k20j86Q8K79m05L43k30J1J93k36J08J37j61Q7j82J9
4483c23K73k93J51J76k63R2k15j8K44R1k73K4L21j00J3m1J42N0m2O2J80l16L70
4506C05J33k19j59J16j91J50K56j06K07m22L56n8j55mO4K63j07k84Q1J22qj51
4528A89J02k36R8Q0j20Oj85K36K1j46L8j27R2J11k21Qo6q5k47L60j82J8L6J06
4552a14k8j71J39J99o43J30K20j13Q7K9R9M7q3l27N17l01L46j59m6K54k27M0n0
4575a55L86j61k9j51J02L49k61J98j3m1O2r1K71k01n7R2n8mq8N2p3K11j65J88
4599C63l7k43M29k71j07J58j11l4J23k02l1O2o6Q4o3n5lj81N3j94r1K42QJ97k70
4624b40j02l3K45k43q5K36k47J58J74l53K97K38l74Q2N3jl4J54k99L10k8K0L1
$$ plain form
4647 -41 -232 297 -189 -168 418 -71 80 258 137 51 133 124 275 143 -100 142 120 74 419 38 100 63 52 543
4671 543 429 98 254 596 304 73 188 110 480 243 128 213 208 435 -152 -185 79 -86 -59 133 104 31 -126
4694 -126 53 -90 -295 -121 32 -230 -143 24 -300 -311 -275 -269 -18 -299 -371 -102 -271 -263 -39 -157 35 -74 -132
4717 -132 -122 -369 -57 -77 -303 -97 -65 110 60 -91 2 33 6 16 -17 6 328 298 -34 194 327 4 148 365
4741 365 364 498 49 367 369 153 -39 156 295 42 322 230 214 161 233 157 153 192 240 159 147 203 -12 325 -133
4766 -133 22 142 -297 -320 -163 -257 -311 -167 -347 -79 -141 -338 -252 -341 -414 -329 -305 -214 -216 -102 -210 -231 -342 16
4790 16 -192 -29 -135 -167 177 3 -67 36 -159 -134 -111 -4 41 101 -65 69 24 9 102 -107 172 28 158
4813 158 121 317 61 210 191 219 207 106 111 184 204 232 212 320 304 440 105 -146 90 250 6 64 277 -154
$$ packed form
4647d1j91N29m86K1N86m89J51J78j21q6Q2rJ51j32k43K42k2m6L45l81O2l7j1M91
4671E43j14l31J56L42k92k31J15p8L70k37j15Q5nK27n87l3K64j65K7J92k9p3j57
4694a26J79j43k05J74J53k62Q7J67l24j1L6OK51k81p2K69j69QK24j18J92j09n8
4717a32J0k47L12k0k26K06L2J75n0j51R3L1k7J0l3K3L22l0l32K28J33l23J44K17
4741C65jJ34m49L18Kk16j92J95J39k53K80r2j6n3P2p6mL9M8q1j2N6k15L37m58
4766a33J55J20m39k3J57r4n4J44j80K68o2j97Q6q9p3Q5K4R1kJ14j08k1j11L58
4790A6k08J63j06l2L44j74p0J03j95K5K3J07M5O0j66J34m5j5R3k09K79j44J30
4813A58l7J96k56J49j9K8j2j01NP3K0K8k0J08j6J36l35k51K36J60k44N8K13m31
$$ plain form
4837 -154 -82 223 160 257 68 -243 -130 -191 -27 -1 -146 -51 15 -566 116 -9 -125 -283 -62 -233 -411 -178
4859 -178 -173 -68 13 -354 -447 -55 -256 -153 -392 23 -112 -265 -235 -15 -221 -58 132 -2 82 304 -29 -75
4881 -75 161 163 -41 69 220 -12 -49 12 47 387 139 255 164 193 32 79 306 -37 468 40 135 121 275 -26
4905 -26 227 101 136 223 -16 292 -61 -16 -77 78 -69 74 91 -90 -177 -123 -194 -333 -289 -96 -228 -235 -71 -67 25
4930 25 -50 -297 -191 -115 -210 -194 -264 -74 -344 -182 -231 -66 -147 73 -139 -53 95 -316 -215 -121 192 161 -196 196
4954 196 133 -234 123 -84 -17 102 78 178 276 27 226 196 62 -9 146 145 149 195 501 204 305 248 293 48
4978 48 168 101 107 229 147 200 150 97 145 -211 195 41 15 41 -167 -57 -45 32 -191 71 -175 -367 -116 54
5002 54 -236 -177 -170 -116 -37 -126 -22 -211 -241 -91 -195 -253 -76 -48 -165 -111 -169 -234 -111 140 -5 -64 -270 170 96
$$ packed form
4837a54P2L05o3R7j89l11J13o1J64K6j45R5O6n81O82j25j16j58K21j71j78K33
4859a78NJ05Q1l67r3L92k01J03k39M15j35j53L0K20k06J63J90j34Q4K22l33m6
4881g5K36Kk04J10J51k32l7O1L5L40k48J16r1K9j61M7K27l43N05m28R5j4J54l01
4905b6K53j26L5Q7k39L08l53M5o1J55j47J43J7j81q7N4p1j39M4J93j32pJ64MR2
4930B5p5k47J06P6r5J6p0J90k70J62m9J65q1K20k12Q6J48m11J01R4L13l1l57L92
4954A96o3l67L57k07O7J19k4J00R8k49J99l0j34p1J55jMM6L06k97J01n7M5k45
4978D8J20o7OJ22q2N3n0n3M8l56M06j54k6K6k08J10J2P7k23K62k46j92K51J70
5002E4k90N9PN4P9q9J04j89l0J50j04n8J77K8j17N4n8o5J23K51j45n9k06M40p4
$$ plain form
5027 96 -33 149 -111 -30 201 -55 34 -21 282 236 144 161 571 179 259 133 135 295 220 199 71 393 157 228
5051 228 307 268 196 152 -5 232 209 109 353 75 210 148 3 -45 22 -60 -20 35 -48 -177 28 -108 245 -224
5075 -224 85 -49 42 -143 -237 -207 -185 77 -398 -134 -428 147 -188 -237 -69 12 -35 -162 -62 -163 91 -38
5097 -38 68 -56 -116 -60 -127 55 0 236 116 126 72 -5 202 31 149 119 -53 280 -54 -168 53 152 336
5120 336 36 -79 260 122 298 118 135 107 147 126 354 114 207 91 -129 -57 212 -85 -79 83 70 4 11 -28
5144 -28 -28 121 -24 -55 -110 198 -22 -69 39 -144 -237 -332 -277 -180 -145 -253 -3 25 -258 -149 -159 -115 -16 46 -144
5169 -144 -70 -224 -69 -180 -100 49 -175 -56 -18 -182 6 362 -9 16 -23 84 -58 -40 -36 139 80 76 166 135
5193 135 256 166 250 168 159 24 163 88 138 148 313 -15 133 179 -7 7 181 60 148 272 131 -6 128 76
$$ packed form
5027I6j29J82k60Q1K31k56Q9n5L03m6r2J7M10l92Q0j26KJ60p5k1j28L22k36P1
5051B28P9l9p2m4j57K37k3j00K44k78J35o2j45m8O7q2M0N5q3j29K05j36L53m69
5075b24L09j34R1j85r4L0K2K62m75K64k94N75l35m9J68Q1m7j27J00j01K54j29
5097c8J06j24o0N6o7J82n5K36j20J0n4p7K07j71J18l0j72L33l34j14K21R9J84
5120C36l00j15L39j38J76j80J7k8M0k1K28k40R3j16k20P2K69k97OJ62j3o6Pl9
5144b8%J49j45l1n5L08k20m7J08j83r3r5N5R7L5j08K50K8k83J09j0M4R9O2j90
5169a44P4j54J55j11Q0J49k24J19L8j64J88L56l71K5l9J07j42J8MJ75n9mR0l1
5193A35J21r0Q4q2rj35J39p5N0J0J65l28J48M6j86J4J74j21Q8J24j41j37J34n2
$$ plain form
5217 76 18 8 87 -213 -82 -70 -233 -227 -116 -72 -86 -91 -37 -386 87 80 -45 -25 50 -45 -140 -183 -257 106 -187 218 -95
5244 -95 -26 -263 -87 -236 135 -122 -251 -58 -66 -30 50 -50 78 187 -231 -73 -69 73 274 -92 -24 149 139
5267 139 41 78 214 181 161 5 134 204 173 204 246 -14 -35 104 151 229 189 54 -11 98 -51 -179 155 93 -101
5292 -101 256 -152 -96 117 212 43 102 -130 -353 -572 -45 88 -202 -56 -241 -144 -353 46 -240 -168 -209 -137
5314 -137 -34 -131 104 -113 -237 -136 -55 -27 -12 -136 -143 -134 175 17 56 -49 -61 208 35 189 -79 124 -113
5337 -113 57 5 -135 207 36 -39 46 218 110 -25 144 118 110 105 -13 119 213 147 58 125 -6 23 87 -53 221
5362 221 -52 274 135 -79 -42 -34 12 124 -135 0 56 -120 8 30 -220 -216 -6 -116 -236 -189 -30 -149 -162
5385 -162 -175 -118 -69 -235 -125 282 -83 -189 -278 -61 -345 -129 -67 -168 -24 102 -187 -152 -6 51 148 85 78 -90
$$ packed form
5217G6n8j0P9l00J31J2j63OJ11M4j4nN4l49M73pj25K0P5r5r5m3p4L63k93M05l13
5244i5O9k37J76j49L71k57j29J93qL6Q0j00J28J09m18J58MJ42K01l66O8J73j0
5267A39r8L7J36l3k0j56J29P0l1L1M2k60k1J39M7P8m0j35o5J09j49j28L34o2j94
5292a01L57m08N6K13R5j69N9k32k23k19N27J33k90J46j85R7k09L99k86P2m1P2
5314a37J03r7K35k17j24J01Q1K8J5j24pRL09j58L9j05j2K69j73J54k68K03k37
5337a13J70n2j40L42j71p5Q5J72j08j35J69k6qnj18J32R4o6q9O7j31K9O4j40K74
5362B21k73L26j39k14L7QM6J12k59J35N6j76J28K2k50MK10j10j20M7J59j19j3
5385a62j3N7M9j66J10M07l65j06q9K17k84K16O2j01J44J26k89L5J46N7R7o3pj68
$$ plain form
5409 -90 36 -145 138 -104 417 91 -133 135 -11 -10 85 -40 30 132 65 12 -21 139 180 226 251 192 125 56 197
5434 197 -158 38 82 22 62 54 -45 157 92 142 -87 -285 -40 -112 61 -155 -6 -16 -94 -14 -134 55 -12 21 -94
5459 -94 -553 98 55 -63 -12 -270 -208 -236 -355 21 -6 17 -136 27 -175 -172 -182 11 95 50 -17 197 -162 -114 -18
5484 -18 -133 194 -20 -33 -16 146 54 -25 238 213 227 116 78 -58 169 480 -47 133 191 55 151 111 172 -63
5508 -63 26 88 86 -35 -177 280 185 46 -50 -117 -19 -163 -113 49 157 -141 -149 -208 175 -238 -134 -82 6 -323 86
5533 86 -97 -205 -49 72 -10 -168 -115 -104 -63 -276 116 -214 74 -50 -66 3 117 101 -55 -101 -175 -161 -21 137
5557 137 15 25 56 109 13 -262 193 166 -39 229 -126 120 54 202 41 271 191 -41 182 223 124 -60 62
5580 62 -32 238 38 3 -10 -6 159 139 55 373 -10 18 -13 -141 -120 -158 113 -241 -48 -26 -376 -113 -157 -133 36
$$ packed form
5409i0J26j81K83k42N21l26k24K68j46JR5j25P0J02o7n3l3J60M1M6K5n9o7o9J41
5434A97l55J96M4o0M0qr9K02o5N0k29j98K45p2J73k16J49j0p8Q0j20J89o7L3j15
5459i4m59O51m3j18N1k58O2k8j19L76k7K3j53J63k02Lj0J93Q4m5o7K14l59M8R6
5484a8j15L27k14j3J7J62r2p9K63k5J4j11l8j36K27L11n27J80N8j36R6m0O1k35
5508f3Q9O2kj21j42M57r5j39r6o7R8j44N0J62J08k98qn9L83m13J04N2Q8l29M09
5533H6j83j08J56J21q2j58N3J1M1k13L92l30K88j24j6O9J14j6j56m6p4J4J40J58
5557A37j22J0L1N3r6k75M55k7k05K68l55K46o6J48j61K30q0k32K23M1r9j84J22
5580F2r4K70k00l5j3MJ65k0q4L18l83K8l1j28K1l8K71l54J93K2l50K63m4K4J69
$$ plain form
5605 36 -69 -46 -12 -201 26 -133 188 -108 -58 -233 25 -371 -109 -150 -192 -162 -46 43 -137 252 8 20 -268
5628 -268 -90 266 -85 115 -127 -63 57 -83 151 114 -178 130 -29 288 -50 -82 -66 23 203 -29 14 -11
5650 -11 206 296 -4 -42 219 196 261 119 223 591 2 63 -60 -123 117 -204 61 -74 60 -45 36 18 -140
5673 -140 -102 204 -114 -54 150 10 -293 -52 -46 -332 60 -198 36 -188 -225 -60 92 -37 -23 111 -18 -264
5695 -264 0 74 -130 -196 4 -123 -319 -247 -251 -164 -135 269 287 119 47 10 6 89 -148 -74 -178 278 -10 68 127
5720 127 9 185 49 178 144 147 36 105 259 -90 200 107 47 15 -42 63 164 209 -61 18 102 -172 216 -16
5744 -16 -158 -1 -104 8 171 -38 113 -97 -143 -41 -98 130 -195 -54 1 143 -102 -84 -147 -70 -103 -44 -168
5767 -168 -162 -207 -28 105 -105 182 -347 -207 -78 24 -124 -83 -39 58 -102 33 -151 -50 80 -70 100 122
$$ packed form
5605C6j05K3L4j89K27j59L21k96N0j75K58l96K62m1m2L0J16Q9j80L89k44J2k88
5628b68J78L56l51K00k42O4J20j40K34l7k92L08j59L17l38l2J6Q9J80k32M3k5
5650a1K17R0l00l8K61k3O5j42J04L68n89O1j23o3K40l21K65j35J34j05Q1j8j58
5673a40L8L06l18O0K04j40l03K41Ok86L92k58K34k24l7J65J52j29J4J34j29k46
5695b64K64P4k04o6K00j27j96P2mQ7K9M04J8j68p2l7mQ3k37P4j04M56k88P8N9
5720A27j18J76j36J29l4Lj11O9J54l49K90r3o0l2n7J05J01M5k70P9Q4k74L88k32
5744a6j42J57j03J12J63k09J51k10m6J02n7K28l25J41N5J42k45J8o3P7l3N9j24
5767a68Om5J79J33k10K87n29J40J29J02j48M1M4R7j60J35j84J01J30j50J70K2
$$ plain form
5789 122 216 21 58 79 256 -48 52 129 68 200 160 245 89 -43 -22 132 -57 32 -83 113 268 -178 114
5812 114 -92 79 -72 -3 42 380 -77 31 -1 30 91 162 -52 -111 -179 -278 -15 -151 -107 -311 48 -183 -366
5835 -366 -109 -11 -155 -224 -190 -2 -118 -44 169 -11 -360 -210 34 13 -266 -159 -474 -46 -103 -21 -21 178 203
5858 203 -71 120 -136 -237 186 89 105 73 108 3 7 118 189 44 193 41 354 65 121 70 -95 19 -107
5881 -107 107 111 87 255 -1 24 165 123 -129 -92 53 -150 234 -201 60 -156 25 -33 10 -425 26 -64 130
5904 130 -168 -77 199 12 17 -225 176 -230 -196 -59 -311 -35 -543 283 -189 99 -42 -132 -59 -32 123 -141
5926 -141 -306 23 -46 7 70 5 84 113 -31 -29 194 -22 87 -358 -44 -13 125 -105 39 142 28 19 142 33
5950 33 -5 131 21 40 -192 88 12 -175 257 55 378 -136 101 104 -56 -64 -23 -106 145 119 118 190 -172 -17 -250
$$ packed form
5789A22R4j95L7K1J77l04J00P7o1J32m0Q5j56j32K1J54j89Q9j15J96J55m46K92
5812A14k06J71j51O9M5L38m57J08l2L1O1P1k14n9o8r9K63j36M4k04L59k31j83
5835c66K57R8j44o9L4J88j16P4K13j80l49J50K44k1k79J07l15M28n7Q2%J99K5
5858B03k74J91k56j01M23r7J6l2L5j05MJ11P1j45J49j52L13k89N6n1j65J14j26
5881a07K14Mk4J68k56K5J41m2k52L7J45k03L84m35K61k16J81n8M3m35M51r0J94
5904A30k98R1K76j87Nk42M01m06L4J37k52K76n08Q26m72K88j41r0P3K7J55k64
5926a41j65L29o9N3O3o5P9K9j44KK23k16J09m45L14L1J38k30J44J03j14rJ23j09
5950C3l8J36j10J9k32K80p6j87M32k02L23n14K37Lj60qM1q3K51k6jP2l62J55k33
$$ plain form
5975 -250 96 -32 33 -363 -30 -121 -13 -160 41 -5 -205 -311 -171 -157 9 285 105 148 -35 -153 -31 -194
5997 -194 94 24 34 144 -201 123 136 -93 14 3 150 10 65 74 0 -91 44 -44 -93 19 -8 291 119 142
6021 142 -56 152 270 175 158 100 45 -20 -176 65 148 28 111 -70 95 71 -39 139 -71 82 -66 -132 15
6044 15 266 96 186 117 -59 -33 28 -4 44 -112 -111 -113 -108 87 -28 -36 24 -31 -7 211 -5 -118 -57 93 -132 -411
6070 -411 59 -68 -14 -53 79 -51 -24 35 -177 23 132 -218 -39 6 -164 -45 -259 13 1 162 -123 210
6092 210 -20 -315 157 168 -128 -61 249 18 -177 -135 270 91 103 -24 98 6 -249 -104 74 -141 -350 -111
6114 -111 -39 16 -45 -4 -78 -24 159 -25 -29 -160 84 122 189 -94 -27 -267 -38 -131 18 -65 110 -65 94 -30
6138 -30 -97 -74 110 -5 86 -133 -161 -50 -149 64 -88 -177 172 147 -18 -172 -161 -55 30 21 1 -35 27 -24 -174
$$ packed form
5975b50L46j28O5l96L33r1J08j47K01m6k00j06J40J4J66K76j80M3j83j18J22j63
5997a94K88p0J0J10l45L24J3k29J07j1J47j40N5Rp4r1J35q8m9J12k7K99j72K3
6021A42j98K08J18r5j7n8n5o5j56K41Q3j20Q3j81J65k4j10J78k10J53j48o6J47
6044A5K51j70R0o9j76K6O1l2M8j56JkNJ95j15qO0n5K4K18k16j13O1J50k25k79
6070d11M70j27N4l9J32j30K7N9k12K00J09l50J79M5j70J19k14K72j2J61k85L33
6092B10k30k95M72J1k96O7L10k31j95M2M05j79J2j27J22r2k55J45J78k15k09K39
6114a11P2N5o1M1p4N4J83j84mj31K44L8O7k83O7k40K29r3J49q3J75j75J59j24
6138c0o7K3J84j15R1k19k8J11r9K13j52q9L49k5j65j54J1J06Q5rk0l6O2n1j50
$$ plain form
6163 -174 -199 -62 4 184 -191 -62 -42 86 -73 156 -37 282 -66 349 151 84 -90 -12 -62 -5 91 208 233
6186 233 -136 108 -208 -209 -88 241 20 73 -49 -71 93 17 -40 -45 37 -108 53 109 -182 -8 -30 -64 -277 258
6210 258 47 -113 -195 90 -32 -118 -304 27 -213 -173 -66 2 222 -47 -66 -65 27 -199 141 76 145 -187 -30
6233 -30 32 -194 -27 233 52 -189 -103 105 114 -95 -16 59 29 2 -124 19 -194 3 -17 220 204 -295 197 230
6257 230 -55 -37 287 -126 189 35 -62 44 -27 58 128 -179 -79 147 247 -103 -91 247 154 104 -110 -167 -104
6280 -104 105 162 -118 21 97 -112 -330 -274 -23 -21 -144 116 -130 8 -99 108 30 16 -84 7 15 -158 64
6303 64 -7 -58 -96 117 -58 -8 -258 -22 99 54 183 -43 128 -191 80 -147 21 104 -105 -83 194 79 -19
6326 -19 -19 12 -97 83 76 -84 16 153 324 89 -104 -49 5 112 -197 -129 65 -133 -106 35 106 -118 293 24
$$ packed form
6163a74k5J37O6J80l75J29K0J28j59K29j93L19l48M15j98o7j74P8n0N7R6J17K5
6186B33l69K44l16jJ21L29k21N3j22k2J64p6n7nQ2j45J61N6k91J74k2l4k13N35
6210B58k11j60q2K85j22q6j86L31k40M0J07O8K20k69j9JR2k26L40o5O9l32J57
6233c0O2k26J67K60j81k41Q6K08Rk09P9P5l0k7j26J43k13J97k0K37j6m99M92L3
6257B30k85J8L24m13L15j54r7J06p1Q5P0l07J00K26J00l50J2L38r3n0k14n7O3
6280a04K09N7k80J39P6k09k18N6K51Kj23K60k46J38j07K07p8j4j00R1Qj73K22
6303F4p1n1l8K13j75N0k50K36J21m5J29k26J71l19K71k27J68Q3k09K2K77j15r8
6326a9%L1j09J80pj60J00J37J71k35j93N5N4J07l09O8J94j98K7J41P1k24M11k69
$$ plain form
6350 24 -46 -58 -210 32 155 17 3 60 -77 -98 -178 -261 123 134 -259 -89 -167 -48 -36 105 112 17 -110 202 -162
6375 -162 -25 -12 49 -170 -82 -357 97 169 -8 67 2 191 -19 188 60 -11 -24 -82 -33 -49 127 -78 47 3
6399 3 171 -84 114 128 -37 -51 102 64 -223 226 18 98 -78 66 -18 -52 -46 -12 -30 73 63 86 -10 -189 -130
6424 -130 -130 112 241 -21 16 -102 -185 -11 -58 -88 -8 106 -139 236 121 -49 -3 -79 9 -204 -33 -101 -78 30
6448 30 -203 -25 -187 155 -66 32 -163 -187 176 -86 -277 162 -123 -91 -93 -68 148 45 -102 18 -72 231 209
6471 209 69 -18 85 -121 -87 145 -74 49 118 -12 -136 156 22 138 -5 187 -122 -9 25 -116 -73 -177
6493 -177 -78 1 -81 -22 -28 83 -192 169 -44 -142 103 133 -28 -58 106 -22 34 -103 -97 152 -173 47 -193 -49
6517 -49 28 1 161 -66 -136 -332 -126 -119 -55 86 -12 -77 58 53 -224 87 200 246 -109 -223 312 -104 -80 1 -46
$$ packed form
6350B4p0j2j52K42J23j38j4N7j37k1q0q3L84J1l93J70p8J19J2J41Pr5j27L12l64
6375a62J37J3O1k19Q8k75M54P2j77P5o5J89k10K07j28p1j3n8M9j6J76k05J25m4
6399CJ68k55J98J4j65j4J53l8k87M49k08Q0j76J44q4l4OL4j8J03j0K3r6j79N9
6424a30%K42J29k62L7j18q3J74m7l0Q0J14k45L75j15j70M6p6Q8k13J71o8K3J08
6448C0k33J78j62L42k21R8j95k4L63k62j91M39k85L2kK5K16j03j47J20r0L03k2
6471B09j40q7J03k06L4K32k19J23O9j30j24K92j34J16j43J92l09J13L4j41M3j04
6493a77R9P9q2N9oJ11k75L61k13r8K45L0j61l0J64j28N6j37OK49l25K20k40J44
6517d9P7k7J60k27p0j96K06PO4J41r8o5J35nk77L11J13M6l55j14N35m16K4Q1m7
$$ plain form
6542 -46 -254 219 75 -125 -258 189 -128 129 210 -204 -16 140 54 69 177 2 -40 190 -9 191 372 80
6564 80 13 -227 -200 -126 113 156 -35 62 -118 44 86 25 -87 -212 -47 -34 167 73 222 -166 -96 90 60 19
6588 19 5 130 -130 -54 21 -68 193 -52 -230 26 -200 -217 -117 111 79 -284 -21 -3 29 44 -115 -125 115 46
6612 46 -17 -108 38 -117 -65 -113 -72 -247 224 -161 -19 62 -164 -11 -6 -88 101 50 -72 56 -274 80 57 -84
6636 -84 55 -108 93 -75 63 236 -34 -23 -145 130 -245 -168 -137 4 136 0 143 59 154 -26 215 104
6658 104 -6 -138 48 137 -283 -61 0 -36 -34 -374 -29 110 62 66 -40 -28 -119 -97 104 -47 -90 43 133 -10
6682 -10 134 79 -83 92 -84 109 87 271 -27 81 -20 179 40 -51 110 246 -21 43 144 -10 -8 -158
6704 -158 59 -280 -165 -87 3 -31 242 -6 69 204 66 103 56 283 -105 72 134 -98 142 110 12 230 -35
$$ packed form
6542d6k08M73j44k00j33M47l17K57Q1m14J88J56q6J5J08j75m2K30j99K00J81k92
6564H0o7k40K7P4K39M3j91R7j80J62M2o1j12j25J65J3K01r4J49l88P0J86l0m1
6588A9j4J25k60P6P5q9K61k45j78K56k26j7J00K28l2l63K63J8L2J5j59j0K40o9
6612D6o3r1J46j55N2m8M1j75M71l85J42Q1k26J53Nq2J89n1j22J28l30L54k3j41
6636h4J39j63K01j68J38J73k70J1j22K75l75P7L1J41J32j36J43q4R5j80K41j11
6658A04j10j32J86Q9m20K22O1l6Kl40L45J39m8Mj06J2r1K2K01j51m3J33R0j43
6682a0J44n5j62J75j76J93k2J84k98J08j01J99j39r1J61J36k67O4J01j54Kj50
6704a58K17l39J15P8R0l4K73k48P5J35j38L7m7K27l88J77O2k32K40l2r8K18k65
$$ plain form
6727 -35 -45 0 -109 70 89 187 295 -63 -66 -131 -167 -198 -105 -152 -89 -12 38 -61 332 -42 -81 -9 -121 96 -98 1
6753 1 104 115 -233 73 -142 156 164 -10 -146 -287 -169 -26 86 45 25 108 160 133 32 -123 293 -168 160
6776 160 73 77 -21 82 20 188 -200 13 152 38 -52 -5 191 128 -40 54 -43 -70 65 -171 -15 133 197 -36
6800 -36 180 84 -73 -103 -54 132 -54 -24 -173 -231 114 -4 -4 -119 -83 81 123 118 -73 -156 248 84 20 62 205
6825 205 -123 -109 -117 -132 90 -36 82 -176 -32 -12 -345 77 47 -159 67 4 188 -146 190 137 85 92 -131 -121
6849 -121 -167 -32 226 71 122 -119 -194 40 99 64 -164 95 -34 77 -86 41 -263 225 329 -5 -114 -83
6871 -83 130 -188 137 43 27 -55 83 -141 -116 79 205 -30 -118 75 -1 8 166 156 -154 -258 -103 14 -170
6894 -170 -20 38 -239 6 85 -224 -357 140 -17 -100 37 -127 208 -15 -225 -95 74 177 -100 -61 -46 6
$$ packed form
6727c5j0M5j09J79J9R8J08l58lo5l6l1R3m7O3P7N0r9L93l74l9P2j12K17j94R9
6753AJ03J1l48L06k15K98Qj74j36j41J18J43J12m1k0Q3N2k7j01j55M16m61L28
6776A60q7Mr8J03o2J68l88K13J39j14r0M7J96o3j68R4r7k7J35k36J56J48O4k33
6800c6K16r6j57l0M9J86j86L0j49n8L45j18%j15L6J64M2nj91q3M04j64o4M2J43
6825B05l28J4qj5K22j26J18k58J44K0l33M22l0k06K26o3J84l34L36n3n2Pk23J0
6849a21m6J35K58j55N1k41p5K34N9l5k28K59j29J11j63J27l04M88J04l34j09L1
6871h3K13l18L25r4j6q2J38k24K5J95J26k35q8J93p6RJ58j0l10j04J55J17j84
6894a70J50N8k77K45P9l09j33M97j57q3J37j64L35k23k10J30J69J03k77L9J5N2
$$ plain form
6916 6 105 -154 -41 -18 32 52 -55 -51 218 34 77 22 -349 92 109 10 -21 -29 188 -167 14 83 -23 55 -124 37
6942 37 -69 180 89 25 -184 -67 -67 -19 195 -139 -38 -151 208 -39 -9 117 7 51 84 169 91 49 8 183
6966 183 -3 266 298 -69 -163 90 -314 16 -40 367 -114 -54 150 -105 -263 -258 97 -6 140 170 221 22 55
6989 55 -210 16 27 -86 -92 98 -16 -141 -145 -69 -186 16 -38 123 -94 59 -71 -144 -26 -178 123 40 -69
7012 -69 -224 91 147 158 71 128 181 -9 -49 -115 -29 80 -64 -5 -129 -153 91 -15 -71 -48 38 -18 112 -148 -179
7037 -179 207 102 -70 -79 63 58 -102 134 27 -63 -34 113 70 -20 13 -61 44 5 -94 -83 -108 -157 96 98 -346 -82
7063 -82 115 -22 51 35 -67 -25 84 -117 -100 -138 123 -122 -53 -37 86 -232 -24 104 95 -4 21 58 142 87 -88
7088 -88 232 -155 50 -113 203 -166 50 -52 -87 15 113 21 65 -245 -32 11 82 -181 -7 359 184 71
$$ packed form
6916FR9k59J13K3N0K0j07MK69j84M3n5l71M41J7r9l1qK17l55J81O9j06P8j79J61
6942C7j06K49r1o4k09J17%M8K14l34J01j13L59k47L0J26j10M4L3Q5p8m2m1J75
6966A83j86K69L2l67r4K53m04L30n6M07m81O0K04k55j58NL55j03J46L0N1j99L3
6989E5k65K26J1j13oJ90j14j25mP6j17K02n4J61k17J53j30p3J18j52L01q3j09
7012f9j55L15N6J1q7N7N3j90m0o6Q6J09j44N9j24k4K44j06n6K3Q6n6J30k60l1
7037a79L86j05j72rJ42nj60K36j07r0K9J47m3r0L3p4J05l9r9J1k5m9K53Km44K64
7063h2J97j37P3j6j02M2J09k01J7l8K61k45O9J6J23l18K08J28rr9K5L7Q4n5j75
7088h8L20l87K05j63L16l69K16j02l5J02R8r2M4l10K13M3P1k63J74L66j75j13
$$ plain form
7110 71 163 182 -2 47 172 64 -179 108 188 75 127 -134 86 -16 60 -121 -21 67 158 269 -20 26 0 -225
7134 -225 -15 99 -138 -134 229 -104 -72 64 -173 -63 13 -48 179 -47 -139 -34 -77 64 139 -75 -112 84 134
7157 134 63 105 72 214 -39 166 -233 -5 204 314 54 79 351 -96 343 74 1 93 -151 31 86 -179
7179 -179 -57 -137 151 35 56 124 -121 79 40 -244 88 329 119 25 -92 270 -68 3 -217 -80 -169 -23
7201 -23 154 86 2 34 213 56 33 -88 204 100 -232 -134 -103 -245 78 175 37 -86 19 36 -155 -88 -14 57
7225 57 -11 100 -151 307 -114 28 -2 -270 -35 151 64 -63 90 121 -147 -216 2 68 207 163 -7 -71 -195
7248 -195 -142 94 -126 315 -33 -52 -76 109 -37 42 172 -22 -44 22 -164 -355 53 31 134 40 150 12 -162
7271 -162 -15 6 -56 8 214 -55 100 -87 141 70 22 120 -51 17 189 -184 -22 126 -69 86 181 6 164
$$ packed form
7110G1R2J9j84M9J25j08k43K87Q0j13N2k61K20j02P6j81J00Q8R1J11k89M6k6k25
7134b25K10J14k37ML63l33L2J36k37J10P6o1K27k26r2J05m3J41P5k14l7J96N0
7157A34p1M2l3J42k53K05l99K28K09J10k60K5K72m47M39k69p3R2k44J82N5k65
7179a79J22q0K88j16K1O8k45K00l9k84L32K41k10r4j17L62l38P1k20J37q9J46
7201b3J77o8q4L2J79j57k3j21K92j04l32R8L1j42L23R7j38j23J05J7j91O7P4P1
7225E7o8J11k51M58m21J42l0k68K35J86q7j27J53L1k68o9K18O6J39m4j70o4j24
7248a95N3K36k20M41l48j9k4J85j46P9J30j94k2O6j86j91M08k2J03r4J10j38j74
7271a62J47K1o2O4K06k69J55j87K28p1m8R8j71O8J72l73J62J48j95J55R5j75J58
$$ plain form
7294 164 -150 -36 84 58 30 -83 20 -200 143 -62 -72 122 94 -31 96 163 -231 -187 -43 43 24 25 -11 120
7318 120 -89 95 31 -7 78 279 -2 -6 -20 -173 49 35 54 16 0 -63 8 25 -210 -66 232 104 -60 -78 -240
7343 -240 106 -93 33 320 -76 -166 125 22 -201 15 -66 -218 56 52 -4 62 149 -168 70 172 6 -104
7365 -104 -255 -168 -73 20 96 -19 -58 95 -169 -35 1 89 -159 97 57 -262 185 -91 84 188 115 53 43 60
7389 60 5 -6 -46 193 -29 -68 -50 36 -187 -95 -208 169 -5 -165 149 -163 84 32 -58 -44 -10 55 289 -193
7413 -193 99 -59 51 -77 -239 29 -5 157 -58 24 -16 -82 -20 -128 37 87 111 52 -207 191 152 -232 -64
7436 -64 -35 -70 -76 -85 -74 -119 -120 -52 -24 17 -23 67 -73 116 -55 126 -33 314 -66 74 -107 245 20 -109 -157 -279
7462 -279 94 -125 51 19 181 19 149 121 121 41 -18 -21 104 -52 16 -157 83 -56 -84 -110 107 70 -47 20
$$ packed form
7294A64l14J14J20k6k8j13J03k20L43k05j0J94k8j25J27O7l94M4J44Q6j9Jl6J31
7318A20k09J84o4l8Q5K01k81mj4j53K22j4J9l8j6o3P1J7k35J44K98j28j64j8j62
7343b40L46j99J26K87l96r0K91j03k23K16q1j52K74mn6O6Q7l17K38J02j66j10
7365a04j51Q7R5R3P6j15l9J53k64J34L6Q8k48K56m0l19M47k76J75J04p3o2j0J7
7389F0n5j1m0K39k22l9J8Q6k23R2j13L77j74j60L14l12K47n2r0J4L4O5K34m82
7413a93K92j58J10j28j62K68l4J62k15Q2m0o6O2j08J65N0K4n9k59L98l9l84J68
7436f4K9l5orJ1m5jO8K8M1m0R0j40J89j71J81j59L47l80J40j81L52k25j29m8j22
7462b79L73k19J76l2J62j62J30k8%q0n9lJ25j56O8j73K40j39k8k6K17l7j17O7
$$ plain form
7486 20 -112 94 -21 139 233 -7 -79 111 58 -138 115 -86 78 -114 23 -306 98 21 -109 -61 7 -75 -45
7509 -45 -232 -220 -7 -31 -111 -53 41 162 -222 16 219 23 64 134 94 187 -295 31 -27 120 148 11 229 159
7533 159 73 -71 -35 123 149 133 -149 86 -345 95 -6 -95 161 212 -6 59 189 -45 61 -48 -320 91
7555 91 -138 -137 -336 -21 -289 6 -96 173 86 53 26 -103 -161 -22 30 -290 5 -130 19 -16 -67 71 128 77
7579 77 237 -19 114 -26 16 -56 5 22 -16 -110 114 120 110 144 -84 -186 4 -32 -34 135 -3 105 -26 -67 -66 25
7605 25 46 155 154 161 221 -35 39 63 -245 -164 75 74 -268 -13 -114 -29 171 107 44 -67 -110 -249 -75 34 -253
7630 -253 97 -11 3 -24 172 -36 -280 -128 54 -99 -170 60 253 -2 -130 148 43 61 -125 3 -19 26
7652 26 143 -36 -48 -64 33 -45 40 -419 66 162 -97 174 129 380 -109 6 67 118 171 263 201 93 129 -18 -7
$$ packed form
7486B0j32K06j15J60R4k40p2J90n3j96K53k01J64j92J37l29M04p7j30M8O8q2L0
7509d5j87J2K13k4q0N8R4J21l84K38K03j96M1P0m0R3m82L26n8J47K8j37K18p0
7533A59q6j44L6J58K6j6k82K35m31M40j01q9K56N1k18O5J30k34J06j09k72M11
7555I1k29Jj99L15k68K95j02K69q7l3k7j29n8J39N2l20K95j35J49l5n1J38N7n1
7579G7J60k56J33j40M2p2O1J7l8r4K24Oj0L4k28j02J90l6kJ69j38J08j31m1JR1
7605B5K1J09jPO0k56P4K4l08Q1K39jl42K55j01Q5K00o4o3j11m3j39J74J09k87
7630b53L50j08J4k7J96k08k44J52J82j53p1K30J93k55j28K78j05J8j86J28k2M5
7652B6J17j79j2j6R7p8Q5m59M85R6k59K71m5K51m89J15O1N1N3R2o2j08L6j47J1
$$ plain form
7677 -7 188 32 221 70 -114 -66 -78 36 94 -69 230 -48 230 110 -108 -20 279 -29 -92 -67 -242 -120 93
7700 93 -307 8 1 22 -182 -44 90 87 148 -3 160 -141 99 -250 -244 139 10 95 -105 84 14 -220 38 -66
7724 -66 27 53 -341 -39 -6 -2 -111 103 18 -36 -65 -137 -2 46 33 77 -223 -275 123 -151 -46 -55 -147 -67 70 -54
7750 -54 -25 9 249 -102 -159 -54 -7 109 86 8 -48 188 -140 -60 63 -23 6 103 -73 -71 101 114 200 -121 -101 -39
7776 -39 95 -39 53 15 154 7 -168 -217 -208 -200 -17 -191 109 12 52 -227 40 -40 236 -57 -167 49 -37 -149
7800 -149 -19 115 203 -176 67 244 -200 -158 3 -5 144 51 190 31 44 100 81 282 -121 80 -60 88 170
7823 170 65 81 209 99 34 7 33 161 230 307 8 -28 123 168 -116 1 114 -13 13 -11 81 -155 -105 90
7847 90 -169 14 -116 137 119 228 -31 56 59 -112 -223 -37 18 -12 -109 94 1 60 78 81 -187 -32 -130 -127 -102 -182
$$ packed form
7677gJ95j56J89j51j84M8j2J14N8j63K99k78K78j20k18Q8K99l08o3K5j75J22K13
7700I3m00L15pK1k04J38J34lO1j51J63l01K40l49OL83j29Q5k00J89p0k34K58j04
7724f6R3K6l94L02L3Mj09K14q5n4k9p2J35M8j3M4l00n2L98k74J05rr2Q0J37j24
7750e4K9L4K40l51n7J05M7J16k3p8n6K36l28Q0J23q6K9R7j76KJ72J3Q6l21K0O2
7776c9J34j34R2l8J39j47j75m9RQJ83j74L00r7M0k79K67q0K76k93j10K16q6j12
7800a49J30J34Q8l79K43J77m44M2J61qJ49r3J39j59J3N6j9K01m03K01j40J48Q2
7823A70j05J6J28j10o5k7K6J28O9P7k99l6J51M5k84J17J13j27K6k4R2k36N0J95
7847I0k59J83j30K53j8J09k59Q7Lj71j11J86N5l0r7K03r3N9J8Lk68J55r8LK5q0
$$ plain form
7873 -182 -34 151 -76 131 -4 43 66 -62 29 -2 -47 -50 -185 -10 160 -96 -71 -59 29 77 114 0 -215 35
7897 35 194 53 147 86 214 -90 -145 -92 52 -26 102 -48 205 -60 -190 -55 123 -87 71 170 -68 103
7919 103 -42 23 -149 -113 -35 -62 -153 -195 -216 -65 6 -15 -89 -186 5 335 55 -67 -99 41 -207 36 -95 -251
7943 -251 -145 -389 43 -7 -273 25 36 -74 -24 207 -3 61 82 -48 -60 299 202 5 -73 103 87 -57 285
7966 285 38 -50 -33 247 -107 -62 158 264 104 89 -201 -118 147 -81 -98 69 -19 12 89 16 84 90 -113 -8
7990 -8 34 11 150 -141 153 122 14 -301 -154 203 51 -248 -233 61 65 -191 -2 -150 114 1 -4 220 -181
8013 -181 -277 -60 -94 -47 -72 123 -45 -175 -109 -103 -117 -80 79 -31 46 -73 -66 -38 5 -39 -128 88 -119 -108 -156 9
8039 9 106 -136 -53 -67 94 -38 -29 7 108 91 -52 -144 27 144 -46 18 -51 67 89 36 -82 -170 156 -146 118
$$ packed form
7873a82J48J85k27K07j35M7K3j28R1l1m5lj35J75J70k56K5J2Q8M8L7j14k15K50
7897C5J59j41R4o1J28l04n5N3J44p8J28j50K53k65j30J35J78k10J58R9k38J71
7919A03j45O5j72L6P8k7r1m2k1J51P1k1p4r7J91L30k80j22l2J40k48K43j31j56
7943b51J06k44M32n0k66K98J1j10N0K31k10O4K1j30j2L59r7j97p8J76j6j44L42
7966B85k47q8J7K80l54M5K20J06j60j5k90Q3K65k28j7J67q8L1P7p3O8Ok03J05
7990hM2k3J39k91K94l1j08l15J47L57j52k99J5K94Mk56J89j48K64j13nK24m01
8013a81r6K17l4M7k5J95j68j30O6Oj4L7J59j10P7j19PK8M3m4q9K16k07J1m8J65
8039IR7k42Q3j4J61j32RL6J01j7j43r2J71J17j90O4o9J18K2n3j18q8L26l02K64
$$ plain form
8064 118 30 83 -19 33 -111 151 119 158 -153 89 -97 143 -160 218 89 -111 13 -38 -24 -19 66 99 71 -107
8088 -107 -202 0 92 80 -20 -83 220 -35 200 -163 92 76 -65 -39 -172 -228 161 -3 83 191 -165 335 -45
8111 -45 -241 -64 184 177 -452 65 -26 11 -121 -64 4 -63 33 -113 -8 150 142 169 -19 -165 -109 196 -9 -32 -130
8136 -130 -196 -109 -195 214 -28 249 -105 13 -279 258 -176 -134 -118 -230 38 -125 -216 182 -25 90 -132 51
8158 51 228 103 -96 132 -100 -29 -148 160 -47 -64 131 -56 152 -240 48 261 128 166 -7 -22 -208 -143
8180 -143 -57 21 235 -110 146 9 20 -26 161 151 -73
$$ packed form
8064A18q8N3j02N2j44K62l2L9l11K42j86K40l03L78j29k00J24n1J4NQ5L3k8j78
8088a07r5K02R2j2j00o3L03k55K35l63K55j6j41K6j33n6L89j64Q6J08l56N00l80
8111d5j96J77K48po29N17r1L7j32N7O8o7R6j46J05J58qK7j88j46N6L05k05k3r8
8136a30o6Q7q6M09k42K77l54J18k92N37m34M2J6j12K68j63r1L98k07J15k22J83
8158E1J77j25j99K28k32P1j19L08k07j7J95j87K08l92K88K13j33L8j73j5j86O5
8180a43Q6P8K14l45K56j37J1m6J87j0k24
8191g3
$$ Imaginary data points
##PAGE= N=2
##DATA TABLE= (X++(I..I)), XYDATA
$$ plain form
0 0 0 0 0 0 0 0 0 0 -7 8 -8 8 -10 16 -18 24 -32 40 -48 56 -64 80 -95 112 -128 150 -173 200 -231 265 -301
31 -301 345 -387 441 -496 560 -629 701 -786 875 -972 1078 -1197 1326 -1464 1618 -1784 1967
48 1967 -2167 2386 -2629 2897 -3193 3524 -3895 4314 -4791 5342 -5983 6744 -7655 8780
62 8780 -10202 12069 -14628 18363 -24337 35370 -62355 261284 220449 -307093 199819 130407
74 130407 13862 66675 -26273 151964 74109 -173058 210506 140074 -111131 41349 53913
85 53913 109760 53043 -121582 122358 83456 -100059 71619 17658 -14455 29478 -120437
96 -120437 88444 66921 -194858 34665 67231 -89823 6635 -78203 9749 81883 -209137
107 -209137 -9486 137247 -178904 -63281 44875 -93524 -7994 -63075 -79353 75232
$$ packed form
0@%%%%%%%%pJ5j6J6j8K6l4M2n6P2q8J04j20J44j75K07k40K78l23L73m31M96n66
31c01O46p32Q28r37J056j189J330j487J661j847K050k275K523k790L082l402L751
48A967m134M553n015N526o090O717p419Q209r105J0133j1325J2727j4399J6435
62H780j8982K2271k6697L2991m2700N9707r7725L23639m0835n27542N06912o9412
74A30407j16545N2813r2948J78237p7855k47167L83564p0432k51205J52480J2564
85E3913N5847n6717j74625K43940l8902j83515J71678n3961l2113M3933j49915
96a20437K08881k1523k61779K29523L2566j57054R6458q4838Q7952P2134k91020
107b09137J99651J46733l16151J15623J08156j38399Q5530n5081j6278J54585
$$ plain form
117 75232 -99005 -107726 89543 -18270 -93411 -41326 10386 38706 -87883 -62469 78525
128 78525 -54762 -59793 60159 -12568 -17727 -23780 715 102746 -32780 -68666 107627 19189
140 19189 -15790 64397 -19830 44099 47835 -38620 91773 39098 -60796 89150 45539 1668
152 1668 73598 -27747 45179 102058 -43396 31629 68444 -18314 35070 10314 13463 50153
164 50153 -53003 27125 67104 -55468 15573 24918 -20187 28904 -42511 -8852 52199 -77262
176 -77262 -16058 30564 -65018 1002 -24003 -52251 27071 -59378 -46000 41426 -64111 -42601
188 -42601 7225 -43163 -1815 -45217 -54176 27221 -48400 -52214 20595 -41197 -31758 -1542 -20403
201 -20403 8864 -33697 -21264 37437 -25320 -14067 26712 -22382 8437 20673 -15998 24628
$$ packed form
117G5232j74237q721J97269j07813p5141N2085N1712K8320j26589K5414J40994
128G8525j33287n031J19952p2727n159o053K4495J02031j35526l5886J76293q8438
140A9189l4979Q0187q4227O3929L736q6455J30393n2675r9894J49946m3611m3871
152A668P1930j01345P2926N6879j45454P5025L6815q6758N3384k4756L149L6690
164E0153j03156Q0128L9979j22572P1041R345m5105M9091p1415L3659O1051j29461
176g7262O1204M6622r5582O6020k5005k8248P9322q6449J3378Q7426j05537K1510
188d2601M9826n0388M1348m3402q959Q1397p5621l814P2809o1792R439L0216j8861
201b0403K9267m2561J2433N8701o2757J1253M0779m9094L0819J2236l6671M0626
$$ plain form
213 24628 6257 -1528 37230 6995 15942 33276 3427 35807 38121 -2048 36567 34526 9830
226 9830 30665 23855 23032 24093 12688 29966 27026 4709 27946 24798 8749 21205 12243 13530
240 13530 12440 198 8214 6706 -8990 3059 -2042 -12825 863 -12559 -11449 -3605 -17570
253 -17570 -15379 -6878 -22278 -19125 -13732 -27321 -19800 -23083 -26598 -22348 -27034 -25216 -20918 -25060
267 -25060 -22813 -14912 -22473 -17642 -15306 -15307 -16245 -16733 -10432 -14782 -13506 -7037 -6232 -9821 -290 291 321
284 321 5946 3420 10352 8807 8477 13854 14599 9304 16069 19428 13422 19996 19276 19997 20499 22964 21716
301 21716 22310 21924 20150 24295 19836 19811 18713 19209 15151 16018 15328 9229 11629 9458 8068 6836 7214
318 7214 2450 4795 2019 -3728 522 -6778 -8636 -7205 -10366 -14295 -10856 -15546 -15230 -14016 -21013
$$ packed form
213B4628j8371p785L8758l0235Q947J7334k9849L2380K314m0169L8615k041k4696
226I830K0835o810q23J061j1405J7278k940k2317K3237l148j6049J2456q962J287
240A3530j090j2242Q016j508j5696J2049n101j0783J3688j3422J110P844j3965
253a7570K191Q501j5400L153N393j3589P521l283l515M250m686J818M298m142
267b5060K247P901p561M831K336jr38m88O301m350J276O469Q05l589R531N81L0
284C21N625k526O932j545l30N377P45n295O765L359o006O574p20P21N02K465j248
301B1716N94l86j774M145m459k5j098M96m058Q67o90o099K400k171j390j232L78
318G214m764K345k776n747M250p300j858J431l161l929L439m690L16J214o997
$$ plain form
333 -21013 -14370 -18278 -21463 -17436 -18147 -21110 -18838 -20263 -18319 -17709 -24895 -14176 -17222 -20533 -13573
348 -13573 -15362 -12338 -10382 -13988 -5484 -2506 -14130 443 983 -5827 3719 -1514 3595 10267 -1195
363 -1195 8207 18037 676 13943 20569 9910 20132 11038 16251 29245 8667 12969 29760
376 29760 10124 18265 23140 11360 26826 9292 10438 34110 6752 5377 25030 6728 15573
389 15573 9516 -5446 25587 -2058 -13130 23373 -5952 -11391 7152 -11321 5759 -8654
401 -8654 -28983 18515 -13440 -34880 9485 -17078 -19604 -9318 -32488 2124 -14343 -47503
413 -47503 9600 -15829 -40220 2491 -23149 -12927 -8398 -42610 8995 -1364 -45730 6272
425 6272 -10088 -18408 11133 -29993 3739 12416 -40218 19843 20057 -31292 13444 5926 7937
$$ packed form
333b1013O643l908l185M027p11k963K272j425J944O10p186J0719l046l311O960
348a3573j789L024J956l606Q504K978j1624J4573N40o810R546n233N109O672j1462
363a195R402R830j7361J3267O626j0659J0222r094N213J2994k0578M302J6791
376B9760j9636Q141M875j1780J5466j7534J146K3672k7358j375J9653j8302Q845
389A5573o057j4962L1033k7645j1072L6503k9325n439J8543j8473J7080j4413
401h654k0329M7498l1955k1440M4365k6563k526J0286k3170L4612j6467l3160
413d7503N7103k5429k4391M2711k5640J0222M529l4212N1605j0359m4366N2002
425F272j6360q320K9541m1126L3732Q677n2634O0061K14n1349M4736p518K011
$$ plain form
438 7937 26305 -26213 19335 37611 -23439 22886 28023 -8169 24080 5689 21974 41829
450 41829 -26224 20942 55193 -10988 16037 25522 4131 31804 -367 5615 41873 -15640
462 -15640 3890 36057 -7415 9354 3967 -4630 32518 -15887 -21411 38611 -13353 -20740 13811
475 13811 -16404 3170 -9744 -32263 20218 -15617 -44894 20102 -11141 -33196 -7467 -24228
487 -24228 11140 -16094 -59371 18574 -1782 -51623 8017 -15890 -26490 5207 -34775 10098
499 10098 4736 -60164 17497 19110 -35915 5330 -14547 -358 28110 -39221 14063 27762
511 27762 -41663 28483 22421 -19143 26936 -13366 13115 56302 -36880 9377 49855 -14187
523 -14187 29806 8662 -1798 52778 -19405 6766 65127 -29357 6650 44261 -7652 31436
$$ packed form
438G937J8368n2518M5548J8276o1050M6325N137l6192L2249j8391J6285J9855
450D1829o8053M7166L4251o6181K7025R485k1391K7673l2171N982L6258n7513
462a5640J9530L2167m3472J6769n387q597L7148m8405n524O0022n1964p387L4551
475A3811l0215J9574j2914k2519N2481l5835k9277O4996l1243k2055K5729j6761
487b4228L5368k7234m3277P7945k0356m9841N9640k3907j0600L1697l9982M4873
499A0098n362o4900P7661J613n5025M1245j9877J4189K8468o7331N3284J3699
511B7762o9425P0146o062m1564M6079m0302K6481M3187r3182M6257M0478o4042
523a4187M3993k1144j0460N4576p2183K6171N8361r4484L6007L7611n1913L9088
$$ plain form
535 31436 -9197 -4518 63254 -25885 -13472 51443 -19524 2700 14814 -17719 30714 -23253
547 -23253 -19685 49700 -34330 -26061 27983 -21387 963 -13189 -36157 32535 -21931 -42770
559 -42770 24066 -26398 -23636 3609 -28345 3680 -18943 -44229 28246 -10329 -46932 6785
571 6785 -12344 -7535 -3792 -33737 10074 319 -36126 16061 4150 -27023 5201 -1733 9893
584 9893 4101 -27634 21345 23390 -22287 11869 16067 -2725 17845 -1417 13485 27078 -16238
597 -16238 15750 37595 -7631 7325 20082 11364 25865 -5716 5905 41279 -6579 1694
609 1694 31363 -1009 7398 11955 1597 23530 -8473 -7778 33570 -7590 -10844 13500 -6485
622 -6485 6772 -3996 -17381 16556 -12455 -20338 15443 -17016 -14098 -1168 -20638 5676 -12255
$$ packed form
535C1436m0633M679O7772q9139J2413O4915p0967K2224J2114l2533M8433n3967
547b3253L568O9385q4030Q269N4044m9370K2350j4152k2968O8692n4466k0839
559d2770O6836n0464K762K7245l1954L2025k2623k5286P2475l8575l6603N3717
571F785j9129M809L743k9945M3811r755l6445N2187j1911l1173L2224o934J1626
584I893n792l1735M8979K045m5677L4156M198j8792K0570j9262J4902J3593m3316
597a6238L1988K1845m5226J4956J2757q718J4501l1581J1621L5374m7858Q273
609A694K9669l2372Q407M557j0358K1933l2003O95M1348m1160l254K4344j9985
622f485J3257j0768j3385L3937k9011p883L5781l2459K918J2930j9470K6314j7931
$$ plain form
635 -12255 -33451 11620 -10513 -27792 2119 -19606 -9494 -4629 -28046 3314 -8508 -29818
647 -29818 6815 -8087 -18656 1272 -15763 1003 2138 -22240 7253 2970 -13331 7868
659 7868 -2850 -1688 10026 -7650 11123 11452 -9773 15262 12232 893 13294 3989 10952
672 10952 18395 -296 14071 17607 1238 16945 13272 6340 14701 6316 10504 16616 3134 8159
686 8159 12593 3638 10024 5109 2458 8282 238 1770 6233 -2323 -1175 2111 -3278 -110 -4688
701 -4688 -6024 -1731 -8063 -7862 -4611 -9796 -9828 -6909 -11455 -8473 -9566 -12943 -8583 -10756 -11449 -9163
717 -9163 -11121 -11748 -8243 -11009 -8668 -6829 -10610 -7082 -6108 -6100 -5285 -5512 -4530 -2318 -3501 -961 1123
734 1123 -2581 2160 2973 2832 4026 3448 5166 6648 5849 7411 8883 5679 9926 9825 8891 9986 9518
$$ packed form
635a2255k1196M5071k2133j7279K9911k1725J0112M865k3417L1360j1822k1310
647b9818L6633j4902j0569J9928j7035J6766J135k4378K9493m283j6301K1199
659G868j0718J162J1714j7676J8773L29k1225K5035l030j1339J2401r305O963
672A0952P443j8691J4367L536j6369J5707l673o932Q361q385M188O112j3482N025
686H159M434q955O386m915k651N824q044J532M463q556J148L286n389L168m578
701d688j336M293o332K01L251n185l2K919m546K982j093l377M360k173o93K286
717i163j958o27L505k766K341J839l781L528R74QQ15k27R82K212j183K540K084
734A123l704M741Q13j41J194n78J718J482p99J562J472l204M247j01r34J095m68
$$ plain form
751 9518 10415 9871 10593 9802 9663 7641 10463 9222 7290 8703 7185 6930 6193 6427 4848 3637 2922
768 2922 3599 2051 -46 1209 -1730 -1214 -1929 -2841 -3944 -5215 -5802 -5191 -6485 -8074 -5949 -9423 -8272
785 -8272 -7454 -10065 -8995 -9501 -9859 -9171 -9542 -10018 -7761 -10410 -8362 -6583 -9112 -6429 -7165 -6447 -4543
802 -4543 -5747 -5229 -1168 -4880 -2241 703 -2644 1542 913 1145 4611 1603 2912 7712 3554 4894
818 4894 9017 4537 9006 7835 6154 11802 7663 6415 12316 7672 7089 11316 5820 11085 8979
833 8979 3948 12016 7197 3271 9028 4502 4379 7226 -1056 6074 4939 -4668 5260 780 -4172
848 -4172 2184 -4364 -2213 801 -11743 -1288 166 -13601 -2305 -6243 -9890 -2271 -13313 -7880
862 -7880 -922 -17908 -6208 -1389 -16014 -5198 -9347 -9389 651 -16639 -8327 3867 -15389 -4522
$$ packed form
751I518Q97n44P22p91j39k022K822j241j932J413j518k55p37K34j579j211p15
768B922O77j548k097J255k939N16p15r12j103j271n87O11j294j589K125l474J151
785h272Q18k611J070n06l58O88l71m76K257k649K048J779k529K683p36P18J904
802d543j204N18M061l712K639K944l347M186o29K32L466l008J309M800m158J340
818D894M123m480M469j171j681N648m139j248N901m644n83M227n496N265k106
833H979n031Q068m819l926N757m526j23K847q282P130j135r607R928m480m952
848d172O356o548K151L014j2544J0455J454j3767J1296l938l647P619j1042N433
862g880O958j6986J1700M819j4625J0816m149m2J0040j7290Q312J2194j9256J0867
$$ plain form
876 -4522 589 -11433 1980 -7089 -5156 10114 -11605 -4036 11661 -5844 2398 3490 -3813 14205
890 14205 -1931 -1876 19309 -2283 2257 15403 1183 11156 5754 -965 23381 3069 -3456 21488
904 21488 5193 5106 10573 960 16465 5150 -6126 21066 4105 -6693 14628 2463 4068
917 4068 3279 -7552 14149 3585 -16028 9123 3020 -9444 2921 -7065 -40 -797 -17327 4766
931 4766 1628 -21853 -2684 -31 -9837 -4203 -17687 -3625 4650 -22660 -6838 3592 -17142
944 -17142 -6344 -4182 -7957 913 -19478 -5623 14498 -18629 -10675 7833 -7090 565 -5295
957 -5295 -7042 14388 -10667 -6976 21507 -8001 -5054 11705 567 12050 -2858 -6278 27841
970 27841 -318 -8129 22531 967 6322 11323 -3305 21614 3794 -9804 28662 5305 -7785
$$ packed form
876d522N111j2022J3413r069J933J5270k1719P569J5697j7505Q242J092p303J8018
890A4205j6136N5K1185k1592M540J3146j4220R973n402o719K4346k0312o525K4944
904B1488j6295q7N467r613J5505j1315j1276K7192j6961j0798K1321j2165J605
917D068p89j0831K1701j0564j9613K5151o103j2464J2365r986P025p57j6530K2093
931D766l138k3481J9169K653r806N634j3484J4062Q275k7310J5822J0430k0734
944a7142J0798K162l775Q870k0391J3855K0121l3127P954J8508j4923P655n860
957e295j747K1430k5055L691K8483k9508K947J6759j1138J1483j4908l420L4119
970B7841k8159p811L0660k1564N355N001j4628K4919j7820j3598L8466k3357j3090
$$ plain form
983 -7785 16614 886 13718 6907 -14256 23005 7458 -14629 17203 834 -4290 10107 -10798
996 -10798 11380 4002 -24448 15845 5280 -18422 3759 -7544 -1314 3816 -24154 4557 3481
1009 3481 -25895 5411 -2317 -15832 -768 -15673 57 3761 -28511 -1060 7142 -19073 -1693
1022 -1693 -7233 -7064 4505 -16841 -1614 8269 -19059 -1070 8018 -8342 1360 -5857 1028 13835
1036 13835 -11468 -2079 14784 -3709 1470 7554 231 9816 226 2631 18243 -2120 -934
1049 -934 16361 5715 4105 5274 2851 15657 4588 -3103 16214 4885 -754 11284 3869
1062 3869 4308 4276 -2499 11863 5213 -10128 8468 4739 -4045 2972 -4607 1446 2764 -11049 2558
1077 2558 2165 -13956 1297 -1124 -7958 -1436 -11672 -2162 2107 -16960 -4534 140 -13190 -1850
$$ packed form
983g785K4399j5728J2832o811k1163L7261j5547k2087L1832j6369n124J4397k0905
996a0798K2178p378k8450M0293j0565k3702K2181j1303O230N130k7970K8711j076
1009C481k9376L1306p728j3515J5064j4905J5730L704l2272K7451Q202k6215J7380
1022a693n540J69J1569k1346J5227R883k7328J7989R088j6360R702p217O885J2807
1036A3835k5303R389J6863j8493N179O084p323R585r590K405J5612k0363J186
1049i34J7295j0646j610J169k423J2806j1069p691J9317j1329n639J2038p415
1062C869M39l2o775J4362o650j5341J8596l729q784P017p579O053J318j3813J3607
1077B558l93j6121J5253k421o834O522j0236R510M269j9067J2426M674j3330J1340
$$ plain form
1091 -1850 -7352 -8981 1309 -13376 -4933 2975 -14455 -4024 258 -8560 563 -7624 -5624 7315
1105 7315 -8789 -2860 5569 -6562 2418 2107 -2944 6661 -2564 292 11908 -2782 2140 8359
1119 8359 963 8314 3797 1442 11641 2318 3494 12148 1601 5939 8470 2752 9663 3884
1133 3884 1725 10344 3340 2426 7240 903 4575 4288 -545 4905 1195 -1087 3635 -37 -1616
1148 -1616 527 -2709 -191 -2016 -5248 -510 -3054 -5363 -3060 -4389 -5116 -4294 -6279 -4683 -4643 -7499
1164 -7499 -4016 -5087 -6836 -5205 -5520 -5452 -4496 -5918 -5155 -3103 -5106 -3217 -2931 -4063 -2306 -2064 -2297
1181 -2297 -1053 -1151 -1637 1305 162 835 1865 986 2780 3008 2458 3963 4059 3281 5297 4198 4823 5684
1199 5684 4594 6259 5286 4780 6174 5308 4663 5845 4776 4537 5276 3582 4808 3733 3198 3723 2718
$$ packed form
1091a850n502j629J0290j4685Q443P908j7430J0431M282q818R123q187K000J2939
1105G315j6104N929Q429j2131Q980l11n051R605r225K856J1616j4690M922O219
1119H359p396P351m517k355J0199r323J176Q654j0547M338K531n718O911n779
1133C884k159Q619p004r14M814o337L672k87m833N450l710k282M722l672j579
1148a616K143l236K518j825l232M738k544k309K303j329p27Q22j985J596M0k856
1164g499L483j071j749J631l15O8R56j422P63K052k003J889K86j132J757K42k33
1181b297J244r8m86K942j143O73J030q79J794K28n50J505R6p78K016j099O25Q61
1199E684j090J665r73n06J394q66o45J182j069k39P39j694J226j075n35N25j005
$$ plain form
1216 2718 2118 2593 1169 703 1232 -625 519 -879 -1244 -1102 -2743 -2268 -2469 -3383 -3808 -3237 -4657 -3571
1234 -3571 -4528 -4995 -4190 -5610 -4937 -4836 -5304 -5021 -4710 -5580 -4048 -4569 -5283 -3326 -4747 -3673 -3318 -3656
1252 -3656 -2795 -2650 -2615 -1130 -1223 -1798 599 -623 737 1189 232 2256 2296 1209 3267 3215 2545 4964
1270 4964 3219 4569 5022 2983 5477 5140 3496 5504 5060 3896 5961 3600 4927 5660 2142 4888
1286 4888 4655 2283 3722 2671 2044 3953 262 1247 3406 -1589 742 1048 -1613 -154 -2030 -2205
1302 -2205 469 -4055 -3557 -41 -5305 -2851 -2720 -5675 -2103 -5579 -6336 -917 -6408 -6866 -1789 -6204
1318 -6204 -3658 -3907 -7290 -531 -4937 -6836 452 -4292 -4701 -96 -4442 390 -1258 -5824 4163
1333 4163 -666 -4311 3879 -489 247 3249 -2476 5379 3902 -3201 7876 3861 -164 6847 2224
$$ packed form
1216B718o00M75j424m66N29j857J144j398l65J42j641M75k01r14m25N71j420J086
1234c571r57m67Q05j420O73J01m68K83L11q70J532n21p14J957j421J074L55l38
1252c656Q61J45L5J485r3n75K397j222J360M52r57K024M0j087K058n2o70K419
1270D964j745J350M53k039K494l37j644K008m44j164K065k361J327P33l518K746
1286D888k33k372J439j051o27J909l691R85K159m995K331L06k661J459j876j75
1302b205K674m524M98L516n264K454J31k955L572l476p57N419n491m58N077m415
1318f204K546k49l383O759m406j899P288m744m09M605m346M832j648m566R987
1333D163m829l645Q190m368P36L002n725P855j477p103J1077m015m025P011m623
$$ plain form
1348 2224 4702 6538 -1436 7797 7592 -2006 7820 4795 2221 7407 62 5417 7402 -3406 5907
1363 5907 6918 -2852 4381 1680 1640 5771 -5180 1461 6062 -6039 418 2046 -4417 1214 -4009
1378 -4009 -2386 3045 -9531 -3994 3954 -7323 -4702 -2518 -5602 41 -7877 -6928 2806 -8296
1392 -8296 -6878 1077 -6293 -4433 -3967 -5689 2719 -6011 -8861 4577 -2833 -5792 690 -3354 956
1407 956 -355 -5744 5740 451 -6644 6599 2458 -1525 2985 -989 6994 5018 -5985 7975
1421 7975 7488 -3167 7025 3539 2749 7082 -2104 8020 8843 -5819 7226 9338 -1420 6030
1435 6030 87 3690 9903 -6562 3764 9335 -5925 3895 4001 -2606 4774 -5488 168 9301
1449 9301 -10182 -1894 5915 -6511 702 -3505 -5434 5244 -9348 -5536 6302 -10685 -4638
$$ packed form
1348B224K478J836p974R233k05r598R826l025k574N186p345N355J985j0808R313
1363E907J011r770P233k701m0M131j0951O641M601j2101O457J628o463N631n223
1378d009J623N431j2576N537P948j1277K621K184l084N643p918R49R734j1102
1392h296J418P955p370J860M66j722Q408q730k850J3438p410k959O482m044M310
1407I56j311n389J1484n289p095J3243m141l983M510l974P983j976j1003J3960
1421G975m87j0655J0192l486p90M333r186J0124Q23j4662J3045K112j0758P450
1435F030n943L603O213j6465J0326N571j5260R820J06o607P380j0262N656R133
1449I301j9483Q288P809j2426P213m207j929J0678j4592L812J1838j6987O047
$$ plain form
1462 -4638 1189 -7206 585 -7870 -7360 6587 -9211 -8548 3802 -7177 -2154 -2122 -7318 4026 -6401
1477 -6401 -6721 7098 -5126 -5514 3666 -2596 2644 -1237 -5608 8857 -268 -4392 6874 510
1491 510 384 4307 -318 6555 2140 -3116 9913 4083 -1957 5827 3671 4615 4395 -1245 6942 5869
1507 5869 -1932 6330 5014 -35 3923 2009 3896 3842 -2931 3293 5945 -3100 580 2279 -788
1522 -788 1573 -2645 -1011 2265 -4881 -2070 2935 -4856 -3150 -990 -3299 103 -6036 -5131 2050
1537 2050 -5308 -5825 -157 -5566 -3136 -2586 -5782 301 -5033 -6404 2342 -4074 -4842 -416 -4259 283
1553 283 -1385 -6066 2785 -1167 -3871 3384 -2024 -837 2286 -1923 3606 1654 -3034 5499 2179
1568 2179 -336 4810 457 3285 4547 -489 5331 3960 -338 6100 3006 1782 5235 749 4804
$$ packed form
1462d638N827q395P791q455N10J3947j5798O63J2350j0979N023L2n196J1344j0427
1477f401l20J3819j2224l88R180o262N240l881m371J4465r125m124J1266o364
1491E10j26L923m625O873m415n256J3029n830o040P784k156R44k20n640Q187j073
1507E869p801Q262j316n049L958j914J887n4o773O224K652r045L680J699l067
1522g88K361m218J634L276p146K811N005p791J706K160k309L402o139R05P181
1537B050p358n17N668n409K430N50l196O083n334j371Q746o416p68M426l843M542
1553B83j668m681Q851l952k704P255n408J187L123m209N529j952m688Q533l320
1568B179k515N146m353K828J262n036N820j371m298O438l094j224L453m486M055
$$ plain form
1583 4804 4757 -555 4740 3675 91 4012 1002 1053 3531 -990 2227 1874 -2217 1615 714 -1491
1599 -1491 743 -1854 -905 536 -3243 -1403 -1113 -3541 -1470 -2563 -3176 -1768 -3722 -2836 -1673 -4603
1615 -4603 -3127 -2200 -3374 -2943 -3681 -3317 -1829 -2991 -2951 -1653 -2602 -2240 -1278 -1820 -1345 -1455 -1021 -201
1633 -201 -355 -967 290 250 292 1317 798 1365 1770 1530 2163 2194 1858 2775 2594 2299 3294 2411 3100 3309
1653 3309 2508 3027 3099 2533 3119 2885 2009 3011 1938 2445 2478 1387 1663 1575 697 1262 807 27 815 -355
1673 -355 -366 -17 -1080 -622 -1121 -1706 -1570 -1803 -2383 -1764 -2644 -2407 -2230 -3087 -2388 -2872 -2899 -2600 -3143 -2689
1693 -2689 -2481 -3085 -2686 -2215 -3062 -1772 -2183 -2087 -1411 -1897 -1572 -1114 -1299 -1114 39 -1030 246 169 -79
1712 -79 1085 251 1031 1371 1264 1578 2024 1400 2340 2227 2048 3025 1821 2559 2866 2212 2924 2901 2201 2837
$$ packed form
1583D804m7n312N295j065l584L921l010N1K478m521L217l53m091L832r01k205
1599a491K234k597R49J441l779J840K90k428K071j093o13J408j954Q86J163k930
1615d603J476R27j174M31p38L64J488j162M0J298r49L62R62n42M75j10M34Q20
1633b01j54o12J257m0M2J025n19N67M05k40O33L1l36R17j81k95R95q83O89K09
1653C309q01N19P2n66N86k34q76J002j073N07L3j091K76q8q78N65m55p80P88j170
1673c55j1L49j063M58m99n85J36k33n80O19q80K37J77q57O99m84k7K99n43M54
1693b689K08o04L99M71q47J290m11R6O76m86L25M58j85J85J153j069J276p7k48
1712g9J164q34P80L40j07L14M46o24R40j13j79R77j204P38L07o54P12k3p00O36
$$ plain form
1732 2837 2077 2000 3314 1517 1867 2452 1216 1905 1423 887 1544 736 -323 1462 -322 -102 259 -880
1750 -880 -155 -843 -1758 -354 -1359 -2568 -660 -2245 -2290 -1600 -3240 -1646 -2085 -3963 -1247 -2354 -3747
1767 -3747 -1548 -2982 -2512 -1750 -3883 -1001 -1208 -3624 -891 -1011 -2382 -465 -1616 -820 770 -2711
1783 -2711 419 1108 -1616 1350 763 123 2370 -155 1270 3508 -686 2185 3470 817 3089 1375
1799 1375 2098 4424 308 1801 5028 275 2488 3340 1182 3875 799 1441 4648 -387 215 3863
1815 3863 -226 1616 790 -935 3344 -1020 -1537 3300 -1716 -1516 1041 -2123 220 -1722 -3366 1955
1831 1955 -2534 -4231 842 -2580 -2344 -1690 -3949 -186 -2173 -5110 594 -2362 -4351 -907 -2426
1846 -2426 -1602 -1586 -4421 788 -303 -4855 481 -572 -2368 400 -1792 403 1162 -3027 1716 2514
$$ packed form
1732B837p60p7J314j797L50N85j236O89m82n36O57q08j059J785j784K20L61j139
1750h80P25o88r15J404j005j209J908j585m5O90j640J594m39j878K716j107j393
1767c747K199j434M70P62k133K882k07k416K733j20j371J917j151P96J590l481
1783b711L130O89k724K966n87o40K247k525J425K238m194K871J285k653K272j714
1799A375P23K326m116J493L227m753K213Q52k158K693l076O42L207n035O02L648
1815C863m089J842q26j725M279m364n17M837n016K00K557l164K343j942j644N321
1831A955m489j697N073l422K36O54k259L763j987k937N704k956j989L444j519
1846b426Q24J6k835N209j091m552N336j053j796K768k192K195P59m189M743P98
$$ plain form
1862 2514 -2212 1682 1715 762 2551 -1219 2049 4293 -1312 1561 4116 -127 2570 2354 1569 4235
1878 4235 -287 1677 6112 -336 671 4084 704 2619 663 -271 5457 -1008 -842 4648 -749
1893 -749 -108 1607 -1034 2547 -1276 -3255 4394 -1819 -3415 1788 -2606 -390 -766 -4154 1725 -1975
1909 -1975 -5443 2160 -2651 -4205 -205 -3964 -183 -1908 -6245 1755 -1353 -5360 714 -2423 -2189
1924 -2189 15 -4431 1460 -437 -5724 2162 252 -2983 985 -1727 930 2296 -3734 2519 2463
1939 2463 -2570 2788 1386 328 2528 -789 2889 4165 -2068 3069 3968 12 3018 1176 2085
1954 2085 4013 -966 2214 4408 -729 1873 3122 558 1883 23 1508 3147 -1427 -195 3090
1969 3090 -443 129 192 -1020 792 -1267 -1303 1312 -1873 -2472 726 -1244 -1889 -1527 -2641 169 -1460
$$ packed form
1862B514m726L894L3r53J789l770L268K244n605K873K555m243K697k16p85K666
1878D235m522J964M435o448J007L413l380J915j956r34N728o465J66N490n397
1893g49O41J715k641L581l823j979P649o213j596N203m394K216l76l388N879l700
1909a975l468P603m811j554M000l759L781j725m337Q000l108m007O074l137K34
1924b189K204m446N891j897n287P886j910l235L968k712K657J366o030O253n6
1939B463n033N358j402j058K200l317L678J276o233N137Q99l956L006j842R09
1954B085J928m979L180K194n137K602J249k564J325j860J485J639m574J232L285
1969C090l533N72O3j212J812k059l6K615l185n99L198j970o45L62j114K810j629
$$ plain form
1986 -1460 -3832 -343 -1694 -3189 -895 -1924 -1887 -1341 -3338 -86 -1130 -3978 -293 -707 -2058 -598
2002 -598 -1928 -519 558 -2604 390 851 -2195 1158 554 -443 1595 -713 1142 2525 -1458 1519
2018 1519 2658 79 2388 845 1115 3261 7 2018 3838 -190 2208 2768 763 3083 569
2033 569 1200 3607 2 1369 2356 -139 1769 876 -264 1720 -702 -172 1892 -1534 -175 720
2049 720 -1051 424 -1064 -1560 438 -1880 -1567 -425 -2293 -1077 -1289 -1933 -893 -2190 -2561 -566
2065 -566 -2175 -1829 -1185 -2145 -1297 -1557 -2155 -1178 -1177 -1493 -570 -1088 -1197 -306 -832 -47 -566 -391 314 235 -14
2086 -14 394 479 407 1137 650 890 1120 914 1471 1719 1207 1424 1678 1641 1931 1305 1539 2036 1829 1708 1571
2107 1571 1486 1601 1647 975 1485 1274 904 1232 611 636 694 101 246 429 -485 108 -174 -812 36 -869 -734
$$ packed form
1986a460k372L489j351j495K294j029L7N46j997L252j044k848L685m14j351J460
2002e98j330J409J077l162K994M61l046L353o04r97K038k308J855J383l983K977
2018A519J139k579K309j543K70K146l254K011J820m028K398N60k005K320k514
2033E69O31K407l605J367R87k495J908q93j140J984k422N30K064l426J359Q95
2049G20j771J475j488m96J998k318L13J142j868J216k12o44J040j297l71J995
2065e66j609L46O44r60Q48k60n98R77Jl16R23n18j09Q91n26P85n19J75P05p9k49
2086a4M08Q5p2P30m87K40K30k06N57K48n12K17K54l7K90o26K34M97k07j21j37
2107A571q5J15M6o72N10k11l70L28o21K5N8n93J45J83r14N93k82o38Q48r05J35
$$ plain form
2128 -734 -550 -1158 -1052 -1188 -1462 -1203 -1404 -1698 -1207 -2020 -1519 -1375 -2215 -1504 -1522 -1868 -1410 -1292 -1487 -953
2148 -953 -1389 -991 -624 -1219 -594 -938 -759 -203 -240 -395 386 -185 233 343 256 686 549 907 1086 1004 1085
2169 1085 1339 921 1216 1322 1505 1819 1264 1426 1882 1597 1571 1381 1281 1305 1239 951 1759 1137 754 1141 544
2190 544 733 607 278 494 415 -484 193 -265 -482 -136 -967 -626 -565 -1310 -635 -780 -1496 -1311 -1362 -1493 -1091
2211 -1091 -1714 -1306 -1151 -2132 -1496 -1168 -1739 -1153 -1411 -1441 -617 -1666 -916 -357 -1523 -766 -387 -802 -197
2230 -197 -724 -422 632 -655 -113 1225 -316 610 922 423 1284 452 506 2048 618 856 2085 777
2248 777 1512 1249 839 2383 1190 543 2730 1071 929 1978 537 1882 726 -24 1986 486 -104
2265 -104 1397 217 472 740 -1204 1258 -52 -1284 805 -355 -1265 82 -1295 -552 -447 -2794
$$ packed form
2128g34J84o08J06j36k74K59k01k94M91q13N01J44q40P11j8l46M58J18j95N34
2148i53m36L98L67n95O25l44J79N56l7j55P81n71M18J10q7M30j37L58J79q2Q1
2169A085K54m18K95J06J83L14n55J62M56k85k6j90j00K4o6k88Q08o22l83L87n97
2190E44J89j26l29K16p9q99O77m58k17L46q31L41O1p45O75j45p16J85n1j31M02
2211a091o23M08J55r81O36L28n71N86k58l0Q24j049P50N59j166P57L79m15O05
2230a97n27L02J054j287N42J338j541R26L12m99Q61q32N4J542j430K38J229j308
2248G77P35k63m10J544j193o47K187j659j42J049j441J345j156p50K010j500n90
2265a04J501j180K55K68j944K462j310j232K089j160r10J347j377P43J05k347
$$ plain form
2281 -2794 149 -436 -2491 -584 -1503 -1881 -669 -2380 -830 -638 -2865 -610 -495 -2287 -472 -1611
2297 -1611 -973 -212 -2361 -353 500 -2119 -329 82 -684 537 -908 123 1328 -1346 153 1534
2313 1534 -382 592 714 613 1957 1 669 2539 373 676 2183 612 1442 1410 860 2701 259
2330 259 186 2590 798 357 1506 649 1483 851 -625 2092 533 -990 1643 317 -218 333 -1084
2347 -1084 880 276 -2441 799 19 -1987 134 -1371 -919 -284 -2850 133 -298 -3188 -65 -320
2363 -320 -2015 -421 -2362 -535 52 -3316 -564 246 -2693 -53 -711 -1489 346 -2267 -279 1300
2379 1300 -2646 -90 838 -1124 799 -724 57 2221 -1430 369 2524 -835 1031 1201 166 2121
2395 2121 -191 839 3397 -444 799 2527 67 1968 788 193 2761 369 333 2782 -119 393
$$ packed form
2281b794K943n85k055J907r19l78J212j711J550J92k227K255J15j792J815j139
2297a611O38P61k149K008Q53k619J790M11p66J221j445J031J205k674J499J381
2313A534j916R74J22j01J344j956O68J870k166L03J507j571Q30l2n50J841k442
2330B59p3K404j792m41J149q57Q34o32j476K717j559j523K633j326n35N51j417
2347a084J964o04k717L240p80k006K121j505M52O35k566K983m31k890L123k55
2363c20j695J594j941J827N87l368K752Q10k939K640o58p78J835k613J988J579
2379A300l946K556R28j962J923j523P81K164l651J799K155l359J866J70j035J955
2395B121k312J030K558l841J243J728k460J901j180n95K568k392l6K449k901N12
$$ plain form
2411 393 1556 229 1508 -324 -406 1902 -336 -705 909 -289 -348 69 -1032 732 -883 -1617 726
2428 726 -876 -1557 -635 -813 -795 -850 -2254 -441 -708 -2261 -741 -1039 -1579 -1020 -1039 -1002 -845 -2094 -347
2447 -347 247 -1660 -527 -488 -476 -228 -570 -593 521 -998 -254 1150 -665 242 659 228 1445 -34
2465 -34 5 1859 266 413 1659 127 1451 1302 593 1898 654 604 2096 542 962 1656 438 1712
2483 1712 533 -206 1857 476 81 1305 -190 609 689 -716 989 -62 -1056 972 -581 -822 -180
2500 -180 -1285 24 -487 -1632 -91 -923 -1323 -100 -1590 -1124 -683 -1398 -660 -746 -1711 -501 -698 -1150
2518 -1150 -617 -1215 -651 -455 -1284 -558 -790 -809 108 -564 -291 123 -536 149 295 -305 544 374 221 281
2538 281 529 370 707 648 1185 949 606 960 880 1164 1035 727 945 894 995 849 1375 775 811 996 795
$$ packed form
2411C93J163j327J279j832q2K308k238l69J614j198n9M17j101J764j615p34K343
2428G26j602o81R22j78J8n5j404J813k67j553J520k98n40N59j9L7J57j249J747
2447c47N94j907J133L9J2K48l42k3J114j519P44J404j815R07M17m31J217j479
2465c4L9J854j593J47J246j532J324j49p09J305j244n0J492j554M20O94j218J274
2483A712j179p39K063j381l95J224j495P99Q0j405J705j051r94K028j553k41O42
2500a80j105J309n11j145J541q32m00J223j490M66M41p15P38q6r65J210j97m52
2518a150N33n98N64J96q29P26k32j9R17o72K73M14o59O85J46o00Q49j70j53O0
2538B81K48j59L37n9N37k36l43L54q0K84j29l08K18n1J01j46N26o00L6J85k01
$$ plain form
2559 795 778 708 685 447 569 154 708 370 266 277 -167 -143 51 -573 -257 -240 -657 -377 -826 -745 -699 -752 -808
2582 -808 -603 -990 -938 -820 -933 -743 -1183 -953 -869 -1072 -963 -864 -1160 -624 -949 -712 -142 -798 -592 -119 -370
2603 -370 9 -236 123 241 87 88 377 290 236 1000 473 557 849 620 905 791 815 1097 897 817 1156 853
2625 853 1000 858 751 1208 909 864 929 839 705 886 680 612 580 270 751 229 347 135 -23 -37 191 -570
2647 -570 -187 -334 -624 -93 -720 -663 -330 -1050 -729 -599 -990 -732 -723 -974 -845 -1085 -1106 -395 -908 -786 -703 -825
2669 -825 -446 -529 -921 -429 -629 -536 63 -689 -418 -178 -413 101 206 -64 578 337 -4 690 323 299 759
2690 759 471 742 850 433 1254 707 518 1020 567 911 984 393 1228 684 508 943 770 475 881 216
2710 216 835 646 -409 592 358 20 310 -189 -65 292 -763 -90 -15 -1226 -290 -373 -933 -217 -973
$$ packed form
2559G95j7p0k3k38J22m15N54l38j04J1m44K4J94o24L16J7m17K80m49Q1M6n3n6
2582h08K05l87N2J18j13J90m40K30Q4k03J09R9k96N36l25K37N70o56K06M73k51
2603c70L79k45L59J18j54JK89q7n4P64n27Q4K92k29K85j14K4K82k00q0L39l03
2625H53J47j42j07M57k99m5O5r0j34J81k06o8l2l10M81n22J18k12j58j4K28p61
2647e70L83j47k90N31o27N7L33p20L21J30l91K58Rk51J29k40k1P11n13J22Q3j22
2669h25L79q3l92M92k00R3N99p52K71K40k35N14J05k70O42k41l41O94l67k4M60
2690G59k88K71J08m17Q21n47j89N02m53L44P3n91Q35n44j76M35j73k95M06o65
2710B16O19j89j055J001k34l38K90m99J24L57j055O73P5j211R36q3n60P16p56
$$ plain form
2729 -973 -606 -132 -1384 -642 -233 -1113 -571 -820 -919 -642 -1273 -893 6 -1577 -532 -275 -966 -302 -520
2748 -520 -701 295 -856 -279 600 -716 54 288 -54 583 87 -117 1074 110 253 958 548 519 594 559
2768 559 1431 686 126 1608 791 348 1026 657 961 461 326 1284 466 172 1187 347 354 480 109 545
2788 545 532 -716 562 561 -481 261 104 -290 -9 -769 -111 98 -1388 -408 -153 -1161 -296 -794 -713 -381
2808 -381 -1682 -720 -52 -1581 -717 -351 -1137 15 -1537 -1080 184 -1194 -497 114 -931 -350 -179 -602
2826 -602 253 -608 -632 1077 -749 -246 516 -77 800 148 -364 1493 156 -103 1739 28 616 969
2844 969 112 1480 457 -12 1888 387 181 1426 97 1153 599 -67 1440 392 -228 1212 157
2861 157 198 720 -477 868 34 -1004 795 -232 -585 126 -353 -252 79 -1015 185 -357 -1346 -31
$$ packed form
2729i73L67M74j252P42M09q80N42k49r9K77o31L80Q99j583J045K57o91O64k18
2748e20j81R96j151N77Q79j316P70K34l42O37m96k04J191r64J43P05m10k9P5l5
2768E59Q72p45n60J482q17m43O78l69L04n00j35R58q18k94J015q40PJ26l71M36
2788E45j3j248J278jj042P42j57l94K81p60O58K09j486R80K55j008Q65m98Q1L32
2808c81j301R62O68j529Q64L66p86J152j552M57J264j378O97O11j045N81J71m23
2826f02Q55q61k4J709j826N03P62n93Q77o52n12J857j337k59J842j711N88L53
2844I69q57J368j023m69J900j501k06J245j329J056n54o66J507j048o20J440j055
2861A57M1N22j197J345q34j038J799j027l53P11m79J01L31j094J200n42r89J315
$$ plain form
2879 -31 -341 -799 -431 -866 -363 -452 -1286 -418 -195 -1185 -692 -559 -778 -377 -971 -272 -268 -804 -534 145 -420
2900 -420 -163 -195 -343 327 -265 -117 465 -62 -82 640 305 317 584 433 1054 557 152 865 751 433 1170
2921 1170 335 826 791 241 1260 726 96 1200 823 420 888 146 607 603 -182 578 258 -386 522 -58
2941 -58 -167 269 -803 217 232 -1188 34 -108 -579 -80 -906 -902 -65 -1024 -193 -436 -1608 -218 -503
2960 -503 -717 -418 -1106 -352 -141 -1218 -528 -478 -767 22 -524 -564 32 -814 -34 17 -571 26 243 -96 252
2981 252 4 137 609 -235 405 498 347 634 579 283 458 463 495 948 718 691 608 638 816 398 417 569 573 402
3005 402 591 408 526 445 318 462 310 83 434 217 -185 94 22 -102 104 -342 -399 -277 -285 -467 -262 -781
3027 -781 -669 -490 -690 -702 -744 -743 -491 -692 -888 -608 -570 -572 -557 -538 -527 -587 -481 -291 -502 -410 -341 -263 -3 -81 -240
$$ packed form
2879c1l10m58L68m35N03q9q34Q68K23r90M93J33k19M01n94O99Mn36K70O79n65
2900d20K57l2j48O70n92J48N82n27k0P22l35J2K67j51O21m97m05P13j14l18P37
2921A170q35M91l5n50J019n34o30J104l77m03M68p42M61mp85P60l20o44R08n80
2941e8j09M36j072J020J5j420J222j42m71M99q26MQ37r59Q31k43j172J390k85
2960e03k14K99o88P54K11j077O90N0k89P89n46m0N96q46P80N1n88N97K17l39L48
2981B52k48J33M72q44O40R3j51K87n5k96J75NL2M53k30k7q3L0J78m18J9J52Mj71
3005D02J89j83J18q1j27J44j52k27L51k17m02K79p2j24K06m46n7J22qj82K05n19
3027g81J12J79k00j2m2JK52k01j96K80L8kJ5J9J1o0J06J90k11R2O9P8K60p8j59
$$ plain form
3052 -240 -49 -98 99 317 -146 520 300 355 416 316 333 682 491 593 491 442 639 582 639 931 592 661 532
3075 532 340 687 544 510 612 192 394 620 505 312 431 120 359 112 -54 6 -124 -322 -162 -300 -228
3096 -228 -365 -239 -455 -458 -628 -307 -766 -583 -379 -945 -736 -609 -545 -588 -570 -894 -667 -663 -577 -285 -848 -480 -447
3119 -447 -503 -434 -259 -478 -200 -275 -405 -19 25 -17 -11 -86 374 449 345 489 409 204 715 683 771 428 494 682
3143 682 758 305 775 1019 675 761 528 609 751 161 484 498 134 640 471 257 575 16 62 411 -85 18
3165 18 231 -284 -219 -93 -232 -104 -431 -343 150 -709 -562 -585 -512 -426 -756 -964 -187 -638 -783 -279 -724 -515
3187 -515 -814 -920 -281 -432 -825 182 -538 -408 -156 -476 132 -439 -298 261 -192 -366 194 -27 217 424
3207 424 5 571 182 -59 932 457 229 840 272 600 496 94 911 558 195 896 594 377 677 172
$$ packed form
3052b40J91m9J97K18m63O66k20N5O1j00J7L49j91J02j02m9J97n7N7K92l39O9j29
3075E32j92L47j43l4J02m20K02K26j15j93J19l11K39k47j66O0j30j98J60j38P2
3096b28j37J26k16lj70L21m59J83K04n66K09J27O4m3J8l24K27MQ6K92n63L68L3
3119d47n6O9J75k19K78p5j30L86M4m2Op5M60P5j04J44q0k05N11l2Q8l43O6J88
3143F82P6m53M70K44l44Q6k33Q1J42n90L23J4l64N06j69k14L18n59M6L49m96J03
3165A8K13n15O5J26j39J28l27Q8M93q59J47k3P3Q6l30k08P77m51j45N04m45K09
3187e15k99j06O39j51l93J007p20J30K52l20O08n71J41N59m53j74N60k21K44K07
3207D24m19N66l89k41R91m75k28O11n68L28j04m02Q17l53l63P01l02k17L00n05
$$ plain form
3227 172 679 649 86 508 636 -178 374 114 153 510 -354 421 291 -626 238 157 -510 79 -137 -305 264
3248 264 -768 -309 -85 -834 -577 -91 -721 -587 -711 -624 -35 -763 -777 -278 -664 -856 -375 -639 35 -703
3268 -703 -970 142 -536 -586 82 -299 -76 171 -290 409 -109 -477 658 221 -78 551 96 203 338 -167
3288 -167 983 385 -235 932 467 516 957 238 788 606 -298 801 697 133 770 291 543 711 33
3307 33 831 554 -317 679 358 -201 496 -67 -10 231 -972 55 -133 -851 -21 -392 -619 22 -964 -670
3327 -670 114 -916 -348 -486 -786 -407 -862 -607 -88 -1174 -335 -30 -964 -499 -234 -351 -242 -707 -621 68
3347 68 -356 -623 101 -1 34 -135 -222 418 -263 63 526 110 145 484 397 540 347 39 588 560 235 663
3369 663 532 527 408 656 512 608 117 756 781 200 734 516 337 443 66 89 531 4 329 188 -314 -79
$$ packed form
3227A72N07l0n63M22J28q14N52k60L9L57q64P75j30r17Q64q1o67N89k16j68N69
3248B64j032M59K24p49K57M86o30J34j24Q7N89p28j4M99l86j92M81k64O74p38
3268g03k67J112o78n0O68l81K23K47m61O99n18l68J135m37k99O29m55J07J35n05
3288a67J150n98o20J167m65M9M41p19N50j82r04J099j04n64O37m79K52J68o78
3307C3P98k77q71R96l21n59O97n63N7K41j203J027j88p18Q30l71k27O41r86K94
3327f70P84j030N68j38l00L79m55K55N19j086Q39L05r34M65K65j17J09m65Q6O89
3347F8m24k67P24j02L5j69q7O40o81L26M63m16L5L39q7J43j93l08N49k8l25M28
3369F63j31nj19K48j44R6m91O39K5n81N34k18j79J06l77K3M42n27L25j41n02K35
$$ plain form
3391 -79 243 108 139 -396 -441 149 -597 -397 -309 -779 92 -525 -781 -111 -705 -724 -262 -928 -414 -566 -733 20
3413 20 -735 -831 -202 -714 -514 -39 -534 -286 -412 -482 24 -462 -315 138 -338 17 127 11 396 260 11
3434 11 528 143 417 745 64 365 688 186 513 306 428 948 419 651 599 429 526 569 432 350 265 270 349
3457 349 344 144 170 -57 250 110 52 77 81 -102 -79 -184 -85 -416 -299 -302 -298 -263 -467 -282 -546 -382 -400 -557 -386
3482 -386 -583 -594 -460 -613 -609 -476 -488 -719 -505 -246 -267 -433 -380 -486 -127 -96 -341 -143 64 -335 -188 290
3504 290 228 -183 515 74 286 530 159 392 208 400 643 487 395 783 367 515 623 355 602 661 196
3525 196 629 607 228 562 -242 479 426 168 297 459 264 206 51 74 115 -27 172 91 -390 12 -313 -468
3547 -468 -235 -513 -534 -499 -649 -607 -634 -750 -214 -471 -375 -593 -642 -539 -374 -719 -436 -133 -564 76 -373 -214
$$ packed form
3391g9L22j35L1n35m5N90p46K00Q8m70Q71o17k56O70n94j9M62o66N14j52j67P53
3413B0p55r6O29n12K00M75m95K48j26p0N06m86J47M53m76L55J10j16L85j36k49
3434A1N17l85K74L28o81L01L23n02L27k07J22N20n29K32n2j70R7M3j37q2q5NP9
3457C49nk00K6k27L07j40n8K5Mj83K3j05R9l31J17lML5k04J85k64J64j8j57J71
3482c86j97j1J34j53MJ33j2k31K14K59k1j66N3j06L59L1k45J98K07l99J47M78
3504B90o2m11O98m41K12K44l71K33j84J92K43j56r2L88m16J48J08k68K47N9m65
3525A96M33k2l79L34q04P21n3k58J29J62j95n8j55K3M1j42J99q1m81M02l25j55
3547d68K33k78k1L5j50M2k7j16N36k57R6k18m9J03J65l45K83L03m31O40m49J59
$$ plain form
3569 -214 -75 -360 -116 -285 -117 -34 -84 -105 243 -216 74 131 173 226 45 136 478 452 290 566 351 319 543
3592 543 477 608 469 221 710 507 404 454 579 382 874 319 409 463 144 223 305 117 286 232 -42 315
3614 315 -22 195 41 107 -46 -17 -167 -103 -430 -404 -102 -554 -556 -245 -254 -500 -327 -440 -519 -490 -557 -231 -622 -590
3638 -590 -244 -518 -274 -312 -520 -230 -379 -391 119 -15 -111 56 -185 -310 135 -445 350 160 -68 343 74
3659 74 201 311 38 397 631 224 283 389 376 635 63 275 722 403 622 549 309 321 331 264 688 91
3681 91 122 385 -7 482 257 150 482 -152 -104 268 -143 -70 156 -319 51 -188 -525 -125 -399 -591 -269
3702 -269 -674 -533 -591 -214 -265 -466 -691 -365 -417 -640 -259 -472 -232 -417 -509 -249 -317 -671 134 -236 -410 -91
3724 -91 -107 -128 73 -266 -15 392 -457 231 466 64 199 153 300 670 144 239 800 -19 331 512 359 697
$$ packed form
3569b14J39k85K44j69J68Q3n0k1L48m59K90N7M2N3j81R1L42k6j62K76k15l2K24
3592E43o6J31j39k48M89k03j03N0J25j97M92n55R0N4l19P9Q2j88J69n4k74L57
3614C15l37K17j54O6j53K9j50O4l27K6L02m52kL11rk46J73j13p9K9o7L26l91L2
3638e90L46k74K44l8k08K90j49j2N10j34r6J67k41j25M45n80P95j90k28M11k69
3659G4J27J10k73L59K34m07N9J06j3K59n72K12M47l19K19p3k40J2J0o7M24n97
3681I1L1K63l92M89k25j07L32o34M8L72m11P3K26m75L70k39l37M00k74j92L22
3702b69m05J41n8L77n1k01k25L26n2k23L81k13K40j85r2K60o8l54Q05l70j74L19
3724i1j6k1K01l39K51M07q49O88K35m02J35m6J47L70n26R5N61q19L50J81j53L38
$$ plain form
3746 697 446 231 825 264 347 854 197 727 367 56 705 -105 381 504 -37 155 435 -377 386 -210
3766 -210 -238 305 -275 -118 306 -455 -46 -195 -492 254 -518 -438 -213 -479 -340 -171 -687 -438 -479 -712 -272
3787 -272 -270 -795 -195 -775 -490 -225 -488 -42 -469 -641 -31 -184 -232 194 -396 36 -6 -87 244 255 39 287
3809 287 600 412 404 308 483 519 375 647 439 298 539 522 480 274 173 413 433 142 369 511 393 423 434
3832 434 225 304 132 138 173 42 32 186 -19 -101 -136 -209 -192 76 -393 100 -391 -189 -322 -551 -456 -306 -152
3855 -152 -124 -267 -818 -198 -368 -508 -176 -587 -233 -164 -629 -229 -111 -462 -186 -278 -467 79 -301 189 11
3876 11 -576 373 65 -187 540 -100 234 554 103 542 315 182 873 317 306 387 12 663 807 82 577
3897 577 182 129 618 371 511 594 184 257 481 33 237 344 156 360 -86 83 124 214 -5 -47 -73 -166 -185
$$ packed form
3746F97k51k15N94n61Q3N07o57N30l60l11O49q10M86J23n41J92K80q12P63n96
3766b10k8N43n80J57M24p61M09j49k97P46p72Q0K25k66J39J69n16K49m1k33M40
3787b72Kn25O00n80K85K65k63M46m27j72O10j53m8M26n90M32m2q1L31J1k16K48
3809B87L13j88qr6J75L6j44K72k08j41K41j7m2k06j01K40K0k91K27J42j18L0J1
3832D34k09P9j72OL5j31j0J54k05q2l5p3J7K68m69M93m91K02j33k29R5J50J54
3855a52K8j43n51O20j70j40L32m11L54O9m65M00J18l51K76r2j89N46l80M90j78
3876A1n87R49l08k52P27o40L34L20m51M39k27j33O91n56j1Q1l75O51J44p25M95
3897E77l95n3M89k47J40Q3m10P3K24m48K04J07j88K04m46J69M1R0k19m2k6r3j9
$$ plain form
3920 -185 -19 -470 -155 -173 -258 -255 -197 -414 -352 -196 -274 -392 -123 -492 -494 -459 -589 -478 -477 -323 -294 -54 -600 -239
3944 -239 -314 -382 -125 -426 -376 -172 -308 -122 43 -124 -193 217 13 103 235 188 -24 243 223 512 -55 260
3966 260 427 418 153 553 580 632 282 623 639 398 714 378 405 362 242 311 484 251 124 341 107 155 128
3989 128 -278 229 -252 -146 122 -144 42 -136 -403 -125 -211 -603 -194 -395 -293 -365 -400 -439 -25 -568 -395
4010 -395 -549 -464 -71 -331 -393 -255 -584 -221 -278 -300 -199 -263 -19 -206 -285 -185 -12 -82 -106 -75 57 197 64
4033 64 53 48 30 458 313 320 282 100 279 590 -18 613 250 302 380 673 180 398 538 573 592 198 443 383
4057 383 443 64 206 56 234 66 -125 42 116 -10 36 204 -75 -135 -11 -123 -457 -351 15 -112 -248
4078 -248 -333 -495 -425 -200 -532 -75 -141 -631 -457 -305 -593 -368 -326 -330 -224 -150 -320 -265 -121 87 -59 -293 182
$$ packed form
3920a85J66m51L15j8q5LN8k17O2J56p8j18K69l69kL5j30J11JJ54K9K40n46L61
3944b39p5o8K57l01N0K04j36J86J65j67o9M10k04R0J32m7k12K67k0K89n67L15
3966B60J67rk65M00K7N2l50L41J6k41L16l36K7m3j20O9J73k33j27K17k34M8k7
3989A28m06N07m81J06K68k66J86j78k67K78q6l92M09k01J02p2l5l9M14n43J73
4010c95j54Q5L93k60o2J38l29L63n7k2J01o4K44j87p9J00J73p0k4L1J32J40j33
4033F4j1nj8M28j45Pl8j82J79L11o08O31l63N2P8K93m93K18J40L5J9l94K45o0
4057C83O0l79J42j50J78j68j91J67P4j26M6J68k79o0J24j12l34J06L66j27j36
4078b48q5j62P0K25l32M57o6m90J74J52k88K25M2mJ06P4j70N5J44K08j46k34M75
$$ plain form
4101 182 -3 -128 212 46 85 226 6 300 -65 22 374 253 244 435 351 362 294 373 552 385 78 544 182
4124 182 81 466 347 256 332 246 540 203 50 583 -7 68 423 157 190 -1 -261 271 -93 -137 296 -178
4146 -178 0 -62 -262 -134 -373 -469 -160 -221 -222 -381 -380 -262 -472 -523 -492 -128 -522 -161 -373 -250 -43 -419 -361
4169 -361 -245 -459 -164 -11 -106 106 -199 -189 -15 -105 -188 208 -7 237 -103 139 -68 147 230 478 188 255
4191 255 353 80 325 426 169 533 310 356 590 345 57 416 199 306 457 -1 582 181 26 234 116
4212 116 28 84 90 123 -86 -212 293 -10 -104 73 -110 -302 -294 -405 -79 -222 -521 85 -324 -690 -216 -291 -142
4235 -142 -349 -603 -363 -203 -582 -92 -215 -414 -113 -357 -124 -159 -591 -6 -226 -419 150 -51 -121 142 68
4256 68 136 353 -93 78 194 202 246 152 319 400 44 279 294 143 276 630 506 289 203 417 482 482 356 382
$$ packed form
4101A82j85j25L40j66L9J41k20K94l65Q7L52j21rJ91q4J1o8P9J79j67l07M66l62
4124A82j01L85j19r1P6q6K94l37j53N33n90P5L55k66L3j91k60N32l64m4M33m74
4146a78J78o2k00J28k39r6L09o1jj59JJ18k10n1L1L64l94L61k12J23K07l76N8
4169c61J16k14K95J53r5K12l05J0J74r0q3L96k15K44l40K42k07K15Q3K48k90O7
4191B55R8k73K45J01k57L64k23M6K34k45k88L59k17J07J51m58N83m01j55K08j18
4212A16q8N6OL3k09j26N05l03r4J77j83j92Qj11L26j43k99O06m09l66M74p5J49
4235a42k07k54K40J60l79M90j23j99L01k44K33l5m32N85k20j93N69k01p0K63p4
4256F8O8K17m46J71J16QM4r4J67Q1l56K35J5j51J33L54j24k17q6K14O5%j26K6
$$ plain form
4280 382 151 324 482 216 296 -86 169 481 141 161 -52 -109 156 47 -3 -318 101 -332 -183 -93 -369 -201
4302 -201 -117 -470 -270 -261 -251 -423 -516 -555 -106 -330 -56 -450 -548 -278 -299 -100 -292 -489 -234 -55 -231 -148 -404
4325 -404 -282 14 -217 -67 -129 -43 277 -76 61 205 336 -223 566 49 94 221 295 641 402 389 490 315
4347 315 262 345 171 347 398 -26 557 176 104 666 166 81 -173 140 124 -82 -97 445 226 171 73 -38 107
4370 107 60 -415 -295 -174 -220 -108 -351 -358 21 -290 -301 -172 -572 -225 -449 -377 -341 -337 -269 -37 -116 -286 -154 -43
4394 -43 -289 -307 -151 -114 -189 -264 -434 -112 299 -320 10 -188 -30 321 84 -88 14 66 -7 213 327 282 47
4417 47 297 52 259 327 126 455 490 -114 363 424 321 499 313 165 339 120 230 267 -7 142 112 148
4439 148 215 -165 85 233 -81 67 -222 -172 5 -112 -139 31 -192 -87 -79 -437 -110 -432 -354 -132 -432 6
$$ packed form
4280C82k31J73J58k66Q0l82K55L12l40K0k13n7K65j09n0l15M19m33J49R0k76J68
4302b01Q4l53K00RJ0j72r3l9M49k24K74l94r8K70k1J99j92j97K55J79j76Q3k56
4325d04J22K96k31J50o2Q6L20l53J37J44J31n59P89n17M5J27P4L46k39j3J01j75
4347C15n3Q3j74J76N1m24N83l81p2N62n00q5k54L13j6k06j5N42k19n5r8j11J45
4370A07m7m75J20J21m6J12k43pL79l11j1J29m00L47k24P2L6MO8K32p9j70J32J11
4394d3k46j8J56L7p5p5j70L22M11o19L30j98J58L51k37j72J02N2p3K20J14m5k35
4417D7K50k45K07O8k01L29L5o04M77O1j03J78j86j48J74k19J10L7k74J49l0L6
4439A48O7l80K50J48l14J48k89N0J77j17k7J70k23J05Ql58L27l22P8K22l00M38
$$ plain form
4461 6 -308 -450 -318 -205 -343 -77 -451 -382 -248 -454 -174 -180 -196 -261 -101 204 87 -85 -112 -133 -214 213 -76
4484 -76 206 226 19 90 232 -81 120 349 141 104 182 70 116 123 251 345 159 298 3 331 316 133 253
4507 253 411 190 -235 -101 29 450 289 -16 -155 187 -86 67 -62 -27 -288 -178 25 -56 -18 -98 -348
4528 -348 -125 -395 -337 -154 -259 -190 -269 -21 -351 -402 -187 -616 -263 -217 -318 21 -274 -498 -113 -145 -33 -163
4550 -163 -244 223 -5 -101 10 18 -93 93 61 63 173 -146 307 183 151 243 185 83 110 252 164 272 304 166
4574 166 384 -40 347 211 370 135 275 305 519 14 99 267 137 159 -60 119 245 157 234 188 61 -122
4596 -122 -249 -6 -91 -41 -24 -59 -335 -316 -155 -336 -178 -163 -307 -50 -382 -105 -73 -333 -201 -359 -209 -96
4618 -96 -138 -397 -230 -168 -245 -139 -275 -306 58 57 91 -218 -267 176 -76 83 -4 -9 299 67 60 184 -52 -36 381
$$ packed form
4461Fl14j42J32J13j38K66l74O9J34k06K80oj6o5J60L05j17j72k7k1q1M27k89
4484g6K82K0k07P1J42l13K01K29k08l7P8j12M6PJ28R4j86J39k95L28j5j83J20
4507B53J58k21m25J34J30M21j61l05j39L42k73J53j29L5k61J10K03q1L8q0k50
4528c48K23k70N8J83j05O9p9K48l30n1K15m29L53M6j01L39k95k24L85l2J12j30
4550a63q1M67k28r6J11Qj11J86l2KJ10l19M53j24l2R2n8j02K7J42q8J08L2j38
4574A66K18m24L87j36J59k35J40L0K14n05Q5J68j30K2k19J79J26q8P7m6j27j83
4596a22j27K43q5N0J7l5k76J9J61j81J58J5j44K57l32K77L2k60J32j58J50J13
4618i6m2k59J67O2p7J06j36l1L64jL4l09m9M43k52J59q7nL08k32pJ24k36J6M17
$$ plain form
4643 381 257 132 217 190 327 360 74 301 249 309 356 93 140 79 71 342 326 201 111 311 103 5 59 -34 294
4668 294 -100 7 155 -40 56 -176 -171 -13 -438 -125 -218 -270 -210 -193 -328 -264 -207 -321 -281 -389 -184 -212 -332 -499
4692 -499 -297 -27 -110 -381 -334 -281 -116 -439 144 -103 -137 68 -199 246 -155 -70 -119 83 27 -19 57 119 126 -129
4716 -129 504 172 -10 137 215 453 238 114 409 417 357 424 178 101 376 270 193 245 294 177 145 93 153 -53
4740 -53 -29 26 152 146 136 141 -76 -91 -87 -61 80 -197 -115 44 -44 -182 -346 -208 -273 -509 -378 109 -427 -214 -357
4765 -357 -269 -387 -383 33 -331 -257 -122 -42 -244 -189 -155 -155 -101 182 179 55 123 208 44 27 -112 65 29 53 142 87
4791 87 20 133 111 413 201 329 187 -31 98 153 -85 25 202 227 148 390 468 230 32 -10 90 152 288
4814 288 -96 128 188 -137 176 -85 -55 173 -102 -69 -50 -4 -189 -139 -191 53 -272 -265 34 -461 -110 -396 -430
$$ packed form
4643C81j24j25Q5k7J37L3k86K27n2O0M7k63M7o1qK71j6j25r0K00k08r8N4r3L28
4668B94l94J07J48j95R6k32NJ58m25L13r3n2O0J7j35O4N7j14M0j08K05k8j20j67
4692d99K02K70q3k71M7N3J65l23N83k47l4K05k67M45m01Q5m9K02n6m6P6O2Pk55
4716a29O33l32j82J47P8K38k15j24K95Qo0O7k46p7K75j06p7N2M9j17l2n2O0k06
4740e3K4N5J26oj0Nk17j5MK6J41k77Q2J59q8j38j64J38o5k36J31M87n36K13j43
4765c57Q8j18MM16l64P4J35Q0k02N5L4%N4K83lj24O8Q5j64j7j39J77l6K4Q9n5
4791H7o7J13k2L02k12J28j42k18J29N5k38J10J77K5p9K42P8k38j98m2J00O2J36
4814B88l84K24O0l25L13k61L0K28k75L3J9M6j85N0n2K44l25PK99m95L51k86l4
$$ plain form
4837 -430 -128 -331 -403 -271 -55 -200 -248 -3 -194 -151 -264 -302 -261 151 -99 -388 121 -42 -48 -83 97 -124 -35
4860 -35 119 82 134 -164 80 227 54 185 80 227 386 55 188 115 136 302 -136 538 154 400 278 71
4882 71 101 136 -32 -21 205 -46 50 187 109 208 118 109 130 -17 -37 -117 -82 -14 -296 -81 -132 -159 -217 -174 -155 -20 -304
4909 -304 -63 -63 -4 -185 -216 -129 -255 39 -317 -330 -377 -90 -135 -193 -245 -65 -242 -49 -91 -60 -113 -130 -16 -98 94
4934 94 105 -56 -14 63 -5 212 325 26 32 94 164 76 115 207 199 208 140 337 316 278 448 204 293 -63 449 457 428 214
4962 214 11 109 40 118 134 169 72 222 -145 -41 -13 75 -107 -392 73 -153 -110 -161 -115 -19 -200 -257 -153 -260
4986 -260 -71 -161 -271 -260 -76 -355 -318 -77 -112 -351 -113 -251 -240 -326 -40 -39 -57 -26 42 7 42 19 11 -89 -118 -49
5012 -49 -54 87 197 226 38 84 243 187 142 66 199 136 116 51 399 208 87 217 308 171 222 83 -148 166
$$ packed form
4837d30L02k03p2J32K16j45m8K45j91M3j13l8M1M12k50k89N09j63ol5J80k21Q9
4860c5J54l7N2k98K44J47j73J31j05J47J59l31J33p3K1J66m38O74l84K46j22k07
4882G1L0L5j68J1K26k51R6J37p8R9r0rK1j47k0q0L5O8k82K15n1k7n8M3J9J35k84
4909c04K41%N9j81l1Q7j26K94l56j3m7K87m5n8n2J80j77J93m2L1n3j7J14q2J92
4934I4J1j61M2P7o8K17J13k99OO2P0q8L9R2qRo8J97k1l8J70k44Q9l56N12Qk9k14
4962B14k03R8o9P8J6L5r7J50l67J04K8Q8j82k85M65k26M3n1M6R6j81n7J04j07
4986b60J89r0j10J1J84k79L7K41l5k39K38j38J1q6K86Jj8L1O8l5L5k3qj00k9O9
5012d9nJ41J10K9j88M6J59n6m5p6J33o3k0o5L48j91j21J30R1j37N1j39k31L14
$$ plain form
5036 166 32 230 30 -102 28 188 -50 -27 284 70 118 0 -249 71 -6 14 61 -141 -192 -112 -47 108 -316
5059 -316 -216 -62 -96 -105 3 -251 73 91 -239 -157 -358 -197 -5 -50 111 -90 -126 -288 155 -232 -160 -100 -93 -72
5083 -72 107 95 33 233 -38 73 97 237 66 168 -73 268 88 209 151 261 404 115 208 128 -17 -39 234
5106 234 53 462 62 167 253 119 97 -41 395 -10 52 170 207 218 39 20 -211 -77 -117 -117 -93 -171 -340 48
5130 48 110 -174 -194 -173 -277 -92 -190 -173 12 -30 -301 -286 -162 -114 -221 -5 -294 -228 -31 -485 -244 -94 -140 -132
5154 -132 89 -282 -118 60 -119 -10 -19 -101 -9 -55 80 218 -254 207 105 64 -80 257 50 -62 -10 97
5176 97 41 397 225 -77 -86 91 161 121 297 110 243 170 -59 157 4 137 55 80 -245 175 -74 -18 -80 2
5200 2 55 -222 19 96 -35 -228 46 -173 132 -55 -84 -192 -290 -90 32 -21 -201 14 -80 69 -148 -108 22
$$ packed form
5036A66j34J98k00j32J30J60k38K3L11k14M8j18k49L20p7K0M7k02n1Q0O5J55m24
5059c16J00J54l4rJ08k54L24J8l30Q2k01J61J92m5J61k01l6j62M43l87P2O0PK1
5083g2J79j2o2K00k71J11K4J40j71J02k41L41j80J21n8J10J43k89R3q0j45k2K73
5106B34j81M09m00J05Q6j34k2j38M36m05O2J18L7J1j79j9k31J34m0%K4p8j69L88
5130D8O2k84k0K1j04J85r8J7J85m2k71J5J24M8j07K16k89O6J97m54K41J50m6Q
5154a32K21l71J64J78j79J09rq2R2m6J35J38m72M61j02m1j44L37k07j12N2J07
5176I7n6L56j72l02rJ77P0m0J76j87J33p3k29K16j53J33q2K5l25M20k49N6o2Q2
5200BN3k77K41P7j31j93K74k19L05j87k9j08r8K00J22n3j80K15r4J49k17M0J30
$$ plain form
5223 22 -227 -233 -213 -37 -71 -47 -38 -123 58 86 -72 -46 -122 -16 105 121 61 55 149 -265 50 129 47 -29 315 120 154
$$ packed form
5223B2k49oK0J76l4K4Rq5J81K8j58K6p6J06J21J6o0oR4m14L15P9q2p6L44j95L4
$$ [...]
8191A76
##END NTUPLES=NMR FID
##END=
