##TITLE=1H_Pr 50-Eth
 CDCl3
 8 sc, 
 23.09.2022
##JCAMPDX= 6.0         $$ Bruker NMR JCAMP-DX V2.0
##DATA TYPE= NMR FID
##DATA CLASS= NTUPLES
##ORIGIN= UXNMR, Bruker Analytische Messtechnik GmbH
##OWNER= root
$$ XWIN-NMR		Version 3.5
$$ Fri Sep 23 16:53:36 2022 Russian Standard Time (UT+4h)  she@DPX200
##.OBSERVE FREQUENCY= 200.1313499994
##.OBSERVE NUCLEUS= ^1H
##.DELAY= (6, 6)
##.ACQUISITION MODE= SIMULTANEOUS
##.ACQUISITION SCHEME= undefined
##.AVERAGES= 8
##.DIGITISER RES= 18
##SPECTROMETER/DATA SYSTEM= spect
##.PULSE SEQUENCE= zg30
##.SOLVENT NAME= CDCl3
##.SHIFT REFERENCE= (INTERNAL, CDCl3, 0, 15.7039)
##AUDIT TRAIL= $$ (NUMBER, WHEN, WHO, WHERE, WHAT)
$$ ##TITLE= Audit trail, XWIN-NMR		Version 3.5
$$ ##JCAMPDX= 5.01
$$ ##ORIGIN= Bruker BioSpin GmbH
$$ ##OWNER= she
$$ F:/spectra/data/she/nmr/H-F/1/audita.txt
$$ ##AUDIT TRAIL=  $$ (NUMBER, WHEN, WHO, WHERE, WHAT)
(   1,<2022-09-23 16:50:37.09 +0400>,<she>,<DPX200>,
      <created by zg, POWCHK disabled, PULCHK disabled
       configuration hash MD5:
       00 E9 B6 7A A2 85 ED C7 34 08 36 98 17 FE 4E 26
       data hash MD5: 16K
       ED D2 E8 92 38 C4 AC EF D9 F9 C2 79 A6 41 3F 80>)
$$ ##END=
$$ 
$$ hash MD5
$$ 4A 74 0E 2E C2 1F 83 5E AC 1A C5 74 D3 4D 6C 72
##$RELAX= 
##$RELAX= 
##$RELAX= 
##$RELAX= 
##$RELAX= 
##$RELAX= 
$$ Bruker specific parameters
$$ --------------------------
##$DU= <F:/spectra>
##$EXPNO= 1
##$NAME= <H-F>
##$PROCNO= 1
##$TYPE= <nmr>
##$USER= <she>
##$AMP= (0..31)
100 100 100 100 100 100 100 100 100 100 100 100 100 100 100 100 100 100 
100 100 100 100 100 100 100 100 100 100 100 100 100 100 
##$AQSEQ= 0
##$AQ_mod= 1
##$AUNM= <au_zg>
##$AUTOPOS= <>
##$BF1= 200.13
##$BF2= 200.13
##$BF3= 200.13
##$BF4= 200.13
##$BF5= 200.13
##$BF6= 200.13
##$BF7= 200.13
##$BF8= 200.13
##$BYTORDA= 1
##$CFDGTYP= 0
##$CFRGTYP= 5
##$CHEMSTR= <none>
##$CNST= (0..31)
1 1 145 1 1 1 1 1 1 1 1 1 1 1 1 1 1 1 1 1 1 1 1 1 1 1 1 1 1 1 1 1 
##$CPDPRG= <>
##$CPDPRG1= <>
##$CPDPRG2= <>
##$CPDPRG3= <>
##$CPDPRG4= <mlev>
##$CPDPRG5= <mlev>
##$CPDPRG6= <mlev>
##$CPDPRG7= <mlev>
##$CPDPRG8= <mlev>
##$CPDPRGB= <>
##$CPDPRGT= <>
##$D= (0..31)
0 1.2 0 0 0 0 0 0 0 0.06 0 0.03 0 0 0 0 0.0002 0 0 0 0 0 0 0 0 0 0 0 0 
0 0 0 
##$DATE= 1663937436
##$DBL= (0..7)
120 120 120 120 120 120 120 120 
##$DBP= (0..7)
150 150 150 150 150 150 150 150 
##$DBP07= 0
##$DBPNAM0= <>
##$DBPNAM1= <>
##$DBPNAM2= <>
##$DBPNAM3= <>
##$DBPNAM4= <>
##$DBPNAM5= <>
##$DBPNAM6= <>
##$DBPNAM7= <>
##$DBPOAL= (0..7)
0.5 0.5 0.5 0.5 0.5 0.5 0.5 0.5 
##$DBPOFFS= (0..7)
0 0 0 0 0 0 0 0 
##$DE= 6
##$DECBNUC= <off>
##$DECIM= 32
##$DECNUC= <off>
##$DECSTAT= 4
##$DIGMOD= 1
##$DIGTYP= 9
##$DL= (0..7)
0 120 120 120 120 120 120 120 
##$DP= (0..7)
150 150 150 150 150 150 150 150 
##$DP07= 0
##$DPNAME0= <>
##$DPNAME1= <>
##$DPNAME2= <>
##$DPNAME3= <>
##$DPNAME4= <>
##$DPNAME5= <>
##$DPNAME6= <>
##$DPNAME7= <>
##$DPOAL= (0..7)
0.5 0.5 0.5 0.5 0.5 0.5 0.5 0.5 
##$DPOFFS= (0..7)
0 0 0 0 0 0 0 0 
##$DQDMODE= 0
##$DR= 18
##$DS= 0
##$DSLIST= <SSSSSSSSSSSSSSS>
$$ [...]
##$SUBNAM2= <"">
##$SUBNAM3= <"">
##$SUBNAM4= <"">
##$SUBNAM5= <"">
##$SUBNAM6= <"">
##$SUBNAM7= <"">
##$SUBNAM8= <"">
##$SUBNAM9= <"">
##$SW= 18.0517283424941
##$SWIBOX= (0..15)
0 0 2 0 0 0 0 0 0 0 0 0 0 0 0 0 
##$SW_h= 3612.71676300578
##$TD= 16384
##$TD0= 1
##$TE= 0
##$TE2= 300
##$TE3= 300
##$TEG= 300
##$TL= (0..7)
0 120 120 120 120 120 120 120 
##$TP= (0..7)
150 150 150 150 150 150 150 150 
##$TP07= 0
##$TPNAME0= <>
##$TPNAME1= <>
##$TPNAME2= <>
##$TPNAME3= <>
##$TPNAME4= <>
##$TPNAME5= <>
##$TPNAME6= <>
##$TPNAME7= <>
##$TPOAL= (0..7)
0.5 0.5 0.5 0.5 0.5 0.5 0.5 0.5 
##$TPOFFS= (0..7)
0 0 0 0 0 0 0 0 
##$TUNHIN= 0
##$TUNHOUT= 0
##$TUNXOUT= 0
##$USERA1= <user>
##$USERA2= <user>
##$USERA3= <user>
##$USERA4= <user>
##$USERA5= <user>
##$V9= 5
##$VALIST= <valist>
##$VCLIST= <CCCCCCCCCCCCCCC>
##$VD= 0
##$VDLIST= <DDDDDDDDDDDDDDD>
##$VPLIST= <PPPPPPPPPPPPPPP>
##$VTLIST= <TTTTTTTTTTTTTTT>
##$WBST= 1024
##$WBSW= 4
##$XGAIN= (0..3)
0 0 0 0 
##$XL= 0
##$YL= 0
##$YMAX_a= 59316
##$YMIN_a= -50746
##$ZGOPTNS= <>
##$ZL1= 120
##$ZL2= 120
##$ZL3= 120
##$ZL4= 120
##$ABSF1= 10
##$ABSF2= 0
##$ABSG= 5
##$ABSL= 3
##$ALPHA= 0
##$AQORDER= 0
##$ASSFAC= 0
##$ASSFACI= 0
##$ASSFACX= 0
##$ASSWID= 0
##$AUNMP= <proc_1d>
##$AZFE= 0.1
##$AZFW= 0.1
##$BCFW= 1
##$BC_mod= 2
##$BYTORDP= 1
##$COROFFS= 0
##$CY= 11.3945322036743
##$DATMOD= 1
##$DC= 2
##$DFILT= <>
##$DTYPP= 0
##$F1P= 2.36226072786647
##$F2P= -0.459571619588291
##$FCOR= 0.5
##$FTSIZE= 0
##$FT_mod= 4
##$GAMMA= 1
##$GB= 0.15
##$INTBC= 1
##$INTSCL= 1
##$ISEN= 128
##$LB= 0.24
##$LEV0= 0
##$LPBIN= 0
##$MAXI= 10000
##$MC2= 0
##$MEAN= 0
##$ME_mod= 0
##$MI= 1.114404
##$NCOEF= 0
##$NC_proc= 0
##$NLEV= 6
##$NOISF1= 3.799351
##$NOISF2= 2.8
##$NSP= 1
##$NTH_PI= 0
##$NZP= 0
##$OFFSET= 15.70392
##$PC= 1
##$PHC0= -17949.7
##$PHC1= 17.20069
##$PH_mod= 1
##$PKNL= yes
##$PPARMOD= 0
##$PSCAL= 0
##$PSIGN= 0
##$REVERSE= no
##$SF= 200.130013532006
##$SI= 16384
##$SIGF1= 3
##$SIGF2= 2
##$SINO= 400
##$SIOLD= 16384
##$SREGLST= <1H.CDCl3>
##$SSB= 0
##$STSI= 0
##$STSR= 0
##$SW_p= 3612.71676300578
##$SYMM= 0
##$S_DEV= 0
##$TDeff= 0
##$TDoff= 0
##$TI= <>
##$TILT= no
##$TM1= 0
##$TM2= 0
##$TOPLEV= 0
##$USERP1= <user>
##$USERP2= <user>
##$USERP3= <user>
##$USERP4= <user>
##$USERP5= <user>
##$WDW= 1
##$XDIM= 8192
##$YMAX_p= 0
##$YMIN_p= 0
$$ End of Bruker specific parameters
$$ ---------------------------------
##NTUPLES= NMR FID
##VAR_NAME=  TIME,          FID/REAL,        FID/IMAG
##SYMBOL=    X,             R,               I
##VAR_TYPE=  INDEPENDENT,   DEPENDENT,       DEPENDENT
##VAR_FORM=  AFFN,          ASDF,            ASDF
##VAR_DIM=   8192,          8192,            8192
##UNITS=     SECONDS,       ARBITRARY UNITS, ARBITRARY UNITS
##FACTOR=    0.0002768,     1,               1
##FIRST=     0,             0,               0
##LAST=      2.2672688,     0,               0
##MIN=       0,             -50746,          0
##MAX=       2.2672688,     59316,           0
$$ Real data points
##PAGE= N=1
##DATA TABLE= (X++(R..R)), XYDATA
$$ [...]
131b473N249L295q854n806J0550O071r886l519P890N14n135P94J144r91J883n86
147A40l398K485L372k833p03K846j674j443K522j453j625M927p89q003L406R486
163G263m946q181N419M716m972o14L505k997j488M738j365n573K886N000l214
178A77l661K404K655l27j204r25R16J365j931j082L216R1m016J063L603j816j134
195f06K617j563k364L245L64m036J788K833l649q76L955j333k597K787N01k842
211a776J204K034j746p86J498l14j204R25J612l16k230m93K712J258k316j334
227a272J666J135j055j171J78O54O4m99l12MP63P65r22j450R46J695j296j328
245a435J728J51k265J351K634k274j418L077j80l029J924J949l093n52L056n03
$$ y = [-2473, 2776, 6071, -2783, -8589, 1961, 8032, -1854, -5373, 2517, 3031, -2104, -1310, -166, -1157, 726, 140, -3258, -773, 2599, -234, -937, 1909, 235, -1208, 1314, -139, -1764, 3163, 2374, -5629, -2223, 7263, 2317, -5864, -445, 4271, -701, -1315, 2190, -807, -2295, 2443, 1078, -4495, -1609, 3391, 177, -3484, -1080, 1575, 1248, 44, -881, 35, 1400, -531, -1613, 1603, 1694, -2322, -1259, 2344, 528, -606, 2011, 448, -1916, 1329, 1693, -2343, -555, 2278, -1371, -2247, 1708, 375, -2222, 565, 1066, -1776, -572, 1462, -284, -1070, 428, 114, -1090, -165, 1447, 1131, -1099, -1592, 1120, 2378, 62, -1272, 394, 1529, 474, -697, -519, 135, 199, -300, -612, -608, 155, 920, -2, -1452, -506, 1189, -107, -1435, 293, 444, -1821, -470, 2164, -110, -1528, 1549, 1369, -1660, 264, 2213, -880, -1432, 1624, 1121]
261A121k074O48Q25n1n17j202J063J961k222j885L111P26l367P97K761j909j731
278a945K205N38j598O89R90r13j32R65l12p99K63L41j56K07Q4n80M3Q72l88j345
298i71O43J530j285j581J582R84j819j92J669k96r38N66J19k64M51l14l08J058
316F34r1j075Q34M63j205M88R96j319r3J597j069j200J812k9j964J261J146k320
334a134K1K289j544j509K568N60k638N14K175j311j417J631O45j266K59Q37o34
351D6k20Q88m01p11P80M52j069k06Q49j53n10K03J46l1j14m84K63N31r42j74J746
372H89n80k074J793J894k926r92L677l55l367J903K460k855q49K992o13k343J626
389B80J049j962J41J129r17oJ070j070n59J385l15j409Q76Q49j008o0P97l91j99
$$ y = [1121, -953, -305, 520, 469, -48, -1250, -187, 1774, -448, -2333, 778, 1504, -1863, -1066, 1695, -214, -1945, 260, 798, -800, -111, 879, -34, -166, 799, 487, -312, -49, 292, 136, 343, 427, -153, -110, 762, 374, -971, -328, 1202, -83, -1664, -82, 902, -917, -1109, 560, 264, -674, -108, 11, -253, 198, -116, -424, 634, 543, -532, 302, 765, -440, 48, 1044, -275, -368, 1229, 160, -1040, 772, 743, -1221, 40, 1186, -1134, -1113, 1176, -368, -1877, 691, 1251, -1387, -873, 1302, -9, -1426, 205, 850, -416, -157, 680, 46, -174, 714, 313, -398, 382, 834, -235, -441, 408, 255, -255, -52, 94, 63, -51, -535, -272, 259, -683, -857, 889, 309, -1765, 28, 1922, -1004, -1996, 1681, 1326, -2041, -138, 2322, -533, -1382, 1610, 997, -1346, 280, 1329, -633, -492, 637, -280, -286, 784, -286, -845, 540, 225, -1184, -308, 541, -467, -527, 270, -121, -320]
408c20N67l41k29P85l16o25J105N8j534R97J562k109r32K844k63l030J476K114
426A809k464n94K495j141j752K399P0k695J494J814k507j43K630j539j442K622
442A056j35k476J718J355k289K75J819j503m03J743r37q66J638p87j259J944k33
459F60k354J713J548k677L8K390j731j084K588q77k421K688J440l478K16L314
475A973j487k170K251O58k145P56J559j490q33J631L21j343j60P44K81l83p69
492f06O6J065k2j346K77J128o35p14J022j17j182J132J026j741l38J960m39j417
510h81J279K99j465J172J012k239j17K589r54k120J513J030j549Q1Q00j000J2
527e38J171p50o50Q77k04l33P95n81r15J619O15k030M4J866m52j099O53K44k28
$$ y = [-320, 247, -94, -323, 462, 146, -479, 626, 684, -850, 147, 1709, -400, -1332, 1512, 1249, -1781, -305, 1809, -655, -1249, 1246, 105, -1647, 752, 822, -1873, -379, 1435, -1072, -1215, 1415, -124, -1566, 1056, 921, -1555, 163, 1518, -771, -496, 1323, -180, -583, 1160, 223, -643, 995, 208, -1051, 893, 660, -1694, 19, 1567, -1110, -1072, 1318, -413, -1497, 1091, 214, -2207, 481, 1921, -1557, -1341, 1973, 486, -1684, 567, 1225, -920, -164, 1395, -95, -928, 703, 1024, -319, -479, 265, 546, 163, -606, -540, 525, 503, -843, -566, 562, -73, -787, 235, 118, -1064, 68, 1094, -647, -985, 975, 536, -881, 398, 697, -768, 404, 1416, -823, -940, 1649, 695, -1425, 88, 1118, -431, -350, 450, -550, -538, 633, -117, -767, 110, -94, -427, 368, -213, -1128, 491, 1106, -924, -880, 986, 534, -565, 88, 332, 104]
546A04M46m03o44Q79K92j031K83P22q60k89J060m81j114Q36R62r41q11R03O67
565E80p34o11O06O33m87m25M08L60k24k02J66L63j41m55K53N30n48o05Q73M51
585G91j062k76R08jq04O7M04k8k26o8J86J11k93q6N63K1p40K78R02m41q69O46
607a7Q19n81o60N96M37l94l09J81J05jm5j70o3J57j59n8K55k18m04M95L51q45
629e28n2J018k32p72M65L32l97K74J98o05K19P21n09l36N56j38l97N48n0o49K84
650e0M59m25k63J75Q1J72j86n38K16O78k56n58K16K74M4O5k65j79N15J98m23q2
672a32L05P4Or9k62J84K91j93k21m5q1M49J55r93n9J245l59j233Q35P11j107q
694e37R96o06m31Q70j27n34N32n4k98O56j49q45P63N86j089n4R86m90n69O75n8
$$ y = [104, 550, 147, -497, 382, 674, -357, -74, 648, -212, -501, 559, 78, -1036, -200, 762, -179, -990, -87, 580, -154, -765, -159, 474, -13, -438, -30, 330, 106, -96, 70, 433, 292, -163, 90, 620, 72, -533, 340, 791, -271, -547, 361, 360, -444, -377, 27, -1, -227, -295, -109, 2, -291, -377, 186, 207, -533, -255, 647, 206, -663, -17, 802, 221, -439, 157, 594, 200, -109, 72, 177, 176, 131, -39, -102, 55, -104, -162, 93, -125, -529, -34, 317, -528, -580, 438, 206, -566, -101, 231, -166, 108, 306, -299, -80, 641, 132, -204, 352, 214, -183, 365, 315, -334, -50, 409, -16, -279, -104, -23, 149, -37, -575, -359, 319, 63, -495, -279, -5, 39, 104, -161, -340, 175, 373, -50, -132, 173, 247, 253, 154, -108, 76, 367, 174, -47, -92, -173, 276, 431, -562, -621, 624, 265, -968, -133, 578, -529, -537, 459, -147, -578, 292, 165, -369, 163, 109, -189, 467, 318, -527, 236, 822, -267, -321, 665, 175, -394, 281, 223]
715B23n11K93M4k41K69k44l51P66K9j103L89J071p22o82R60J45p75L66N49n64
735h9j62N81k5m00J79J81j77K7J49k47j64L19J37m79k01N07M3n42J25L81l08k23
757c88M63o3m12K33L81k08j62RK46K47l50l31N29L65o34p6N40k66k86N19k24n19
779c87N84J76q05J91O44o23k79Q00k52p93P22N90j005k44J109j30p83L82N04l98
799Cj38L58q2o9Q1j07J06J19m01k3N90k42p17N19N15p57k32O71k08l90M44n5m60
822d75M84K04o60K07O97o37k39R04k85p60Q46L73j036J86Q31n08m14N89j56l27
842a76M39j72m79N57R8p67L04N79o38k81O99n8n71L29L06l33oK16q1K8J20j40
864b7L7K63j67k30L65J20n31P9N57l10n07M82K47o53N3N09m07k33M78j65m35N51
$$ y = [223, -288, 5, 49, -192, 77, -167, -518, 248, 277, -826, -437, 634, -88, -770, 190, 335, -440, -74, 475, -89, -251, 330, 305, -95, 84, 265, 88, 115, 264, 17, -147, 172, 309, -170, -371, 136, 179, -363, -238, 143, -165, -388, 75, 12, -400, -167, 214, 6, -156, -147, 99, 346, -4, -335, 194, 559, -75, -151, 389, 123, -163, 356, 132, -387, 197, 373, -432, -241, 403, -220, -499, 301, 49, -744, -22, 568, -437, -681, 428, 298, -485, -103, 401, 3, -135, 223, 141, 72, 153, 46, 152, 271, -130, -153, 437, 195, -522, -3, 512, -245, -477, 194, -14, -404, 40, -15, -475, 9, 213, -447, -240, 457, -180, -419, 485, 200, -560, 286, 659, -377, -191, 640, 132, -282, 307, 151, -176, 263, 91, -388, 169, 267, -500, -196, 383, -255, -536, 163, 105, -466, -137, 169, -164, -170, 46, -35, -7, 113, -27, 10, 273, 106, -124, 241, 361, -170, -91, 466, 156, -351, 131, 378, -275, -222, 287, -120, -353, 125, -40, -475, 76]
886G6J26p12K51O86n88l17P69o1o68N21K87m74Q7K93k94R3K03m16J47M82o31l01
908d41R33k32r39O43N67r25m5P71l84m18N54J9m32L36L1k10L12o0m01M59L72p08
930a98p8O99j06m73J87J65j48L8J6k34J40J16j89jJ5j15J00J34k24j72K55J55
952H2j60j60N6L10N5l58RL90qk81J04J06q3O8L7j48L0R5j23J2L5k11J08K03k73
977a05k30L49O7l22M8J88j34K3J41j48r1L24jk83J84K20k31n0K58p5k21K17J70
1000B98k97p8K36o3j17km0K8J49k24j62L10N2l56N6L40k32k02L88J7l09J64J92
1023A48j82J3J55j22O6J43k46k7K90j06k79K60J82m15o4L61j12k63P8J22j6n8
1045g2j14N0J75j01j65J86J45j77q6K50O5k49QL12k3l83J35M08k34l46K61K44
$$ y = [76, 202, -510, -259, 427, -161, -478, 291, 230, -438, 83, 370, -104, -17, 276, -18, 75, 278, -138, 9, 491, -140, -441, 492, 260, -679, -36, 531, -394, -439, 332, -52, -470, 84, 103, -329, 7, 38, -172, 140, 80, -321, 138, 510, -198, -276, 423, 317, -156, 31, 196, 48, 86, 102, -132, 8, 124, -65, -66, -51, -166, -66, 68, -156, -328, -73, 82, -78, -238, -182, 128, 183, -175, -166, 224, 216, -65, 39, 145, 62, 130, 167, 19, 49, 144, 21, 33, 68, -143, -35, 168, -105, -335, 14, 81, -241, -193, -5, -139, -116, 25, -123, -214, 110, 109, -174, 10, 230, -1, -51, 207, 132, -89, 128, 298, 1, -77, 159, 96, -21, -23, -63, -35, 114, -110, -272, 38, 90, -266, -210, 130, -102, -304, 84, 101, -208, -44, 148, -34, -21, 134, 12, 78, 221, -25, -52, 238, 132, -147, 113, 295, -120, -184, 177, 65, -198, -120, 2, -14, -72, -186, -136, 39, -62, -227, -41, 104, -73, -159, 91, 156, -93, -85, 227, 204, -179, -44, 364, 130, -216, 45, 289]
1067B89k85j32J63N3p8j33k5J79J7l67J75L65m02k46N92K8n77L00L99m09q9M15
1089B32k07j35L78j79k67M11L6m77K53K78m36m3L90j92k52K55m9j73J81q8j74
1110b58L23m3l90K70L65m78q3N54j66l50K74K52k09r7J09P5%j07m4J28L8j72P
1133bJ61j52j36J37N4j53j00J22J07r1j77J68J23j78n5K19j7j13J14Ll4O9j0q0
1157b1J30R2j97MJ90j19j78J38R4j62n9J06j1o9l8kR5Jj76L5K39j26k13K14J69
1182A36k30k5K58rk18J06J69j14r1J03O4p9l9pnM3o0j58J16J58k28j47K90M7l23
1207b43Q6K39j44o9J14n0k5J36o1l4J85o9j53K53N0l68J38L75l01k91L51J26l19
1230g4k4J89j11l2L4j16J2J93j69q4J81Mk19J17K54k49j16K83Q2k53P6J37o5p
$$ y = [289, 4, -128, 35, 88, 10, -123, -148, 31, 48, -319, -144, 221, -181, -427, 165, 193, -384, -84, 315, -94, -183, 232, 25, -110, 268, 89, -178, 233, 269, -208, 45, 323, -113, -156, 234, 42, -210, 45, -4, -177, 4, -84, -258, 65, 22, -368, -98, 267, -211, -294, 260, 94, -256, 18, 270, 61, -36, 73, 148, 148, 41, -3, 125, 163, -9, -2, 159, 7, -129, 8, 62, -91, -191, -69, 38, -53, -230, -62, 61, -117, -172, 47, 30, -83, 31, 34, 0, 69, 59, -21, 109, 201, 4, 8, 198, 79, -99, 39, 133, -29, -88, 18, 7, -62, -100, -102, -7, -6, -182, -147, 92, -34, -247, -33, 136, -94, -119, 139, 130, -88, 18, 187, 73, -18, 85, 149, 70, 31, 24, 19, 62, 2, -156, -40, 118, -110, -257, 33, 80, -243, -157, 82, -62, -131, -17, -67, -92, 44, -17, -51, 134, 65, -88, 165, 215, -153, -15, 360, 59, -232, 119, 245, -74, -98, 91, -20, -52, -18, -134, -122, 71, -98, -182, -1, 3, -216, -99, 155, -94, -210, 73, 155, -98, -22, 115, 50, 43]
1254D3P5q8jJ28j18p1J87m6k88K00K34m37q5M73r1m52K52K04k65qJ49j28P2J83
1278A22k52k7L82k13k23L95L5m02K10K98l45j22L44j20j42J69p5j60K21k3k97
1299b25J89J42k52rK86k13j73K87Q8k88M4J59j7jk7o4J62R3j75r0K23O5k15l2
1323d3J82j01j16J00R1j91n4J71L3k49jK08m6r7RL3K3N4j22j3K39m0k19K28J25
1348B04k96L4L20j80j91J84P9j40Lk5k9J43m6k66J26K27k51j28K52J5j99N0J69
1371E5j60l7J44M8j20%N7Q2L0j23LJ73K4k06J7J57qj73N2J27j36j42J57M4j45
1396h0j5R7k0ro2n8J14J29k45l3K66k3k06J21J99k42M8K20j28j66J90L2q8Nl1
1421A5n9J75m0k88J40K70k65k06K96N4k84P5K06j64q7J61J7j38J12jmJ22q4j10
$$ y = [43, 118, 30, 29, 157, 39, -32, 155, 109, -179, 21, 255, -182, -267, 206, 115, -337, -85, 119, -146, -154, -5, -133, -61, 122, -130, -157, 225, 12, -211, 184, 219, -183, 27, 325, -20, -142, 202, 82, -60, 109, 34, -126, 95, 72, -225, -36, 106, -146, -155, 131, -82, -255, 32, 120, -168, -124, 35, 18, 17, -10, -74, 88, 181, 6, -84, 139, 204, -11, -43, 139, 38, -78, 22, 113, -78, -132, 39, 72, -177, -178, 30, -16, -113, -104, -71, -48, 6, -116, -129, 110, 70, -149, 79, 204, -92, -58, 262, 82, -109, 75, 154, 14, 17, -8, -37, 106, 60, -206, -80, 147, -104, -232, 20, 35, -164, -114, 55, -105, -142, 2, 50, -70, -70, -13, 69, 99, -24, -21, 152, 176, -30, -13, 144, 136, -37, 15, 142, 6, -136, 21, 65, -80, -95, 2, -18, -27, -89, -147, -33, 96, -149, -182, 84, 61, -145, -24, 175, -67, -19, 201, 73, -93, 97, 129, 41, 46, 15, -44, 131, 91, -197, -57, 213, -52, -258, 38, 92, -192, -117, 89, -75, -162, -1, 16, -122, -10, -11, -15, 107, 23, -87]
1445h7J34J93k65q0K74Ok60J03J39j88k2J41o3j36J31k5r8J02m4j23J52R8k91
1468b09R0K79j57k06K41R2j83K7J24p9l5J25r9J3J34j61p7K38n3k63J85J03k06
1491g7k3J66q8j19J07j3k9L4m2kJ16l9j23J45R9j27p6J49Q5j34rR3L1p4m8L9M7
1518H8k6r2N3K%p0j6P5k8j02L9J19j34p9J88O0k18N7J56n3q5O7K2L2j7o7O6J67
1546B04j73j12K36j4k37N9J73j30j01R9O2j23j8M2j1P2j19n7J80Nj92J10J61j29
1570a3q9J34N8p0k1M6L3pj01Q7J13j59r1J36O3j67l5J09K3r8j7oO8Nj22J6K21
1597A16j31j67K19O2k23R6J81j12q9J14kj6M9j05L0R6p7j65J98O5k57M0J85q8
1621A9j73J44J7j02NM4j7M3j5p6J00J27j63p4K46K8k46O1K08j32j18J88qj26O9
$$ y = [-87, 47, 240, -25, -105, 169, 175, -85, 18, 157, -31, -53, 88, 25, -111, 20, -5, -103, -1, -45, -168, -16, 82, -209, -119, 160, 3, -203, 38, 130, -53, -26, 98, 19, -16, 109, 10, 23, 157, -4, -81, 157, 104, -159, 26, 129, -77, -100, 66, -22, -141, -34, -47, -76, -42, -84, -86, 30, -9, -132, 13, 112, -15, -91, 58, 143, 9, 0, 93, 124, 50, 2, 41, 88, 62, -30, 23, 25, 25, -45, -61, 14, -14, -116, -77, 42, -92, -171, 17, 77, -141, -84, 72, 19, -66, 1, 23, 55, 38, -29, 37, 204, 31, -81, 155, 141, -96, -37, 136, 6, -95, 4, 66, -57, -75, -33, -44, 28, -91, -148, 32, 37, -155, -45, 116, -13, -102, 32, 90, 20, -1, 45, 78, 71, -30, 57, 170, 11, -80, 56, 119, -48, -83, 26, 49, -49, -66, -72, -4, 1, -121, -105, 116, -15, -182, 37, 99, -124, -28, 153, 41, -48, 66, 64, 48, 97, -8, 22, 118, 41, -124, 74, 139, -118, -78, 107, 19, -154, -10, 7, -95, -90, -46, -63, -20, -35, -111, -11, 116, -47, -121, 125, 153, -93, -32, 176, 44, -74, 114, 106, -20, 49]
1646D9K1m8J6k1o2P4O2k31J6K41j56j70K37L5j76K3J20o5m6R9k4j1R2q4o5K04
1672A30j6k11J12K12k16j27K05L7j83K5R7q0k1J8j8M4l0r8P7Q6q3q1J15P1j43
1697g8k9J89Kj43J3J60m9j02O6O9m6j7l3K9M1o6j05J01J04k21l8K42n8j98J02
1722f5J39j54n8J50n0l3J13o9l0J59o5j33J62Q7k47Q8K08j57j72K11K7j51J8R9
1746G7p7Jrp9J13Oj57lK15j12j68J80R1k04L9J72n5q6O0J8J9J9k4mL8Rr3M4P8
1775A08n9j48J24Q3j65m1J46j3j51K9J22q3o5O6K0Rk0m0P0Q6q1j10J54O9j65K4
1801c1J85q1j38J34K6j16K5P9p5J3lp8N4P3j63l2K01j9k39R2J46j23n9J57j3o3
1827d8M3K9l3M3mm1O2N7j58J4K01q7j74J12J27j95l8J32l9q0M9K9k8J1m0j6J02
$$ y = [49, 70, 22, 38, 17, -45, 29, 91, -140, -124, 117, -39, -209, 28, 63, -113, -90, 30, -35, -81, 18, -6, -17, 75, -9, -74, 130, 114, -97, 15, 227, 11, -116, 89, 126, -57, -32, 65, -15, -36, -18, -36, 8, -22, -120, -43, 43, -40, -121, -6, 65, -78, -107, 82, 84, -59, -46, 114, 65, -37, 29, 98, 52, 35, 2, 31, 72, 6, -99, 2, 106, -115, -153, 89, 31, -167, -65, 74, -80, -138, 12, -38, -71, 42, -27, -57, 102, 37, -96, 66, 153, -94, -6, 202, 45, -127, 84, 111, -40, -22, 77, 0, 1, -8, -87, 26, 32, -125, -128, 87, -25, -193, -13, 78, -126, -87, 85, 30, -56, 4, 22, 41, 60, 36, 32, 70, 79, -14, 30, 108, 49, -99, 25, 108, -57, -98, 48, 35, -116, -87, 35, -48, -113, -47, -27, -18, -38, -78, -8, 78, -3, -113, 41, 110, -55, -31, 154, 73, -65, 69, 95, -21, 4, 83, 8, 21, 18, -60, -6, 67, -96, -128, 73, 54, -185, -93, 53, -70, -129, 28, 15, -48, -5, 24, -9, 34, 30, -11, 51, 108, -50, -36, 165, 78, -96, 16, 143, -52, -90, 42, 3, -77, -28, 1, -27, -16, -56, -72, 30]
1854C0l5j26J12R6j55m4K15m6j28P1J33j16jO5m3j7N1p6j3J20o8j28J24N6j79
1879a02j3J51m8j04L8R2m7m3J3M4P4o5l8Q4K5j13O8P8k0j04N7J05q7q3K4J21m1
1906F6j30P6N3j05k9N4L4p9J0K7J1Lp8M8R2n9j31J46P0q2q0J18K0k9k9K5K5J3
1934F0k1m4P6o2o3O0N8j03j0R6K7j46j9R4Oo7m0N0J02p6n8N6O3o5J4O1l3m7P1
1963D0KNp4M4M7K0j17j2J07k6q3PO9m6nk2K3j0j3k8N9J4q0K0J20l1j21Q8J05r9
1993Co4R2K2m2Lk3L0M3p3m0J04k2j07M9Q5p0j01J13O9j16k6R0pm0%J8K5rl6j6
2023d6J08J1j18J02Q6j43p4J60jj34L8N3m5l9M6pj7N0q2l8J44q6j04J27M1j38
2049a06J5J44m7j09Q6O3j1k9kK8L8o2o2Q9M6q3m0J34m0j08N1N3p9m6R8J2q0j1
$$ y = [30, -5, -131, -19, 77, -78, -122, 93, 47, -81, -10, 123, 7, 6, 71, 28, 11, 62, -14, -27, 93, 25, -103, 21, 77, -102, -115, 36, -12, -116, -78, 14, -33, -76, -63, -19, 55, -10, -48, 36, 61, -52, 16, 94, 74, -30, 27, 132, 45, -38, -14, 107, 66, -64, 12, 65, -40, -69, -15, 19, -60, -50, -23, -12, -9, -87, -39, 53, -6, -137, 9, 79, -3, -83, 35, 55, 26, -3, 22, 47, 60, 39, -5, 71, 9, -54, 6, 64, -39, -49, 47, 74, -72, -91, 3, 9, -58, -98, -48, 54, -22, -80, -24, 39, -26, -12, 49, 16, -31, 40, 42, 47, -27, 17, 64, 84, -33, -45, 62, 36, -47, -40, 29, -17, -22, -44, -21, -31, -44, -72, -13, 1, -79, -59, 61, 30, -91, -3, 102, 3, -61, 31, 53, 11, 14, -9, 21, 64, -9, -49, 55, 33, -74, -25, 60, -10, -111, 2, 71, -45, -71, 19, 12, -28, -28, -10, 15, 6, -30, -46, 62, 73, -45, 57, 143, 0, -74, 86, 85, -49, -11, 42, -3, -42, 4, -3, -20, 30, -52, -90, 54, -32, -136, -9, 32, -106, -91, 53, 6, -103, -17, 46, 35, 6, 4, 32, 70, 8, -54, 35, 81, -2, -42, 92, 52, -56, -5, 48, -31, -77, 21, 33, -47, -58]
2077e8K3%L5l8m6O9N2r1lJ17mj24Q3Q3r5o1J19ro7jN6ql5n0K1M4oj10O4Q6n6j00
2109a10J04O6j42oJ27n6j7N4k3J9J2k8j1J08n7r4O7R8j51j1J32pj15P2M0r0l8
2136e7K6N4k1m6j0M4K8n8o1J02M4q0j2R0%q2L6O0nn9M2J3j5m7L0J9L2o9rN0j0
2167B9o9QR7q9q8P5P1q8l4J27l3n3M6nlL6m5j0R0j2q0K5J24r2p6J06M8j13j6P5
2197E1m5l9jJ4N0l6m4J6N5m5q5O8O0q5J0J00m7k7K0M8l4n4N1K5K6m8m0N0N1m1
2227B4m7L5N6j08j4R6k2j02N5O5o8l1N0rpLmK5Ml9l1J25J1r9OJ20o0q1R3Jn7M
2259fM7nm2j3j6N0J7r8k5J10j4j16Q2O8q6j1R0rl7qN6j3Kl0K8K1k6k8J4P6n5o6
2291d3N9O5j00j7P3jp6K3KNn8K2K3rj8j0M8M9n7l1P9J4r6M4R9n2l7J2N5n4J2k0
$$ y = [-58, -35, -35, 0, -38, -84, -15, 37, -54, -57, 60, 56, -68, 15, 98, 3, -58, 61, 52, -15, -16, 40, 32, -3, -53, -32, 12, 6, -104, -40, 46, -10, -110, -6, 60, -82, -88, 39, -17, -34, 20, -3, 16, 28, 0, -11, 97, 40, -54, 13, 111, -40, -51, 81, 74, -41, 31, 71, -19, -57, -31, 23, 2, -44, -54, -10, 18, -40, -101, 1, 45, -35, -47, 43, 43, -39, -3, 57, 52, -7, 35, 48, 33, -14, 16, 35, 67, -2, -11, 39, 29, -40, -32, 65, -24, -112, -37, 34, -54, -88, 39, 6, -47, -1, -6, -9, 27, -18, -28, 62, 50, -30, -5, 119, 27, -49, 57, 105, -8, -24, 51, 6, -33, -34, -20, 30, -6, -50, -34, 21, -24, -109, -41, 19, -66, -56, 44, -3, -30, -10, 38, 4, -50, 1, 26, 52, 4, -36, 14, 65, 24, -23, 12, 68, -40, -54, 42, 20, -82, -27, 38, -30, -61, -11, -20, -27, -24, -28, -3, 1, -38, -69, 56, 67, -32, -26, 94, 34, -47, 46, 47, -10, -6, 41, 36, -6, -19, -35, 15, 32, -66, -91, 19, 5, -111, -29, 39, -47, -58, 32, 23, -14, -22, 34, 21, 23, -7, 21, 42, 16, -12, 2, 78, 23, -43, 16, 81, -19, -36, 37, 36, -40, -17, -15, -10, -68, -46, -23, -32, -50, -60, -12, 37, -20, -51, 28, 42, -54, -10, 89, 37, 0, 12, 67, 13, 25, 5]
2323EK2Kj9l6L8lm5j4N3j2o1K5P2m4m4L9L1m1j4L6L7m4j1K0L0ok1K4M7l4k9j0
2355gO3j8p2L8L2l1n5M1Qj9m5M3M7m6k4K8M4m7m9P0N1q6K1N7j2m2J2J3J3k2J9
2386B5j2nPo0O3K8n2l9O4K2r0l1Q6J6l6j6M0jl9oQ3j2o7K6N8No4J7K0j1j1j2Q2
2419G8o8l6K7K7l3n7Q6J9m8m1L9j3K1l4KN2k4o6M4P4n2k3N1L4m7j6Q6m7m3J8Q
2450A8Njj6k0P3n3m8OP1n5o1R4k6m4K1L6j5l0J1L8jj0m2L5N6q3kP5L4r2J8L8J2
2483D2n3J9L0l7j4J0j6M5l8m0M1K1m1l4P2J6r4O0N7oq1L5M4l2k5L6Rj0k3k3P1
2514D1mn8J3O5o9m9O9J7m0j9M2j4l8LK0K0pj7jN1l5m6N8M4j4p9P4M1n6k6O7j3
2546D0p7O0K4kq4N1j5j9K1n0M2K1o8j2N6K8j00L7P2l5j4J7k2RJ5NLJ6Pm0P8oq4
$$ y = [5, 27, 29, 10, -26, 12, 9, -36, -50, 3, -9, -70, -45, 27, -17, -61, -22, 9, -32, -46, -10, 27, -17, -28, -8, 22, 16, -5, 19, 66, 32, 3, -7, 56, 38, -34, 4, 36, 5, -50, -9, -1, -20, -65, -22, 25, -21, -45, -17, 27, -20, -69, 1, 52, -34, -13, 44, 32, -10, 2, 15, 28, 6, 25, 13, 8, 15, -45, 18, 46, -6, -45, 19, 41, -49, -80, 6, 22, -14, -30, 10, 9, -30, -36, 47, 35, -32, -6, 52, 57, -7, 10, 30, 19, 8, -4, 78, 10, -26, 1, 28, -5, -62, 24, 43, -5, -46, -7, -20, 1, -33, -31, 21, -3, -69, -25, 49, -3, -26, 25, 59, 12, -4, 82, 35, -8, 10, 18, 23, 22, 6, -14, 59, 6, -42, -36, 35, -20, -81, 13, -13, -57, -36, 0, -15, -45, -34, 4, 3, -7, -49, -14, 42, -41, -43, 32, 66, -26, -8, 30, 42, -11, 8, 38, 1, -13, -3, -19, 26, -12, -52, -11, 10, -31, -65, 7, 23, -71, -11, 46, 40, -41, -6, 38, 6, -19, 17, 26, 16, -7, -30, 41, 37, -21, -8, 57, -12, -61, 8, 25, -15, -34, 8, -6, -44, -41, -21, -1, -8, -25, -26, 25, -10, -56, 2, 46, 32, -47, 27, 68, 12, -14, 53, 40, -37, 23, 47, 45, -39, 12, -3, -22, -1, -51, -9, 12, -56, -68, -12, 16, -84, -47, 25, -10, -24, -7, -29, -20, -5, 0, 3, 19, 26, -14, 64, 58, -26]
2579b6j6P7Nn5J7M7p7j0K6J7n2QL9rnl0NN2j2m6J6J02n8k4K1M5m5l9L5L5n1J4
2611FK2%mp0N6L7k5m7J7L6k6p3O8J9m3j8M2K1m3OJ7Mj%l5M9j0j4L0k4Nk9P5j5
2645C3n7L6K0Km8OJ5k7k4L4mNlj5K5Mk5LK2J4l5J1M0n4L3J6j5j2j2J8j1L0k2j9
2679a6M6Ln9lO2p3j9M9L8n8j6K8mj%kkL2k1j5O7k6l1K6M7o6lN5on0mM5lk9j3M2
2715B0K4n5j0K5J1n3k3P3rn4JN0lj3J6K3j6l4K5K8j6J6o7M7J9k7j6L6J9k9l1O1
2747C8l8m1L9L0n9%J0J4K5l3j1J2L0m9nM2J3k6lM7k7j4K3J3j2k5j0L0J6k9LJL1
2780C5p4K9J5ll4J1K0J9k3J0rj6k3M9J7j6j7K8Pj9l3M1J4k1nJ6J7o1K8K8j6k3
2812inL9j5n6L7j3K0k9L6mKn1M5K2rm2M9MJ0l4j9N1j5l2K2J4j2Rl2K4nJk1j6L1
$$ y = [-26, -42, 35, 40, -15, 2, 49, -28, -38, -12, 5, -47, -39, 0, -9, -14, -44, -39, 13, 1, -45, -29, 73, 15, -9, 12, 57, 12, -27, 8, 43, -8, 6, 28, 28, 24, -46, 10, 47, 22, -25, -8, 28, 2, -71, -3, 16, -27, -45, -3, 18, -25, -19, -2, 2, 1, 1, -34, 15, 5, -9, 21, -3, 2, -27, 48, 33, -24, 12, 32, 34, -14, -8, 7, -20, -44, -10, -14, -9, -12, -27, -2, 2, -23, -20, 2, 16, -19, -8, 32, -22, 11, 27, 12, 0, -12, 6, -5, 25, 3, -16, 30, 33, -26, -29, 33, -40, -59, -10, 28, -30, -46, -18, -22, -23, -23, -25, -27, 5, -16, -31, 36, 10, -21, 5, 52, -14, -17, 38, 32, -18, -22, 23, 20, -9, -22, 20, 44, -11, -21, 4, 15, -38, -61, 12, 3, -51, -50, 0, -3, -16, 0, 23, 7, -27, -2, 26, 10, 26, -41, 6, 25, -2, -18, 18, 37, 8, -23, 38, 0, -41, -2, 28, -31, -31, -21, -7, 18, -15, -26, -14, 16, -33, -38, 4, 17, -9, -12, 35, 8, -6, 17, 30, 18, -7, -17, 13, 29, 0, 3, 4, 35, -39, -10, 5, 2, -32, -21, -1, 18, -5, 5, -4, -20, -43, 6, 23, 7, -10, 18, 25, 6, -27, 14, 28, 7, 2, 18, 35, -26, 2, 30, 14, -9, -14, 25, 10, -46, -9, -22, -2, -31, 5, 1, 3, -48, -3, 19, 10, -32, 17, 21, 31, -3, -22, 29, 14, -18, 4, 18, 6, 15, -17, 7, 2, 3, -18, -34, -3]
2847cn0L1K4n4LK7M7n2J5J1%l8J2J4QK3oMJl7J3MM2l0rM8k7k0rM0om4J0J4l3L4
2883Gm0NmK1k0K6L4n2LJ7Nj9ML5j5j8J0K4J1j3j8J7Qn1K7j0K2pROpk9j2N4l1j2
2919a3J7Qk4qRJ3J7j4j9N3j8l7L8nNk2L8j8l8K1J6j1k9Pj0K2j2nMJ4j6l9M0K7
2953A1k0k4O2qk2%K9k6j0JK2kMolJ9j6nJ4Jl9J9Rmj6mJ0j5j6L9JJ0m0mlK9j3n
2991b1M1j3m3K2L4j0j5K4K8k7k9M2k9M%K2l7J5l5lL6j9Qk5L8k1k1L0Pk0J4jLq
3025irj9K8Jm1N8J8k7k0L9K3k8l3L7jm1K4M0o9L5j1M%Ml7K0K0j6j1M2nk9jN8l8
3060Fk6K1K1k8K2Rm0K0Ok0J9Nm1PL2j1m6QN2j8j7J3KLJ0J0k0lj0K3rM5l3j2M0
3095D0l6j3j1L1j9kJ9rkm7O3j4NKn4N8m9j6K4K5k6QL8lj3J0Mrk1QK3Krj2qN9m3
$$ y = [-3, -53, -22, 2, -52, -49, -22, 25, -27, -12, -1, -1, -39, -27, -13, -5, 18, 12, 16, 17, -20, -7, -3, 39, 9, 0, 48, 21, 1, -8, 32, 26, -18, -8, 6, -27, 7, -33, -28, -32, -11, -31, -5, 29, -23, -20, -3, 2, -17, -13, 22, 7, -11, -1, 23, 34, 21, 3, 20, 28, -23, 4, -6, 16, 9, 18, 24, 17, -12, -24, 30, -1, -13, 4, 12, -12, -20, -11, 2, 19, 5, -14, 39, 21, -16, 22, 17, 22, 0, 38, 20, -18, 3, 19, 8, -21, -14, -24, -2, -14, -19, -15, -1, -17, -56, -16, 11, -9, -33, 29, 21, -1, -1, 28, 2, -8, -7, 15, 13, 17, 11, 8, 27, 11, 6, 20, 21, -18, 1, 10, 6, -10, -14, -4, -19, -35, 4, 5, 15, -25, -29, -32, -3, -16, -21, 20, 7, -36, -14, 20, 10, -5, 19, 47, 20, -9, 33, 4, 8, 8, 30, -7, 8, -27, -30, 6, -13, -5, -30, 8, -13, -34, -4, 3, -17, -3, -4, -1, -9, -18, -37, -9, -8, -49, 9, 27, 0, -20, 19, 42, 14, -19, 18, 17, -24, 0, 40, -29, 6, -5, -1, -1, 3, -34, -14, 6, -10, -21, 21, 16, -13, -14, 44, 6, -20, 1, 22, -6, 16, 25, -15, 5, 11, -9, 10, 15, -26, -19, 13, 2, -44, -36, 16, -2, -19, -6, -4, -1, 9, 19, -1, -4, -14, 9, 0, 45, 12, 0, 40, 4, -9, -20, 11, -8, -10, 9, 0, -2, -49, 14, 0, 5, 7, -47, 11, -38, -54, -30, -5, -31, -23, 15, 12, -1, 9, 13, 4, -17, -9, 14, 16, 7, -5, -13, 46, 3]
3132Ck0L4kj8mJ7j9j6L5j4j8o%J5K0k9J8K8j7k4mP0l9k8J6jL1l6nM1k2j2K3jk6
3167a0qL0k1L1n2lK4RrLL2m1rK9j3J2j5JK3j8qPJ3K0l1NK0k3j2J1L4n3K4lL3p5
3203d3K8L4k9Jj7K9mj8pK7J6k7kK9J1j8J0j4M6n2J7kpl2M9K1m3Lk9K1Lm3M1Ok4
3238a9J1j8K0J7l1OQPLk7J9jj3K4ojOj2J3lj9K2J1k9OML4k5j3J9j8knnj4J8mR
3276hK7n2rK3J5j2K0j3mJ1J1K0k7J3k1L1m4K9pj4K3l4JlL2Kl7M1Kl5RQk2QK3O
3312A3j5j5jL4k7J2j5K9pj5J9nqj1j4N0j6kNoJl8K3j8M0k2J3jj0J0k9M9j7j8%
3347a2K9k2mM2m7Pj7L9pk6K3k4J2Qj9J0J6J7j7rJ9k0j9L3Pl7J0j4J6K5mmj8j1
3381a8PK3Mk0J3QJ7m0J0J6k0j6K1mnl4L8j8K5j2JOj5j2J5L7n4qK6J7ll4N0k0J6
$$ y = [3, -17, 17, 15, -3, -7, 10, -9, -25, 10, -4, -22, -28, -28, -13, 7, -22, -4, 24, 7, -17, -21, 49, 10, -18, -2, -3, 28, -8, -13, 28, 6, -6, 17, 16, -10, -18, 12, -9, 22, -30, -33, -9, 0, -9, -6, 26, -15, -24, 5, -8, 4, -11, -10, 13, -5, -13, -6, 7, 27, -4, 1, 21, -2, -14, -3, 31, -22, 2, -1, 32, -43, -15, 19, -10, -9, -26, 3, -1, -19, -26, 1, 17, -10, -12, 17, 28, 10, 20, 6, 52, 0, 17, 15, 8, -24, 25, 46, 3, 6, -23, -2, 1, -42, -1, 5, -19, -8, -26, -6, 11, -20, -14, -6, 1, 4, -23, -4, -5, -18, 6, 0, -1, 5, -7, 6, 3, -16, 6, 17, -12, -6, -2, 32, 7, -6, 13, -5, -7, -12, -17, -31, -13, -17, -8, 19, -33, -42, -19, -4, -16, 4, -9, -13, -2, 9, 29, 2, 15, -6, 25, -19, 10, 3, -11, 12, -22, -21, -24, 8, 10, -27, 14, 16, -19, -10, -2, -24, -16, 7, 13, -2, -17, -18, 16, -11, 1, -14, 15, 8, -7, 12, 7, -1, -12, -26, 24, 8, 6, 11, 5, 6, -32, -9, -27, 13, -9, 4, 3, -7, 3, -26, 23, 6, -12, -12, 17, -5, -9, 33, -14, -7, -24, 15, 8, -18, 5, -19, -7, 1, -18, -8, 8, 25, 8, -1, 18, -2, -21, 12, 19, -18, -8, -22, -6, 19, 15, 11, -7, -18, -11, 12, 16, -4, 9, 17, 34, -6, 4, 20, 0, -16, 5, 1, -4, -38, 0, -18, 7, -5, -4, 2, -13, -25, -10, 27, -27, -35, -9, 8, 5, -29, 21, 1, 17]
3416A7J4k8JrNJ0L1k5m3L5L2n8Kj4N0m1J0J4j0j3K5qK5rk9K7j6Nkl0M4k2lK8o
3451Ik0j5J5j1K8Qk1oJ5j2pL2l5l6O3ql9J2N5k3l4K6ojK3j5J3%%k0J6k2k3L2K2
3486A5J8l7J6Rl1j0K4l4OLK4j3pkrJ9k1NK2J2ll8L1%J6JJ3Nm4L8k4K4Qk4ORk5
3523Bj3J6rql2L8K7n0J4k3K8Rl6N2mj6p%K6L0n8K4J6l8L2J0j4l1K1J9j0Ml4mJ9
3558@J4nJ3nn3nN8k5l1N8n4L6m4N2k6qlL2oPpjK3l2l0N0k5K5k1MK0j8opK7l1j9
3595d3O9j0k9ML1k3jK0l3J3J4j3ML6m8K4J5kj7j6J2K7o4K8PMk1l1L4Mk1PJ3j0
3629a6ol3O2j6j7QK0j4KQL4j8Kl7M1k9J5OQk2j0K7j1KnLJj4j8J0J2Okk4M3j2j6
3666a0OL0l7j2J1nM5m7M7j6Jk0L1J0n0L2j3K8j8Roj7ol5M9Rml8M9j1k3K1j0J8
$$ y = [17, 31, 3, 4, -5, 0, 10, 41, 16, -27, 8, 40, -18, -16, -30, 20, -21, -11, 3, -7, -20, 5, -3, 22, 13, -16, 11, -5, 0, -2, -32, 12, -10, -13, 15, 9, -11, -26, -11, -22, 6, 14, -7, -13, 2, -10, -17, 15, -20, -56, 7, -1, -40, -28, 27, 4, -30, -4, -10, -11, 12, -3, 10, 10, 10, -10, 6, -16, -39, -7, 15, 33, -4, 12, 21, -10, -20, 4, -30, -24, -21, 3, -10, -17, -19, -28, -9, -30, -25, -3, 9, 6, -32, -1, -1, 15, 16, 29, 34, -10, 28, 4, 28, 36, 12, 18, 27, 2, -11, 5, -4, -12, -44, -6, 21, -29, -15, -38, -10, -1, -37, 15, 11, -5, -12, -12, 14, 44, -14, 10, 26, -12, 20, 30, 16, -15, 6, 25, 15, 19, -15, -19, 0, 14, 9, 22, 17, -36, -41, 17, -8, -39, 19, -35, 1, -43, 9, -17, -25, -28, 4, -2, 5, -2, -3, 20, -12, -42, 8, -17, 8, -13, -9, 11, -7, -13, -20, 7, -24, -43, 26, 16, -13, -9, 22, -1, -2, 18, -15, -2, 12, -1, 3, 39, -9, 15, 30, 28, 11, -5, 7, 34, -30, -2, 5, 9, -12, -43, -9, -5, -26, -19, -6, -16, -22, -55, 7, -9, -26, -18, 2, -12, -10, -2, 32, 14, 16, -21, 20, -9, 6, 12, 20, -2, -12, 15, 4, 6, 1, 4, 5, -9, -27, -17, -5, 1, -1, -25, 18, 6, -10, -4, 26, -11, -23, -12, -17, 28, -19, 28, 12, 13, -7, 24, 34, -16, 16, 3, 31, 13, 22, 16, -1, -7, -42, 7, 16, 12, -26, 23, 12, -11, 10, 0, 18]
3700A8k7j6J1J8oj9J7J8k2l0L0K0j0J5Rk3Pk6N2j7l8NL4k9j0LK0K2n9M8kj3j5
3733a5rN1j5k8LL0k9J0MJK2l9j0M3rl7K6K6k5l4N6Mk5l4K0L8l4j0K7Mm5J5K7K6
3767C5k8k0KLK9k3L9j7l6J5J3Ol8J6j0L2l5J1MOj6J1kl0K3j3J5oj3MM6l1k2J0
3801b0J7J8k3mK7k5lK6j5J9oj5J0k3J9mQpl5M1J0k2j9J7J3j7mlJ6KJ0j0J6k8O
3836hj1M5l2QK6j5j5Qj9mJ1OomL2l2k6K7J1rLJ1j4MN%j1Qj5K1j2j3L6j2pJ7l3
3873a9K1k3MK7Nm1J4J4lj8lK4k0J6%k4M1k3PlK3j9oj1J6j1L3J2k8k7M8j9rj0k
3908a4kJ3j5QJ3l4J7mNmj3L2pqJ3j4MOJ3j6%J0k0K7NrJ0k3N1l7j3J7mj6j4M0n
3945A2k3j6L7m5L7j4j3K3Rl1MK8k1J3PklpJ3k1Nl3M9J6k4k1J8j7QjK3K5o5L3l
$$ y = [18, -9, -25, -14, 4, -2, -21, -4, 14, -8, -38, -8, 12, 2, 17, 26, 3, 10, -16, 36, 19, -19, -14, 20, -9, -19, -16, 4, 26, -33, 15, 13, 0, -15, -24, 27, 12, -16, -13, 17, -12, -2, 2, 3, 25, -14, -24, 19, 10, -27, -1, 25, 0, -34, 22, 26, 1, -33, -13, 25, -9, -19, 8, 12, -33, -18, 9, 35, 7, -13, -11, -8, 21, -2, 37, 20, -16, -1, 12, 18, -20, -4, -14, 18, -17, -6, -2, 4, -12, -1, -3, -33, -10, -23, -8, -14, -27, -23, 23, -8, -30, -20, -3, 15, -8, -12, 15, -10, -13, 13, -2, 17, 11, -4, 6, -17, 2, -2, 6, -1, -36, 5, 15, -7, -26, -9, 4, -13, -17, -20, -4, -2, 8, -2, 14, -14, -8, -19, 26, -6, 2, 28, 13, -2, 6, -13, -17, -6, 0, -6, -10, 22, -10, -36, -9, 2, -7, -4, 7, -7, -3, 2, 2, -9, -1, -16, 5, -7, -20, 16, 4, -3, 14, -19, 2, -21, -17, 10, 15, -26, -12, 2, -1, -19, -22, 2, -18, -2, -2, -26, 15, -8, -1, -4, 19, 0, -6, -17, -1, -12, 21, 33, 5, -22, 26, 7, -2, -12, -14, -16, -3, -18, -10, 3, -31, -14, -18, -13, -17, -30, 2, -5, -13, 0, -14, -10, -4, 9, -7, -7, 3, -17, 10, 15, 6, 16, -7, 44, 7, -6, 11, 7, -9, -23, 17, 12, -11, -27, 10, -35, 2, -12, -25, -2, 7, -24, -20, 8, -13, 0, 7, 5, 2, -5, 8, -13, -8, -41, 8, 24, 0, -21, -3, -20, -12, -13, 10, 35, -30, 3, 0]
3980@Pj5OJ3m1RML4ll2M3Nj2k0jJ7j2l0J6K6qj7L0pk7J3k6M6l6kJ1mnmOL7jk2
4018bK2mrlk0L0k1j4NM5j1k5K7k5L1l2K4jj2k3J5Pl1L2J6qn5J5K1Rlk2NlOK3j
4055Hk7kL6rrOLqRj5J1J7j2k5pM4k8j8L6l2K4j4j0nJ9%RqK0o0K8K6%nj6J1NRj0
4094AkQNJ3k3LmOj7jk2L0J9m4L3j3j9J3j5NK4lJ4k3J9l1K2NK7n4MJ1L1k4k8N0
4130B0J5m1%pL3k0j0J4Pl0pNomK2nnJ1K1j7k6J2K1PJj9J0J3j5J3NJk5j3J9K6n5
4167b9K6KLk0RJ2J2l9nj1M2p%j3J0j8LM4j1kk4K0K3k1k7J9LMk2J4RjJ2j4j2K2
4203A3k8K0K0k9lk2K9j5NoqK0lpQj9J6rlL2j6L2m1L1k1J3oOK3j9Mj9nJ8l7NK0
4240aRqL1l6NjKj3PMJ0k3QMj1jJ5K0l1K8k6MoJ7pJ7k6mRk1jJ1KK2j4lLJ5k3J4
$$ y = [0, 7, -8, -2, 11, -30, -21, -17, 17, 14, -18, 25, 30, 18, -2, -3, 14, 2, -28, -12, 14, 6, -11, 19, 12, -15, -2, -28, 18, -18, -20, -9, -13, -18, -22, -16, 21, 20, -2, 20, 16, 7, 4, -16, 14, -7, -21, -16, 29, 18, -7, 20, -5, 26, -6, 18, 17, 5, -18, -3, 4, -27, 5, 21, 13, -42, -27, -6, 3, 0, -22, -17, -20, -14, 9, 8, -19, -21, 15, 6, -3, 3, 6, -2, 7, -8, 3, 20, 8, -17, -24, 20, -8, -26, 10, -22, 2, -12, -22, -27, -8, -8, 1, -7, 13, -47, -19, 7, 7, 2, -14, -3, 2, 11, 1, -1, 7, 12, 25, 2, 5, 1, 7, -10, -11, -33, -3, 16, -28, 5, -8, -27, -14, -29, -24, 0, -3, 11, -12, 7, -24, -2, 3, 30, -24, -20, -9, 22, -2, -30, 20, 35, -6, -6, -13, 20, 0, -10, 4, 11, -19, -26, -21, -27, -31, -9, -14, -19, -8, 13, -4, -30, -18, 3, 10, 11, -8, 2, 15, 0, 13, 18, 19, -6, -19, 0, 26, -29, -3, -1, 2, -18, -9, 3, 15, -24, -29, -40, 2, -5, -5, -18, -8, -26, -23, 21, 10, 8, -16, 4, 27, 6, -21, -2, 1, 5, -17, -3, 6, 5, 17, 3, -9, 13, -15, 5, 25, -4, -7, -29, 0, -15, -10, -16, -24, -4, -7, -14, -6, -25, -9, -18, -21, 11, -5, 27, -14, 17, -4, 9, 3, 9, 32, 13, 17, -2, -7, 11, -26, -21, -1, 8, 0, 31, -5, 0, -1, 1, -12, -5, -1, 9, -14, -6, -2, -13, -14, 1, 21, -10, 18, -8, -4, -10, 7, 0, 17, -9, -13, -4, -25, -26, -15, -13, 9, -5, -8, -5, 10, -13, 1]
4280AJ2rk1rN3k8pK9j3qj5nK5nkkJ5%k9L5k6OrJ0j0J8rMMk7pL9oj8M6j0l8OJ9
4319IOj7LjJ0j0rlK4j1J0pJ5k1j5j5N7l1%k5Qj2J3J8qK3k0mJ0J1k3J4L8m4j5O3
4355D1k7k2J6Qlj8kL2rk1K2k3L0k4j5RJ9k6J3J0jj1k5J8j5K4j9K0j2JKK0%k6J6
4390BJ2Qj2J5k0J5j4j9J6nJ2j8Kj1LmL6j5J0lJ6k8k0J4J3Nm8O0Pj9k5N1l1L4n4
4425a5nN3j4qkL2n9nNK5kk3K5pk6J7R%j3oj2Q1m1k7RL0j6k8L9Nl3J1k1Qj1JN4
4462C0rl4lOJ2Jk1Kj2LNML6k8J3J3j7j0j7L2K2l6J0%%Nk0J7Qk8%J7qmKK3l7J1
4500a2J2Rm1J6qL1k0K2j6J7j4l2J8K7lj8K1k2jNL9k3j0k5M9%nl4K3Kk4KJ8k8L0
4535Ek8L8j7j1kkL0j7PLJ6nj5oK5n6J7NL0j3l6L5k4J9j5qJL1lpK5k4K1pj0j1J3
$$ y = [1, 13, 4, -17, -26, 27, -1, -8, 21, 8, 0, -15, -20, 5, 0, -2, -4, 11, 11, -18, 17, -9, -3, -12, -2, -12, 6, -3, 1, 5, -22, -29, 10, 4, -14, 32, 22, -16, -10, 9, 15, -2, 1, 0, 10, 0, -9, -12, 12, 1, 11, 4, 19, -2, -17, -32, 25, -6, -6, -31, -23, -35, -22, -4, -12, 11, -9, -13, -3, 8, -15, -1, 37, -7, -22, 41, 14, -8, 8, 16, 13, -5, -7, 25, 16, -5, 17, -6, 24, 0, -15, -6, 13, -13, 0, 10, 9, -2, -27, -9, -24, 0, -19, 1, -11, -10, -8, 12, 12, -14, 2, 14, 22, 10, 25, 5, 20, 6, -13, 3, -2, 10, -8, -6, -17, -14, -18, 18, 3, 13, 10, 26, -2, -22, -8, 5, 10, -38, 22, 29, 10, -15, 36, 5, 39, -15, -20, 33, 19, 11, 9, 41, -18, -23, -18, 7, 5, -18, 7, 0, -26, -9, 0, 0, -13, -19, -31, 50, 9, -18, -9, 21, 5, -23, 16, 21, -12, -1, -22, -14, -25, -24, 30, 21, -13, -16, -10, 2, 3, -18, -16, -28, -25, -20, -16, 20, -8, 5, 18, 1, -9, -26, 6, 28, -8, 2, 2, 2, 7, -13, 4, 12, -16, -16, 1, -7, -11, -9, 14, -23, -12, 0, 9, -32, -16, -24, 7, -13, 9, -7, 10, -4, -36, -18, 9, 6, -12, 9, -13, -14, -9, 30, 7, -3, -28, 21, 21, 16, -18, 5, 7, -17, -15, 3, -25, 5, -23, 15, -2, -13, -15, -17, 13, -4, 3, 6, 22, 17, 2, -4, 21, -35, -18, -13, 17, 4, -32, 3, -21, -2, -17, -25, -24, 7, 4, -3, 22, -2, 19, 12, 2, -9, 4]
4572Dj6K8k2KL8l3j6J4mJ4k2J9qNj3J2L1m9j8K3J2qj2K9k4Mj2KK2mj5L9j4rJ0
4607InK5m0J0l1M2J5k9J5K2k1pKK2kl7J5K0k9nKnNK3l3K8k3kJ8l%j2L0l1%j7J2
4644a7K6nJ4rjj4L6l3Qj0j0K4Nk9kJ6Jj9%L1m4K7%J1j9LK0j0j0JK3L%l1PJ9j1
4681Ak9L7k1mnOj3J4J2J2j4mJ0J5k8J9k6qN1l4J2rpJ2j1pO2o1K5PJ2k7jJ3krm
4718dj3K4k7%oM2p0L6%oQj9M6j6LnLjJ0J2k0J1Qk5J3j3MNlK0nnK2Jml2Pl8N5m7
4758b9L5j1j2KJ3Ql2J2J7lj5jJ5PPmj7J1QoJ9l0mJ3J9rmJ2j0ok2jJ9k0j2L0j8
4795a9K1j3M0Nl9J7J8j2k7J4MPk7K9j8J1rnJ1Jj8J4konJK8Nl9jK4Nj8j5J2J4k9
4832b1L4rJ5j5J7qQl4OK7qk0rK2j4mpO0n5J0PkNk7JL2l0J4j2L6l5Pj0L8qj4rM5
$$ y = [4, -12, 16, -6, -4, 34, 1, -15, -1, -5, 9, -13, 6, -2, 3, -10, 2, 33, -16, -34, -11, 1, -7, -19, 10, -14, -10, -22, -20, 2, -2, -17, 22, 8, -1, 9, 4, 29, -11, -1, -32, 10, 25, -4, 11, 33, 12, 5, 7, 29, 27, -10, 5, 25, -4, -9, -7, -12, -7, 16, -17, 11, -12, -14, 4, 1, 1, -11, 19, -12, -12, -29, -17, 9, 4, 18, 9, 8, -6, 30, -3, 5, -5, -15, 9, 14, -15, -17, -1, 0, -19, -19, 12, -32, -5, -5, 6, -13, -10, 10, 0, -10, -9, 14, 17, 17, -14, -7, 12, 1, -28, 9, -12, -16, -21, -15, -28, -14, -2, 10, -4, -8, 2, 17, -11, 8, -18, -26, 25, -9, 3, -6, -13, -1, -12, -19, 43, -18, 7, 14, 26, -1, -2, 11, 9, 0, -4, -17, 7, -20, -20, -26, 16, -54, -18, -18, -24, -16, -35, 11, -5, -2, -7, -4, -5, 5, 17, -3, 8, 16, -9, 4, -9, -5, 0, -3, 17, 12, 7, 29, 30, 26, -6, 1, -37, 18, -29, 6, -5, -17, -15, -2, 6, -26, -14, 3, 0, -15, -16, -1, 6, 13, 9, -8, 3, 11, 5, 24, -6, -10, 3, 22, 13, 9, 21, 11, 5, -17, -18, 1, -19, -31, -1, -19, 2, -11, 29, 34, -5, 12, 30, 18, -9, 5, 9, 16, -11, 18, 0, 11, 2, -3, 8, 9, -9, 5, 3, -3, -8, -7, 21, 26, -13, -14, 10, 15, -3, -18, -6, 8, -21, 13, 4, 19, 4, 21, 13, 21, -13, -7, 20, 12, -8, -17, 5, -9, -13, -20, 40, -15, -5, 2, 0, 5, -22, -21, 11, -19, -5, -17, 19, -16, -9, -19, 19, 11, -3, -12, 33]
4870C3j5j1Jk3L6j3lOj5j3NK9kj8Qrj1j4J7RLj0j6J8j8K2lOk1pK5oPk1N7m8MK9
4908A8lj9j0J2K9m7NJ1JRpPl6L4k1L2l4K8l9K0K3lrmMJ2k2NK4l7j9N6km4M2k8
4944a2K3j4l0M2Kl1k6L4QqjK0J3k6kJ9Nl0PK3j3Oj9K6Lj6j2J2rNjOj4JQj1K7k2
4982gJ8m0j1J7j3L0nJ8j7MJ8k6pL7k2MLjJ2LJ0j0rm6M2Rklk6L4k2j1kL2j7J7J9
5019C0j5k5j5J0L2opj0OLnK3ll4PNQlNoj9M0l3kJ4j8J1%j5j2OL3K2l0k7N0Ll4
5057a1J9J6Lo4M8j2j2K5k8N5l6j7LJ3jqK8l2L0j8j4J1nJ2J3k4OK3k2j9K1j1Jo
5091a3M1l0J9J3m9jK7Nj8NOMqj1kMQk8L6j3%k8J0L1m0J1K9j4lJ0J7Nl7L2J3mk8
5128a%k6K4oMJ3Pj1j8J8j6K9m9jK2NJ3mk8NPK2j3qMNmk3L4j7J3kqoL6n0K0K4j6
$$ y = [33, 18, 7, 8, -15, 21, 8, 5, 11, -4, -17, -12, 17, 15, -3, 5, -4, -15, -29, -12, -3, 0, -10, -26, -8, -26, -4, -7, -1, -22, -29, -4, -10, -3, -24, 33, -15, -11, 18, 15, -4, -14, -2, 27, -20, -15, -4, -3, 6, -1, 6, -30, 4, -17, 15, -19, 9, -30, -10, 13, 10, 1, -3, 1, 13, -9, -4, 20, -17, -36, 20, 18, -26, 16, -12, 11, -3, -33, 9, 11, -20, -46, -12, -4, -12, -13, 7, 20, -6, -8, 11, 16, -14, -7, 16, 3, 9, -10, 16, 19, 3, -9, 3, -6, -1, -2, 4, -10, -9, -1, -12, 15, -7, 11, -29, -40, -23, -36, -6, -11, 7, -10, -6, 12, -14, -21, 16, -6, -2, 1, 0, 12, 15, 25, 15, 6, -40, 2, 11, 9, 6, -20, 14, -8, -19, -21, 11, -6, 11, 30, 15, -10, -25, -15, 17, 11, 4, -6, 0, 3, -2, 21, 18, -16, -9, -4, 4, 1, 6, 0, -19, 21, -12, -14, 0, -18, -7, -7, -22, -34, -28, 5, 27, -3, -30, 20, 23, -11, 8, 24, 27, -37, 11, -1, -13, 12, -16, 39, 3, -14, -11, 2, 1, -7, 21, -11, 19, 1, -13, -2, -7, 5, 18, -6, 0, 23, 1, -18, 3, -8, -7, -13, 28, -2, 17, 30, -19, -20, 7, 12, -6, -1, 5, 9, 1, -10, -12, -8, 0, -28, 8, -5, -5, -33, -23, 8, -32, -21, 8, -6, -9, 1, 18, 23, -14, 18, 31, 27, -1, -1, -27, -3, -9, -5, 8, 15, 4, -14, 4, -12, 17, -32, -33, -11, -6, 7, 3, -25, -20, -13, 9, -4, -12, -8, -3, -7, -30, 4, -13, 0, -2, -10, -16, 20, -30, -10, 14, -2]
5167bj0mK0j4j3J5K1k3k0K3j1l%K3j4j8M7k9J9mmj8K6nj6J9jJ4m3L2%j1J2k8J5
5202ej0k1M7k2RLPl%mk1PrJ7J2plk4K5Rk1J6Q%qmJ9jj2%l9K8J0l2O7k7llk9J8
5242frJ6j3MrK4Nj3lk1N0j3JnQj6%j7L8k9oL3jKj4l2L1pk0K7Kk1j1%K3qJ6k4J9
5281Ak2kL5j6j1MJ4J0ok2MmK4l0L3J3m3K3mJ8j4L%l0L3Pj6j5K4j0pJ0mkJ0k5K4
5318Gl7M6j6k3M4j0j5k4J3%K1J0m3%L6l0%K3PqPRk8J3m7M2J5pk5K7rj8K5j6L1
5353B0l7J4j2J8l4PM1l7pJ2J5j7LPK1k5j8M8k2Ol3j0M7j9JJJ2qQj2J5Qj4RMpk
5390CQj0k6JJ3OKkl6L3rj1K4j4k6M1oOl6J2K6j5j2K2KMj8QmL6o3M4%k6K3K6j4
5427A2j7oqJ8kPj2NKJj9NoK4MLk7j9K7J7l8J2L1mk3J9kPm8K3MJ1knjQk1OK8k4
$$ y = [-2, -12, -16, 4, -10, -23, -8, 13, -10, -30, -7, -18, -21, -21, 2, -12, -30, 17, -12, 7, 3, -1, -19, 7, 2, -14, 5, 4, 18, -25, 7, 7, -4, 8, -20, -5, -15, -36, 11, -11, -2, 1, 8, 5, 5, 1, -20, -13, -22, -5, 7, 0, -3, -27, -2, 7, -14, 2, 10, 10, 2, -2, 17, 16, 4, 4, -35, -7, 3, -29, 38, 11, 8, 5, -24, -6, -15, 1, -12, -8, -17, 7, 12, -1, -4, -25, 25, 12, 13, 8, 16, 0, 0, -17, 21, -8, -14, 19, 18, 20, 6, -26, 5, -2, -22, 5, 7, -14, -25, -25, -2, -10, 6, -18, 1, -21, -23, 12, -4, -15, -11, 3, 13, 7, -15, -11, -15, 9, -21, 12, 25, -18, 5, 1, 19, 5, 8, 8, -22, 11, 18, 2, -13, 11, 1, -6, 4, 0, -2, 8, -17, 7, -30, 16, 0, -23, 21, 11, -4, -28, -15, -15, 6, 16, -27, -27, 9, -21, -21, 2, 9, 1, 8, 17, -11, 2, -45, -3, 12, 5, -20, 7, -2, -20, 5, -11, 20, -17, -3, -15, 3, -31, -24, 17, -20, -27, -15, 0, -17, -14, -7, 14, -11, -29, 19, -3, 3, -30, -40, 7, -12, -11, -10, 2, -6, 2, -10, 5, 13, -1, 8, 12, 5, 3, 11, 1, -25, -24, -11, -5, -3, -5, -41, -8, -17, -28, -4, -18, -44, -3, -9, -3, -39, -27, -1, -16, -28, -6, -4, 0, -18, -10, -14, 22, -41, 3, 3, -23, 0, 26, 12, -5, -11, -19, -1, -3, 4, -8, -3, -1, 0, -19, -14, -20, 4, 8, 11, -16, -35, -8, 9, -29, -17, 14, 10, -13, 6, 4, 11, -37, -14, -10, 1, -1, -6, -7, 1, -20, -14, 14, -10]
5467a0J3kJ2k0mLK6m8L1PJkk0LL3j4j1pNL6l1j6RLjk5JM3k6l%K5j4k5K1mJ5j5
5505a1qRpjK7jj0rM9l6k1L7lKl0J5M5n1%j3KK0k2JK2k3j5L0lNOJ9j4lLj7Kj3J2
5544emJ7k7LN9m0Mk7QK1j7RJ0j9mJ1mQmj3Ok1L5k6J0k0J1J5j1rL2pKJn2L5L1j9
5582aq%J9j7plJ3kk6J8K9l6K5j8J6l3K3K1k1oJ9k9M3Om2NNKQJ2l5K9j5K3rj5n
5619a2K8k4n%oJ4j5JL7l2j1%K3J5j0jKKj9K4oJ6k0pRLk5J9LqNj4RJ4j3LPj5mo
5659a9J9%l6K7Jj1qJ9K3j5K1m9M8j9j3J3k8RNJ7JqMOj4qJ8mK0Nl5MJ2LJ5k6k4
5696b7J4rk9P1Lm0jM2rj6QklnJ4J1j4l1L4kl9QNJ6l3kM0mMJk1J5k6NM1j9Jj6K6
5735A1j8M3k9j2J4j5J4Llj0lLJJk6K1J9k3J0k4N2k4k8OK3J7l1KK7l3J1jnrj9L8
$$ y = [-10, 3, 1, 13, -7, -11, -8, 18, -30, 1, 8, 9, 7, -13, -10, 23, 9, -2, -9, -4, 32, 1, -15, -6, -3, -4, -29, -28, 15, -11, -14, -14, 11, -3, -28, -7, -11, 4, -11, -19, -10, -17, -18, 9, 8, -2, -11, 38, 2, -19, 18, 15, 17, -13, 2, 47, -4, -4, -17, -15, 5, -17, -16, 6, -17, -32, -2, -5, 0, 6, 25, 11, 8, 11, -6, -4, -17, -5, -9, 8, -19, -16, 43, 3, 7, -20, -12, 9, -8, 1, 11, -8, -12, -1, -5, 3, -1, -14, -8, -29, 6, -20, -10, -30, -19, -4, -15, -24, 8, 1, 3, 4, -48, -13, 18, -1, -9, -9, 10, -7, -14, -17, -4, -6, -32, -14, 15, -21, 4, -14, 2, -31, -8, 13, -8, -14, 5, -24, 19, 25, -17, -12, -7, -5, 3, 15, -20, 9, -6, 17, 8, -7, -12, 16, -8, -13, -13, -19, -5, -20, -19, 18, -14, -25, -25, -2, 13, 3, 2, 4, 6, -13, 11, 5, 21, 1, -6, 3, 6, -19, 0, 3, -5, 0, -14, -5, 9, -4, -1, 6, -9, -13, -19, 0, 0, -36, -9, -8, -19, -27, -8, 15, 0, 21, -28, 20, 1, -12, 1, -27, -18, -13, 4, 5, -3, 1, 7, -7, -15, 3, -1, 19, 24, -11, -7, 5, 8, 23, -3, -27, -13, -22, -51, 20, 23, -17, -18, 24, 15, -1, 7, 5, 2, -3, 11, 22, 8, -23, 11, 9, -30, -22, -17, -1, -34, -36, 4, 0, 4, 5, -16, -1, -27, -22, 19, 0, 1, -15, 11, -7, 36, 7, -5, 9, -6, 8, 11, 8, -2, -5, -2, -1, 0, -26, -5, 14, -9, 1, -23, 29, 5, -23, -17, 6, 23, -8, -6, 21, -12, -1, -2, -7, -16, -35, 3]
5771CJ2j4oRj0J6k1NmjOok0QJ7J3k6NJ3kp%k1L8Koj0J5j7j4N0j7j3PJ3j8JK3j0
5810A3k3KMNkmJ0K2k0k2kJ8j3j7L8j7LK2k7NJ1pj3L3l9j3K4%%j0JK6j1K4j4j1
5846dNOL4k3mj6K7k2jlKk4L5k4K1K5n3J8LLmJk1K9qj9J6mk3ML8%l5K0Onk0JOj3
5886b6J8lRnnPjOJ2nK2k2nJ5Kj9%kOJ0Kl5K0J6l3J6J7j9k2NNRK0l3K0K2l5J0k5
5925b6K7j2K6k4PpkJ8j1j9L1kQj6j9M1j3k6K0PJ8n6K0K8k2nrM4k5j8K8j8KJ1k8
5960b2J8Ll5K4K9j5J3j6j4L1m0M0j1r%J7J9l2j0J7POl2oQLJ0j7M5k0k7K1J3m2
5994b4K8j8K8Jk7JK2j3jK4k7J1j3K7n5L8kOK9o2K0mK0j5j1qJ2%j1M2j3j8L8j2
6028A3j6j0J1K9ql7K5j1pNlpJ7k1L4j2pk0LN6j7m6K3qk0K3kL3l4joM3l7rL7l6
$$ y = [3, 15, 1, -5, 4, -6, 10, -11, -6, -10, -11, -5, -11, -31, -23, -6, 7, -19, -14, -1, -3, -10, -10, -31, 7, 9, 3, -7, 8, -9, -23, 27, 10, -3, 4, 17, -1, 0, 23, 13, -10, -8, -4, 1, -1, -5, 5, 27, 7, -15, -17, 1, -12, -29, 9, -8, -5, 17, -10, -5, 6, -1, -14, 19, -20, -33, -9, -9, -9, -19, -18, 8, -3, 21, 7, -4, 1, 7, 41, 18, 14, -2, 25, 3, 2, -1, 1, -23, 12, -12, 9, 34, -19, -1, 2, 5, 1, 2, -19, 10, 2, -17, -1, -5, -28, -24, 14, 14, -21, -1, 5, 0, -20, -19, -13, -26, -8, -11, -2, -7, -12, -5, -6, 0, 12, 7, 29, 7, 2, 17, 19, 0, 0, -2, 4, 14, 16, -19, 1, 17, -16, 0, 17, -2, -24, -19, -14, -5, 15, -18, 2, 24, -11, -1, -26, 1, -11, 15, -9, -2, -9, -11, 7, -4, -23, 8, 6, 14, -2, -21, 20, 7, -19, 1, 8, 26, -30, -10, 18, -4, -9, -18, 26, 1, -17, 11, -7, -5, 6, -22, -4, -1, -36, -12, 17, 2, 15, -1, -15, 16, -24, 16, 5, -4, -4, 13, 32, 0, -10, 7, 14, 20, -12, -18, -10, -7, 3, -14, 31, 11, -16, 5, 18, -24, 4, -14, 14, 15, -12, -11, 11, -2, -3, 21, -6, 5, -8, 19, -36, 2, 0, 6, 35, -27, -7, -11, 9, -6, -17, -25, -13, -13, -24, 18, 5, -13, 25, 13, -3, -13, -2, 27, 19, -18, 7, -4, -11, -6, -9, -16, 1, -20, 14, 2, -5, -25, -22, 34, 17, -29, -6, -14, -34, -11, -13, 20, -14, -15, -21, 22, -15, -24, 13, -23]
6064b3L4j7L4l2Pj9N0j4k2k3J6J8k9j6M4Jm8M7j6jJk0K7mKpK0Nll9J3J0K1k2j
6099fl%k4M6Jj3J7m4J7J2j3J7L6n5oJ1j0J8jKJ0l8J4KK8l7OKJ2j2J8l1MkJ7Oj2
6136a1%j3K7lj7K4j7mK5%lj1lqKk2L7jK5m1Rj0K2jlMoj0j2JKJ2j3K4Jpj5K2j7
6175a1nkL5j4Jj7K0Ok0Lj5J9l0M6pj5qj4M6j5j4M1k8j4OJj8J2L2l2MNm0L8Ql7
6211c3OJ0K5j6NJ6qk4K3%J0n5K7NLJ1j2PlJ8j2j6K3oPPk6Qk6M4J8l5K3m9J1J3
6247ak2L1ok5K6j2J1j5qK8NJ0n5M9m9J0K1rJ7l5J8qk7L8qOjJ2k0L0j8J8JMj2j4
6283a0J0j1PLpKL4km1K2kk1LK6Km8N8k2mlJ8J2j8j0JKokJ9Lk3Rj2J4Mk1K0pJ9
6322A8k5LJ2k0LRK9k4l5L6ql0J4J6Rj7Qk1N2j5j4j7pN3l2mJ0m2O5Pm2Pk1%M4l1
$$ y = [-23, 11, -6, 28, -4, 3, -16, 34, 20, -2, -25, -9, 9, -20, -36, 8, 9, -39, 8, -8, -9, -8, -28, -1, -5, -3, -10, 10, 15, 12, -27, -14, -4, 17, -5, -6, -9, -9, -33, 13, 14, 1, 18, -26, -9, 3, -10, 7, 43, -12, -18, -7, -17, 1, 0, 2, 12, -26, -12, -10, 18, -19, -13, -11, 1, -11, 7, -24, -20, -22, -5, 1, -11, -11, -24, 3, 0, -17, 7, -10, -14, 11, 11, 8, -3, -6, -14, -12, -34, 3, 2, 27, -14, -5, -15, 7, 6, 3, 7, 1, -9, -21, -20, -18, -6, -19, 5, 6, -1, -16, 6, -11, -16, -18, 17, 3, 4, -13, 7, 13, -7, -4, -19, 0, -30, 16, 9, -6, -14, -28, 18, 3, -11, 30, 2, -12, -6, -5, -23, -11, 21, -11, -7, -2, -42, -4, 4, -33, -27, -17, 8, -8, -3, 13, 5, -19, 4, 4, 14, -41, -14, -9, -6, 5, -7, 0, -3, 15, 3, -13, 10, 4, 11, 18, -8, 0, -26, 18, 36, 1, 24, -25, -14, -1, -23, 8, 2, -23, 3, -9, 2, -13, -21, 7, 12, 22, -33, 16, -33, -23, -2, -11, 6, -29, -11, -19, -46, -8, -16, -10, -11, 1, -19, 11, -7, 11, 12, 16, 4, -10, 0, -11, -4, -1, -8, -6, 28, 26, -15, 7, 5, -16, -13, 13, 15, -33, 25, 3, -1, -4, 14, 26, 8, -2, -1, 1, -5, -7, 12, 15, -8, 1, -11, 3, 7, -14, 6, -1, 18, -7, -4, 8, -12, -9, 0, 29, 5, -30, 6, -2, -32, -18, -2, 7, -10, -2, -23, 29, 14, 0, -17, -24, 29, -3, -7, 3, -39, 26, 33, -9, -2, -23, -23, 21, -10]
6358a0PK6k8j3K5J9j7j6j0L0pQNj2j4k1L8l7J7QJ1J3k1PMPk1J6k2J2Mj7mLoNM4
6395C3m2JPKmJ2nK0l4M4n3j0M4j7j0K7J7j9olpo%L0j1j0olRl2M0k4J7loJ7m6K1
6433a6j9K5Jj4J0kOk1M0j2MJ0m2K6OJ2jOl1%OJ4Jk1K6j6Oj0Qk1Mj7J0QK9k7J8
6470FmJj7%MlknJ8J0ok5L4l9L0j7M3k2pKK2km%k4K4k0K8j9J1Jm1K7qqM2l0j6K8
6509A2k0K1l6K5Ml1KJ6jMJ3Nqj2Oj2NJ2qj7M2l5MJ0QpnPjjk1K7JMk2K6j4RPj0
6549IorK6m6QL5l9j4N5k4m8N8k9Qj3M9k6j5L7l4L3k7J0j2J8oJ8j2J8knmPm3N6
6584C1k0Jm0K5lk6L9j7J4m5N7k3orK5pK2l0k0KM9j7l4M5m0L4lJ2mOk4ML8k8Ol5
6620b1L0k8LL9j7l9M8j9mJ7qj2LLK3pj5k9J8OK9k3opNjJ3J5k0Kj5K8k0q%L9j0
$$ y = [-10, -3, 23, -5, -18, 7, 26, 9, -7, -17, 13, 6, 14, 19, 7, -7, -28, 10, -27, -10, -2, 9, 22, 1, 8, 12, 19, -2, 14, -8, 4, 8, -9, -13, -10, -16, -11, 33, -9, -8, -1, 1, -3, 9, 4, 24, -10, 34, -19, -29, 15, -2, -12, 15, 32, 13, 7, 4, -3, -9, -9, 21, 10, 0, -6, -9, 0, -32, 8, -16, 1, -2, -8, 9, -37, -16, -35, -10, -9, -23, -13, -15, -9, -30, 10, -2, 2, 12, -30, -4, 2, 14, 13, 19, -12, -12, -6, 8, 9, -12, 14, -2, 4, -6, 2, -19, -15, -32, -22, -14, 15, -12, 6, 2, 3, -14, -14, -10, -13, -15, -20, -2, 8, 2, -23, 11, -28, 2, -15, 28, 6, -1, 1, 23, 21, 17, 17, -7, 17, -3, 25, 6, 17, 18, -23, 4, -4, -12, 30, 0, -16, 12, -8, 13, -23, 2, 6, -25, -23, -7, -8, -4, 9, 14, 6, -6, 0, -12, -7, 5, -3, -20, 22, -13, -9, 1, 9, 2, -3, 4, 3, 2, -19, 8, 9, 13, -9, 17, 3, 12, 19, 9, 3, -6, 20, -26, -18, 17, -22, -36, 19, -5, -53, 5, -24, -16, -29, 20, -6, -21, 16, -18, 15, -12, -2, -14, 4, -2, 16, 4, 22, 20, 15, 11, 18, -25, 31, 11, 12, -28, -3, -6, -32, 7, -10, 4, -41, 16, -7, -13, -22, 3, -4, 18, -12, -32, -30, 19, 2, -32, 13, -27, 7, 4, 16, 12, 18, -6, -2, 36, 8, 14, -21, 9, -19, -16, 23, 6, -33, 15, -4, -8, 9, 1, -11, -8, -5, 18, 11, -4, -33, -15, -9, 20, -3, -9, -16, -11, -12, 1, 16, -4, -2, -17, 11, -9, -17, -17, 22, 12]
6657A2lj4k5K5PNj7L4j8j1lOkj6J3L1j8j3Rj8L1k2L0k6pqK2j3J7j6k1M9m4J0r
6692b3JJ1R%qM2qjj7Kk6O3l5Ql%j1jJJ4J1j8J4l5J3J7j8KJ3n4M7j3nRl1K6NJj3
6731a1J9jOJ1l2J5Mk5N0l7plJK0RJl2K6qJ8lKk7K2j7OpJ7j2l3OJ7J9l7jK5J0q
6769CrRqk2O0l2mj3J6Lj4J1j7PK3j7pmM0pj5NjJ6j7L5m3lLK2k3rQk0K9j5K1j1
6807@J7j8Ok3K2J1n1N8j2J5k8K1l6NjJ0LJ7j4mQj3Rj0K0k5K2qJ2jJl9J4J2L4j2
6843B2j1l2K2Ol2J9J5k3J2L7m7rk4N6Qk6MJ2QK1m9L3ol1L2k3J2j5K6Lk7L0k6J8
6877A5oMK4o1M8m4J4LnJ8J1l9K2j6PO%j1M9l5oj0K7j4%Rl1L8mLk5J6J2j1ql3M1
6914H%j0j3MK8J1l2%L2l6KJ3mk2J6J8j5j5mL1Kk0k1K7l0L3Qj0k2L5k3PrlK8nP
$$ y = [12, 9, -5, -30, -5, 2, 7, -10, 24, 6, -5, -8, -2, -4, -20, -7, 24, 6, -7, 2, -16, 15, -7, 23, -3, -10, -18, 4, -9, 8, -8, -29, 20, -24, -14, -23, -22, -11, -2, -2, -10, 32, 24, 23, 6, 8, -18, 45, 10, 18, 15, 15, 4, 3, 4, 18, 29, 11, 25, -10, 3, 20, 2, 4, 17, -37, 10, -3, -8, 1, -30, -4, 1, 2, -11, 8, 7, 13, 24, -8, 7, 11, -14, 36, -1, -8, -11, -10, 10, 19, 20, -12, 14, 6, 24, 21, 23, -4, 18, 1, 7, 0, 17, 5, -28, -22, -5, 14, -23, -24, 1, 11, 3, -6, 3, -5, -27, 33, 1, -3, -16, 0, 3, -11, 0, -17, -10, 13, -4, -11, -15, 25, 18, 3, 8, 7, 23, 6, 41, -2, -5, -2, 20, -3, -12, -4, -24, 5, -10, 11, 0, 17, -1, 5, -18, 4, 15, -36, 22, 10, 25, -3, 18, -18, -13, -14, -4, -1, 16, 2, -2, 6, -7, 2, -8, 12, -13, 9, 1, 13, 12, 13, -26, -12, 0, 34, 22, 11, -21, 1, 7, -25, -6, 9, -14, -2, 35, -12, -21, -45, 11, 19, -7, -3, 9, 17, 38, -11, 22, 16, -15, 17, -6, 6, -9, 17, 20, -7, 23, -3, 15, 9, 13, 37, -24, 24, -20, -6, -3, -8, 10, 21, -18, 4, -12, -5, 1, 1, -10, 39, 4, -2, -12, 15, 1, 1, 10, -21, 17, 13, 16, -9, 7, 19, 8, 0, -33, 8, 8, -2, -15, -11, 17, 28, -4, -4, 28, -8, -6, 7, 3, -19, -3, 15, 0, -15, -19, 12, 14, -6, -27, 0, -30, 3, 11, 1, -21, 14, -9, -2, -11, -14, 14, 9, 16]
6951A6l4MJ3jrJ3J1J1pMk1qJPj2K4j2j8K7j5JK7j7l4O5n3JmMPJ0k6L0l5K8JMj
6989Blj0NJ5k2MJ9qj9L2qoJRk6K1J6l6K5Rj1k0J7j4k3J1L3jj2j2PJj5J2JPj3M
7027hk2L1JrJ4jKjk8M8k9nJ9m%Kk8L0Mj2j9N1j7k5NK0kpK0l0j9M0m3J4qJ9j6J2
7065aNnoMKJoJ2j5k2L6po%KQJ3j7N4n6NK2j2JmQMNm3K7k1J4l4L1l0L4Lj0Qj4l
7106a3oJ3J8j9J2Lm2J8K7j6qROMj2j3K1K6nj2j3K3Jk5L5Qk1j9%Qk1MoKJ4m6Q2
7143C7m4j2lpJ7J3J2j4j4K2m2O9k2k4lQk0J4L0j1j8J0k1L7Oj9J1qj1J5qj0K1R
7177B0j1j6K9lj7jk6L1k7J0rK5jL1m4PJ3okrqlJ6nK4j8qJ9rjrK6k8K1rk3JML1
7216A5j8J8mj3J3K2j3l6K2mrK9k0k4J5k5NK2J2mj5lM2m4ORj7QJ0J8m4L7l7L7%
$$ y = [16, -18, -14, -1, -2, -11, 2, 13, 24, 17, 21, 0, -8, -7, 0, -12, 12, 0, -18, 9, -6, -5, 22, 5, -29, 36, -17, -16, -20, -16, -9, 1, -25, 5, -30, -2, -1, 3, 2, -1, -11, -6, 9, -13, -9, 10, 2, -17, 15, 7, 1, 2, 11, -15, 6, 22, -14, 11, 20, 9, -11, 6, -8, -31, -20, 13, 12, 0, -12, -5, -4, -19, -7, -6, 1, -12, -8, -30, 1, 2, -7, 7, 6, 8, 7, -21, 27, -2, -7, 12, 8, 8, 10, -18, 12, 16, 4, -15, 36, 19, -6, -1, 19, 17, 10, 30, 0, -19, 21, -22, -8, -16, 3, -13, -1, 4, -1, -7, -3, -1, 0, -6, 6, -9, -31, 5, -2, -8, -8, -6, 2, 15, -2, 52, -4, 1, 23, 11, 12, 8, 16, 20, 25, -18, 9, -12, 2, -32, -1, -31, 3, 6, -4, 4, -10, -13, -19, -6, 12, -7, 5, 8, -34, -16, 11, -5, -13, -4, 2, 6, -6, -19, 2, 28, 23, 11, -2, 21, 22, -3, 32, 40, 19, 0, 0, 8, -13, -9, -15, -13, 1, -45, 37, -7, -19, -22, -29, -12, 1, 13, -1, -15, 7, -35, 34, 12, -12, -15, -7, -27, -13, 17, 6, -12, -2, -23, 14, 20, 1, 12, 4, -7, 8, 0, -10, 11, 20, 9, -7, 22, 19, 2, 1, -25, 6, -21, -11, -20, 5, 4, 35, -9, -2, 11, 5, 3, -6, -14, -17, -1, -6, 18, 0, -8, 11, 2, 1, -8, 18, -10, 11, 2, -21, -20, -16, 15, -3, 15, 11, -2, 11, 33, 20, -16, 6, 2, -7, 22, 2, -22, -7, -32, -27, -5, 7, 3, -12, -15, 27, -17, -11, -2, -19, -11, -1, 17, -27, 10, -27, 10, 10]
7251A0jK5m6K2J3l8K9lj9LJ2ONMJ6m5L4rj6oKlKQk4N2n0RJ0%j3LJ5Nj8pK3kj8
7290a0rJ9j9K5j6OJ4mnPlKoJJqk9L1mJ1k5K5q%k3J4J9rJmK7l2kL4k7J6j5kMKl1
7331c2L8jPrj6J7J3k0K0k0K0m3L8Nj2j4J6J0k9J5KKjqpJ5pK5l7L0m8L2j2j2K0
7366cJnK3j0l1K0J0j5J9k8J8L0j1nnQk2J3L5m1MJ7j7J0pmPj6J0JoK3l8J4J2l1
7402b0J7j5J3nJ%Oj2RLJ0k0OJ7k3PJ9j8j2K5mK2Kk8mJ5J0qj3mNjkj0J6Nj0lJ0
7441FKoll0M5j4Oj7j2J6k7J8K1j6rK6j7J3Kj0qoK9J4n5K5mK5j2jK0j2k1K4j0K7
7477B9l1J5m5K9k5L4Lk0J8l1L3k0J3jkJ3j1Nj1J0k2PJ0m5M7k9RL3Lj4nJ2Ok9p
7512a9L7%j0Rl8J9J5kJ4l5J1QK1k5olK6l8j4L2j3olK6j8K6Mk5rOK1lrj9M0j2J0
$$ y = [10, 9, 34, -12, 10, 23, -15, 14, 11, -8, -5, 7, 13, 18, 22, 38, -7, 27, 18, 2, -4, -2, -5, -3, 5, -19, 33, -17, -8, 2, 2, -11, -8, 7, 12, -6, -13, 10, 8, -10, -19, 0, -19, 6, -10, -4, 10, 6, 1, 8, 5, 7, 1, 2, 3, -5, -34, -3, -7, 4, -21, 4, -4, -4, -27, -13, 6, -3, -2, -6, 21, -11, -13, 21, -6, 10, -5, -7, -3, -1, -32, 6, 5, 12, 3, -13, 4, 17, -3, 17, -3, 17, -26, 12, 17, 5, -9, 7, 17, -12, 3, 5, 7, 6, -2, -9, 6, -1, 24, -13, 17, -31, 1, -11, -23, -3, -2, -7, 16, 6, -25, -5, 5, -10, 9, -19, -1, 29, 18, 13, 8, 16, -6, 7, 42, 1, 5, 22, 5, 15, 8, 4, 11, -5, 5, 6, 0, 23, -15, -1, 11, -20, -3, -18, -5, -10, -9, -9, -3, -15, -6, -3, 7, -13, -7, 10, -13, -6, 13, -5, -17, 8, 4, 26, 28, 0, -4, 11, 21, 13, 0, -4, 1, 0, -2, -12, 4, 9, -1, -4, 6, 8, 2, -1, -31, 14, 0, 6, -11, -23, -7, -34, -16, 5, -11, -20, 6, -11, 2, 4, -6, -14, -20, 9, 23, -32, -7, -11, 14, 2, 1, 21, 9, -12, 12, 2, 29, -2, 13, -32, -3, -28, 6, 9, -11, 7, -24, 9, -11, 2, 1, -1, 12, 1, 6, -5, 5, -17, -10, 0, -45, 2, -27, -18, 15, 18, 4, -1, 11, 17, -12, -19, 18, 18, 8, 17, -21, -2, 13, 11, 25, -10, 1, 9, 30, 5, -1, -4, 22, -16, -30, 2, -11, -17, -20, 6, -12, 14, 18, -7, -16, -10, 11, 8, -1, -20, 20, 8, 18]
7549A8l4J9k8M0Pj2Rj4K3k1K5l2RPj5kj0J2jjJ2j6jj7K2jkk6J6L9m4MJ7rK3Jl7
7586b0K6m4K5RjOK0lpk0K5l5J7K0m4M4j1NqlK8J2l0l0K6l5J4J3J0J3j5K8n9K2
7620bk5K0PkK7j9k5K3Pl8L7KK0nrl6L2Nk5nJ3J1K4k5k2J5LQj2Nl3J8PMj2K0j7
7657dNRroK5m1K2Ok0kJ5lj4J6J6J1n5M4K3o3L5Kj3J3JOk9kJ3K0J8qkj9Rj4j2M
7695cKoJ1jJ8j8qJ5j2oJ7J7l2L6p0K5J5m2J9J5K9j4j2K5j1j1J8k2lL8m5oL0Qj9
7730cL0j8lQj4Nj5L0k5J2RJ7l4K3k7MK0l6MJ7noJ6%j3k1K8kJ2j7PPl9K4Mj6K2
7767Ek1L7Lj5k6kPj7L9J2n6K9RKk4pPkPJJ2k8J0KOLl6K7lJ5J3kLjJ6rpRk8mL0
7808A6Kj3lJ6k1Nl0L2K0j0k1J9nk9N5o3L2%Lk5L5J4k9%j4nJj0K5nJ4j1j8J9rK6
$$ y = [18, -16, 3, -25, 15, 22, 10, 19, 5, 28, 7, 32, 0, 9, 16, 1, -1, -11, 1, 0, -1, 11, -5, -6, -23, -1, -2, -4, -30, -14, 25, -19, -15, 2, -7, 16, 17, -20, 6, -38, -13, -4, -5, 1, 21, 18, 11, -9, 16, -19, -2, 18, -26, 18, 7, 12, 4, 1, 29, 41, 11, -19, 7, -28, -14, -1, 9, 22, 7, 35, -24, -2, -27, -7, 0, -2, 25, 6, -19, 4, 11, -27, 10, 12, 32, 27, 18, -18, 14, 19, -6, -11, 2, 13, 37, 12, -10, 5, 8, 16, 4, 9, -24, -6, 1, 5, -7, 13, -4, 1, 10, 1, -5, 20, -21, 1, 7, -13, -15, 0, -3, -17, -1, 15, 26, -29, 15, 38, -25, 10, 12, -1, 12, 13, 19, -10, -12, 1, 21, 39, 31, 29, 10, 19, 5, -7, -3, -1, -7, 4, 3, 21, 3, -5, 10, -2, -8, 9, 26, -6, 30, -40, -15, 0, -42, -23, -8, 21, 7, -5, 20, 9, -2, 16, -6, -9, 29, -16, -22, 8, 16, -3, 27, 9, 6, 14, 0, 5, -10, 20, -5, 7, 16, 33, -1, 22, -5, -1, 19, -17, -13, 4, -1, -7, 9, 9, -4, -25, 3, 1, 13, -4, 3, 10, -29, -5, -1, -17, 5, -16, 21, 24, 9, -17, -19, -12, -29, 10, 22, -34, -5, 4, 6, -18, -25, -18, -20, -13, -12, 0, -28, -18, -16, -10, -7, -43, -16, -19, -4, 9, 7, 10, 9, 25, 16, 9, 18, -10, -14, 16, 18, 5, 2, 18, -3, 2, -28, 4, 24, 14, -7, 12, 7, -22, 33, -30, 2, 2, 5, -20, 15, 29, 0, 0, -14, -19, -18, -28, -3, -8, 6, -5, -23, -4, -13, 13]
7844A3j7pM4k6l5M1Qj2qQPk4k3N5j9J4k1j8RJj3L6j1k3J7nJRrOJ2j0j5K1Pm3K1
7881iPKjpQl3NK0j2M2k5K8roMl1J9J1pmJlJ4k9L2j6K2pk7Rj5K8j6Rj1k0J1K9k4
7920a1mJ7Nk4K4k0J1JpK2j2ok0M5jjl1J7J7k5J3k3K2l1J9lk4L1k5K6Lj4QK5l8
7955a4NoJ6KlonN%K5k5jqL6l3J2nj5KK2j5J4K0k4Rj5J1nJ8j8jj8J2L5k6K3l2%
7993hJ0kM0l4pl0J0K1J9m9J9qrK6rJ0Rj5k7L8j3MJJk6J2NJ9Qm6L2PkK3m5M1Ok7
8031Dj6K7k1J0k4J6J7j9J6k0%K3j2Jk8mM4ll7L9n1N3Km2kL4j8J4Kj4K7l5J3J1
8065GMJ4j2l1K7j3k1J2J2J4l9N5kj6l5M3l2kQK3Pl9MmPmK0qj1K6j6PJ0m6M4m0
8101b7K1J2j5J5LOk8J7J0l0oL1J1m7M3j5jJ7J6l5K7l1NqQJ0k1k7L1OKK2l1mmj
$$ y = [13, -4, -11, 33, 7, -28, 13, 21, 9, 1, 9, 16, -8, -31, 24, 5, 19, -2, -20, -11, -10, -23, 13, 2, -21, -4, -9, -8, 1, -8, -2, 10, 0, -15, 6, 13, -30, -9, -2, 0, -1, -8, 0, -33, -28, -8, -20, 22, -3, 25, 16, 10, 14, -17, 2, 13, 6, 2, 3, 0, 14, -15, 17, 1, 23, 16, -11, -2, -17, 11, -5, 4, -7, -27, -16, 13, -11, -15, 2, 7, -17, 7, -13, -2, -1, -8, 14, 2, -4, -24, 21, 20, 19, -12, 5, 22, -3, 10, -13, 9, -22, -3, -6, -30, 1, -24, 2, 5, -9, -1, 24, -14, -9, -15, 1, 3, 0, -6, -11, -6, -6, 19, -6, -7, -15, 21, -12, 0, -5, -20, -18, 4, -11, 3, 23, -1, 8, -7, 4, -1, 17, -1, -2, -20, -8, 27, 1, 24, -8, -8, 2, 0, 40, 6, -1, -31, -21, 0, 19, -30, -11, -19, -28, -2, -11, -1, 8, -7, -34, 4, -9, -5, -4, -3, -29, -17, -12, 7, 15, -31, 1, 8, 6, 29, -16, 25, 31, 4, -12, 15, -6, 4, -20, -4, 13, -6, 10, -10, -10, 13, 1, 2, -26, -30, 14, 11, -26, 13, -38, 15, 17, -25, -27, 7, -11, 3, 5, -9, 18, -17, -4, 7, 11, 25, 13, -18, 9, -4, -25, -13, -1, 13, -26, 29, 27, 11, -24, 19, -13, -15, -7, 16, 23, -16, -12, -16, -9, -13, 7, -1, -12, 14, -2, 5, 15, -31, 13, -27, -6, 6, -9, 6, 9, 15, -13, 4, 14, -16, -22, 9, 20, -27, 16, 1, 0, 17, 33, -2, 25, -6, -1, -9, -1, 9, -12, -39, -8, -2, 0, 22, -9, -13, -17, -18]
8137a8J1J5j2Jl0K9K1j3O%j3K3k3L2m1PK2KMm0QRk1K2J8j9Kpj7K5J2j4nrpK4j2
8174hjL6j5k4OJ6kj2jlJ0RrPnNk0
$$ y = [-18, -7, 8, -4, -3, -33, -4, 17, 4, 10, 10, -3, 20, -3, 29, -12, -5, 17, 19, 23, -17, -9, 0, -21, 1, 19, 0, 2, -5, -22, 3, 15, 1, -4, -13, -20, 4, -8, -9, 27, 12, -12, -6, 10, 8, -4, -5, -8, 2, 11, 2, 9, 4, 9, -11]
8191a1
$$ Imaginary data points
##PAGE= N=2
##DATA TABLE= (X++(I..I)), XYDATA
0@%%%%%%%%%%%%%%%%%Qj6J6j6J6j6J7k5L2l2M0m8N6o4P2q0Q8j04J20j36J52j68
39h8J84k08K32k56K88l20L52l85M25m70N17n68O25o89P59q39R28j027J141j272
59f71J428j611J831k106K455k918L567m541O195r724L0428l8322l6757P7543r79
74B5818m0601Q435J7456k1909P576J6522j3899j5004J7398J1513j0266j6719O271
87g409K0871j351k6483J427K3385l504j6777J0065O505j3721K590J4501j0189
100i0p397J5974j366j9554Q397J6662j1601j0021J0913P30p396P929M826j2641
114d635l019J2521J893j0150k084N928K090l040l293N36N140K811m089l748J232
129a907K215L127J348p379n032R861O298j0416m907R246K135o503M69L133j205
$$ y = [0, 0, 0, 0, 0, 0, 0, 0, 0, 0, 0, 0, 0, 0, 0, 0, 0, 0, 8, -8, 8, -8, 8, -8, 9, -16, 16, -16, 24, -24, 32, -32, 40, -40, 48, -56, 64, -72, 80, -88, 96, -112, 120, -136, 152, -168, 184, -201, 224, -246, 271, -297, 328, -361, 398, -441, 487, -540, 601, -671, 757, -854, 977, -1129, 1326, -1592, 1975, -2566, 3629, -6095, 24333, -13989, -50746, 26797, 25818, -14783, -6348, 11108, -10801, -3225, 13297, -602, -15606, 1792, 13305, 3039, -13680, -7409, 13462, 12111, -14372, -12945, 10440, 6936, -9841, 224, 6729, -6992, -4402, 10099, -90, -7487, 8487, 7121, -12433, -4036, 12626, 1025, -8996, 1917, 2647, -4749, 3180, 8006, -4635, -7654, 4867, 6760, -3390, -5474, 454, 2544, -496, -3789, -3253, 1887, 4698, 609, -3139, -1907, 308, 3435, 4783, -2596, -7628, 2233, 8531, -1885, -6792, 2454, 4589, -1914, -1445, 1688, 483]
144D83L22J8l180J324L458k909k220L052m23k075K608L45k145L224N02o754K011
161b359Q899m384r202N389O812n086k432M566j232k532M025j42n509K040N153
176D006l445m521K884L175j364j796l07J017J336j239j319K515N97l815M18M050
192B192j434k444K426j13k518K724J625l750O95L578l004k066L908m72l533K093
208i3J580k945N25K602j550j452J660J03j357O13J235p96j970j6K634J109k393
225e11j240K177J372j303j138N39Q56r6o36k21J59N66L25q76j142R35J606j131
243B41j648J407P39k082N70K492j884k157K761P26l114J188K764k504j210L298
259A587o8k651O92J344m54n40n13O61J671j557j983K674J328l393n7L038j579
$$ y = [483, 805, 823, -2357, -1033, 2425, -484, -2704, 348, -75, -2150, 458, 803, -1342, 1882, 2384, -4370, -2359, 6540, 2156, -7046, -1657, 5155, 69, -2363, 2203, 971, -1561, 2464, 2322, -3187, -1147, 4006, 561, -3960, -1076, 2099, 735, -1061, -1368, -351, 985, -254, -1573, 942, 1539, -2276, -1858, 2192, 758, -1686, 740, 627, -1891, 833, 2458, -1292, -597, 2981, -23, -2089, 1819, 1347, -2186, -93, 1487, -1458, -933, 1669, 119, -1333, 327, 430, -927, -314, 921, 125, -1845, -1861, 773, 1882, -511, -1751, 426, 1798, 495, -643, -104, 752, 656, 20, -201, -42, 524, 849, -27, -1169, -234, 1372, 241, -1407, 0, 739, -1343, -773, 1719, -165, -2322, 439, 1165, -1949, -761, 2003, -501, -1711, 1587, 1519, -1132, -440, 904, 450, -90, -603, 58, 1729, 172, -1811, 863, 2191, -1202, -1259, 1779, 200]
276B00k374K069J093j946J88J303q06m94J035q2q81M06N97k09MJ77m01NP59j95
296D48j060N47J473r85j596J402J320j830o78J711j59j466M33M90m79K56N2m79
314f00P79J87j162M58Q63j064J3J316q98o03J644m20j477J538P20k027O52J576
332A495j928o21K331q02j991K047J025k746l7K431j051j811J558R91j472j36J071
349C54m52n61Q47o7p50P21O69r44k62J047jo61K22K57j78j35k95J46N42o23m35
370e59J338k09k044J122K020k453j507L382L64l618J206L035k454j629L110J28
386A232k742J229J782j832m32J659n47n66J056o10q87J288M3j514O45J142j060
403a14n08Q83k57n44N18r1m62O34l3p57P74M37j321M83J647j521j268K567L97
$$ y = [200, -2174, -105, 988, -958, -770, 533, -273, -767, 268, 186, -695, -289, 308, 99, 103, 280, -121, -116, 643, 448, -612, -65, 1408, 423, -1173, 229, 1549, -281, -959, 752, 593, -873, -440, 50, -429, -173, -121, -600, 179, 366, -796, -338, 525, -539, -526, 790, -108, -711, 933, 513, -964, 574, 1294, -733, -81, 1495, -433, -1054, 1277, 475, -1516, 531, 1556, -1190, -1227, 1204, 153, -1658, -100, 891, -581, -717, 354, -98, -659, 188, 121, -629, 92, 761, -183, -445, 602, 601, -60, 162, 419, 241, 106, -189, -43, 499, -124, -559, 779, 570, -1474, -352, 1668, -785, -2292, 1090, 1454, -2164, -958, 2077, -377, -2006, 1104, 1232, -1510, -281, 1501, -331, -763, 896, 349, -217, 839, 229, -658, 630, 673, -841, -196, 946, -114, -622, 261, 4, -540, -22, -113, -575, 59, 26, -731, 43, 480, -841, -358, 1289, -232, -1500, 1067, 1464]
422A464k989R38K676k033j367K539k71k260J796Q85k715P16K321k163j059K689
438A167p86k156K184O58k718J027K010k115m88K235r35j159J834k47j431J471
454E51Q9j570J482N88k302J060K076k367q87K680r62j913K229J02k687J845K022
471B036l277o35L511r56k808J985J437k245J13J980j175j150J715N36j506j33
487e72J035K02n06n25J91R41k9j284J05J224n17j005Q59K65j158N92J116j473
505e39p18J856k7j749R62Q92j389M93J321j747n53K578m17k364J285J642j651
522a25l96J224o47l95J153m87r96Q75J78p50N23j11r81J117P92j880l32K050k82
541E30j511O19O85m35J75l3n67O94N77r75L3R33n89n54R78q5j115O88J003r48
$$ y = [1464, -1525, -587, 2089, 56, -1311, 1228, 957, -1303, 493, 1378, -1337, -621, 1700, -463, -1522, 1167, 381, -1775, 409, 1067, -1651, -624, 1386, -729, -1217, 1018, 83, -1076, 758, 511, -920, 551, 640, -930, 552, 1140, -1162, -102, 1974, -393, -1280, 1400, 438, -1475, 754, 856, -1831, 14, 2036, -1241, -1876, 1635, 679, -2129, -144, 1293, -952, -839, 1141, -34, -1184, 531, 1067, -439, -572, 463, 665, 159, -366, -175, 766, 737, -547, -442, 782, 265, -740, 119, 384, -774, -182, 934, -539, -1257, 599, 572, -1177, -215, 677, -712, -219, 1102, -645, -1198, 1380, 963, -1401, -116, 1526, -125, -521, 703, 56, -339, 814, 327, -669, 206, 384, -366, 157, 46, -935, 182, 974, -906, -1238, 812, 530, -981, -362, 323, -112, 63, 30, -537, 157, 734, -241, -208, 725, 136, -418, 560, 475, -640, 48, 1051, 103]
561A03r11Q67O46q02o73O11O10n42n59M45M16l59k38K40K68j42l39K20N21l59
581B3n23P62N93r90l76J055R7q95N9N68m6l60n6J53O2k54j47L79M6o93J35P98
603C90l71q67N67Q85n83p65O34O03m75l50L80J98o0j7j31qK00lj68J05m7l23L17
626A11L61p26k70R36q5r58K96N91m93k1L21m73O9P38l78n37N96J43m62M13K07
647C79o24K37N92m13l40L07J76n8j51l90J68O43l38o40K21L98j49p4k16j75L92
668e5K34m50j24M31O2j22k6j00J34L35j73k65J23R6K37J63p15j59J105j41j303
689g13O07R25j030m13J048l26p40P17J27p31L58K58m54M06J09p67M89Q10r32l34
709e86J135k32p92O99K37o07K13K67k91J18J5l85M83K13j013J00J155o06r64Q75
$$ y = [103, -808, 59, 705, -97, -770, -159, 451, -91, -650, -205, 211, -148, -386, -146, 122, -20, -359, -139, 382, 23, -500, 262, 855, -135, -511, 544, 641, -254, -195, 373, 327, -33, -89, 64, 126, -128, -275, 104, 150, -543, -408, 390, 19, -848, -281, 604, 21, -744, -110, 493, 18, -332, 48, 246, 186, 169, 38, 30, 230, 227, 59, 164, 117, -206, 111, 472, -254, -524, 412, 327, -631, -335, 256, -237, -258, 63, -410, -341, 397, 19, -518, 78, 221, -241, 172, 379, -245, -8, 584, 171, -169, 138, 314, 256, 105, -285, -117, 526, 188, -452, -231, 167, 18, -56, -272, -447, -55, 179, -271, -395, 36, 98, -24, -50, -150, -16, 319, 146, -119, 4, 100, 337, 500, -215, -374, 731, 590, -713, -106, 819, -211, -624, 424, 98, -642, 75, 202, -529, -171, 87, -367, 39, 148, -619, -130, 680, -252, -586, 549, 317, -475, 224, 461, -146, 67, 334, 43, 161, 176, -209, 274, 487, -526, -426, 729, 123, -841, 34]
729C4M12r21R6P12m95l48O26O4m92J75L25j41r8J87j00j28L41J59m48j66N40O3
751C97n54L7M49k48l15L52L1m58J42L49k35k62O4K14J35k63l07M52M17n80j94
772c77O50r1m03M08O0m71L85L98p27l2P62m13n36P28k4q47N23O52r34m25J057
793C43J6r66K74O52m32k90M08J6j72J35RNJ56k08p9N29p1o78M22O09o48l82P20
816C68Qo19L54J50n61K54L51o32k5P02m81m71Q18m7q72O15O25r75p8J025l81n60
838d32O15J37n07L82P2m56L66K85o69P1P05n13m55O49R8p18K24L82l46j68K71
859gm8q7P1n5n0K36p8k43K89K22m04kN45k18m64L95M16n65j40O03k39m27M30R1
883B71n47L12L18o65PP38m83n08O86Q4p30L45M59n06n8M35j97q1L11k46n3N03
$$ y = [34, 446, -475, -379, 333, -162, -510, 116, 180, -312, -137, 188, 47, -51, 136, 36, -92, 249, 408, -40, -206, 334, 397, -157, -120, 329, 81, -234, 118, 149, -309, -167, 182, -53, -315, -251, -37, 98, -165, -472, -20, 397, -183, -377, 273, 182, -221, 187, 247, -224, 161, 559, -168, -200, 562, 149, -387, 341, 317, -530, -7, 645, -289, -714, 343, 359, -607, -333, 319, -113, -403, 5, 21, -151, -16, -7, -2, 154, -54, -133, 396, 325, -353, 69, 678, 30, -352, 368, 376, -243, 111, 261, -300, -46, 305, -327, -352, 350, -131, -602, 216, 169, -703, -88, 537, -438, -516, 509, 128, -432, 183, 320, -187, 195, 267, -189, 177, 462, -207, -136, 569, 56, -399, 250, 348, -370, -146, 236, -110, -278, -7, -55, -142, -71, -126, -176, 60, -18, -261, 28, 250, -154, -156, 389, 171, -293, 102, 518, -47, -187, 416, 177, -250, 180, 271, -276, 36, 354, -311, -304, 434, -49, -557, 129, 213, -517, -172, 287, -219, -277, 158, -39, -120, 191, -55, -108, 395]
905C95l67m19Q56L0r86M44Q04q36l54Q61j61o70M51J75m85J71J63k83J18J05l76
926c64K50L90n68j93P36kn51J81L58j65l4P4j11Q8J74j65n4Q6o5J9J22k11j84
949a89K58J52k69j89Q5K24K1l49n9M13j0l35P4K55j20kQ5j14M9J45n8RN0r2K2
974E6K59k01k74L23J50m12k2K54j17j07J25j01j66K31N7k99N8K62j90j09K85j0
996E2k21J81J92k15r1K60K4j67K2O8PO1r6k17K69J12l69J3L40j76l35L31Q0l79
1020b54P6K71j89j13K27q2j8J48j58n7L20ol14K24K39l74n8M05n5l33J11K03j07
1043A06j32k7O6J02j13j95J15J69j88j53K17O8k23nK80k3k96R5L64j48l38K56
1065cL26k54j70K11Q8j27p5K2J67K9l31N6L29k89l23M81R9o14J44N41m00k77M39
$$ y = [395, 28, -391, 465, 495, -491, -47, 757, -79, -433, 428, 267, -403, 48, 223, -262, -91, 72, -211, -93, 12, -364, -114, 276, -292, -485, 251, 249, -302, -121, 237, 72, 38, 112, 1, 89, 263, 98, 44, 130, 65, 84, 206, -5, -189, 69, 221, -48, -237, -152, 72, 93, -256, -315, 98, 88, -247, -173, 82, -38, -40, 45, -69, -20, 125, 67, 76, 126, 34, 56, 315, 114, -160, 163, 313, -99, -121, 133, 16, -91, 34, -67, -233, -2, 55, -244, -186, 76, -114, -223, 62, 52, -169, 12, 204, -11, -102, 158, 182, 15, 37, 105, 112, 173, 77, -140, 129, 241, -128, -115, 225, 49, -286, 45, 125, -254, -178, 93, -96, -209, 18, -64, -82, 66, -92, -149, 171, 165, -149, 75, 314, -60, -118, 287, 232, -101, 10, 213, 106, -26, -53, 13, 115, 2, -193, -78, 91, -97, -250, -33, 35, -188, -193, 87, 64, -232, -137, 227, 79, -259, -3, 323, 69, -101, 110, 198, 71, -4, 18, 185, 214, -117, -61, 268, -21, -344, 137, 236, -378, -234, 307, -93, -370, 69]
1088F9o0k60K95j4l10L32J77m74J75M38l65j97M73r3l27K84Q6k57J37Qk03J74
1110H8P5m15J49L72m27k07N33o3m90K26K84j71j74J90M9j3k9j9J04N3j28J9J87
1133A93p6j50J25O6j38m9P1R2j06j50J38Q5j78j10J77M9j75K9J07r1J9K4q7J16
1157a9J06j38k9K20j5k02J15J56j39p7J62j4r7Oj1O8j2j83J6J63q2k37J90J49
1181I6j84j30K23K5k20P0K14r3j35J41P5o1m0N7N1nNj10O1J88j73j77K30J16l13
1206h9k7K41j15j66J50j8r1Q1k4q6J04K1j66K10J01l17M5M32k46l25L78K12l56
1229e1j1K41l4j13P5o4l2J43q9j53J45L8k22J3K39j86k11K74P3k52%J92k9q3O8
1254b9K6m9J34m2j10J46Q0k36Q9L06k98k21M77rm96J53L51k89j07J69j05l0J66
$$ y = [69, 9, -251, 44, 30, -280, 52, 229, -245, -70, 368, 3, -194, 279, 186, -141, 143, 229, -28, 109, 117, -86, 88, 163, -252, -103, 269, -158, -365, 168, 105, -385, -159, 125, -46, -220, -30, 19, 6, -23, -42, 62, 115, -13, 6, 193, 117, -33, 92, 158, 20, -29, 42, 134, 28, -122, 16, 101, -77, -187, -10, 39, -136, -107, 0, -91, -72, -48, -135, -19, 87, -51, -80, 140, 125, -77, 38, 194, 55, -22, 140, 126, 29, 35, 24, 92, 80, -103, -87, 76, -6, -243, -53, 96, -88, -218, 5, 30, -190, -120, 94, 1, -134, 7, 82, 21, -19, 38, 89, 84, 89, -21, 40, 228, 55, -122, 108, 224, -89, -116, 125, 10, -156, -6, -24, -115, -34, -58, -144, -40, -19, -185, 25, 126, -191, -146, 286, 40, -285, 93, 305, -51, -62, 179, 145, 32, 107, 43, 11, 154, 65, -88, 57, 95, -127, -114, 125, -61, -272, 2, 75, -177, -177, 15, -14, -97, -29, -3, -52, 82, 40, -70, 76, 156, -80, 9, 315, 17, -204, 273, 264, -232, -79, 272, -17, -124, 45, -60, -90, 76]
1277G6j73j01K87q1k90L03J47m23J03L89k78j81L81K4k83J60N7j77J56J01k79
1298h2J06K04k60p6K87j15k59K15J59l31oK03p0o2pk3P5J00j33p1K19P5k53K7
1322g8K30o2j32R7J12j54p2J76R6k62j4K14o0j69L0N3l1J7q1m4J55J6k58J46J90
1347A15k54n5L21r1k43K20J37j47l0J25q6J05P4k70P7K60j84j90J90J03k51L8
1369c6J43j37q9J34Kj37J7L8M3Po9o7J67N3j70rK18jj76Q5J61j04j15J32P6j43
1395B3n5J47l9n4l1m0R7K2j69p9K45j7k75R6K52k35o1K79j08j71J56J30j36j3
1419c6P5n1J18L5k60R2K98j94k63K91J09l15JK34j26j62J60L2j54N1L4n7Q6o7
1443f9p8J00J75k40m4K66K6k47J04J83j62n2J77kj88J27K6j06M8mj10R5J21k62
$$ y = [76, -97, -198, 89, 8, -282, 21, 168, -255, -152, 237, -41, -222, 159, 183, -100, 60, 117, -60, 96, 197, -82, 24, 228, -32, -108, 179, 64, -195, 20, 179, -152, -158, 45, -25, -87, -94, -117, -42, 58, -75, -146, 73, 148, -105, -78, 152, 90, -42, 55, 167, 13, -59, 117, 213, -49, -63, 151, 91, -78, -48, 5, -26, -9, -90, -134, 21, 37, -221, -75, 115, -139, -194, 127, 36, -207, 13, 150, 3, -27, 98, 12, 117, 191, -79, -2, 258, 74, -116, 74, 177, -74, -36, 107, -30, -119, 15, 17, -120, -103, -65, -22, -15, -84, -151, 16, 69, -101, -110, 108, 107, -69, 16, 177, 73, -42, 90, 166, 23, -32, 115, 76, 22, -9, -49, 48, 70, -99, -178, 67, 50, -225, -129, 123, -112, -173, 106, -2, -173, -17, 113, -23, -36, 39, -12, 106, 141, -119, -27, 271, 77, -186, 105, 214, -101, -100, 134, 8, -154, 6, 38, -116, -65, -31, -88, -2, -69, -147, -47, 128, -112, -156, 110, 136, -111, -7, 176, 14, -38, 139, 137, -51, 76, 102, -4, 44, 40, -70, 25, 146, -116]
1467a16n1K62o6k81J88J42j91m5J71l4n6P3n5lJ25m8j08K27J3k58J46J97j88j29
1491h5K35l5j28L5N0r3NPl9O9k4j36O8J08j15p9J60K9j24j9J10N7l7m7K0Q6m9
1518B9m6O8M1l0n5KP6l3q1j0J45q2j25J10J01k12LJ51p3j21R1L5l8J5l9N1J17
1545I0j13j17K27N8k23J1K48p8j72J44M3j11J3jK0N5j22n9J27K3k00N1J37q0j27
1570a56J19P8r6l6O5N5qp7L0J73j10j29J41J38k05l0J54%j09J7pO4J4j64mK01
1596A18j10j82J58R5k10j4K14j02j45J49L7n9M0j5jJ12l8j37J79R9k13l1K55j02
1620I7j43P6J02j23k0L0jpk4r0O3J21j91q7K04P0k27JK64j33j45J82Q1j55M3J14
1646A02p2NK1o8Q2M2j33OJ59o0k38J81J31k29k3J60q3r0R3j8m9R1k6j12J46N9
$$ y = [-116, -167, 95, 29, -252, -64, 78, -113, -158, 13, -21, -77, -4, -59, -62, 63, 15, -93, 134, 147, -111, 35, 232, 44, -85, 150, 115, -13, 22, 72, -21, -16, -9, -48, 21, -3, -139, -71, 37, -78, -157, 3, 32, -92, -111, -1, 56, 19, -28, -8, 78, 29, -17, 51, 92, 62, 7, 9, 85, 52, -29, -39, 106, 24, -101, 9, 110, -102, -99, 52, -21, -142, -51, -16, -54, -39, -78, -27, 90, -23, -140, 87, 145, -78, -67, 181, 103, -69, 75, 118, 7, 20, 19, 39, 94, -28, -87, 40, 63, -137, -86, 51, -29, -156, -37, 41, -55, -91, -26, 29, 21, -56, -26, 147, 37, -92, 49, 187, -18, -48, 106, 106, -3, 14, 7, 71, 85, -79, -83, 118, 8, -174, -16, 79, -131, -145, 69, -33, -178, -29, 8, -51, -11, -26, -27, 85, 47, -90, 89, 188, -25, -56, 199, 97, -46, 30, 132, 9, -11, 19, 18, 11, -13, -103, -40, 81, -110, -197, 7, 77, -150, -149, 115, -18, -163, 19, 100, -55, -12, 102, 30, 35, 56, -12, 70, 112, -21, -15, 144, 84, -154, 27, 158, -71, -94, 66, -17, -107, -14, -32, -81, 10, -16, -128, 18, 77]
1672G7k30R6K18j52j46K18N1j83PJ64m7n3L0K7m6ol0pQ8p4q6N8J08j73n2J84N
1699D6j59OJ40l1r8P1O6m3j5J0M9NJ2r0O8J06j52o4K15j9k40R7J80j89p8J45l2
1726Fr6J04l5q5R8l3j19J61J02k29oK66j09j75K00P8j84N1J07o1k9M4n7N8N6j46
1752c3j6J62n5k16J30J44k06l5J59m1j12M0N9j9QMK0J5Om0RP6l8r0R6J19j29o4
1780d7J71Qj67LJ37o7j11O9M5j5m4l4L4O0q1j09J34Q3j77j1J58k2j48J43N2r3
1806b9%J22j3r5N0l8L5Q0j24n5J49L6k29N9J34q7j17J35M8j64M8N1l9pK3l2P4
1833A5K8r3l6K08p4j62Q8J80j25q8J45Rj17L1K3oj8J4n3N3J4j48O3J10j17j21
1859a77K31Qj95M5J80j01p6P1M2k6M0n5J2Q3k0r5Q8P0j38n1J62mj47L4R0o0o7
$$ y = [77, -153, -57, 161, 9, -137, 81, 132, -51, -44, 120, 73, 20, 50, 77, 31, 25, -5, -12, 76, 2, -84, -26, 82, -91, -143, 41, 46, -113, -107, 33, 2, -96, -25, 41, -2, -17, -7, 42, 47, 59, -31, 37, 143, -9, -73, 142, 123, -117, -20, 160, -29, -107, 38, 6, -90, 14, -21, -106, -8, -41, -160, 1, 103, -126, -132, 134, 25, -150, 50, 128, -56, -5, 102, 41, 12, 56, -1, 57, 113, -33, -49, 113, 58, -158, -28, 116, -90, -125, 34, -7, -119, -79, -20, -39, -31, -27, -7, 8, 14, -26, -17, 59, 21, -69, 27, 146, 17, -47, 124, 132, -35, -32, 105, 38, -73, -4, 41, 26, -18, -52, -18, 42, -39, -148, -14, 69, -108, -119, 39, 17, -131, 12, 64, -29, -29, 93, 80, -15, 35, -3, 32, 112, -12, -67, 82, 118, -111, -52, 82, -5, -122, 13, 61, -103, -55, -4, -43, -50, -27, -59, 15, 43, -50, -86, 122, 48, -114, -26, 154, 29, -59, 86, 95, -22, 9, 32, 26, 8, 22, -31, 22, 36, -112, -49, 61, -56, -177, 54, 62, -133, -88, 92, -9, -85, -14, 28, 2, 42, -13, -1, 82, 62, -33, 55, 125, -13, -64, 98, 94, -53, -19, 71, 11, -56]
1886e6K4J5lm3k6O0N2j10OJ14j8j33N6J12oj06N6J14p9n6L8J08p1q3O7J7k4mp
1915A4J0J3q7NP5l5j20R3J11j37n6J09K1m1k7L3lL9qj7L6pn9P9R2j22n7J32J1
1944I7j29k1Q9M4r2p5N0P9n6r0R3O8r8m4J00j5q1O3K3k2m6M3O6J6q5K3O6L5j16
1973a5j2J02o3j2JK3j8j5j4J3L9q3k8J27Kj45L2J03p8p2J04J3m0J2L5J0M2o1o
2002dP9kj21M1J15r2r3R7P9j18n1J13j9m3k7K0qL1p1k2J05k9o0M8R8j02o3J48
2030D9K7j20J3J07m4o4P6j3RO0p8l8O5J1j35P0Q1j37k9J22k9j29P4J11j01n2M6
2057d8L9roo2N7R5j05k2J37qj11N9R3j13j6P0L0p6jnJ5J5m1m6L0M7p2j1R8Mj41
2088a04N5J28j30m3J38K9j19L3P7j4m6j3M1J0Qj03N0P8l2j16R8M6j12j8Q8j3p9
$$ y = [-56, -32, -17, -20, -63, -89, -29, 23, -87, -81, 33, 15, -118, -62, 50, 44, -62, -6, 108, 29, -27, 11, 119, 48, -35, 32, 49, 25, 21, 14, 24, 37, -50, -45, 30, -5, -125, -32, 79, -58, -114, -5, 16, -25, -52, -19, -22, 17, 9, -8, 28, 21, -38, 41, 133, 11, -46, 86, 97, -32, -53, 36, 80, -12, -87, -37, 42, -14, -104, -11, 57, -41, -85, 15, 0, -81, -18, 5, -17, -63, -20, 46, 62, -23, 0, 66, 101, -15, -27, 75, 12, 0, 1, 24, 6, -9, -23, -10, 29, -54, -82, 45, 47, -98, -66, 37, -41, -113, -9, 4, -36, -24, 11, 21, 63, 2, -4, 75, 73, -48, -7, 108, 16, -77, 20, 99, -19, -70, 43, 24, -19, -46, -26, -34, -3, -74, -96, 9, -20, -80, -32, 66, -36, -99, 49, 76, -44, -31, 76, 32, -32, 44, 31, 40, 100, 22, -16, 49, 60, -75, -5, 76, -61, -90, 32, 3, -126, -52, 59, -42, -94, -48, -9, -18, -24, -86, -29, 66, -39, -61, 76, 68, -43, 16, 109, -4, -20, 50, 80, 4, 3, -2, 13, 28, -13, -59, -29, 18, -54, -65, 33, 37, -104, -49, 79, -51, -94, 44, 73, -46, -13, 64, 50, 4, -9, 32, 42, 50, -53, -3, 75, 43, -73, 25, 71, -41, -59, 29, 16, -63]
2115f3L9K4l6K5ok6O6k3q6P1R8r3o3J53Mj12O6O6o2p0L9L2l2k0K5l0M5k3o4N4
2145bK5o9n5J08Or2MO7kl5J2L9J1m4NP8ml0nM6Oo7j2R3k3j24J02M9j17KM3j9l4
2178c8J1K9n8L1J3o3Q0J8r9N3N9k5j10R9P1j01PQ1K3m4l5K9J8%m6j3P2n7p7Q5
2208A3L3j18j5Q3J7p8L4M9k5k7J0L2j6nk9K0L7j6n1Q5O2j06k4J17k6r5L0R2o1
2237B2p7O4kj9j2j0J5M1n8k0L2N1j06QJ32n1p1M9Q1p1j0M3Nk3oj8PP7q7k3O7J2
2269D2o8j1J25r9p5J18kp8OM3k6j7l3M7K8j1j9QP5m6n1L4P6o1n6J05Op1J2P3m7
2300B7k5l2L8mon8P1J2m9o7J11Jj04J3Q4j6l2J2M5On7L2K9Nm3qP5J0o7j5Q1k6
2332D3p3K6P8o3p8N3K1j5l8L8rK3l7Qmok2J1N4J6o6K7O7no4N2K1j6n1L0K8m9K
$$ y = [-63, -24, 0, -36, -11, -17, -43, 23, 0, -86, -15, 83, -10, -73, 80, 84, -28, 38, 104, 42, -28, 11, 43, 11, -9, 16, -14, 31, 8, -56, -2, 23, -46, -101, 7, 13, -79, -75, -8, -10, -45, -33, 6, 17, -27, -22, 56, 52, 22, 17, 63, 69, 2, -10, 83, 60, -64, 38, 87, -30, -28, 15, -4, -38, -27, 2, -56, -25, -12, -75, 5, 23, -76, -23, 36, 11, -99, 0, 71, -30, -23, 58, 81, 37, 2, 31, 49, 49, 3, -10, 62, 5, -72, 13, 46, -72, -87, -4, 13, -65, -31, 18, -7, -34, -24, 8, -8, -13, -42, -22, 15, -1, -52, 33, 95, -11, -35, 82, 56, -39, -9, 83, 22, -55, 9, 7, -12, -24, -34, -19, 22, -36, -56, -24, 27, -79, -71, 61, 10, -61, -12, 69, -2, -12, 31, 36, 13, 7, -11, -4, 73, -14, -37, 30, 42, -26, -37, 88, -11, -86, 32, 30, -48, -42, 1, -25, -42, -75, -28, 0, -11, -30, -22, 53, 7, -44, -10, 66, 5, -51, 54, 60, -11, 1, 74, 27, 2, -30, 8, 4, -2, -60, 11, 23, -26, -93, 18, 19, -85, -72, 12, -4, -36, -24, 21, 27, -30, 2, 31, 36, -7, -15, 60, 70, 3, -12, 69, 43, -30, -4, 74, 11, -67, -14, 7, -8, -46, -8, -17, 6, -31, -23, -27, -33, -55, -44, 10, 26, -40, -13, 54, 49, -15, 37, 58, 42, -9, 21, 49, 0, 2]
2365BK1J0k6j2jK8l7k5L1L7o1o1J19k7k0lN8k5pPk0L4jj2N4om5l4Q1Qr9rP0J2
2399D1q0J2M2J3q6J9N9pp2L3K1K8o3KN4j3l0K4N3j4l7M2Pj7k9J8L6m0m1N7lk4
2431Ek0J6QL2j02K7N9l5n3M1K7n9kN3j0m1M9J5qMmk5N0J2o6L7L6k1n5M7M1o2k5
2464b9N8rm6kL4k4j1j4N1L0p9k2M1P4q0m2J06j5n7K6O0p8L4NJJ6j6l0J9N4n0l8
2496c3N7j1q0L3O3m3n7O6J7k5k0J5L6j2k5kN4on7O2K6l5n9M4N1n6j6L7J5m0KJ0
2528A1k5k2l0L8L7j4l5K3N8n5m7M3M1m0l4P4No0L5K6kl9J6L8k9LK3k2J7k6l7N3
2560B4M2r5RO3m1l7J6M2n0j4QJ5jK3n8L8O3m6m8Q8jr1O2M0nn9M8J6j0n9L1j6J3
2593A0l4K7J0J2m5j5M2np3L0M0%o7N6L2j1k9J3J1K3k9J0J2k6j2M3J3l1k7J0O9
$$ y = [2, 23, 33, 7, -5, -6, 22, -15, -40, -9, 28, -33, -94, 25, -2, -22, -25, 33, 8, 1, 8, -12, 22, 21, 9, 63, 57, 12, -22, 59, 67, -32, -41, 29, 41, -39, -27, 15, 28, -58, -39, 20, 13, -59, -26, -5, 23, -40, -38, 16, 3, -27, -3, 50, 36, -1, 41, 48, 31, 2, 20, 56, 16, -25, 32, 29, 5, -15, 1, 9, 41, -61, -34, 25, -10, -63, -22, 5, -54, -56, -3, -13, -54, -5, 10, 2, 6, 2, -23, 27, 39, -27, 10, 46, 25, -30, 17, 58, -4, -29, 29, 20, -26, -28, 6, -18, -29, -43, 8, 38, -41, -63, -22, 52, -28, -70, 36, 21, -36, -10, 50, -28, 6, 11, 12, 28, 12, -18, 1, 55, 5, -33, 24, 13, -67, -34, 29, -14, -71, -5, 12, -13, -33, -18, 18, 6, -19, -21, 33, 27, -30, 32, 58, 23, -36, 8, 59, 3, -13, 24, 39, -1, 1, 11, -14, -36, -66, -28, 9, -5, -40, -17, 41, -14, -61, -18, 23, -17, -51, 23, 28, -32, 3, 29, 27, -12, 4, 42, 13, 16, 39, 17, 34, 8, -29, 24, 66, -29, -20, 43, 2, -35, -19, 23, -27, -41, -33, -18, -19, 4, -54, -16, 47, 1, -47, 41, 40, -51, 11, 51, 46, -13, 35, 51, 41, -18, 13, -3, 10, -24, 3, 13, 25, -20, -35, 7, 2, -71, -41, -1, -1, -68, -12, 20, 9, -20, -7, 4, 27, -2, 8, 20, -6, -18, 25, 38, 7, -20, -10, 59]
2624E9p1j1L7J0o7J5L8j1k0%j1N6n0J0K0%l4j2L9M1p6K8M8k7l9M6J8l9J2Kok0
2656a5J4j6J7J0k3k0kK9m6OM1k5j9O6m1J6J4qj5L9j5l3L4J3l7L1K7l7k3J3M7l2
2688A0mJ0j5k6Rk5K6J0kn4P4k3n3K5O1m1m9P6J2n1K3K4POl3K7K5j4m6K0M2m9j4
2721a2J0M3m9m0N9j8l6lO7m0l8M0LLk4OM2j6Rk3K3L3p1K0L5K0n9J7K7km3K7L7
2754D7n1Ok3K7k0rJ2L2l5l2K5N0l2k2K7O%l2K0L2k5njJ1qJ2qMjl3K3K9n0jL9%
2790A4m1K9K6n4J9k3L2rrl7N3K4m4PL0mJ9n3J8M8n0j3K6L7m4%Rpj4J3j9L2j0l8
2824c3L5pj7%K8j5k2J9RK1l9J2L0k4Oj0J6Rj0k6M3j1k4RN7n5k7P0l4j6k0MPLk3
2859c5J4J2j7J2K2J6n6J6j2M4nm8M7K0j8k2L3KorJ1j9J3l6L7k8J5l4K1K2m0l5
$$ y = [59, -12, -23, 14, 24, -43, -28, 10, -1, -21, -21, -32, 24, -26, -16, 4, 4, -30, -42, -3, 38, -38, -10, 38, 11, -28, 18, 36, -3, 9, 11, 5, -15, -1, -17, 0, 10, -13, -33, -35, -6, -52, -46, -5, -30, -49, 17, -24, -8, 6, -2, -17, 22, 7, -26, 8, 21, -16, 15, 42, 5, -18, -5, 42, 10, 6, 16, 1, -25, -16, -41, -15, -5, -7, -61, 13, -10, -63, -38, 23, -18, -67, 9, 21, -30, -7, 17, 24, 30, -3, 24, 49, 35, -11, 9, 51, 2, -12, -2, 41, -8, -48, 11, -7, -43, -46, 21, -19, -57, -17, -14, -11, -35, -29, 13, -3, 6, -17, 6, 39, -32, -12, 23, 43, -16, 1, 28, 26, -17, 10, 47, -4, 2, -21, 6, -14, -23, -11, 21, -14, -46, -21, 29, -3, -25, 2, 8, 8, -24, -4, 28, 3, -2, -3, 8, 0, 12, 4, 8, 7, -26, -3, 26, -24, -25, 14, 14, -27, 2, 28, -26, -7, -30, 2, -7, -16, -53, 0, 24, -20, -13, 17, 13, 32, -21, -3, 45, -5, -18, 8, 45, 1, 1, 10, 3, -11, 2, -17, 15, 5, -33, 2, -5, -22, -22, 6, -9, -31, -12, -3, 18, -21, -9, 21, -3, 3, -7, 9, 18, 8, -18, 25, 14, -10, -1, 56, 1, -26, 44, 10, -6, -26, -22, -15, -12, -35, -21, -9, -26, -14, 8, 24, -32, -16, -28, 16, 11, -37, 10, 30, 12, -10, 23, 25, 19, 10, 21, 2, 15, -21, 16, -12, 3, -31, -10, 12, -28, -63]
2891f3N7J1m6J1L5Pn3M6Nmmj8NK2j8%JQj1lL5k4n0O4Kj1l3L9Jk1j8K2Rkrk5M5
2928A2Pj7m7O9j1m7M6J9j2m6O6Jk5l3L2J3k8j9mK5j2J3j2K4k4l9O2ok2n4J05l0
2960Fn1L0%Qj9nM9nj1k3K6K9k7l0O4l1k7lM3l6jj3K4rk4L6k3L8j7k6rP6m5j2J9
2995Aj0l1M4K1k4j9RL1k6PJ2JL1m2m1N8j1j2KK7k5j5K6j5k7j1J9J0j6J0J4J7j8
3028cj9K1K9po3N8Nk8k6N8Nl8J0lRJJ3rj9M6p1RL6k5rK2M3p0ML6Jk9L1qorRj8
3066a4J4Rj2K1Ql1rO0k9j9j9L1jk4JL4m1MjPMj0OPMk1k0P5m1nN3k7l1K0L5j0l7
3103iJ8OllK0k7kJ8n0K8M0m8l3L8K2m7k4L5Qj7L9j5mL1l6OJpJ3KJ5j5k1O4k0l9
3139a6J3L6ql6QJ6Pl7J3j1K2k9QK8j8n0M0L1j0l6QK4J8k0J5ok3J5k1L3j6mNK6
$$ y = [-63, -6, 5, -41, -30, 5, 12, -41, 5, 10, 6, 2, -16, -11, 11, -7, -7, -6, 2, -9, -12, 23, -1, -51, 13, 15, 4, -29, 10, 11, -10, -28, -6, 3, 1, -8, -33, 12, 19, 2, -45, 24, 13, -34, 12, 31, 19, -27, 39, 40, 15, -18, 14, 27, -1, -20, -24, 1, -11, 2, -10, 14, -10, -49, 13, 7, -15, -69, 36, 6, -45, -15, -15, -7, -26, -31, 18, 13, 2, -21, 5, 34, 7, -23, 41, 10, -17, -20, 23, -13, -14, -27, -3, -12, -36, 0, -23, 15, -2, -28, -37, 39, -6, -18, 1, -9, -40, 4, 25, 1, -18, -9, 22, -4, 3, 15, 16, 47, 5, -36, 22, 11, -1, 1, 28, 3, -12, 14, -1, -28, -39, -20, -10, -26, -16, -2, 15, -3, -22, -1, 28, 21, -42, 16, 21, -7, -33, 25, 30, -8, 2, -1, 8, 9, 22, 13, -6, 40, -31, -22, 14, -11, -20, 2, 45, -25, -21, 15, 16, -13, 18, 10, 4, -5, 4, -14, 0, 9, -3, 18, 26, -5, -14, 46, 17, -2, -21, 10, 9, -15, -14, 20, -21, -17, -18, -11, -7, -17, -11, -4, 0, -21, -41, 34, -7, -12, 41, 14, -17, 3, 38, 28, -9, 9, 15, 12, 9, 29, 2, 0, 18, -32, -4, 36, -12, -45, -7, 15, -32, -56, -21, -13, -30, 9, -6, -10, 21, -15, -9, -8, -15, -2, 0, 15, 0, -21, 43, 23, -16, -3, 33, 25, -11, -3, 13, 20, -17, -4, -15, 7, -22, -14, 14, -4, -54, -14, 17, 7, -29, -21, 3, 21, 1, 16, 10, -13, 2, -19, 14, -2, -6, -1, 25]
3173B5pn6N2J0l9k1M9j1k8J1K8j8J3j6lrj3J9J5K5k3J9l5J4nj4NM3l1j1MK1k9
3206a6J2L2rj2k5%K2jk3K3Qm2L1%pj0KJ5K3l2K2j1L4l2kL1l9j8J4L4pk7KK1%j6
3242cj1kJ8l1KL5l4mL8Ll7j2L5Pj1j3J0L4Kk9MJ5Ll3N1k4j9mN1m6J7j6OK3j3j8
3278fJ3Lqk8%J8k9K5K2k0j4M5j6Ll3M1k4QJ8m5M2ml4PK2J6l2J3j2L5kqpjpj4J4
3315Aj2J5k6MK1j2rM7k3QJJ1rn5M3j4rK2J2L0n8pQK9k2j3qL0Rl2J7pk0OK3Ln1
3352d7N8J3qj3mJ6oj8rK7J3j2j6lJ4j9RQk2kK6k4Nmj2KQJ1%Qk1nJ8L5nl4J3K6
3390B6m8K2j0L9k3j2OqPJ0mmjk0L0L4l8k8J1J3j6j4K0J4qj1qK1Jqj7L0qk2K3J7
3426A6J2l9J8J0k2RK2j1Jj1Mlkm4J7J4K5l2K5J2k8j4K4mj0PK6j7j1oONj7K7pk3
$$ y = [25, 18, -38, 14, 24, -15, -36, 13, 2, -26, -15, 13, -5, 8, -8, -11, -20, -33, -14, 1, 26, 3, 22, -13, 1, -4, -18, -13, 30, -1, -12, -8, 13, -16, -4, 28, 19, 7, -18, -18, 4, 3, -20, 3, 11, -31, 0, 0, -7, -17, -15, 0, 23, -9, 13, 2, 36, 4, 2, 33, -6, -24, -10, 24, 17, -10, -8, 13, 13, -3, -14, -16, 2, -29, -27, 8, -26, -30, 8, 11, -26, -38, -3, 4, -7, -20, -10, 24, 26, -3, 1, 16, 19, -14, 37, 13, -6, -10, 41, -5, 12, -4, 2, 25, 12, -6, 7, 10, 2, -26, -26, -8, -37, -12, 10, -10, -24, 21, 5, 8, -25, 16, -8, 0, 18, -27, 15, 11, -23, -16, 6, 22, -10, 3, -9, 26, 24, 16, 9, 8, 1, -13, 1, -11, 4, -22, -18, 3, -9, -18, 29, 6, 14, 15, 26, 17, -38, 5, -9, -18, 4, 16, 46, -12, -19, -11, 18, -4, -17, -25, 5, 14, -18, -1, -8, -28, -22, 1, 4, -47, 11, 24, 16, 3, -1, 15, 9, -9, -18, 9, 22, 10, -6, -9, 5, -14, -5, 3, -19, -21, 5, -19, -14, -18, -30, -28, -20, -9, -9, -1, -22, -27, -9, 26, 21, -13, 0, 26, -22, 0, -10, 29, 6, -6, 0, -8, -1, 9, 5, 1, 0, -20, 10, 44, 6, -22, -11, 2, -14, -28, -8, 6, -2, -13, -21, 0, 1, -7, -24, 6, -2, -24, -1, 16, 28, -11, 7, 17, -5, 4, 26, 15, 16, 5, 9, 6, 4, -40, -23, -9, 16, -16, 9, 21, -7, -21, 3, -1, -11, -4, 22, 5, -6, -12, -6, -1, -18, 9, 2, -21]
3462b1KJ4PKpk0J2J5m2K1K4Rm1J1JJ5k2%K4j0k2L5K%j5J7kLk9RL0j4JJ2j6pnM
3500cJ7k2kJK8j6j5J7Rn4J6O0m4RMRQk8K1k4jK0J7l1L2l8MK8Qn4J9NK0j9j9JL4
3537A7l3j1NK6k2LlQL6m7L2rj5M5k6j5M2m7J2K0l8L0KJ3k9j0J6j2M3n8QqK1Pj5
3572a2J0mmOQj0pN0m5j3K0K5ln8L1Oj1mK7nnmPpnqj1L9Lk9lNLpL0k2moJ1J9l9
3613b6J5J2K4l2K2j6J4Kj4J7j0j6NK8j3j1Qj6Nk7K3J5ml2K7nj3LJL7l0K0k8K5
3647A0j2j9L6NJj0J0J2j8rK3J7l7j9RL4j5l9K2rQj0j0J6j3j7RKJ7%OQj0J6lj9
3683hnJ2Qj5M5n2K3jJ2moJ8k5j4OLJ1l7N4l4pQmPk2mJ1K1j7k1N1k8J4k1L7Mj8
3720BJj2M8m6%%rKKN5m5k8K8K5j4l6NN0m7j5L0LL2k4LRnk1KK4m1qM3mj5%J4K5
$$ y = [-21, -19, -5, 2, 4, -3, -23, -11, 4, -38, -17, 7, 16, -25, -14, -13, 2, -20, -20, 4, -6, -28, 7, 9, 9, -6, 11, 9, 12, -17, -8, 22, 8, 9, 21, 5, -2, -7, -3, 14, -8, -10, -9, 19, 3, -12, 5, 14, -40, -24, 36, -8, 1, 5, 14, 22, -6, 15, -9, -10, 10, 27, -4, 28, -10, -6, 22, 30, -24, -5, 0, 20, 1, -18, -17, 17, -16, -27, -22, 4, -18, -15, -18, -10, 26, -21, 11, 2, -13, 32, 6, -9, 33, -14, -2, 18, -20, 10, 12, 25, -4, -14, 2, -10, 33, -25, -17, -25, -4, 3, -12, -2, -6, -10, -4, 4, -6, -13, 37, -8, -21, -1, 24, 21, -37, -6, 0, -11, -15, 12, 7, 2, -2, 5, -2, -7, -15, -26, 13, 16, -13, -16, -11, -8, -15, 15, -7, -11, -17, -6, 13, -26, -11, 1, 25, -7, 15, -1, 13, 15, 1, 18, 8, -8, -3, 25, 12, 1, 9, -7, -2, -29, -6, 9, 5, -27, 0, -5, -18, -15, -14, 23, -7, 13, -15, 10, -2, -21, 15, 20, 21, 11, 21, 33, 15, 6, 29, 46, 9, -10, -1, 33, 18, -21, 1, -8, 0, -10, -20, -4, -17, -34, -25, -23, -6, -6, 0, 8, -2, 14, 11, -8, -13, -1, 7, -8, 37, -15, 8, 7, 19, 15, 9, 27, 2, -12, -6, -3, 8, -29, 25, -9, -16, -8, -12, -5, -27, -31, -20, 1, -16, -37, 14, -14, 0, -21, 16, 20, 2, 3, -9, 39, -7, -7, -7, -16, -14, -12, 43, -2, -30, -2, 23, 9, -27, -22, 28, -19, -34, -4, -1, 31, 7, 10, 19, 14, -7, -5, 19, -22, -30, 13, 9, -6, -6, 8, 33]
3758C3m7NK5k6pPkJ2k7K3Rj0kj4L0JoRMNj4J7Lk4l2K9QJ7k4QqJ9j0lqj0qqK9j3
3798a0k1K5KrJ4j2pK1JPjJ3lj3Klj4J8J0Rk5jJ5lk4PRn4M1LjJ7l2J2Jj1lQK2r
3838Aj7J5M0l1JLj3joJ0KJ0j8KK2j3l0K9Mj8K0l8K5j5PK7j1mJ1%k2j4LL1J0k0
3874Bl9N0K1m5oJ5J6l0KL9k2j1L8m3%k3M1QmPl0oK5kkJ4Rn4L0J2j3K1k0K0kL1
3910D9p0L3oj7QJ2j5j0mL6jj7kNl4kK0J5j0j1jpmJ1J8kOkK3K0l1j4K8k0j7RJ9
3947A5j1j1PJ6k3Rj0NJ5j5mQj3Oj8J5nk9J5L7mk3J9%Mj8KK0J3m0NRJ1k7L3K0l8
3984eK6l2RkRj2M2l4lMJ7m7J5K8j3Rl6K3J5j3MkKj4J3j3J6J2k6QLOqk1J6Jm1N6
4022A2j7J2k8L4Oj1oOLk2K1k9L1l6L1L1J6l6j1LNL5o8K4Kk0QLj4qJ3jJ6j1NJ7
$$ y = [33, -14, -9, 16, -10, -17, -10, -12, 0, -27, -4, 5, -5, -7, -21, 9, 10, 4, 13, 17, 22, 8, 25, 28, 4, -28, 1, 9, 26, 2, 10, 2, 21, 11, 8, 0, -10, -18, -26, 3, -10, -31, -6, -4, -13, 1, -11, -18, 3, 4, 11, 10, 23, 20, 7, 9, 6, -8, 10, 20, 29, 4, 3, 18, 15, -9, -2, 7, -47, -6, -3, -4, 13, -19, -7, -6, -17, -20, -12, 10, 1, -16, -1, 39, 8, 9, 12, -1, -2, -8, 2, 4, 14, -4, -2, 20, 7, -23, 6, 10, -8, 12, -26, -1, -16, -9, 18, 7, 3, 14, 14, -8, -22, -19, 12, 22, 2, -37, 13, 34, -11, -17, -2, 14, -16, -14, 25, 3, -8, 30, -13, -13, -36, 5, 13, 9, 16, -14, -20, 5, 3, 1, 15, 24, -30, 0, 12, -1, 20, 0, 20, 18, 49, -21, 12, 6, -11, -3, 9, -6, -16, -20, 16, 15, -2, -4, 1, -33, -35, -15, 0, -10, -21, -22, -29, -33, -22, -4, -6, 0, -2, 21, 41, 10, -4, 24, 4, -13, -4, 15, 4, -7, 0, 16, -7, 2, -8, -3, 12, -3, -7, 1, -12, -6, -24, -9, -14, -43, -28, 9, 5, -18, 1, 1, 5, -13, -11, 9, 22, -18, -13, -4, 7, -20, 13, 33, -5, 21, -11, -2, -4, 5, -7, 35, 1, -2, 2, 19, -28, -13, 15, 2, 11, -25, -2, 13, 0, 4, 2, 4, -10, 3, -10, 6, 18, -8, 0, 3, 9, 1, -20, -4, -3, -44, 12, -5, 7, -21, 13, 19, 8, 2, 8, 11, -11, 10, -19, 12, -24, 7, 38, 54, 18, 7, 10, 15, 50, -18, 6, 8, -12, -4, -1, -15, -23, -10, -11, 5, -6, -1, 16]
4058A6m6kK1L1kk2%M7l7k1J2qJ8oK6qj3Plj4J3j9M3mj9j8lOk5K1NK2l1k0N5Ll7
4095a2Pj3MqKL9l0Rj5L5J3m1QJ7rK9pj0j5l0J3K0l0M2k8LK4poK4nm8K5J5j0j7
4131a2K7j7MJ9j5j9J7j5MK0j6n%KJ0j5k7L2J2Jk1L1jk5pK6rj0L6m5JK0l1L1qr
4167a4J0J8pJ0KL7m9k1J9Omm0N1Qm7LJ5kJj2J4k5PNL1nj8nK6Pj3LJ1qQj9Rmj2
4206dkM0lm6J2K7k2j3LORj1JmPk4MOJ6oj8L9j4k6OK6j4j3L0Oj5oj0MK2jj7K8l2
4245inQjJ0l9L4K7j9l5L5K1k8k2L0k4RONoJ5Kl7J2K2k4M1k7l1nJ8L2k4mJ9j7J4
4281CJ3nj7J0qNrJk5L2oqL2J4m0L5k4o%mRNPk9j5K8j9pK0K4k0j0NJrj0K5j0j1
4320b3K2nK3j2rJ4jM4n3k0M5k%k6J9k4jJ0Ql6J3J5j8J9OLk4mqoK9j2Oj4M2l6j5
$$ y = [16, -30, -32, -11, 20, 18, -4, -4, 43, 6, -15, -3, -11, 7, 1, 27, 19, 6, 13, 10, -4, 9, -10, 33, 29, 10, -8, -11, -5, -30, -9, -4, 18, -13, -33, 22, 25, -12, -5, -18, -14, -22, -20, 19, -11, -2, -17, 18, 31, -10, -2, 15, 6, 35, 28, 18, 3, -27, -14, 6, -24, 18, -10, -7, 17, 10, 4, 28, 23, -25, 0, 15, 5, -12, 15, -2, 2, 21, 6, -13, 4, -11, -7, 13, -3, -8, -8, -6, 4, -11, -38, -6, 6, 7, -14, 17, 16, -9, -16, 10, 1, -9, 27, -18, -17, 3, -28, 3, -5, -14, -4, 14, 7, 17, 19, 56, 7, -14, 5, 11, 7, -33, 18, 26, -21, -18, -3, -5, -4, -16, -2, -27, -20, -15, 16, 11, -7, -12, 14, 21, 8, 11, 22, 14, 22, 3, 12, 8, -4, -6, 34, 31, -15, -3, 24, 2, -11, -8, -2, 7, -4, -3, -7, 0, -24, -20, -14, 2, -4, -22, 17, 3, -23, -17, 9, -5, -18, 12, 18, 3, -3, -13, -9, 13, 12, -5, 23, -9, -14, -6, -7, 3, -36, -2, 25, 6, -29, 6, 27, -1, -23, 7, -17, -8, -2, 3, -3, 12, 14, -23, -11, 11, -13, 28, 1, -30, -35, -17, 15, -9, -13, 6, -11, 3, 16, 11, -6, 4, -4, 1, -8, -7, -32, 0, -6, -14, 18, 32, -8, 27, 3, -3, -3, -7, 2, 7, 14, -15, -30, -2, -21, -28, -8, 16, -4, -14, -9, -8, -17, -27, -2, -12, -23, -1, -6, 17, 5, -4, 10, 9, 53, 0, -20, 25, 23, 23, -3, 16, -8, -9, 1, 9, -27, -14, 1, -17, 2, 8, 11, -13, -17, -25, -31, -2, -14, -8, -22, 20, -16, -31]
4357c1L7kJ6l1M7k9%J2k0K3k4JjRqj3M7ll5k2M6rj0Qk4J1k2K7J9j3Mk5L2j2kJ4
4393A7k1K9j4m4N2mj6l0M5k2NL2k6J8l7J7K4l7J8jopPK1j1J2k2j6jJ7k0KL5j3
4427CpJ5J2oPj6Qk2k8K8Nj4RnONmMJ6l8J5J0K1l8J0jJ4LrK7j9npJL2l5J3K3m5
4466a2OOKjj0J6l3K7j9NJ2lj7JK1N%pl9M4lk8K4K1l2K9j9j1J5j0L7l3j0K1%j9
4502a4j7N3k6j6KJ3j0K1qrPl6L3OJnk9L2j4j3J8J1kpj0MJ5K4l2k0L2kk2k1J9L7
4538A5k8K8k0J3kk0Pj9oN3qk4j2J7K6rkMk4Kj4M0j1j5jj0Qj7K5j8L1l6K4J0%l3
4574b6j0L2lj4j1L7rnj%L1l3K6lj3Jj9L9j4rkQrj4PrL1l6L1l9L6ol2qL3l0M3Q
4612Hl2j0L4lK5j8J6j2k7K6J4j4K3k4j3K0l7L7Pj6mopK2m1KJ9J7mj1j1J3noK1
$$ y = [-31, 6, 4, 20, -11, 36, 7, 7, 19, -1, 22, -2, -1, -2, 7, -1, -14, 33, 30, -5, -27, 19, 10, 0, 8, -16, -5, -27, 0, 19, 6, 10, -15, 17, 5, 3, 17, -4, 25, 11, -33, 19, 15, -1, -31, 14, -8, -3, 29, 3, 21, -16, 1, 25, -12, 6, 5, -1, -8, -1, 20, 9, 21, -1, -17, -18, -1, -21, -19, 16, 3, -4, 11, 23, 17, 24, 8, 16, -6, -34, -6, -1, -15, -6, -11, -5, 0, -4, 0, 16, -22, -7, 3, 24, -14, -4, -5, 9, 12, 3, 30, 11, 6, -1, 0, 32, -3, 10, 33, -12, -6, 0, 2, 1, -9, 7, -26, 1, -18, -13, -1, -4, -21, -20, 1, 6, 6, -1, -40, 4, 1, -27, -3, 18, -14, 15, -4, -15, 0, -10, 27, -6, -16, 5, 5, -14, -31, 22, -4, -20, -18, -5, -15, 6, -2, -11, -4, -40, -7, -1, 0, -5, -34, -2, -16, -29, -11, 0, -2, -9, -19, -15, 0, 24, -8, -28, 4, 2, -20, -41, -22, 15, -13, 15, -5, 8, 6, -14, -7, -26, -32, 21, 13, -11, -23, -6, 20, 11, 9, 13, -11, -9, -23, 17, 6, -9, -10, -20, -12, -29, -4, -22, 9, -27, -3, 7, 7, -26, -36, -4, -7, -21, -32, 5, -4, -9, -10, -10, 21, -12, 14, 11, -2, -1, -20, 19, 5, -4, -6, 2, -7, -21, -14, -23, 8, -28, 3, -36, 0, -6, -38, -46, -13, -43, 0, 8, -24, -34, 0, -3, 22, 4, 20, 8, -19, 7, 21, 7, 30, 6, -7, 13, -24, 13, 20, 4, 0, -6, -13, 9, -32, -30, -11, 6, 2, -9, -20, -7, -12, -18, 3]
4647Cj0KoJ7L%rRJ2l3K3oJ4m0J4M1m6rK4j9J2k8PJ7J7k1RK7Ml9RPk6J3K1K3n5
4684a9JK9oNj2j0J9l2J2jj1L8m2M5Pk1K3m3K1l1K2Pj8J4OKJ5ql5j4N2j6J6k5L3
4719B3m2K1j2J0Pl2K7j4MrPmJ0k5JK2%oJ1Okk4K0jmoK7k3J0J4Kj0JMj3klj3L1
4758A3j2qJ3M3l9l6J3K7k2QRrm1J4L5pqk4L2jmj3J0K3k1l3L0mM%kL7l4k3L7Lk4
4795a4jKJ5k6K1NJkrl7P0k4qNKj4K2j1J9k4RNk0K5l6J8lj2J5qJ3k6L0jk8J7JL
4833fj8JJ4K1Ql0lJ4Lk1L4Rj8LpM6l1m3N1j0j3j6Pqj0NmK8Ll8oM6k6j8K9J0J5
4870B1m8J8K1ql8K0M4m0j1K7j0jK2rJ1n4L1k0N3l6J6J0j2l0OJL8j0n7J0K4mK9
4903A4k3J3j7j2J2J5j8LJ1pJ1kJ1j2nL5j6o%OQJ4k3k5KRK4j1Qjj8oN0l4k2LjL
$$ y = [3, -7, -5, -11, 6, 9, 9, 0, 9, 21, -12, 11, 5, 19, -21, -7, 34, -12, -21, 3, -16, -4, -32, -25, -8, 9, -12, -3, 24, 28, -11, -2, 5, -21, -8, 13, 36, -19, -18, 11, 5, 10, -2, -12, 7, -25, -13, -14, -25, 13, -29, 16, 23, 2, 25, -18, 3, -28, -6, 1, -17, -3, 3, 5, 20, 12, -23, -37, 15, -1, 15, -10, 23, -19, 2, -10, 0, 7, -25, 2, -12, -8, -17, -10, -14, -4, -29, -28, -6, -6, -12, -1, 5, 3, -21, -1, -2, -6, -12, 15, -8, 2, 16, 18, 8, 9, 13, 0, -2, -5, -18, 13, 1, -7, 6, 49, 10, -26, -13, 14, -8, 0, 9, 0, -41, -27, 8, 1, -7, -31, 1, 0, -4, -17, -7, 16, -5, -38, -8, -12, -8, -8, -10, 27, -7, -30, 7, 10, -14, -15, -13, 2, -24, -3, 2, 3, 1, -8, -45, 25, 1, -7, -2, 0, -14, 8, -3, 16, -8, 1, 6, -14, 11, -25, -7, -10, -22, -7, -15, -2, -28, 2, 1, -27, -10, -9, -6, -24, -23, -9, 12, 20, -10, -13, 1, 4, -17, 17, 26, 8, 11, 4, 50, 19, -24, 27, 17, 4, -12, -5, -13, -23, -18, -22, 6, 9, -29, -35, 11, -15, -33, -4, 6, 21, -27, -9, 12, 4, -34, -14, 30, -10, -21, 6, -4, -5, 17, 8, 19, -35, -4, -24, 29, -7, 9, 19, 7, -23, -17, -16, 22, 12, -45, -35, -11, -15, 14, -9, 4, -13, -25, -13, 2, -16, -13, -2, -9, 2, 0, 11, -1, -6, 29, 13, 7, 7, 13, 21, 35, 12, -13, -11, -2, 22, 11, 19, 18, 0, -6, 44, 10, -12, -9, -10, -7]
4941gj7K3p%qLPj0J5L3k9k3K0PJj9J3k%oRmlJ8j7NJ0k7j0K6J5k4oL5Jm0J9Oj4
4980gj3L5j9mKJk5K5Nl3L6Pl4L3k0J9mk8M1j4j0m4O8Jl8L5MpnJOk4j9L1J9k4q
5017a1J3kk7K1JL0n1K2k2L3k8rOOLJ1k1L2Ok4JK7m1J0JJ4L1j6%K6m0OK0j6j8P
5053ANJ8k1Pj1oK5l8J7rNj0M0mj8qJ1jj6mJ6pj1L5qk6J0j8j6N7m2ML3j7Qj8K3
5090Fqk4J3RoMJ4m%j8L0Km0L5k4NJ7j3%j0p%Lj6RKL0k2j0pJ3LQLJ1Qk0j0J5Jn
5131cm%J7k4J2LJ0kK9l9J3k8J7j1j6J5mjK2l1RJ3%j6kJ3Pl2j1M8k6J5j7L4j5J6
5167A1l6L4k9J4L2l8J9j6ML4jqj3M8m3j2kK3j6l8LL6J2k8mK2l4K6plMl3K9L0k3
5202cl9L4%pK0J3j2Ok2ML4k7j9J1J8j7j0jJ7j2L2qk0L4l2J4J4l0J2MJk5K0Mnk6
$$ y = [-7, -24, -1, -8, -8, -16, -13, -6, -16, -1, 32, 3, -20, 0, 7, 8, -11, 2, 0, 0, -6, 3, -1, -4, 14, -3, 2, 12, -15, -25, 1, 16, -8, -14, 21, 22, -18, 1, 7, -7, -20, 15, -4, -8, -6, -5, -30, -5, 0, -33, 3, 10, -24, 9, -11, 8, 4, -24, 17, 3, -7, -51, 17, 18, -20, 15, 19, 12, 7, 8, 14, -10, -29, 2, 21, -3, -11, 2, 0, -27, -6, -5, 25, -26, -4, -26, 7, -21, -30, -24, -18, -15, -4, -25, 7, 13, -11, -10, 17, -24, -14, -13, 1, 32, 16, 16, 42, 2, 8, 28, 12, -6, 1, 6, 24, 3, 10, -1, -7, 18, -20, -3, -12, -7, -17, 23, 19, 1, -7, 4, 3, -13, -17, -1, -8, -19, 16, 8, -18, -8, -26, -42, 15, -27, -23, 10, -7, 1, -17, 6, -2, -26, -13, -4, -10, -6, 8, 4, 4, -14, 16, 18, -22, 13, -11, -6, 11, -2, -2, -12, -19, -19, -16, -32, -23, -21, 9, -13, -23, -30, -17, -14, -6, -3, 8, 16, -4, -14, 1, 2, -3, -7, -7, 10, -14, -2, 1, 11, 9, 38, -1, 12, -16, 1, -10, -26, -11, -15, -16, 6, -25, -16, -3, -3, -19, -21, -8, -1, -33, -44, 4, -22, -7, -24, 10, -5, 11, -25, 9, -20, -6, 26, -12, 7, -9, -5, 29, 28, 20, 7, 55, 12, 0, -2, 21, 5, -33, -30, 6, 18, -10, -14, 8, -26, 0, -7, -10, -6, -39, -10, 20, -3, -42, -8, -8, -15, 5, 18, 6, 12, -10, -6, 28, 1, -18, -7, 11, -6, -16, -17, 0, -12, 20, 12, -8, 26, -6, 8, 22, -8, 4, 8, 9, -16, 4, 8, 3, -23]
5238b3R%J9l8L0lj8KRLJ2k0j7M0j3knJ7rPjJJL%Lj1OkJ4%j6oPk3J8j4K1mj3jj
5280a8K2j1nK5l0J8l4K8j2JjJ3k4L3j6J7%j4K4jm1QJ5lj3K4J4j4k2J8j9N0m7J5
5314@K9m1J5l3L2j8J3j5L0k6J1qN5m6j4J9j2kRjQK6k0moK6m3jK4j5JJ4j1m%lN8
5351D7k3j2j7J1j2J7j4nJ6j7KK4lk2J9j0oPJ5j6Pl0L3j2jj6NkK3j7j2L1k9K5J0
5386A6Ll2J3KPK9l2jJ0k1M%J4j8K0l1K4k1OK8k7oRJ0rj7J9K2l0RK5n1lK8J3j8
5422fJ7l1J3J3qMKK9k4k6NK6nj2j0J4j3K0%J6j7k4K2J3j9lJ1j9NmN4n5K4k0k2
5457c0L8nk2MJ4j6K7nj1j6KL3Pl7J8nRJ4l5K4k3nJ3KJ6O%k7K0j1pKJ6j7J0J5m1
5494b3J1mK7J6p6L5J7rr%qpK0kJ5j0j5L6j9k5K2K7kk1oM3j7pj5K2Ok8QJ5lKj2
$$ y = [-23, -14, -14, 5, -33, -3, -6, -24, -22, -13, -10, 2, -18, -35, 5, -8, -10, -15, 2, -7, 0, -1, 0, 1, 4, 4, 7, -4, 2, 0, 14, 14, -2, -8, -1, -24, -6, -20, 1, -3, -16, -17, -18, 4, -7, -12, 13, -17, 1, -33, -5, -17, -16, -17, -4, -28, 5, -11, 6, 6, -8, 16, 15, -26, -18, -3, -6, -19, 5, 19, 5, -17, 1, -18, 32, -15, 0, 29, -12, 3, -30, 2, -16, -3, -18, 12, -14, -3, -11, 44, -2, -16, 3, -9, -11, -2, -3, 5, 31, 11, 7, 1, 27, -16, -17, 7, -8, -7, 7, -4, -8, -8, -11, 47, 24, 12, -5, 6, -6, 11, -3, -8, 8, -9, -7, 17, 14, -8, 11, 1, -5, 2, 17, 1, 8, -22, 11, -1, -2, -18, -13, -15, 8, -9, -21, 10, -19, 6, 16, 19, -13, 0, 2, 9, 38, 6, 5, 15, -6, -2, -2, 12, -6, 14, -17, 7, -14, -8, 20, -7, -13, -4, 6, -3, -20, -1, 21, -9, 0, 25, -26, -29, -1, 12, -6, 11, -20, -7, 6, -2, 2, 4, 33, 9, -17, -12, 14, 9, -3, -13, 1, -12, 8, 8, 24, 7, -17, 5, 18, -1, -4, 7, -12, -7, -11, 43, -12, 12, -8, -30, 8, 3, -19, -15, -1, -17, 10, 5, -6, -22, -20, 13, 20, -17, 1, -4, 5, 19, -16, 8, -15, -20, -7, -5, 11, 17, 17, -10, 10, -1, -8, -6, 10, -7, 3, 18, -23, -12, -16, 11, 27, -49, -14, 3, -6, -15, -15, -23, -30, -10, -12, 3, -7, -22, 14, -5, -30, -8, 19, 17, -4, -10, 33, 16, 9, -6, 16, 22, -6, 2, 17, 14, 16, 4]
5531DrJ6k8L2k4J6pm6LL6jOkNj2j4K3K1k1%J3k5JOnJ9kj6NJ7Rj5J4rk5M1l3J4
5569Gnl3J5kPqK3k2K7k4J8k7J4JRj9jMMKj6J4J0J1pRk2PJ3PJj4Qkl0J5nJ9J0l1
5609a3J5KLjl9L9K8m5QmjJ4l4K1Oj6RRLj8Oj0L2Kj6m4K9M2m3J3Nk6J7P%JJ1J1
5647B3k5j1J2j0M6j3k4L1j1j2k7RK0j5j1NJ7j4pj5J7oLJ5%lj1K1j9OMRkk7N2j6
5683A1j5j1Rj3J0LJ3L2o3K7J8k5J2k0kJ2Qj8Mj8J2Ql0N0k4j2J0j4JPN5n0J4j9
5717a8M0m0J5LJ7j2kj1j6L2k2Pj0J8mjK6k6oPQmmjJ8k3j6J7kJ7%lLj0Kp%jk3L0
5757bQrk4jRJ9nJ4J0Jm2J3nL8m0K9kj3J6JJ3j1k4J6lKrpJ5j5rJ2K4%k7%llJ4l
5797cJ1k3pJ2J0mklJ3LNkNpK5ok3KqK1qnROj1jk3M4k7jnK1j9j1K7jj4nk5K4nN
$$ y = [4, -5, 11, -17, 15, -9, 7, 0, -46, -43, -7, -8, -2, -4, 1, -11, -25, -2, 19, -2, -2, 11, -14, -13, -7, -12, 7, 5, -11, -6, 11, 20, 5, 19, 10, -15, 26, -7, 7, 2, -31, -16, -18, -11, -19, 4, -18, 9, -15, 3, -24, -10, -9, 0, -19, -20, -16, -12, -10, -26, -12, -2, 9, 2, 11, -11, -4, 9, 16, 17, 3, 11, 9, -21, -6, -11, 8, 18, -13, 2, 4, 7, 6, -33, 6, 34, -11, -3, -7, -8, 6, -28, -7, -1, -17, -8, 1, 4, -14, -8, -18, 14, 16, 0, -44, -15, 27, -16, -3, 2, -24, -7, 0, 0, 1, 12, 23, -2, -13, -1, -11, 35, 22, -2, 29, 18, 6, -21, -12, 8, -7, -18, -13, 4, -10, -17, -32, -15, -21, -18, -3, -3, -6, -17, 4, -15, -9, -5, 4, 2, -25, 27, 11, -4, -15, -6, -19, -9, -6, 7, 39, -24, 3, 21, -4, 8, -12, -14, -2, 6, -12, -8, -26, -14, -6, -36, 14, -10, -22, -12, -26, -25, -18, 37, -13, 1, -18, 22, -18, -3, 0, 17, 5, 3, -8, -24, 8, -14, -7, -17, 1, -3, -4, 22, -4, -10, -3, 5, 1, -3, -4, 14, -9, -25, -8, -10, 7, 7, 4, 7, -3, -1, -8, -8, -9, -32, -2, 6, -3, -27, -28, -19, 0, -5, 9, 19, 20, -22, -9, -14, 24, -16, 13, 11, -2, 14, 15, 28, 17, -7, 9, 6, 8, -1, -8, 7, -8, -17, -5, 19, 19, -8, -8, -11, -14, 0, -3, 8, -15, -22, -10, 0, -4, -6, -9, 4, 7, 12, 10, 15, 8, 33, 27, 4, 6, -2, 19, 11, 6, 15, 21, 10, 9, -14, 30, 3, 2, -3, 18, -1, -12, 15, 14, 0, -5, -30, -6, -11, -6]
5839fk2L8lKj4LQl7K3QJ2k1LJ6j0k2M3j9kjpK0qj5K3ojK4opj5OK2j2l1K8k1Rj2
5878a0j1QJ9j3lRMj4k0J1L6j8JNqk9K9j0K2k9K3LJ5l9J7LqQQJ9nk2J2j8Qj5J7
5915EPj5j0l0L2QqJ5m2L5l2JJ4jL0k4K3l2L2%K0j5k4K3Mj9%K1OJ7m4J6Pl4K3n
5951DJ7J6l8KJ6pk3OK2Rk9j6oK4K0m1K6K0l4J6j5j2M3j7oJ5J7k9J7j5j2mK4j9
5985iqL8j5L2m7K1l3N8m9J0Pqr%J0LJ3jJk6j4K8Kj3j7J3J9Qk2K5j8j3K8j9moj2
6022b7J9jNJJ0rlJ7rj4JJ4lK3k7Pj6J7l9J8M1k1J8k2qj7nJ9J2k2LOLRm3K3L9j9
6060@n%K0rj0k1M4k5MQpJ1pj9M5Jl2LOk5J6Nqnl5L8pj4K2j5M4l4KJ1Mk7RK5mo
6100Cl7L2kNl8K9j5J8K7J6n8K2j1L3k6oK5k1J5rOk6Rnj1L4k4J6jl0L0rjQKj9K2
$$ y = [-6, -28, 10, 7, 9, -5, -2, 6, -31, -8, 0, 12, -9, -6, 10, 0, -22, 21, 2, 0, -1, -8, 12, 4, -11, 12, 6, 5, 29, 23, 16, 1, 7, 29, 17, -14, 14, -7, 2, -10, -21, -13, 6, -7, -10, -1, 3, -11, -31, -20, 16, -2, -1, 4, -4, -33, -4, -14, 8, -21, 2, 5, 20, -19, -2, 1, -7, 1, 9, 28, 23, 1, 13, -5, 3, -12, 5, 12, -3, -13, -43, -11, -3, -11, 4, -38, -3, -35, -34, -20, -21, 9, -15, 8, -24, 8, 8, 28, 13, -11, 12, 16, -3, -3, 18, 24, 41, -3, 13, 20, -14, 9, 4, 21, 37, -1, 1, 17, 10, -13, -7, 15, 24, -5, -21, -27, -3, 17, -24, 2, 22, -12, 4, -11, -23, 20, 3, -3, 12, 29, 0, 17, 2, -10, -14, 10, -9, -17, 21, 6, 38, -9, 12, -21, 37, -12, -2, 5, -3, -12, -12, -2, 1, 14, 13, 14, -12, -26, 2, 4, -9, -26, -13, 6, 14, -8, 17, -1, -14, 14, -5, -9, -15, -27, -8, -9, -4, -3, 7, -2, -5, 12, 3, -11, -10, 4, 1, 24, -3, 4, -12, 5, -34, -16, 25, 4, 22, 0, -8, -25, -30, -11, 1, -21, -18, -12, -9, 0, -43, -20, 19, 0, -5, -5, 15, 6, -4, -25, 19, -6, -2, 6, -1, 10, 3, -16, 29, 30, -2, 1, 7, -18, -2, 3, -5, -10, -45, -7, -14, -28, -6, -21, 23, -11, -9, 2, 6, -21, -12, 13, 9, 3, -34, -2, -4, 1, -37, -8, -23, -5, 22, 38, -20, 2, -9, 24, -2, -8, 17, -4, 11, 2, 8, -18, -9, -14, -25, 9, -15, 1, 0, -30, 0, -9, -10, -2, 0, -19, 3]
6137Ck0jRoL4j6k2K0J4Om0J5MkJNkJMLj0nlK8nMk0rJ6Jkj1j0mj5K4J8l5M2k3n
6178a4K8k3J6Nl0k5M7Pk1J6j0K0j8kkJ6m1L1KJ4J2m1K4j5ONmj5J6J5nlJ6k9mL1
6214B5m0kKNLl3K7rJ0kL3lm9K2j4J2J2K1oomj9%J7Pk1J6j8J3Qk9K9j2J9Jj5nJ2
6252Gj7l1L5pNqk5K2K7j7Nj2J0rk2M2kj2LqK9qMNk1l5P6j1k1J3k1J1joJ9rlnJ2
6291A4K4k4k4J5Jj3K1J2k8j1j9J8J5j9j2N2l9J8j6K1pjLk2K2Qk3K8Jk4J1nPOn
6326EkJNj6J5nK0rj9K3qk8K5K3m5l3J8%QJ2J0j2j1pJ3J2pjKj5J8J2k2N0m3K4K0
6363C3j9j7L1n0K5%l1M4J0k6K9k5pK7j9j0qjKNJ0J3l4KJ2rmmJ6j0Llmj1oM7j8
6400gJ7mqJ5k8J3K0k5j6M0Ok1j0K1j5K1n1J9K3j0KqMJ3j3oK8j3l3J6J3pk4K4k5
$$ y = [3, -17, -18, -9, -15, 19, 3, -19, 1, 15, 21, -19, -4, 0, -2, -1, 4, 2, 3, 7, 10, 0, -5, -8, 20, 15, 19, -1, -10, 6, 7, 5, -6, -16, -20, -35, -11, 7, -28, 14, -9, -14, 14, -9, 7, 12, -18, -43, 4, 11, -10, 6, -4, 16, -2, -4, -6, 10, -31, 0, 2, 16, 28, -13, 11, -4, 2, 7, 3, -12, 4, 19, 14, 11, 27, -2, -6, 25, -15, -17, -15, -10, -7, -40, -13, -22, -12, -14, 19, 16, -33, -11, -25, -13, -1, 20, 14, 8, 4, -15, -15, 2, 9, -12, 4, -14, -1, 7, -22, 7, -5, 14, 15, 0, -5, 7, -10, -41, -6, -13, -8, -16, -41, -19, 8, -9, -4, -16, -6, -15, -37, 5, 3, -9, -6, -14, 15, 7, 11, 16, -5, -40, 36, 25, 4, 17, -4, 7, 6, 0, 19, 10, 7, 2, 14, 38, 14, -10, 5, 6, -7, 14, 26, -2, -13, -32, -14, 1, -18, -30, 22, -17, 1, -15, 6, -1, -2, 1, -21, 1, 9, -14, 14, 15, -9, 2, -3, 4, 10, 5, 3, 4, 9, -7, 8, 3, 23, 14, -5, 18, 10, -18, 7, 30, -15, -48, -30, -30, -22, -10, 0, -12, -23, -30, -17, -5, -12, -13, -11, -26, -8, 4, -18, 32, -11, 13, 33, 14, -3, 28, -22, 3, 3, -28, 16, 26, 0, 29, 4, -3, 24, 5, -5, -13, -14, -12, -7, 3, 16, -18, -16, -4, -13, -17, -21, -5, -15, -12, -15, -19, -30, -36, 11, -7, 10, 6, -2, 13, -15, -2, 18, -7, -23, 17, 23, 2, -8, 13, -2, 19, -32, -13, 10, 0, 2, -6, -2, 11, -2, -8, 20, 7, -26, -10, 3, -4, -28, -4, -29]
6435b9M2j9Qj2mJ5pk2J2J6mJ2k3LJ8j5J0pnJ7Oj2OLl8L5K3n0L0k6j9M9j9j5K8
6470Gj2Jk8L8l2J1lJ4k3kJ0L1k0nJ5J1j3jnj1L9j9l2L9l5K5j9K5k8K1Mk9PmM3
6505B0l0j7L4k6K7rlpRL0n5O2p3L3MlNOlk6L9k7%j1L0l7L9%K5k8Nl0K2j9J3Rj2
6542dK3j9nk6PN6l0j1mJ5qj0J5j1PmJqjOK4k6K6j0k1NKK3j3Jj1J3pJK7j0j3lM4
6581D1m6J9Kk4J3l4L9j0mPLk4K8j2Oqlj9J0J3j8jJ7J5k7n%K5j4J6j1J2l0J5J6
6616GJ3j5RJ3l5Pj3K9J2l7K9j6KJ1k0K5k3LLmRk5PKpkj4PK6j8KK3qj2J4Klmj8
6655a9K7n%J3j6JkL9m2Lj5N4m9L9j5mql0P8n2J2k3LNK4Mn1L4J0Qm4J3kPrJ1l4
6692c5K4qJ4oNJ1J2j7l4K8J2k2L7j4nM0n4J6PJ8j2j0J2k0K3k5J5j2j3J2j4K2j6
$$ y = [-29, 13, -6, 2, -10, -14, 1, -6, -28, -16, 0, -4, 8, -15, -12, 6, -9, 1, -6, -11, 6, 12, 0, 6, 9, -29, 6, 29, -21, 9, -17, -36, 13, -6, -21, 7, -5, -4, -32, 6, -26, -15, -18, -4, -27, -29, -19, 12, -8, -13, 2, 13, 0, -1, -6, -17, 22, 3, -29, 10, -25, 0, -19, 6, -22, -1, 3, -26, -19, -23, 20, -10, -27, 7, -19, 8, -1, -4, -11, -2, 28, -27, 35, -38, -5, -1, -4, 1, 7, 4, -22, 17, -10, -10, -21, 9, -28, 11, 11, 36, 8, 13, -17, 5, -14, -1, 8, -4, 19, 0, -5, -31, -24, 32, 2, -9, -13, 2, -6, -16, -1, -12, -5, -9, -8, -16, -17, -11, 13, -13, 13, 3, -18, -13, -11, 12, -1, 0, -11, 2, -5, -4, 23, 13, 0, -3, 41, -5, 14, 16, -8, 5, -29, 10, 0, -4, 3, 6, -18, 10, -2, 4, -4, -7, -26, -16, -3, -21, -22, -5, 10, -17, -22, -22, 3, -11, 5, -6, 6, -24, -9, 7, 20, 5, 14, 27, -8, -1, -14, 15, 27, -10, 19, 3, 5, 16, -4, 21, -2, 1, 4, 0, 9, -16, -9, -7, -14, -16, -30, -23, 3, -15, -13, 10, 2, -10, 4, 6, 3, -1, -19, 8, 3, 3, 16, 0, 1, -1, 38, -4, -1, -16, 38, -11, 28, 13, 9, 1, -29, 49, -3, 9, -14, -11, -6, 18, 22, -29, 5, 15, 23, -21, -8, -10, -3, -12, -1, -35, -11, -19, -5, -11, -6, 5, 17, 0, -34, -6, 6, -16, 21, 7, 2, 42, -12, 4, 11, 29, 17, 7, 19, -1, 22, -3, 12, 0, -13, -1, -15, 7, -9]
6725ilnkj1M7k6Mj3K5j3Pk2ORKj5J2LQJ5k0JMj9%%O3m7j4J8Mj2K1l3K6rJ0qm1
6764c7NK8Ol3M3ql5NJ2J7LmJ0l8K6nlPJ9j6J0mk4k5J0L4JnJLJ1k6L6Kk4Qlk5K
6803a6J9OoK5m7J1J4j5k5QK2K8m3jK9kk6J8lk4K9MJ7l3J2kPJ6Pk1k2K6l6L6Mm
6839A2rLq%j1L2j5k9J2lJ5k2J3LJ3omk2Kk0J8K5k9KJ4J3rj1K3mnJ7nK1Pk5l5K4
6877cL0k9QK2j2l5L0KMk0J7J0l7Pk3M7j2Lk0j1Ol1K4J3QoJ7j4k6KM2j9OJ1Jk4
6913a2K5K6m4K9k0QJj6J5jj1%J5k5J0MK0l2KJ4oj1J2PJ1l4%LPJ1j5Ok4L8k2K4
6949A5j6nK0l1J0qJ4%jRj8oK6J4l0KL0j0J9l2J1k5J6J0jjpj5j7K7jJ3j7K6l9R
6985inJ1k6M5m0L2nK9k6k8M7j1%l0K4Ol1N5l6M2l5l5K9NqK5oj0nj4j1J7KJ7l4
$$ y = [-9, -12, -17, -19, -30, 17, -9, -5, -18, 7, -6, 1, -21, -15, -6, -4, -19, -7, -4, 4, 19, -1, 0, 4, -15, -15, -15, 48, 1, -13, 5, 9, -3, 18, -15, 11, 2, 12, 4, -37, -32, -4, 2, -31, 12, 4, -31, -26, -14, 3, 6, 2, 12, -26, 0, -5, -8, -1, 18, 2, 12, 8, -16, -41, -31, 3, 4, -1, 0, 3, 14, -12, 24, 26, 2, 10, 7, -18, -16, 3, 9, 3, 28, -19, -8, 6, -9, -34, -26, -4, 24, -19, -20, 9, 7, -19, -1, -4, -28, 1, 5, 22, -11, 1, -1, 6, 22, 29, 8, -14, 12, -24, 12, 16, 12, 3, 6, -2, -2, -13, 19, 4, -25, -13, -16, -1, -23, -10, -7, 6, 0, -4, -26, -24, -44, -26, -1, -30, -28, -14, -1, -10, -21, 2, -2, -7, 10, 5, 26, 33, 8, -27, -3, 27, -2, 6, 28, 16, -19, 11, 13, 17, -3, 14, 24, -13, -6, -29, 18, 6, 9, -11, -22, -16, -47, -23, -10, -2, -8, 9, -5, -31, -29, 13, -6, 0, 11, 12, -12, 13, 39, -5, 24, 4, 12, 13, -3, 12, 11, 0, 0, 15, -10, 0, 4, 24, -8, -6, 8, 2, -9, 3, 10, 21, -13, -13, -10, -3, 8, -7, -1, -25, 13, -9, 15, -1, -6, 14, -17, -7, -15, -1, -1, -2, 7, -11, -17, 9, 23, -7, -5, 25, 15, 34, 2, 13, -12, 4, 14, 13, 12, 5, -10, -27, 0, -1, 12, -5, 21, -18, -9, -14, -3, -29, 16, -24, 8, 3, 32, 6, -22, 25, 14, 14, -16, 8, 14, -17, 38, 2, 44, 9, -26, 3, 8, 0, 25, 19, 9, 4, -10, -21, -4, -2, 15, -19]
7020a9L5j0rJrj4J6qJ8pLpJJ9j9LK0k7J0J5Lj3lKoJ3rJ4J1j8nrK2k8J8k7NJ7K5
7059B4m8K0rj4L3j2k5K3j2RNK1l9J2pJ3KmoJ4j8JJ%lM7k7LJ9k1oL0l2J4l2J7O
7096alJ8JRj2J7k4j0J2oJ8k8j4Oj5K8j5N%J3j5jJ9Nk1jK2oRJ0l8LJ5J5j1J2rK
7134Ilj0K3j9mJ2NJ4j6Lj2qL2l9RJ7j7Oj1J2Jj3rQJ1j2Lm9N5j7mNj0J7K4Qk5N
7172Ak8M0K7k1j4k6J7PoK2j8j3L5j7k1JJ1Qk1K1Lnk5K3Jok8J4K1J4k6NOJqj5q
7209b8M3k4pK6J6j7j8K3k6K3j4Qkl0J6L1k0J7l0J8rK8l3K2j2k5LK2j1oLnQPOj0
7245gj5J5J4Qk1j2M5m6J7j0QK5l2J0J2J6npoRm7K5K4k3NJ0Kl2p%J9J8mk6mK0l8
7282d0J4PK9k6jKL1Kl6K1J7l5L7j4Mm3M4ql2M0rk1J8J6k1J6rk5rL4PJKk3J4Ql0
$$ y = [-19, 16, 6, -3, -2, -11, -25, -9, -17, 1, -6, -3, -10, -9, 10, -9, -6, 14, -13, -3, 12, 15, 2, -1, 1, -5, 8, -1, 13, 24, 6, 1, -8, 14, -14, 4, -23, -18, -1, 24, -24, -4, -13, -27, 6, -6, -31, -8, -20, -11, -6, 15, -24, -12, -19, -6, -4, -8, -14, 0, -18, -17, -16, -16, -19, 28, 1, 4, 23, 2, -4, 26, -6, 8, -24, -7, -1, -4, 14, 15, 24, 12, 29, 5, -5, 7, 1, 19, -9, -23, -17, -32, -4, -19, -14, -14, -1, -16, -17, 2, 7, -14, -15, 7, 1, 10, 20, -18, -15, 0, 15, 4, 16, 7, 9, 6, -4, 19, 0, -4, 8, 13, 27, 11, 14, 2, -6, 26, -13, -4, 13, -4, 2, -9, 3, 4, -9, -18, -10, 1, -11, -8, -57, -2, -19, -23, -18, -28, -11, 13, 21, -4, 1, -27, 13, 40, 19, 5, -21, -4, 3, -3, 19, 1, -12, 23, 6, -15, -14, -3, 5, -16, 5, 8, 3, -22, 1, 2, -4, -32, -18, 3, 17, -9, -4, 2, 3, -5, -20, -28, 15, -9, -16, 10, 26, 9, -9, 14, -12, 11, -3, 5, 3, -27, -11, 20, 0, 17, -13, 5, -4, 24, -9, 13, 1, -24, -21, 1, -10, -16, -13, -18, -10, -3, 3, -7, -22, -7, 7, 15, -6, -18, 27, -19, -2, -12, -4, 21, -11, -1, 11, 27, 22, 15, 9, 18, -29, -4, 20, -3, 2, 12, 14, -18, -25, -25, -6, 12, 8, -18, -22, -2, -40, -26, -19, 10, -16, -17, -15, 16, 18, -18, 3, 20, -15, 22, 8, 12, -31, 13, 5, -27, 13, 4, -17, 1, 17, -4, 12, 3, -22, -31, 3, 10, 11, 13, -10, 4, 12, -18]
7319a8k9LL3Rj2M3n3J0OPNoNJ1l0L9j2%J3m8L0j7kJ0LKOJ4k2M3l0oL7k7k5k2K0
7356a0J3pJkl3K7%J5l2lJ8J7k3lK8MOl1mQJ0K1Jl8oJ1J5LrMJ4rJKJ4qk2Pj1jM6
7397C4k4j4jK5l0J0nK5j2J1j1ooMj6J3j5oNoK9J3l5J9j9k1M9l8N1k4j4J0MlpN
7433fMoJ1mK3k4QnJ9m3RJ3jj5J2Qj5OKK0j1j8j3RpJ3PK4l7Pk8J4K5K9l3QJ3k6
7471hOJ8r%j9k0K3K2Ok9K7k3J2j1L3l6MJ0j1K0j9J3mrlJ1J2k7L0l5j2M0Nk9L4
7506B2r%j8L3n0OJ4K4l0J1KLmoRJ9k2pJ3k5J7oJ1kJ2k1Rk5J2qM2m3J1j7oJ3Lk
7544a5K3l3J6L4n1J8KQlMkj0K9KqoLk1J2J3J0j9j1nJL8m9K5l0J4j1J3kJJ2qlj9
7582b8nK3lK3k9j3L4k3QJ6K1j8j9NJ6j8J5KJ2mqj1j9K8k5N1j8l0Oj4L4k5K1qJ3
$$ y = [-18, -47, -44, -11, -2, -14, 29, -24, -14, -8, -1, 4, -2, 3, 14, -16, 23, 11, 11, 24, -24, 6, -11, -13, -3, 0, 2, 8, 22, 0, 43, 13, 7, 44, 17, -8, -30, -10, 3, -4, -3, -5, -38, -11, -11, 4, -28, -31, -13, 4, -19, -22, 6, 10, 16, -15, -19, -11, -1, 20, 21, -17, -23, -12, 3, 6, -3, 1, 15, 6, 7, 9, 23, 15, -7, 0, -11, -12, 34, 10, -4, -5, 20, -10, 0, -5, 20, 8, 19, 8, 2, -4, 0, -16, -3, -18, -24, -19, -25, 4, 17, -18, 1, -18, -39, 10, -28, 23, -1, -15, -5, -1, -4, -11, -6, -2, -8, 3, -1, 22, -2, 6, 1, 20, -23, -14, -1, -2, -17, -5, 3, -12, -6, -4, 16, 5, -13, -26, -17, -24, -11, -4, 20, -17, -10, -38, -24, 1, 30, -3, 5, 18, -8, -2, 16, 7, 7, -12, -32, -9, 13, 19, -10, 17, -6, 6, -5, 28, -8, -4, 6, -5, 15, -4, 9, 5, -4, -7, 4, 16, -11, 19, -16, -28, 12, 17, -12, 22, 13, 13, -5, 28, -22, -16, -2, 22, -8, 3, 5, 8, 4, -2, 7, 26, 4, -3, 10, -15, 2, -4, 7, 5, 17, -4, 5, -20, -8, -16, 26, -17, -6, -23, -29, -16, -13, -15, 8, -25, -9, 25, -26, -8, -6, 2, -1, 3, 1, -9, 20, 22, 14, 8, 11, -10, 2, 15, 25, 6, -5, -10, -9, 29, -20, 5, -25, -11, -22, -9, -11, -10, 2, -6, -9, -28, -33, -10, -13, 10, -19, -32, 2, -21, -13, 3, 24, 6, -13, -8, 8, -10, 5, 7, 19, 15, 7, -4, -23, 5, -20, 31, 13, -17, -11, -25, 9, -16, 5, -3, 10]
7617A0Kkl2lM3k1J1l3J4lJ3lj8Nl1M0mj3M7mj9j4J8J5j8%j1M9j2rJ3j2k2Kj5Q
7653ioKLj9J4J3j6J4k9K6k8N8k4k3jL2pj1K1k2L6k0j3J4J8ok9L6Mj5m4M7l1J4
7687ajK3j9Rk1J6kj8mj2L2k1K8j9%J2j9K2k8J2qj1K5lJ0l6L2j0PK2k7J5Qk6K9
7722A6k1L3k9Kk2M5j0J8qk6J8jPk4MnJ3j9NJ4KJ0k7mj2L8k5%nrK4l4J2%MJqQj
7761a6k1K7LNNK0okj8L2k7j5O3l7k8J2Pk1MKJ0k2L5J2k8rOllJ7l7L0j1KjOlL0
7799B0Kl4nJ8pOqK4j9k4J9NJ2j5L0j8Qj0kJ7j5NJk2J0K0m8OJ6j7J0oJ4Pk6mL6
7836Fk1p%J3j0RJ1k4K1J4j8k0K5J5mLk6OK9l6J8Qj5Pl9J4K0K9k9k5mJ7J8j0kk8
7872c5J1J5J9k1NPj2OMj5NJ1j4QQj5pJ8j8J4LMJ0j2J1L0l1%j1J5PJ6m0J4oMJP
$$ y = [10, 12, 10, -22, -25, 18, -3, 8, -25, -11, -14, -1, -4, -22, -17, -48, -8, -12, -25, 22, 18, -1, -15, 3, 18, 0, 0, -11, 38, 26, 17, 30, 18, -4, -2, -17, -9, -15, -13, -10, -29, -15, -2, -18, -4, -33, -7, -35, 23, -1, -24, -25, 7, 0, -11, 10, -12, 24, 4, -9, 5, 23, 17, -12, 24, 28, 13, -31, 16, -15, -1, -2, 21, 2, 11, -10, 6, 4, -14, -18, -30, 2, -19, 9, -10, -10, 2, -17, 5, -23, -11, -19, -30, -5, -8, 2, -34, -2, -12, -5, 17, -10, 5, 13, -13, 16, -5, 28, -1, 1, -21, 24, 14, 32, 24, -2, 16, 15, 22, -2, 2, -3, 10, -9, -4, 10, 12, 22, -5, -9, -21, 17, -8, -8, -13, -22, 2, -32, -20, -20, -16, -15, -23, -15, -16, -37, -10, -7, -2, 3, 23, 17, 15, -3, 29, 2, -13, 50, 13, -15, -3, 4, -17, -13, -11, -1, -23, 12, 24, -4, -13, -7, -10, -13, 4, -33, -3, -14, -12, -13, -7, -10, 20, 22, -12, -17, 1, -6, 0, -8, 16, -3, -27, -8, -3, 9, -6, 24, 6, 14, 4, 2, 19, 4, 9, 10, -12, -2, 18, -30, -24, -8, -25, -15, -21, -7, 0, -26, -30, 6, -15, -22, -22, -9, -19, -10, 1, -23, -2, 12, -6, -26, -1, 14, 10, 13, -13, -7, 22, -14, 4, 12, -3, 4, -35, -21, -1, 28, -1, -26, -30, -13, 5, -5, -7, -35, -24, -9, 10, -11, -6, 1, -11, -5, -1, -16, -11, 0, -14, -6, 2, -13, -20, -2, -20, -6, -3, 1, 11, -1, 10, 40, 9, 9, -2, 13, 20, 36, -4, 10, 4, 8, 9, 16]
7910A6k7J3J4j3j1K4l5J9j1k5K1Roj2LJ8Pj0JJ3rk2N2l1NKj5j1K2JmJ4Jk8M5k8
7946Bj8J0lj9L7k6K4m1K8Plj5J3Qk3PK7l5J7Okrj7M1j6rK2k4J2j1K5l3oJ6L1j6
7982GJ5J1k7JKKJ3l8K5nj8J2Pk6NJ3J6j9K7m9L2j6J2kk9QjKK4k1K0l9K0jNJ2Q
8019HJ7j9j0QQj2pqL2l1K2k9K1R%k2M3j4j9rJ1Jj4nNK6k3nK7j8l3M0l9K1J4pl
8056a4J0j0K2k9M4j2nJK8l8RJ0roK5l8MOK8j0k4J8kk4J2Pk5RJ7l7M3k0j2M4m1
8091a9J5J4k5j2J6L%%K3opoL8l5K6j3j7K2j5j8MQK6k2nPj4LLK1m3Lj2K9oK9m1
8128b6%J3mLNjpJ2J5m9K6J8l7J3J4L2j5J5k7Jj1KJ4j7J4ql%K2Nk6%J7l4L0%j1
8165eK4l9QkJ1Qoj7J2j1Lk2K3nmJ6Ql2L6k2K1j7K1j9ML2
$$ y = [16, -11, 2, 16, 3, -8, 16, -19, 0, -11, -36, -15, -6, -12, -24, -21, -3, 4, -6, -5, 8, -1, -23, 29, -2, 3, 5, -10, -21, 1, 2, -2, 12, 13, -15, 30, 2, -16, -6, -9, -28, 9, -17, 7, -34, -6, 1, -2, -17, -4, 4, -19, -12, 15, -20, -3, 3, 1, -8, -25, 16, 0, -9, 13, -11, 1, -10, 15, -18, -24, -8, 23, 7, 22, 33, 6, 7, 9, 11, 24, -14, 11, 6, -12, 0, 7, -19, -14, -1, 15, -4, 23, -26, 6, -10, 2, 0, -29, -21, -22, -20, 4, -17, 3, -36, -16, -17, -12, 0, 8, 25, 6, -4, 4, 12, 0, -7, -15, 17, -14, 8, -21, 0, 9, 9, -13, 30, 16, -3, -12, -1, 0, -14, -19, -14, 12, -11, -16, 11, -7, -40, 0, -39, -18, -4, -11, -14, -4, -14, 8, -21, 23, 11, 6, 7, 35, -3, 6, 16, 7, 1, 26, -12, -8, -2, 26, 16, -8, 10, 8, -16, -4, 3, -22, -13, 4, -33, 10, -10, -22, 22, -19, -4, 10, -15, -27, -11, -8, -8, -8, 15, 9, 2, -4, 34, -1, 25, 12, -5, 17, 2, -16, -12, -4, 22, 0, -5, 2, -12, -9, -6, 15, -28, -25, -37, -8, -14, 15, -26, -26, -13, -17, -14, -9, -10, -17, -5, 10, -39, -13, 5, -32, -19, -5, 27, 12, 27, 0, 1, -10, -8, 6, -11, 3, -5, -8, -8, 14, 19, -7, -7, 10, -24, 6, 6, -5, 19, -20, -12, -14, -3, 5, -1, -18, -6, -17, -14, -36, -13, -18, -22, -6, 2, -30, 6, -16, 5, -12, 9, -10, -6, 26]
8191B6
##END NTUPLES=NMR FID
##END=
