##TITLE=1H_Pr 50-Eth'
 CDCl3
 8 sc, 
 23.09.2022
##JCAMPDX= 6.0         $$ Bruker NMR JCAMP-DX V2.0
##DATA TYPE= NMR FID
##DATA CLASS= NTUPLES
##ORIGIN= UXNMR, Bruker Analytische Messtechnik GmbH
##OWNER= root
$$ XWIN-NMR		Version 3.5
$$ Fri Sep 23 17:04:30 2022 Russian Standard Time (UT+4h)  she@DPX200
##.OBSERVE FREQUENCY= 200.1313499994
##.OBSERVE NUCLEUS= ^1H
##.DELAY= (6, 6)
##.ACQUISITION MODE= SIMULTANEOUS
##.ACQUISITION SCHEME= undefined
##.AVERAGES= 8
##.DIGITISER RES= 18
##SPECTROMETER/DATA SYSTEM= spect
##.PULSE SEQUENCE= zg30
##.SOLVENT NAME= CDCl3
##.SHIFT REFERENCE= (INTERNAL, CDCl3, 0, 15.7039)
##AUDIT TRAIL= $$ (NUMBER, WHEN, WHO, WHERE, WHAT)
$$ ##TITLE= Audit trail, XWIN-NMR		Version 3.5
$$ ##JCAMPDX= 5.01
$$ ##ORIGIN= Bruker BioSpin GmbH
$$ ##OWNER= she
$$ F:/spectra/data/she/nmr/H-F/1/audita.txt
$$ ##AUDIT TRAIL=  $$ (NUMBER, WHEN, WHO, WHERE, WHAT)
(   1,<2022-09-23 17:03:26.51 +0400>,<she>,<DPX200>,
      <created by zg, POWCHK disabled, PULCHK disabled
       configuration hash MD5:
       00 E9 B6 7A A2 85 ED C7 34 08 36 98 17 FE 4E 26
       data hash MD5: 16K
       1C AC E8 84 B0 AF 95 C5 75 FD 51 B4 ED D1 16 49>)
$$ ##END=
$$ 
$$ hash MD5
$$ BA F0 05 E4 E0 1D 4E 65 0D 3A D1 5C A9 85 F7 CE
##$RELAX= 
##$RELAX= 
##$RELAX= 
##$RELAX= 
##$RELAX= 
##$RELAX= 
$$ Bruker specific parameters
$$ --------------------------
##$DU= <F:/spectra>
##$EXPNO= 1
##$NAME= <H-F>
##$PROCNO= 1
##$TYPE= <nmr>
##$USER= <she>
##$AMP= (0..31)
100 100 100 100 100 100 100 100 100 100 100 100 100 100 100 100 100 100 
100 100 100 100 100 100 100 100 100 100 100 100 100 100 
##$AQSEQ= 0
##$AQ_mod= 1
##$AUNM= <au_zg>
##$AUTOPOS= <>
##$BF1= 200.13
##$BF2= 200.13
##$BF3= 200.13
##$BF4= 200.13
##$BF5= 200.13
##$BF6= 200.13
##$BF7= 200.13
##$BF8= 200.13
##$BYTORDA= 1
##$CFDGTYP= 0
##$CFRGTYP= 5
##$CHEMSTR= <none>
##$CNST= (0..31)
1 1 145 1 1 1 1 1 1 1 1 1 1 1 1 1 1 1 1 1 1 1 1 1 1 1 1 1 1 1 1 1 
##$CPDPRG= <>
##$CPDPRG1= <>
##$CPDPRG2= <>
##$CPDPRG3= <>
##$CPDPRG4= <mlev>
##$CPDPRG5= <mlev>
##$CPDPRG6= <mlev>
##$CPDPRG7= <mlev>
##$CPDPRG8= <mlev>
##$CPDPRGB= <>
##$CPDPRGT= <>
##$D= (0..31)
0 1.2 0 0 0 0 0 0 0 0.06 0 0.03 0 0 0 0 0.0002 0 0 0 0 0 0 0 0 0 0 0 0 
0 0 0 
##$DATE= 1663938205
##$DBL= (0..7)
120 120 120 120 120 120 120 120 
##$DBP= (0..7)
150 150 150 150 150 150 150 150 
##$DBP07= 0
##$DBPNAM0= <>
##$DBPNAM1= <>
##$DBPNAM2= <>
##$DBPNAM3= <>
##$DBPNAM4= <>
##$DBPNAM5= <>
##$DBPNAM6= <>
##$DBPNAM7= <>
##$DBPOAL= (0..7)
0.5 0.5 0.5 0.5 0.5 0.5 0.5 0.5 
##$DBPOFFS= (0..7)
0 0 0 0 0 0 0 0 
##$DE= 6
##$DECBNUC= <off>
##$DECIM= 32
##$DECNUC= <off>
##$DECSTAT= 4
##$DIGMOD= 1
##$DIGTYP= 9
##$DL= (0..7)
0 120 120 120 120 120 120 120 
##$DP= (0..7)
150 150 150 150 150 150 150 150 
##$DP07= 0
##$DPNAME0= <>
##$DPNAME1= <>
##$DPNAME2= <>
##$DPNAME3= <>
##$DPNAME4= <>
##$DPNAME5= <>
##$DPNAME6= <>
##$DPNAME7= <>
##$DPOAL= (0..7)
0.5 0.5 0.5 0.5 0.5 0.5 0.5 0.5 
##$DPOFFS= (0..7)
0 0 0 0 0 0 0 0 
##$DQDMODE= 0
##$DR= 18
##$DS= 0
##$DSLIST= <SSSSSSSSSSSSSSS>
$$ [...]
##$SUBNAM2= <"">
##$SUBNAM3= <"">
##$SUBNAM4= <"">
##$SUBNAM5= <"">
##$SUBNAM6= <"">
##$SUBNAM7= <"">
##$SUBNAM8= <"">
##$SUBNAM9= <"">
##$SW= 18.0517283424941
##$SWIBOX= (0..15)
0 0 2 0 0 0 0 0 0 0 0 0 0 0 0 0 
##$SW_h= 3612.71676300578
##$TD= 16384
##$TD0= 1
##$TE= 0
##$TE2= 300
##$TE3= 300
##$TEG= 300
##$TL= (0..7)
0 120 120 120 120 120 120 120 
##$TP= (0..7)
150 150 150 150 150 150 150 150 
##$TP07= 0
##$TPNAME0= <>
##$TPNAME1= <>
##$TPNAME2= <>
##$TPNAME3= <>
##$TPNAME4= <>
##$TPNAME5= <>
##$TPNAME6= <>
##$TPNAME7= <>
##$TPOAL= (0..7)
0.5 0.5 0.5 0.5 0.5 0.5 0.5 0.5 
##$TPOFFS= (0..7)
0 0 0 0 0 0 0 0 
##$TUNHIN= 0
##$TUNHOUT= 0
##$TUNXOUT= 0
##$USERA1= <user>
##$USERA2= <user>
##$USERA3= <user>
##$USERA4= <user>
##$USERA5= <user>
##$V9= 5
##$VALIST= <valist>
##$VCLIST= <CCCCCCCCCCCCCCC>
##$VD= 0
##$VDLIST= <DDDDDDDDDDDDDDD>
##$VPLIST= <PPPPPPPPPPPPPPP>
##$VTLIST= <TTTTTTTTTTTTTTT>
##$WBST= 1024
##$WBSW= 4
##$XGAIN= (0..3)
0 0 0 0 
##$XL= 0
##$YL= 0
##$YMAX_a= 8439
##$YMIN_a= -6762
##$ZGOPTNS= <>
##$ZL1= 120
##$ZL2= 120
##$ZL3= 120
##$ZL4= 120
##$ABSF1= 10
##$ABSF2= 0
##$ABSG= 5
##$ABSL= 3
##$ALPHA= 0
##$AQORDER= 0
##$ASSFAC= 0
##$ASSFACI= 0
##$ASSFACX= 0
##$ASSWID= 0
##$AUNMP= <proc_1d>
##$AZFE= 0.1
##$AZFW= 0.1
##$BCFW= 1
##$BC_mod= 2
##$BYTORDP= 1
##$COROFFS= 0
##$CY= 11.3945322036743
##$DATMOD= 1
##$DC= 2
##$DFILT= <>
##$DTYPP= 0
##$F1P= 2.36226072786647
##$F2P= -0.459571619588291
##$FCOR= 0.5
##$FTSIZE= 0
##$FT_mod= 4
##$GAMMA= 1
##$GB= 0.15
##$INTBC= 1
##$INTSCL= 1
##$ISEN= 128
##$LB= 0.24
##$LEV0= 0
##$LPBIN= 0
##$MAXI= 10000
##$MC2= 0
##$MEAN= 0
##$ME_mod= 0
##$MI= 1.114404
##$NCOEF= 0
##$NC_proc= 0
##$NLEV= 6
##$NOISF1= 3.799351
##$NOISF2= 2.8
##$NSP= 1
##$NTH_PI= 0
##$NZP= 0
##$OFFSET= 15.70392
##$PC= 1
##$PHC0= -17947.57
##$PHC1= 11.00069
##$PH_mod= 1
##$PKNL= yes
##$PPARMOD= 0
##$PSCAL= 0
##$PSIGN= 0
##$REVERSE= no
##$SF= 200.130013532006
##$SI= 16384
##$SIGF1= 3
##$SIGF2= 2
##$SINO= 400
##$SIOLD= 16384
##$SREGLST= <1H.CDCl3>
##$SSB= 0
##$STSI= 0
##$STSR= 0
##$SW_p= 3612.71676300578
##$SYMM= 0
##$S_DEV= 0
##$TDeff= 0
##$TDoff= 0
##$TI= <>
##$TILT= no
##$TM1= 0
##$TM2= 0
##$TOPLEV= 0
##$USERP1= <user>
##$USERP2= <user>
##$USERP3= <user>
##$USERP4= <user>
##$USERP5= <user>
##$WDW= 1
##$XDIM= 8192
##$YMAX_p= 0
##$YMIN_p= 0
$$ End of Bruker specific parameters
$$ ---------------------------------
##NTUPLES= NMR FID
##VAR_NAME=  TIME,          FID/REAL,        FID/IMAG
##SYMBOL=    X,             R,               I
##VAR_TYPE=  INDEPENDENT,   DEPENDENT,       DEPENDENT
##VAR_FORM=  AFFN,          ASDF,            ASDF
##VAR_DIM=   8192,          8192,            8192
##UNITS=     SECONDS,       ARBITRARY UNITS, ARBITRARY UNITS
##FACTOR=    0.0002768,     1,               1
##FIRST=     0,             0,               0
##LAST=      2.2672688,     0,               0
##MIN=       0,             -6762,           0
##MAX=       2.2672688,     8439,            0
$$ Real data points
##PAGE= N=1
##DATA TABLE= (X++(R..R)), XYDATA
0 0 0 0 0 0 0 0 0 0 0 0 0 0 0 0 0 0 0 0 0 0 0 0 0 0 0 0 0 0 0 0 0 0 0 0 -4 8 -8 8 -8 8 -8 8 -8 8 -12 16 -16 16 -16 18
50 18 -22 24 -25 30 -32 34 -39 44 -50 55 -63 72 -85 102 -125 161 -220 337 -653 3139 8439 -2620 -5774
73 -5774 1263 2513 -1795 -705 467 -1730 -1285 1659 102 -2747 -829 2485 531 -3173 -1767 2454
89 2454 1924 -1627 -1396 1295 1104 -60 823 884 -521 186 1459 -148 -1061 1281 1512 -1245 -1181 1053
107 1053 522 -764 -21 -225 -1570 -493 1143 -195 -1818 -590 972 354 -805 -445 721 805 -194
124 -194 -576 169 641 455 430 25 -611 268 1682 576 -1305 -348 1352 356 -1120 -401 474 -181 -733
143 -733 -390 -97 -29 -263 -494 -154 53 -250 -187 153 28 -71 352 192 -233 516 1011 -44 -561 618 969
164 969 -168 -409 342 305 -163 -150 -88 -223 62 8 -499 -518 -41 -37 -455 -459 -146 -30 -205 -223 93 358 89
187 89 -203 221 524 224 53 293 189 64 404 318 -171 98 542 -56 -514 125 288 -429 -450 28 -264
208 -264 -505 -102 8 -308 -313 -84 -100 -36 76 7 -97 -9 236 416 241 -22 223 544 222 -42 256 392
230 392 -57 -106 186 -52 -259 75 -9 -445 -263 90 -246 -457 -72 -118 -473 -217 173 -62 -301 30 178
251 178 92 73 193 219 178 218 241 193 157 189 264 82 -96 105 232 -161 -392 22 52 -392 -339 9 -180 -424
275 -424 -125 -78 -289 -92 97 -174 -135 220 146 -51 124 283 173 145 230 196 212 215 136 93 82 44 26 -23 -161
300 -161 -133 -50 -152 -301 -131 -88 -260 -268 -53 -142 -258 -59 24 -64 -6 173 104 78 202 246 71 213 297 151 56
325 56 205 134 11 47 66 -31 -103 -41 -104 -221 -170 -117 -185 -257 -156 -101 -136 -140 -62 2 -40 -18 80 174 74 80 221 208 96
354 96 229 254 63 104 244 57 -67 90 78 -182 -142 2 -160 -278 -110 -77 -277 -236 -68 -108 -213 -110 4
377 4 -24 -17 69 136 111 128 163 205 137 139 258 218 75 86 169 57 -31 6 -18 -144 -109 -51 -203 -230 -72 -139 -305 -155
405 -155 -24 -162 -197 23 23 -122 41 155 73 59 215 188 112 168 198 176 118 58 97 134 13 -86 0 -11 -119 -129
431 -129 -48 -186 -184 -33 -142 -244 -89 -27 -217 -95 70 -18 -71 130 112 11 129 233 66 83 187 157 52
454 52 114 159 65 -1 0 -19 -27 -96 -164 -78 -106 -212 -132 -88 -197 -140 -27 -95 -189 7 94 -27 -23 137 127 34 130 185 116
483 116 148 210 123 45 103 111 9 -28 -13 -46 -45 -86 -161 -150 -99 -97 -126 -192 -155 -51 -41 -135 -80 41 18 -10 69 147 79 105
513 105 166 120 54 162 246 47 -48 118 197 21 -163 -61 10 -89 -153 -140 -133 -135 -121 -105 -177 -162 -79 -3 -41 -111 -28 101
541 101 80 17 50 183 241 68 32 177 254 94 40 100 79 7 -1 31 -80 -163 -70 -27 -144 -259 -122 -18 -113 -219
567 -219 -135 -11 -74 -76 44 27 -36 60 153 100 60 111 172 158 117 58 124 162 25 -81 29 122 -63 -190 -76 -3 -131
594 -131 -196 -110 -121 -174 -83 -25 -89 -129 -54 88 40 -55 5 181 146 14 121 227 84 56 159 106 13 22 113 -19 -68
621 -68 5 -6 -91 -121 -167 -145 -47 -106 -209 -159 -6 -49 -64 -55 -37 16 49 90 56 72 140 131 111 104 101 140 111 1 32 117 64
652 64 -89 -59 16 -58 -106 -118 -118 -149 -82 -116 -138 -97 -45 -66 -76 -27 9 14 48 122 98 87 106 131 128 116 134 69 71 61 53 38 -22
685 -22 -44 -40 -44 -108 -99 -74 -121 -134 -108 -67 -88 -124 -61 -21 -73 42 71 16 48 112 135 55 109 124 77 94 122 86 46 16 50 20
717 20 -39 -78 -50 -53 -107 -123 -79 -95 -124 -105 -75 -97 -97 -3 -22 -45 2 70 36 50 64 101 106 137 78 102 109 82 31 10 19 4 -9
750 -9 -55 -36 -65 -100 -96 -85 -105 -98 -88 -81 -108 -66 -31 -39 0 20 39 73 73 74 66 120 105 89 97 81 92 83 73 35 39 -5 -23 -46 -55 -120 -83
787 -83 -62 -122 -136 -96 -75 -76 -99 -57 7 -17 -11 36 57 67 89 91 87 81 117 132 64 63 86 29 35 5 -28 -43 -21 -62 -107 -102 -74 -114 -114
822 -114 -104 -62 -72 -85 -43 -7 -29 -27 7 53 18 52 99 93 46 114 91 65 46 81 31 25 36 15 -2 -43 -31 -108 -78 -85 -108 -101 -107
855 -107 -94 -77 -72 -33 -20 -35 -15 1 44 36 33 82 96 94 109 105 93 68 67 97 40 17 26 -9 -39 -48 -45 -72 -70 -84 -103 -107 -81 -73 -76 -56 -26
892 -26 -21 10 16 38 19 55 84 110 72 75 123 96 73 35 37 44 9 -22 -2 -47 -79 -66 -50 -97 -93 -75 -94 -81 -69 -33 -52 -42 -8 -22
926 -22 9 40 46 35 81 84 65 50 70 98 95 37 42 35 9 4 4 24 -63 -80 -43 -83 -108 -52 -47 -89 -85 -33 -63 -17 -33 -52 -2 19 11 25
962 25 72 78 73 86 122 95 73 64 82 58 42 15 9 -10 -35 -68 -47 -80 -78 -65 -75 -88 -96 -52 -57 -47 -61 -13 -18 -9 27 57 57 53 67 79
998 79 73 69 67 58 39 44 29 50 18 -43 -37 -39 -55 -50 -50 -93 -70 -41 -99 -89 -36 -6 -65 2 23 -17 10 66 35 72 80 44 56 86 73 55
1034 55 93 51 12 22 18 -3 -4 -38 -29 -62 -43 -77 -97 -69 -48 -53 -52 -37 -27 -10 17 45 -9 41 51 67 48 96 95 62 70 62 72 46
1068 46 49 3 34 -8 0 -36 -53 -56 -87 -51 -46 -91 -140 -74 -37 -78 -55 -33 -2 13 4 19 19 37 49 82 104 65 47 80 89 49 47 47 22
1103 22 0 -3 -16 -23 -57 -53 -73 -65 -39 -94 -58 -51 -46 -41 -19 -17 -31 -1 30 33 32 28 67 81 96 60 59 66 22 34 55 22 -17 -4 -2 -19 -40
1140 -40 -52 -95 -71 -91 -33 -61 -52 -37 -37 -25 -1 -11 19 24 23 39 68 80 36 51 62 70 51 45 41 42 43 -8 -2 10 -29 -54 -57 -27 -50 -54
1176 -54 -81 -50 -69 -3 -29 -26 -41 4 7 11 38 12 33 84 58 31 67 90 54 58 33 37 7 15 11 -19 -16 -46 -52 -49 -37 -69 -58 -57 -82 -60
1212 -60 -53 -55 -20 -17 15 11 10 32 24 65 57 40 77 60 73 29 58 43 15 14 15 4 -20 -17 -42 -54 -46 -71 -52 -62 -22 -56 -62 -38 -8 -33
1248 -33 -11 21 -11 -2 67 59 38 68 69 37 58 27 41 41 16 18 8 16 -48 -57 -46 -46 -38 -68 -34 -41 -68 -33 -27 -2 -34 7 20 21 25 21 40
1285 40 59 27 37 63 59 43 49 31 5 22 41 18 13 -21 -53 -49 -17 -52 -53 -25 -35 -49 -39 -37 -12 -21 -28 -4 5 27 29 35 51 37 28 58
1321 58 49 34 70 56 39 10 32 32 15 -33 -32 -52 -85 -70 -36 -89 -45 -34 -37 -45 -48 -41 -30 17 -6 -6 40 49 41 36 45 52 68 67 62 46 54 43
1359 43 7 9 31 3 -29 -7 -30 -51 -65 -55 -39 -65 -83 -51 -31 -47 -29 -16 22 -18 -4 32 15 21 18 45 65 28 37 66 57 5 2
1392 2 43 9 -4 -5 4 -41 -15 -28 -54 -62 -48 -51 -16 -18 -33 -19 -15 0 17 -1 16 -13 19 34 45 46 42 44 34 34 25 20 35 47 14 -3 -15
1429 -15 -8 -18 -44 -74 -60 -29 -80 -46 -24 -51 -2 20 25 -12 32 43 43 15 58 39 34 40 21 88 12 18 25 52 -2 -3 -2 7 -16 -63 -79
1464 -79 -32 -64 -85 -52 2 -47 -57 -29 -1 -5 -12 18 23 2 10 38 51 44 60 39 48 33 50 24 34 -5 -27 -5 -35 -25 -42 -13 -46
1497 -46 -68 -50 -23 -38 -69 -58 -28 -17 -1 -4 4 -15 15 15 42 51 35 46 47 55 37 32 27 17 17 -12 -3 -23 2 -28 -17 -18 -52 -55 -48 -34 -25
1534 -25 -50 -11 -43 5 -3 16 22 -1 23 60 74 26 30 18 60 36 46 41 12 25 -29 7 12 -27 -33 -41 -27 -11 -56 -43 -37 -57 -29 4
1568 4 -24 -32 -6 8 11 -2 12 5 56 54 8 35 55 32 7 23 45 -23 2 -15 -13 -35 -15 -52 -58 -42 -59 -67 -62 -64 -58 -17 -5 -25 -8 -5
1604 -5 21 -7 12 49 32 36 32 38 44 39 21 51 39 48 6 22 -8 -33 11 7 -31 -32 -39 -52 -28 -23 -25 -26 -37 -5 -23 13 -17 -14 3 19 0
1641 0 25 55 33 44 18 54 44 1 -1 10 -8 13 -12 -29 -34 -34 -65 -57 -20 -61 -50 6 -21 -53 6 -24 -3 -2 8 15 23 40 13 39
1675 39 43 31 45 72 3 17 13 20 -6 8 -26 -37 -53 -23 -26 -35 -43 -32 -60 -25 -22 -11 -14 -61 -23 6 10 32 24 13 47 17 41 48 63 30
1711 30 36 4 5 9 16 -17 -39 -9 -7 -44 -50 -34 -36 -18 -28 -49 -15 -14 -11 -31 13 25 23 33 17 33 47 39 24 53 31 37 12 30 35 21 -4
1748 -4 -23 -21 5 -6 -14 -17 -43 -34 -36 -34 -36 -26 -37 -44 -47 -17 3 -15 35 37 20 41 8 38 26 -5 54 35 23 41 3 21 28 -17 -10 -5 11
1785 11 -43 -33 -20 -20 -32 -12 -14 -34 -33 -33 1 -25 -2 -3 -12 -4 16 41 36 29 19 42 20 33 42 33 15 34 -5 7 -11 -9 -28 -13 -31 -9
1821 -9 -22 -40 -25 -8 -28 3 6 6 3 -2 6 17 8 17 43 25 51 41 24 31 29 21 5 -1 -12 -15 10 -29 -29 -2 -25 -44 -27 -37 -23 -54 -4
1858 -4 -10 8 -31 -21 23 22 22 41 45 52 50 19 38 32 8 13 13 -3 -1 13 -15 -11 -6 -25 -23 -8 -22 -31 -6 -25 -37 -27 -33 -14 2 -28 19 -9
1896 -9 18 34 27 43 42 51 29 39 25 51 49 24 0 -9 17 10 19 -33 -25 2 -10 -28 -31 -27 -20 -15 -12 -30 -14 -20 11 27 32 11 21 31 32 21 42
1935 42 31 28 42 22 26 13 3 6 6 -9 -8 -9 -19 -32 -30 2 -16 -8 -23 -8 -8 -9 -12 -11 5 -16 34 56 11 19 51 31 9 11 18 8 -8 -7
1973 -7 -4 -26 -19 -17 -1 -41 -32 -19 -42 -49 -13 -35 -52 -6 2 -32 -5 6 -13 11 16 42 21 36 64 29 36 40 46 12 39 25 12 -7 -3 -17
2009 -17 -17 1 -36 -30 -38 -40 -26 -39 -35 -33 -25 -5 6 8 9 36 30 22 31 10 45 40 16 50 54 -2 40 9 41 -17 -10 5 7 -19 -3 -15 -45 -7
2047 -7 -14 -5 -5 6 -39 -1 -6 0 -6 26 26 31 35 33 36 24 33 31 45 43 -5 47 34 -1 23 2 10 -8 -31 -24 -8 -28 6 -4 -45 -29 -32 -22 -9
2086 -9 -9 -6 17 24 21 9 28 16 2 61 23 40 19 39 26 14 4 10 -4 8 -18 -12 -15 -47 -39 -33 -3 -44 -40 -23 -2 18 6 17 5 8
2122 8 38 32 30 47 29 21 30 21 -7 43 33 33 47 5 -15 9 -12 -14 -21 -5 -6 -15 -21 -31 -8 -28 -16 6 -10 9 18 -6 27 25 32 30 31 33 18
2161 18 15 39 6 25 3 11 25 18 -17 -23 -17 -4 -29 -29 -11 -24 -37 -23 -20 -7 -4 -25 15 21 -4 14 12 13 19 5 20 6 -8 16 39 2
2197 2 37 2 4 4 14 13 8 16 0 -24 -35 -19 23 -4 -8 -16 -10 -2 -5 9 40 1 -2 21 28 -3 23 41 -10 40 -2 12 24 4 -1 10 15 -6
2235 -6 -14 -29 -45 -30 -10 -15 -33 -40 -19 6 -14 -2 2 -10 55 22 -5 4 40 12 35 13 25 45 20 17 7 11 13 3 -9 17 -5 -42 -26
2270 -26 -7 -39 -23 -28 -9 -12 0 -10 -12 30 -2 2 32 19 30 11 43 50 23 17 36 36 26 35 17 26 26 3 27 -14 -4 -24 -29 -50 -42 -33 -2
2307 -2 -13 -30 3 -13 6 -18 -4 -1 -2 1 -5 20 6 26 16 23 32 19 -7 -3 1 5 -6 -3 9 -37 1 0 12 0 -5 -3 -27 16 -6 6 9 6
2345 6 15 3 6 -2 26 30 19 16 -3 3 24 3 -16 -24 -13 2 -3 0 7 -1 -22 -20 -17 -28 5 -38 1 -25 20 -2 6 -6 -32 18 12 18 12 23 20 38
2385 38 28 22 5 16 14 -11 -2 4 19 -9 -14 -6 -32 -19 -24 -42 -48 -27 8 -6 -8 -19 -21 -1 0 23 17 13 26 30 14 27 -8 8 63 15 20 -4
2423 -4 32 -3 24 18 -22 1 -27 -25 -33 -30 -54 -28 -9 -24 8 -27 -11 -17 9 1 -35 14 11 -2 19 42 -1 10 30 34 -1 49 -10 13 9
2458 9 3 -3 -6 -12 -5 -17 -5 -21 -14 -26 0 -17 6 -7 -28 16 -17 -2 19 13 9 5 -13 8 31 8 22 12 18 4 1 -11 20 5 -23 -7
2494 -7 -24 -10 -15 -16 0 -36 -7 -14 -18 6 -9 -12 -2 8 15 25 33 6 18 34 -3 4 40 18 6 5 -6 -14 -24 -1 -2 2 -15 -37 -21 -26 -6
2531 -6 10 -17 -20 -19 -28 -24 17 6 24 6 -19 18 7 5 39 11 34 14 -20 2 37 -24 22 -18 -11 16 5 -1 -14 -29 -2 -14 -26 -25 -31
2566 -31 -22 -19 -8 0 -16 6 24 2 10 -16 24 -13 30 8 28 27 17 26 16 -7 4 4 -1 7 -3 3 1 -10 -11 6 4 -30 -17 -15 12 -1 14
2603 14 -10 12 9 -11 -5 -12 -2 14 25 26 15 29 1 22 -2 6 -20 19 0 -12 11 14 -5 -24 -19 8 -9 -16 3 3 -19 15 18 16 16 15 15
2640 15 10 22 6 31 21 17 27 37 5 25 -6 1 -27 -4 -10 4 -18 5 -45 -33 -17 -8 -2 -18 -7 3 18 -8 -3 14 10 12 20 39 18
2675 18 12 -8 9 23 10 12 -16 -6 9 2 -18 11 -33 -9 -30 -20 -23 -3 -21 -8 1 -31 -19 14 5 9 23 21 4 -5 -9 8 -2 7 4 1 16
2712 16 -11 35 16 -4 5 23 10 17 -5 -32 -5 -10 -43 -6 4 -36 -33 -20 -7 3 -1 -1 -23 -8 11 27 22 15 6 20 5 54 4 -5 -3 3
2748 3 4 14 -7 9 7 -28 -25 -5 -3 -9 18 -13 -25 19 6 2 3 -3 14 19 22 11 24 14 17 10 31 21 -5 -9 22 1 -23 16 -2 -14 -4
2785 -4 -2 -43 -22 4 -16 24 27 -18 -27 27 20 -27 2 31 17 28 6 12 17 4 29 12 36 19 -18 -7 -5 17 -12 -27 -26 -32 -17 -24 -13 -7
2821 -7 -7 -18 -26 -10 -8 9 -12 -11 11 13 8 5 28 10 17 -10 27 2 24 16 -4 1 14 18 5 15 5 -9 13 4 -25 -12 3 10 -19 -7 -17
2858 -17 0 3 11 9 -17 -3 -8 -17 -8 11 13 -8 20 -4 -9 2 16 27 29 -18 26 -34 -12 -29 -14 -20 -20 -4 -3 -15 -8 -5 21 -16 2 5 -2 -4 11
2897 11 9 4 26 -9 13 -11 10 -9 20 34 -5 -5 2 4 -23 -15 -21 -34 -19 1 0 -28 -18 -28 5 7 0 8 38 1 -13 12 -16 18 26 12
2933 12 31 -6 18 9 9 14 8 10 -2 -31 -9 -22 -16 -23 -27 -14 -36 -21 -45 -11 -11 -12 -23 -12 19 5 5 17 36 9 -8 17 6 9 -3 36
2969 36 8 34 12 -18 7 -13 21 -16 -12 -42 -10 -4 -7 -19 -18 -18 -14 6 -12 9 -18 -10 0 -5 -1 -9 4 33 7 -4 25 34 -6 29 11 12
3005 12 -19 8 0 -4 -1 -3 -3 12 -13 -4 -24 -7 23 -23 35 -24 -12 3 -2 8 -1 7 11 15 -2 -7 25 12 0 -1 11 -34 -25 -13 0 -6 -10 -12 -11
3044 -11 -21 -12 22 21 4 14 7 -3 -12 -17 -7 12 -2 1 -12 8 -15 14 30 -17 0 -5 -19 1 18 -17 12 -12 -22 -32 -29 -9 -15 -22 2
3079 2 -6 -10 -8 -10 -3 19 -3 2 -8 32 16 -2 7 -8 22 -2 11 20 13 17 16 3 -18 5 25 18 15 -5 -8 -13 30 -12 -21 -8 4 -10 -10 7 13 -38
3119 -38 11 -5 11 19 -6 -2 9 12 23 17 24 2 24 7 -12 10 -27 -7 -1 11 23 30 -9 15 -22 -11 -17 15 7 -24 -6 23 -2 15 1
3154 1 -10 -3 2 6 26 34 -6 1 -3 23 11 -10 9 -7 -24 10 8 -1 -19 -9 13 -29 -2 2 -7 -15 -8 -4 19 6 17 26 7 22 0 -5 1 2 -12
3193 -12 13 -16 3 2 3 -9 -3 5 -22 -9 -11 0 -18 -22 -22 2 8 11 7 -5 -1 -23 10 2 28 8 35 2 0 24 1 -4 6 20 26 8 19 -5
3231 -5 -6 14 13 18 -19 3 -37 -7 -30 -17 5 8 -1 -5 -9 -22 -3 -10 -6 -18 15 -5 -10 -11 13 -2 25 10 -9 3 -1 16 -16 -17 36 8 -2
3268 -2 -8 -11 -19 -11 -8 -12 -4 2 0 -36 3 -4 10 -16 15 -18 8 -16 -19 -13 -9 19 -14 5 -8 36 -2 -2 -3 -11 13 -4 -8 17 -9 -12 -5 10 0 6 4
3309 4 15 7 13 -6 17 4 -3 8 10 -8 4 -1 -1 -5 -6 -4 0 13 5 -17 -4 -64 -20 -4 -11 -13 -5 6 -12 -29 -6 21 -19 3 -12 9 19 6
3347 6 -9 -2 25 -5 25 -4 -15 12 8 -4 8 8 -17 23 -4 -2 -14 -9 -22 6 -15 -11 -1 -14 7 -10 -40 -7 5 3 -17 -10 4 3 -12
3382 -12 12 16 -20 14 -5 18 21 13 -7 9 1 -5 -5 18 3 10 -8 10 -8 -3 1 -10 3 18 -3 17 -10 -18 5 20 0 -23 11 -1 17
3417 17 1 16 25 4 20 -1 0 18 28 8 -5 -1 3 0 -11 -13 -19 3 -15 -3 14 1 -27 14 -8 9 8 -1 -7 -7 -2 -2 11 -16 27 -12 -23
3454 -23 3 -12 -3 -15 -11 -8 -6 -25 -6 -6 -5 -11 -8 -21 -22 2 -3 1 16 3 2 28 44 19 44 10 14 16 -10 23 36 12 -40 -18 14 18 -12 0
3492 0 31 -1 -2 -7 -2 -2 -14 -14 -25 2 -19 16 8 10 -13 27 23 -18 6 42 10 20 10 9 -16 0 9 -7 24 13 2 2 18 1 6 9 -8
3529 -8 -3 -25 -24 6 -9 -6 -13 7 -17 25 -9 14 -20 14 -18 -1 2 19 0 -10 24 38 13 17 -4 -14 -6 -8 -27 -5 23 -4 -23 12 -7
3564 -7 -17 -11 4 13 1 8 7 34 33 7 -8 14 25 8 2 17 7 1 -8 -16 18 -17 26 -18 0 -24 -14 -10 -7 -11 -9 19 -8 -13 10 7 -4 12
3602 12 22 21 18 -14 1 20 32 23 -10 16 8 22 -11 -21 -4 0 -23 13 9 15 8 -2 -19 5 23 -42 -11 -28 -29 0 -3 2 -13 8 8 1 -3
3639 -3 0 13 28 3 16 -4 13 27 2 7 21 24 35 -8 6 -17 -9 19 -3 -8 -24 -21 -34 -4 -1 -11 -3 -8 -9 -29 -25 -7 22 3 12 -9 -5
3676 -5 -18 1 2 30 17 18 15 4 10 -1 -42 -4 8 7 -32 3 -5 13 -20 20 -34 -3 21 6 6 6 5 -2 19 25 5 -16 -4 31 10 2 8
3713 8 -12 -10 -19 -11 -16 -5 -34 -2 5 -5 16 6 1 24 -6 -5 -8 8 3 9 11 6 7 28 -3 21 16 12 -1 20 -3 -13 -1 21 -4 -10 -16 -12 -16 -28
3753 -28 -10 -17 -8 -7 -6 -2 -13 -11 -3 4 7 -4 -1 15 7 -8 10 45 19 0 26 -2 -4 7 -27 28 4 -16 31 -9 -2 14 5 -3 12 -26 -11 -5
3791 -5 1 -14 -7 -5 6 14 13 22 0 14 10 4 26 1 0 -11 -22 3 -9 -3 -17 10 8 -23 -6 -6 -18 -14 8 16 -10 -2 4 -14 -11 16 12 0 2 -4 1
3832 1 9 22 12 4 5 -4 11 17 -5 12 -7 -6 -6 -35 -16 -8 -9 -5 7 10 4 3 -20 -11 -3 -27 7 18 0 13 -18 -4 13 -3 3 13 -10 -4 -4 15
3872 15 -9 -26 -22 0 18 -14 11 5 3 -6 4 -27 -3 -9 -6 -40 -9 12 -21 -10 -8 9 -21 10 -2 -5 -11 7 18 -4 19 -1 -2 24 16 23
3908 23 19 -19 11 -1 -18 -17 -46 3 -17 -17 -12 -27 -29 -10 2 16 5 13 6 -3 10 -8 -8 14 1 -3 -18 -12 16 4 31 -3 -6 -3 -4 -2 8 7
3946 7 -3 -15 19 -5 29 -6 6 12 10 -6 -3 -34 20 14 -13 -13 -8 14 -12 -8 11 14 -19 0 -6 12 -32 15 -15 -36 -22 3 9 25 11 5
3982 5 -8 -44 9 -12 -5 -10 5 -17 -18 17 -1 19 5 12 13 13 9 23 2 9 12 20 -13 3 2 -15 8 10 2 -10 13 -25 -9 2 -18 20 -5
4019 -5 -11 14 -11 -9 -27 12 24 25 49 3 23 30 3 19 26 15 8 -7 -6 -7 4 -30 -38 7 22 -26 -5 11 -5 12 -22 26 19 -5 5 7
4055 7 3 -4 -8 5 21 8 10 10 10 -29 -4 21 33 2 31 4 4 16 -6 3 -12 0 -8 -2 -32 -4 -5 5 5 -9 -25 -23 -16 -6 4 -3 -29 26
4093 26 -21 5 0 3 18 -23 0 -12 10 -3 16 -1 -11 0 -5 -7 22 -12 1 -5 -14 23 12 11 11 15 22 25 6 -1 7 24 24 26 0 18 -2 -20
4131 -20 -1 -11 19 26 -2 -21 -4 -22 -3 -2 -7 -4 32 -8 -30 12 32 -1 -5 -11 8 16 24 7 26 -4 -31 18 13 12 -9 2 -15 20 -3
4166 -3 -15 -11 4 -23 -1 5 -22 -6 -15 -4 15 -19 0 3 -5 -22 -33 -1 -19 -1 5 -14 1 -1 15 30 1 4 13 0 -3 21 11 -1 32 7
4202 7 2 12 -4 10 -4 -14 14 -19 18 23 3 8 0 -17 -14 -2 9 10 4 22 -3 19 0 -2 -3 22 35 4 7 6 14 -3 0 2 19 -33 -14 -11
4240 -11 -24 -13 2 -4 -12 1 3 39 32 8 -17 -2 8 -1 -22 1 12 10 -11 -14 -4 -39 -31 -27 -5 -3 -31 -18 6 -41 -10 -2 -34 0 -14 13
4276 13 -29 -8 -10 6 -15 4 -13 27 18 31 -5 -4 1 5 12 -11 30 -7 2 -9 5 -11 1 11 1 -30 -28 -16 5 -39 -26 -3 -4 2 -11
4311 -11 -11 -21 3 -13 -14 4 -5 13 31 -13 14 20 14 3 -6 -4 35 9 9 10 -6 8 9 2 16 5 22 -10 20 0 21 -10 -9 -18 1 -1 -32
4348 -32 2 7 7 7 10 -27 -21 6 8 19 15 -8 -16 -22 28 -4 20 1 -16 17 29 -30 19 0 -15 -8 3 -10 19 8 12 -8 -22 -1 21 18
4384 18 26 0 -1 9 9 15 -7 -18 -1 10 -13 -12 -2 -24 -6 -19 1 26 6 8 2 7 -12 -19 5 14 14 17 -6 0 23 21 49 -10 -26 -9 -15 -7
4422 -7 -7 -12 -12 16 -9 -10 3 14 -17 -12 8 -4 4 0 0 -8 -8 -23 -13 -2 -20 -8 -5 -25 10 1 26 19 4 21 25 -21 2 2 11 9 11 -10 -8 19
4462 19 17 17 23 -15 -3 -17 -23 -4 -24 6 -1 7 -3 -9 -7 17 -14 17 -13 5 -11 11 -17 19 0 -17 15 2 18 -5 -16 25 -20 -5
4496 -5 2 -2 1 -2 18 -10 -5 -11 15 -26 -12 -14 -11 -20 -13 -3 -18 13 -3 -13 -26 19 18 -19 18 -3 10 11 -5 -20 -13 0 -1 5 35 -9 14 19 -10
4535 -10 27 0 -13 -19 19 24 3 0 14 -8 -8 -20 -1 2 -30 -1 7 2 25 -2 21 -16 -5 -11 6 23 -23 -9 -30 -6 -2 -29 -2 -2 -11 22
4571 22 19 1 16 42 13 2 9 26 13 -4 29 -14 2 1 4 18 5 11 8 -16 -25 -6 -17 -18 -11 -12 -16 -5 -3 5 -16 11 15 -24 8 10 9 -17
4609 -17 15 17 -38 16 -20 -6 14 18 -4 -11 1 9 5 34 -10 -1 -16 22 -3 0 -5 9 7 5 22 24 13 -3 3 -13 -11 -23 11 17 22 6 -15 -9
4647 -9 19 4 -17 -9 -4 -14 0 -8 12 -38 24 -1 14 -15 17 12 -7 15 42 2 -10 -8 1 5 16 8 -19 13 2 0 -3 21 0 4 -24 -16 -15
4684 -15 -39 2 25 0 4 -4 7 -2 -43 -19 -15 2 -9 0 10 -2 32 6 -37 -10 16 0 -4 4 -1 -6 -11 -7 9 -14 -33 3 -2 21 10 -24
4720 -24 -13 17 9 -13 -12 -6 -12 14 5 -21 7 15 4 -10 6 0 -14 -14 13 6 -5 13 -2 41 -16 -2 35 9 -10 -5 13 10 13 19 -6 16 -15
4757 -15 -4 -15 -58 9 -6 -7 -21 -1 -14 6 -6 2 9 15 12 -6 3 30 -24 8 23 -16 -10 16 2 -11 -18 -2 14 -11 9 11 6 8 46 -1
4793 -1 16 23 10 -34 18 26 14 -4 14 16 -25 7 5 6 -5 -16 17 -15 -11 -17 -33 -15 -42 14 -4 -9 -5 -23 -10 -7 4 -13 -13 15 -10 12
4829 12 7 -12 -5 -1 -13 6 20 10 15 0 18 25 2 0 10 -5 0 11 1 -6 -2 18 1 -8 -15 6 -36 4 -2 -7 -17 -17 -4 -18 -13 -2 -10 9
4867 9 -9 1 2 23 -3 22 13 15 17 4 5 -9 35 -16 18 27 -14 -7 -14 2 12 -5 23 0 -21 -26 -2 -2 -12 -2 -13 0 -20 0 -3 15
4903 15 -6 -18 19 12 -12 -7 -18 8 -9 -17 -8 -33 0 2 0 9 18 -1 -6 3 -11 13 12 6 -3 -36 1 1 7 -17 -18 -14 -5 -26 10 -9 -47 -3 -10 -6
4943 -6 -17 -7 25 -37 -8 -20 -14 -38 -22 -13 -22 16 6 -10 -6 11 -18 -5 6 -6 11 29 0 7 -22 6 16 26 -27 9 -6 -2 -6 11
4977 11 -16 -2 -5 -38 -1 0 -31 -8 9 -31 5 -13 -27 -1 24 -23 -7 25 8 -11 8 2 3 16 -3 -4 12 1 19 1 -4 -8 -7 1 2
5012 2 -15 -8 4 -21 3 4 -12 -28 -18 -7 0 -16 19 -18 -17 2 10 1 5 -22 29 1 -2 -13 -15 15 14 6 -10 11 8 -21 5 2 -15 18 15 16
5050 16 -18 6 7 10 5 -1 32 -20 5 32 15 5 -2 -15 12 17 11 -18 7 -25 -15 15 15 15 -24 11 0 -29 -3 -12 14 1 -6 14 18 27 4
5087 4 -11 -13 18 10 1 1 -6 -15 4 -13 -28 -2 14 -18 4 -7 -10 39 -5 9 7 -10 -3 -15 21 -21 -12 -4 23 -1 -1 -22 -21 -4 -7 7 -8 7
5125 7 15 10 21 19 22 23 1 18 -5 31 9 12 -9 -21 13 18 1 -33 -13 -15 29 -12 0 -9 3 -6 -12 2 14 -14 -15 2 4 3 -17 11 -22 7
5163 7 36 3 16 -1 3 7 -14 9 -8 14 -3 -9 7 -24 -14 2 -1 18 11 -16 14 2 11 -1 -1 -19 -2 -19 2 6 -18 -30 28 -8 -25
5198 -25 -4 -18 26 1 -6 -33 -1 -6 9 -12 -16 8 -2 -10 4 -4 -28 -5 -11 14 10 10 18 -10 52 8 25 9 23 21 6 -1 -28 -3 0 -4 -5
5235 -5 17 -3 0 4 -18 21 0 -5 2 17 -25 7 -21 11 7 10 14 -12 9 9 32 20 27 36 21 20 -2 14 -19 22 -19 8 -15 -10 9 4 4 28
5273 28 19 2 17 -27 -7 -17 7 -2 -9 -13 -3 -23 1 -6 23 -8 3 32 0 -18 -6 0 -4 8 6 1 19 7 32 0 8 -22 -15 9 18 31
5309 31 -9 10 9 -2 4 -34 -26 -9 -12 15 -21 18 -25 -6 -1 -8 2 -11 -5 -19 1 -8 -2 -15 -34 -10 20 25 -2 -16 -18 9 30 4 27 3
5345 3 8 22 -3 28 11 20 21 7 5 6 -3 10 15 -39 -21 0 5 -18 -10 -10 -16 -20 -1 -6 -7 13 5 13 7 16 -5 -23 -18 17 25 11 0 -15 42 29 4
5386 4 0 3 -9 -34 0 -4 9 -2 24 3 21 -35 8 -3 -8 -20 8 10 -28 5 6 -5 6 6 -13 22 -1 20 -8 7 4 -24 -12 -12 21
5421 21 3 -15 -15 2 9 15 13 34 -18 17 -4 -13 -3 27 2 7 7 19 5 -1 -25 7 -5 -8 -10 -22 -12 2 0 -12 9 -14 -13 -30 9 -9
5457 -9 -3 6 20 -30 0 -20 -20 -27 -11 6 20 20 -3 23 -1 0 24 4 -14 5 -16 8 -2 -17 15 1 6 -2 -13 -7 35 3 -33 -8 -26
5492 -26 -19 -3 -15 -17 -21 -15 -30 -5 -5 -15 16 -9 -2 1 -19 4 10 2 -15 5 3 -4 -11 10 10 -1 -7 -16 31 3 13 -34 -4 14 7 -2 2 20 1
5531 1 -1 7 -28 -11 11 -1 -4 18 4 4 -23 -10 -7 0 20 13 6 -13 27 7 14 1 -17 4 -14 -6 -4 3 3 12 -24 19 -7 15 8 21 25 -28 31
5570 31 1 -11 -22 -5 -6 -27 -14 3 -6 -4 -5 -16 -34 -5 -2 6 10 -2 -8 13 24 8 -2 14 -17 24 -1 6 -1 -1 -14 15 -27 6 -2 13
5606 13 -7 -10 9 6 -20 -10 4 -23 -13 27 0 -5 29 -8 -10 -27 -23 0 -11 13 -14 -31 -7 -4 -5 5 3 13 -20 4 13 9 8 -8 1 6 4
5643 4 18 5 -11 16 12 -8 -5 8 19 2 -7 0 2 2 -9 16 -9 6 -21 6 -2 -18 15 -19 -2 -21 -33 12 -5 1 30 3 -7 -19 4
5678 4 -2 14 -12 16 19 16 -4 -12 18 10 -15 -12 6 18 35 -13 -13 -3 -12 -10 4 -2 -27 3 -9 9 -1 -5 -44 6 -2 2 -6 5 -6 -24 13 -4
5716 -4 -9 9 6 4 -3 16 -2 -10 -5 -2 3 -32 14 3 -22 -19 1 -14 -3 21 -4 23 4 14 -8 -13 -10 -17 -2 2 -3 40 5 -9 1 19 -31 -4
5754 -4 -10 -9 -8 11 1 18 16 6 -5 -4 6 8 -11 1 -15 20 10 -7 -18 20 -4 6 9 8 4 -4 4 -16 -5 -10 -19 13 -10 -33 -19 -10 -10 5
5792 5 3 -39 -11 -14 1 -21 2 -14 0 4 1 -33 -9 14 -15 8 17 -11 -2 17 16 -1 -4 27 39 -23 -10 0 -10 -16 -15 16 3 20 -9 2
5828 2 -7 -11 -6 -2 10 21 -1 -1 18 -11 28 4 -3 -18 -12 -10 4 13 3 19 15 1 -9 31 18 -3 5 27 12 6 -5 -9 -7 -11 12 -19 23 -7
5866 -7 12 -5 -3 13 -4 -10 5 -3 -22 9 -18 25 -10 -19 -12 5 0 -12 -12 11 -1 11 -13 19 0 27 10 -1 -3 2 -4 12 10 27 12 -3
5902 -3 -20 -27 -2 -17 0 -32 3 -1 -22 -9 3 -22 -33 -15 22 -13 7 -25 -17 -4 -4 -10 1 -13 -13 -13 8 10 -21 23 33 24 6 26 -11
5937 -11 23 26 8 6 6 13 -11 6 -5 11 16 -1 34 13 6 -7 1 -5 -8 -24 -11 -20 0 -21 -17 -38 12 18 -6 -3 -3 8 -8 -11 6 3 -1 -7 2 0
5977 0 20 29 8 -7 -25 0 8 29 0 2 -1 -21 -15 23 -2 -30 -6 3 4 -13 -5 3 -5 0 12 4 -13 -14 -9 -16 12 -3 -11 9 10 -10 -7 17 18 9 30
6018 30 7 17 6 -4 19 -2 11 9 23 22 -4 12 -6 -2 5 6 -16 -5 6 -20 17 8 -23 -26 -11 -10 12 -19 -12 -3 8 6 -33 -6 9 -4
6054 -4 -27 13 5 17 5 -12 10 5 -10 -3 -11 -6 7 -5 0 3 4 15 -41 -24 42 23 6 -16 -16 -18 -26 -27 -3 0 -28 20 -39 -38 -22 0 -29 7
6092 7 -15 15 -5 -2 18 6 21 19 12 10 29 -3 32 36 13 -6 -27 9 -7 -4 -22 16 14 -44 23 -17 -3 -17 -14 -12 13 13 -18 -29 -7 3
6128 3 -9 -18 -27 -17 -19 14 -15 -15 -9 -12 8 5 9 -3 17 -30 -15 -19 -10 1 -9 15 16 29 -21 -8 -2 -9 9 14 32 -19 1 18 -2 -9 -12 -37 -21
6167 -21 -3 17 8 -15 1 -2 -30 -10 -16 6 -6 30 26 7 -30 13 24 9 5 -7 -13 -5 16 -12 9 18 17 -2 -26 11 -8 -2 5 8 11 0 -12
6204 -12 -6 0 29 -2 -8 -20 -12 1 -1 -6 11 -16 -15 -12 18 6 -6 -6 -16 -18 15 -16 6 -6 -3 7 -2 -8 24 -3 1 -2 -3 -25 2 18 -11 -20 3
6243 3 -13 6 -7 -34 -13 4 6 -6 -5 -18 3 5 4 -18 -9 -21 -16 -4 13 3 -11 20 2 2 -7 13 8 20 0 13 -13 6 -2 24 2 18
6279 18 13 11 -2 21 22 0 -9 2 -17 -5 18 13 -30 -1 -24 19 16 -18 -1 -4 -7 -5 -4 -7 -14 -7 -20 -7 14 22 -31 -11 -40 4 -16 -1 26
6316 26 -4 8 7 -14 0 13 3 15 -9 10 18 -1 23 10 9 -10 -9 -5 10 -11 -6 -18 -15 9 0 -21 -2 0 -7 4 -4 -10 8 2 -10 6 5
6353 5 18 6 -6 14 7 1 -16 1 2 -6 -1 15 -1 17 -3 -7 31 -20 0 -16 -9 5 -27 -20 12 -12 -27 -23 -16 -14 -6 15 -19 -4 -2 10 -32
6390 -32 -1 27 8 -15 -15 -10 -14 11 6 10 10 21 -20 19 14 3 11 18 -1 -9 23 -1 -13 -26 -19 8 -10 -3 -25 -8 -26 -3 16 -2 7 -16 -33
6427 -33 8 -23 -7 -31 -15 -11 -22 -6 -11 -14 -10 -1 9 -12 -12 -20 -9 -3 -15 8 -21 -12 -6 5 4 14 1 -40 16 1 -24 2 -12 -14 -9 -14 -12 -26
6465 -26 -8 1 7 -23 -28 -9 -30 -9 -25 -10 -19 -2 12 -11 12 -9 3 1 9 -1 -3 0 -10 -13 -1 23 -18 7 -9 3 21 13 18 -5 14 -24
6501 -24 14 -13 -28 -8 10 8 -16 -17 -14 -5 -10 -21 4 -4 -19 -15 -16 -17 9 1 -4 6 -5 1 1 13 -19 4 0 -2 5 9 7 2 4 29 3 6 -2 -25 -17 -1
6543 -1 -16 0 -36 -22 -23 4 -7 -18 -14 -28 4 11 -27 -7 5 8 -1 16 8 0 -6 16 -13 24 -12 -25 -6 0 18 9 5 6 14 11 26 4 -4 12
6581 12 19 8 -8 -23 2 -5 -17 -18 -11 -7 4 -15 10 9 19 5 18 -27 -25 -22 -30 -15 0 -5 24 -13 7 -7 -11 13 0 14 -17 9 -5 -17
6617 -17 3 -11 -3 -10 25 -1 11 2 1 -4 -10 2 8 0 1 1 9 -5 2 5 10 18 -11 -16 -39 1 2 4 -5 11 23 -5 10 -8 -12 -22 6 -20 29 23 27
6658 27 2 -15 6 1 13 -6 -9 -17 16 3 6 10 10 -6 -7 0 -4 11 -7 -10 6 -20 24 5 16 9 9 23 -25 -26 -34 2 2 10 6 0 -3 5 9 -13 -1
6699 -1 9 30 7 3 1 4 -16 -11 -23 11 4 8 -7 -14 -7 -31 11 3 -6 -19 -16 5 1 21 -14 -1 -8 13 -6 -1 -2 10 -8 -14 4 0 13 -16 3
6738 3 0 23 19 -1 -8 0 -19 12 -12 20 16 -13 18 -5 14 -10 6 5 8 5 -9 -7 4 -14 -5 -9 -15 -11 -4 -10 -25 9 -2 0 -14 19 -2 -16 -3
6777 -3 5 18 18 13 -8 -15 -11 -7 -13 8 -8 19 -36 -19 -9 0 14 6 22 -21 -16 13 2 -16 8 3 19 -12 7 -4 -7 14 -7 -13 11 -25 -30 -20
6815 -20 -25 -14 5 -2 3 25 4 -3 -13 -28 9 -17 -8 -8 -1 5 8 19 -11 0 5 -11 -7 2 10 -6 -12 20 2 -40 -7 -3 -3 8 -25 -3 -26 5
6853 5 -21 -13 -4 6 -35 4 12 -11 -9 2 17 19 23 9 -3 10 25 -12 -16 13 12 12 9 1 9 18 -4 -9 28 6 10 -11 -2 -13 -15 22 0 -8 -4 -2 4
6894 4 1 5 -24 -20 -1 8 -9 -11 -10 4 6 12 27 -21 3 -11 -11 18 15 23 -14 10 1 18 4 32 -25 19 -17 10 -17 26 -10 -11 -15 -3 10 14
6932 14 -18 -46 -10 -6 -13 7 -7 -23 1 -6 10 2 -20 10 19 -27 7 0 23 16 6 -11 -8 -1 3 5 2 -8 -16 26 -22 -8 6 8 16 -8 25 -32
6970 -32 20 6 -13 -4 -8 -4 -9 18 3 -7 -14 -8 -42 -8 -21 -14 -1 -9 11 -1 25 -11 15 5 -4 4 17 15 -23 8 -3 9 12 -1 -1 16 14
7007 14 9 11 3 1 -2 -6 -2 -3 16 5 11 -28 -20 -14 -20 -3 2 -8 -36 -5 -14 12 17 9 -18 5 -23 4 10 -3 2 12 -12 -11 5 -8 19 19 8 30
7047 30 8 -2 -3 -2 -10 -6 20 -22 7 32 3 -6 -1 -14 -8 -11 -19 -6 -32 -9 -9 13 -5 -5 -2 -6 -10 -10 15 -5 -19 -3 24 3 29 16 -9 10
7085 10 11 -8 15 -11 28 -12 -6 12 -12 10 19 4 -7 -8 -11 -31 -15 -25 4 -15 -4 3 -26 -14 -17 -11 8 3 21 4 2 -5 6 -17 3 -9
7121 -9 -21 -11 -13 3 25 -22 2 -16 10 16 10 -18 -17 4 -21 -5 0 2 -11 2 -1 -19 -15 2 -19 0 11 6 13 -35 -9 -2 18 -5 -1 22 6
7158 6 0 -1 32 3 7 7 -7 7 -4 12 -2 17 -13 10 6 0 3 -2 7 -18 4 -34 -1 10 -13 7 -17 -6 -4 -8 -17 -26 2 -24 5 5 -5 21
7196 21 18 -23 25 2 9 8 -8 4 -2 13 14 38 15 7 18 -8 -5 1 -3 17 -14 6 3 -6 16 5 -20 -26 -19 0 -11 20 -9 -14 -6 14 -15 -17
7234 -17 17 6 25 -21 -4 -9 3 -6 8 32 6 2 3 12 2 -8 -6 16 -23 -15 12 23 3 22 4 6 14 4 8 6 -20 10 -9 -2 15 -3
7270 -3 1 6 -6 -21 0 3 -15 -5 -4 -15 14 4 3 5 7 17 11 30 6 13 23 7 0 10 4 2 -6 0 2 5 1 29 19 2 22 -34 -7 -12 -18 -34
7310 -34 -3 -13 -17 1 -1 -8 -22 -10 -8 -6 -14 17 4 -6 8 14 3 15 -5 1 5 2 7 5 0 27 4 -2 -1 2 1 -8 6 5 -18 8 38 7 -9 0
7350 0 -11 -7 30 2 -32 -9 -17 -9 1 4 -20 4 -4 19 -6 21 -7 -3 5 -4 -21 -4 14 11 28 8 17 -6 17 -4 7 29 1 6 1 -5 -29
7387 -29 18 -23 8 8 7 -18 21 11 -17 11 -7 -8 -10 18 14 -10 0 -14 16 7 -11 -20 0 -9 -2 4 4 2 1 16 -5 6 16 30 4 -13 7
7424 7 19 -6 13 -14 -13 -24 8 12 -13 -30 13 10 -8 2 -15 -7 18 -13 -12 -4 11 2 -23 -13 -22 -12 5 10 -10 0 6 18 -4 29 -2 -3
7460 -3 12 32 12 -4 14 -5 0 14 15 12 8 -28 -6 -8 -25 -25 -6 9 -8 -12 2 -39 -17 -8 2 5 -24 21 -8 -10 8 -10 11 23 -7 -42
7496 -42 12 -28 -19 2 -7 -4 5 -5 12 4 1 -10 32 9 7 0 3 2 -15 22 -13 -10 10 -24 -2 -25 -7 -18 19 -36 3 -26 13 -3 -7 25
7532 25 -1 -18 5 19 3 -2 -2 0 -27 -4 -6 2 12 -3 17 1 -2 9 1 -1 14 -1 5 10 -25 24 -1 18 -12 11 -20 -13 8 3 -12 -32
7568 -32 -6 -2 -11 -3 -5 -27 4 -1 10 14 15 -4 11 3 -12 -4 31 9 17 0 46 -1 -7 10 15 11 2 29 22 -2 19 -14 -7 29 2 -12 1 -32
7606 -32 -36 1 7 -10 -25 -9 4 -28 -23 2 3 11 -40 -20 24 19 1 4 -2 -39 -7 -4 10 8 -19 0 -2 -18 -5 13 -5 11 -7 -9 -5 -22 -3
7643 -3 -13 -22 -6 8 -8 -22 -8 -31 -26 -21 -45 -6 0 -21 -15 10 -17 17 -21 -4 -19 -6 3 1 13 2 6 5 8 7 -2 18 6 -18 13 11 3 28
7681 28 1 5 -10 17 -18 5 20 2 -12 -14 -11 7 -25 5 25 10 -18 -21 -13 -35 -17 -4 16 8 2 -18 -8 6 -16 -2 1 1 -17 33 19
7716 19 22 13 16 16 -15 -4 27 -11 -26 -14 -27 -13 -7 -14 10 35 16 6 -3 -16 -8 -29 -17 11 -8 -29 -26 -13 24 1 -6 6 0 -16 5 -10
7752 -10 3 -3 6 4 9 -21 8 12 2 -34 5 -16 1 -6 24 5 -2 -17 -20 9 5 -7 -8 -11 -7 2 10 -7 -8 16 17 1 -20 25 1 -10 1 8 2
7791 2 -3 -36 4 8 14 17 12 -17 32 15 19 1 -14 6 12 19 30 -5 4 24 11 -4 13 22 20 -25 -11 -17 -23 -6 -19 -4 -28 -1 -7 -23 -12 -28
7829 -28 -18 19 -14 -9 3 4 -36 -4 8 5 7 -13 -19 -1 4 14 -11 -12 -2 9 14 -12 -3 17 31 -1 6 19 1 -24 7 -3 8 8 7 -8
7865 -8 2 -33 -37 -4 13 -18 -15 12 6 10 2 -4 8 2 10 5 8 -2 1 -3 35 -15 -13 16 -12 7 5 3 -24 13 0 -14 2 -20 -16 1 -3 27 -14
7904 -14 6 -16 -12 -20 -32 -3 3 -8 8 -9 -6 -23 -37 -2 7 -25 -36 47 -1 -12 0 16 -2 -20 22 5 10 6 31 11 11 0 22 15 -7
7939 -7 -15 -8 12 -16 -8 -13 -9 0 -27 8 -30 -26 -9 -33 -31 -23 -10 -28 10 7 14 10 -5 10 8 -20 -14 6 -38 -23 18 16 -3 -10 -34 2 -9 -18 11
7978 11 -7 2 -11 2 -2 -4 -22 5 -1 -13 27 6 -38 -14 -33 -3 -16 -34 -5 -6 -27 6 -3 -20 -4 5 -3 -6 22 9 18 0 -6 -23 -7 -19
8014 -19 -2 6 -22 -15 11 6 3 -6 -16 -18 -2 -25 -26 -15 3 -10 -20 -38 -11 -7 -15 -8 -14 -7 -61 -35 -21 -7 -46 -18 -20 -28 10 -11 -4 2 3 20 -12
8053 -12 2 14 -10 -4 26 14 -6 -6 -2 3 -1 -15 -21 13 -34 4 -12 -9 -10 -19 31 -8 10 4 1 12 -15 -15 -13 -13 -44 10 -12 12 -15 -6 -43 -6
8091 -6 20 12 7 -14 15 -9 -9 -9 22 16 13 -11 5 -7 -8 13 4 -7 -12 13 -11 -11 -23 -2 0 -14 -15 10 -30 -22 -18 -3 8 -31 -7 4 -21 -9
8129 -9 -17 -10 -8 -19 1 11 -16 2 8 -14 0 -13 16 3 -2 -11 -6 20 -13 -10 9 -2 -14 -14 -20 -21 0 3 6 23 -11 -2 -16 -30 -19 -25 -14 10
8167 10 -13 9 6 -23 37 -25 -9 2 5 5 2 11 -3 18 -11 -21 -7 1 1 2 -20 -3 -6 -2
8191b
$$ Imaginary data points
##PAGE= N=2
##DATA TABLE= (X++(I..I)), XYDATA
0 0 0 0 0 0 0 0 0 0 0 0 0 0 0 0 0 0 0 0 0 0 0 0 0 0 0 0 0 0 -2 8 -8 8 -8 8 -8 8 -8 14 -16 16 -16 16 -23 24 -24 30 -32
47 -32 32 -40 40 -47 49 -56 63 -69 74 -83 94 -103 118 -133 151 -175 205 -246 308 -400 572 -983
69 -983 4666 -694 -6762 3272 4641 -534 -1220 1551 -679 -710 1648 730 -2404 -441 2361 465
85 465 -3310 -1560 2329 1391 -2744 -2359 793 832 -1019 -326 341 -696 -296 1219 67 -982 1037
102 1037 1652 -930 -948 1637 1381 -426 180 639 -500 121 1502 20 -1741 -506 1039 81 -1260
119 -1260 -752 416 359 -704 -931 -5 481 4 -260 -400 -583 130 1255 328 -1264 -150 1758 814
137 814 -790 27 1103 347 -431 -38 335 134 -178 -345 -135 118 -255 -426 -91 -195 -470 -192 -200 -549
157 -549 -29 520 -290 -760 449 954 -152 -435 520 652 -4 39 268 221 289 343 -72 -87 385 297 -212 -336
179 -336 -47 -44 -331 -431 -222 -22 -303 -555 -172 196 -144 -354 6 91 -60 193 227 -113 142 648 215 -217
201 -217 427 743 1 -139 435 208 -188 105 188 -217 -307 -74 -111 -214 -154 -257 -378 -320 -91 -40 -181 -406
223 -406 -127 257 66 -210 163 461 87 -28 380 335 23 265 335 -66 14 422 127 -211 101 145 -312 -182
245 -182 159 -213 -517 -250 -43 -255 -306 -137 -92 -122 -68 26 7 31 96 193 116 69 261 425 134 -45 331 417
269 417 -13 -59 296 109 -234 -25 99 -220 -168 19 -306 -375 -36 -86 -379 -221 37 -135 -169 1 12 -2 116
292 116 110 97 177 242 190 190 139 160 253 143 30 96 154 -51 -123 48 -37 -258 -172 -92 -248 -275 -134 -163 -269 -61 -60
319 -60 -155 -58 102 28 -36 171 191 99 165 267 165 129 234 213 91 120 191 55 -58 -9 -5 -129 -196 -172 -127 -179 -224
346 -224 -184 -124 -170 -227 -69 -67 -121 -6 100 -11 12 230 144 40 225 306 96 73 294 170 2 104 175 -61
370 -61 -106 60 -41 -223 -148 -84 -190 -220 -153 -158 -199 -167 -130 -65 -89 -53 53 107 7 57 199 160 81 188 198 116 124 206
398 206 83 21 124 92 -112 -57 44 -89 -231 -97 -61 -275 -221 -73 -158 -207 -57 -55 -122 -38 63 59 58 105 107 190 124
425 124 82 153 234 92 111 180 92 -4 96 31 -174 -65 -11 -189 -204 -64 -152 -246 -108 -92 -233 -112 12 -106 -122
450 -122 72 70 -3 78 184 123 110 170 183 188 120 95 145 146 7 23 64 -54 -60 18 -75 -241 -134 -45 -215 -234 -90 -77
478 -77 -192 -67 13 -67 -81 67 59 26 116 168 129 97 189 221 165 141 107 98 79 76 -7 -62 -59 -18 -66 -168 -169 -68 -109 -212
508 -212 -132 -88 -106 -140 -24 -52 -110 40 144 12 -66 152 270 71 7 169 254 150 41 67 92 77 49 20 -81
533 -81 -103 -59 -12 -113 -229 -100 -67 -132 -178 -169 -43 16 -72 -110 56 132 18 -10 137 181 89 112 143 98 53 153 173
560 173 60 -61 24 136 -9 -159 -104 28 -101 -188 -97 -88 -178 -108 -39 -88 -140 -29 28 -7 -10 20 131 150 114 25 150
587 150 279 139 -12 110 225 39 1 73 10 -50 -19 -10 -102 -181 -122 -31 -128 -215 -164 -10 -42 -168 -103 84 16 -76
613 -76 81 124 49 101 197 126 46 149 216 114 58 62 68 105 66 -123 -92 30 -53 -136 -130 -107 -134 -92 -73 -155 -81 -61 -53 -34
643 -34 -45 13 81 72 35 68 192 153 53 78 172 135 54 89 61 30 34 34 -52 -70 -8 -53 -108 -100 -107 -136 -100 -64 -86 -108 -53 -22
675 -22 -32 -14 14 56 41 87 139 106 95 96 137 123 60 88 79 20 -24 22 7 -67 -71 -48 -78 -109 -108 -71 -127 -126 -46 -34 -89 -54 20
708 20 -4 6 70 71 60 84 139 141 110 82 118 119 93 46 60 55 -14 -25 -37 -98 -90 -76 -108 -165 -168 -74 -115 -106 -68 -45 -18 -18 -52 8 65
743 65 85 81 79 108 123 110 81 109 105 88 74 80 13 3 12 -48 -50 -79 -76 -68 -95 -135 -97 -97 -91 -60 -56 -38 -35 11 -10 44 34 59 87 78 100
780 100 54 106 124 98 58 41 86 22 10 -10 5 -64 -77 -35 -58 -103 -125 -93 -48 -86 -60 -55 -63 -32 -12 53 5 23 46 108 92
811 92 93 92 102 118 97 48 56 66 5 24 -37 -7 -34 -39 -53 -62 -69 -125 -126 -85 -108 -102 -40 -35 -32 -16 26 45 46 72 115 96 80 136 111 88
847 88 95 65 35 33 40 42 6 8 -53 -61 -60 -68 -89 -84 -93 -80 -87 -60 -33 -13 -33 -9 35 39 22 43 84 50 66 115 97 95 80 73 57 58 49 25 -5
886 -5 -12 -29 -62 -43 -40 -84 -124 -73 -105 -81 -78 -42 -38 -43 -63 12 21 33 40 68 92 66 54 116 90 48 75 99 88 43 38 28 -40 -19 -14 -39
922 -39 -43 -61 -50 -95 -82 -95 -97 -61 -30 -42 -27 -22 15 46 24 24 54 79 56 93 122 68 51 96 40 22 20 53 -20 -64 -23 -19 -39 -47
956 -47 -94 -82 -51 -68 -96 -56 -49 -51 -2 -2 -6 -13 37 77 60 95 82 119 68 83 34 40 43 31 11 46 -12 -26 -12 -21 -52 -77 -50 -85 -80
991 -80 -58 -69 -84 -58 -37 -64 -15 -28 31 19 70 48 69 89 107 71 74 109 74 57 59 52 24 29 -22 -54 -24 -41 -122 -61 -56 -120 -85
1024 -85 -44 -64 -63 -40 -40 -25 9 7 31 19 39 54 68 94 51 69 84 97 61 64 51 12 -14 13 -14 -30 -47 -61 -38 -42 -43 -75 -56
1057 -56 -44 -34 -59 -55 -34 -46 -13 45 35 31 41 47 94 84 61 74 57 57 49 27 56 20 -26 9 -2 -49 -82 -23 -45 -89 -24 -34 -63
1090 -63 -56 -27 -6 -1 -45 -31 34 48 32 44 87 57 48 68 80 56 51 39 40 29 20 -26 -10 -4 -42 -47 -71 -67 -69 -72 -47 -36 -64 -47 -48 -5
1126 -5 2 0 21 47 44 40 54 102 42 51 60 78 48 78 76 13 24 3 -12 -21 -46 -18 -32 -54 -69 -87 -48 -70 -66 -74 -40 -59 -14 -9 -6 18 59
1163 59 33 56 72 59 43 80 65 79 55 47 25 15 30 39 -6 -61 -43 -81 -45 -46 -80 -77 -46 -72 -45 -37 -47 -64 -28 20 19 3 26
1196 26 42 51 53 69 59 51 47 33 67 70 0 -8 11 -26 -42 -56 -30 -43 -77 -38 -36 -17 -45 -68 -33 -32 -40 -35 6 13 11 37 54 46 37 78 76 27
1234 27 63 37 49 32 35 14 12 0 -33 -9 -21 -50 -43 -38 -32 -72 -40 -39 -16 -49 -9 21 3 14 33 27 58 41 69 49 86 61 42 41
1268 41 47 49 48 16 9 -19 -22 -17 -45 -51 -39 -75 -39 -62 -80 -43 -64 -68 -15 12 8 9 26 43 36 45 49 51 67 79 65 49 55 49 21 40 23 -15
1306 -15 11 -42 -32 -37 -57 -64 -49 -29 -68 -48 -24 -51 -44 9 -27 -10 -5 17 45 41 20 57 79 49 42 67 61 19 20 31 22 17 -12 -19 22 -41
1342 -41 -37 -21 -56 -24 -40 -43 -49 -57 -14 -32 24 -19 12 -7 9 6 53 66 41 75 62 46 38 35 15 29 27 -6 -14 -2 -6 -38 -42 -16 -44 -54
1378 -54 -48 -24 -32 -47 -22 -8 -13 -31 9 34 32 10 47 55 66 21 66 61 31 22 42 30 16 8 -7 -1 -21 -38 -25 -24 -19 -44 -51 -47 -51 -35 -21
1415 -21 -25 -47 11 3 42 40 32 48 36 80 33 63 63 39 52 20 47 25 -6 36 -28 7 -45 -38 0 -29 -68 -51 -43 -84 -54 -48 -34 -36 -20
1450 -20 -1 -2 17 28 20 52 71 35 40 75 52 48 33 24 43 5 -7 8 -30 -15 -2 -2 -24 -47 -16 -54 -41 -49 -38 -20 -5 -7 31 21
1484 21 20 29 42 39 51 48 46 38 58 35 43 42 15 38 3 3 -18 -31 -13 -45 -41 -4 -22 -5 -41 -43 -21 -24 -39 -8 15 2 38 14 31 65
1520 65 54 73 61 40 47 11 46 22 -7 9 19 -12 -36 -28 -9 -68 -18 -35 -60 -54 -35 -38 -8 -8 -14 -10 -5 6 22 0 18 36 34 65 57
1555 57 63 57 42 46 44 46 31 18 -1 3 -17 -4 -56 -15 -19 -25 -44 -48 -71 -22 -22 -4 -45 -14 8 -3 13 31 23 15 42 51 37 37 75 4 11 37
1593 37 46 -14 6 12 -5 -12 11 -39 -49 -1 -27 -50 -16 -31 -30 -30 2 -15 11 -6 -14 44 38 55 32 46 49 48 46 51 40 15 28 15 9 12 1
1630 1 -30 -1 -26 -46 -49 -29 -21 -42 -1 -7 -33 -23 -10 21 23 36 -5 19 35 67 0 49 30 36 58 51 31 30 28 -1 10 -17 -18 -27 -42 -39
1666 -39 -41 -25 -47 -55 -37 -14 4 -27 11 27 15 11 35 20 32 59 22 52 59 40 23 42 30 22 28 14 -21 -15 13 -25 -35 -25 -1 -37
1700 -37 -64 -25 -59 -29 -35 -11 4 3 17 2 23 42 47 54 31 56 51 29 52 26 57 65 21 38 9 -8 3 -2 -21 -42 -19 -55 -15 -20
1734 -20 -31 -24 -14 11 -24 -9 -12 -5 14 -9 6 19 31 20 28 35 33 3 18 72 28 -2 7 7 12 0 -14 -34 -30 -16 -19 -32 -22 -44 -40 -21
1770 -21 -34 -12 -12 8 45 23 24 30 18 14 22 10 64 27 12 6 14 -9 -9 -10 -29 -28 -17 -41 -29 -34 -33 -42 -48 -24 -28 3 -12 -18 16 34 21 18 35
1809 35 24 33 38 37 48 35 29 8 16 10 20 16 10 -33 -12 -18 5 -17 -21 -44 -43 -18 -17 -21 -25 -25 -14 12 28 -9 26 29 56 71 21 30 44 38 26
1848 26 26 19 18 11 22 10 -1 8 -19 -15 -47 -40 -18 -34 -34 -44 -8 -7 -10 -23 -18 -15 -21 7 18 18 11 27 25 2 26 24 44 6 22 18 -1 11 6 -10
1888 -10 -19 -43 24 -23 -28 -25 -25 -45 -7 -13 -11 4 -17 6 12 6 22 18 18 3 5 17 37 50 7 19 -20 3 3 -4 15 -5 25 -28 -21 -33 -38 -34
1926 -34 -28 -27 -20 -10 -42 -14 12 -1 -5 -3 -15 29 51 55 50 -4 18 37 27 -3 30 8 -1 29 -18 -19 -18 -20 -31 -34 -32 -10 -49 -29 -27 -26 -21 -22 1
1965 1 -23 5 20 18 35 9 16 23 46 53 29 39 32 27 8 39 21 -15 -21 2 -8 -29 -47 -30 -6 -53 -36 -44 -7 -18 -29 -8 -19 -19 4
2000 4 -2 4 15 -6 5 7 14 31 23 44 30 16 31 6 -4 -8 -20 -8 -47 -21 6 -16 -16 -34 -3 -29 -4 -33 -22 -26 16 -14 7 1 -6 26
2036 26 50 14 20 33 22 15 -41 14 2 -6 -15 2 11 -9 -51 -21 0 5 -16 -14 -6 -8 -35 -18 -23 -8 -20 -10 4 34 36 11 10 -6 32 36 26
2073 26 57 15 4 10 34 -28 10 -3 -9 4 -17 -7 -48 -56 -46 -9 -8 -13 4 -16 -6 -15 -4 38 21 39 14 14 25 29 12 42 34 24 31
2108 31 16 1 2 14 7 -5 -36 -23 -14 -11 -34 -57 -36 -26 -47 -11 -1 -38 -19 -7 5 2 -16 27 18 9 35 9 25 -2 36 28 -5 14
2142 14 24 20 2 -8 -20 -6 1 -18 -38 -21 -19 -1 -14 -25 -31 -5 -28 -28 -15 37 31 15 22 17 8 27 6 27 -2 33 11 9 13 -21 -15 9
2178 9 -14 -21 -22 -12 -10 -13 -14 -19 -23 -10 -19 9 -8 4 13 8 4 2 37 17 19 -9 6 55 8 24 12 -6 1 8 -3 -28 -19 -28 -38 -5 -47 -48 -27 -41
2218 -41 -32 -24 15 -17 5 -7 9 39 29 10 23 45 18 39 6 30 22 11 50 10 16 6 20 -16 -4 -6 -7 -11 -38 -20 -29 -23 -20 -45 -28
2253 -28 -31 -15 6 -9 7 -16 -6 11 0 27 21 21 24 30 -13 46 19 34 18 -11 19 3 -48 -9 0 -35 -12 -34 -36 -3 -23 8 5 -15
2287 -15 -23 13 8 -35 0 2 32 27 10 4 19 4 -3 24 -29 2 17 31 -8 5 -13 -12 -3 -14 -11 -12 3 -29 -6 -9 -1 -40 9 0 9 -4 21
2324 21 4 -4 10 -1 20 1 37 45 50 13 4 -2 -1 -2 -1 -20 -2 -37 -9 -33 -11 -16 -17 -32 -12 -22 -3 5 8 -3 -2 17 26 15 33 46 9
2361 9 25 45 0 32 4 -7 24 1 1 -4 -9 -13 -6 -28 1 -31 -8 -35 -57 -39 -24 -18 -15 -17 -13 10 7 -18 4 23 16 14 38 33 14 55 5
2398 5 20 -3 21 16 14 0 6 -30 -44 9 -13 -17 -13 -7 -20 11 -21 -31 -20 8 -2 -8 -15 6 11 21 4 12 17 -4 7 -4 14 12 -17 -8 -26
2435 -26 18 -12 14 18 -2 6 -30 -37 -3 -12 -3 -8 -24 24 14 -8 18 -10 -4 39 21 -6 33 -12 30 -1 22 11 -7 14 -16 -1 -22 -1
2469 -1 -27 -27 -25 12 -38 6 -3 -29 -3 -2 17 -3 -14 5 20 27 15 32 6 16 47 28 7 29 23 9 5 18 4 -7 -4 -20 -10 -54 -16
2504 -16 -20 -13 -55 -11 -38 -3 -32 -6 -11 4 -11 20 17 26 9 8 1 30 11 -7 23 7 17 22 -11 -7 11 20 13 -26 15 -5 -12 -1 -13 -22 -10
2541 -10 -9 -6 -13 1 6 -6 1 23 26 21 4 15 20 11 32 25 24 8 -23 -26 -16 9 5 1 -13 -17 0 -2 12 -2 -5 -6 3 8 -20 13 -1 -22 -3 15
2581 15 8 25 24 0 20 22 -3 19 -14 12 2 4 -11 -8 7 -8 16 -22 -34 -2 -9 -1 -17 -9 -1 -18 -19 5 7 25 5 9 24 9 13 27 25
2618 25 22 13 34 21 42 28 22 11 -8 5 -26 -24 -14 -11 -30 -19 -9 -17 -38 -25 -31 -31 4 -2 0 -4 -3 5 30 -11 15 13 26 40 2 27 25 -11
2656 -11 20 24 -14 12 -2 10 0 -18 -12 12 -16 -46 -22 -2 4 -20 -2 -7 -13 -9 -34 -4 13 18 3 -3 11 11 -16 12 14 -9 -8 -4 -4 22 4
2693 4 0 2 14 1 -26 -16 -17 -3 3 0 -34 5 11 -4 -15 -6 13 4 13 -15 23 -12 15 -16 17 16 22 18 -11 2 1 -14 -13 -13 5 -23 -40 -17
2731 -17 -6 -35 1 -4 -30 2 11 7 9 29 -15 21 10 -4 25 10 11 33 21 46 31 2 9 10 9 7 -14 -2 -2 -16 -26 -9 -24 -9 -1 -39
2767 -39 -19 -29 -2 1 -19 24 23 -21 18 34 13 14 26 39 24 24 2 36 5 7 11 24 -5 1 -15 -29 -28 -4 -25 -28 -22 -29 -34 -18 -20 -22 -24 -9
2805 -9 -3 -14 17 30 14 15 22 17 23 -9 9 37 10 22 -3 -5 -14 10 -10 -22 22 -22 -16 -21 4 23 -5 11 -7 4 -10 -3 -3 22 17 4 17
2842 17 -4 4 -1 27 -1 5 -6 5 1 1 -5 -19 -19 1 21 -13 -4 -13 -39 -2 -13 6 5 5 -35 -17 13 5 7 5 33 -18 11 -11 0 -7 19 15
2880 15 -16 17 12 8 -7 11 -22 -25 9 -45 -5 -9 -26 2 -24 6 -13 -22 0 -20 -17 5 16 19 -17 -13 22 19 30 17 2 -4 25 0 -14
2915 -14 -14 0 -20 -21 -3 -2 -10 -20 -19 -39 -22 -9 -19 -10 -33 -6 -11 -21 1 2 1 13 -19 -6 16 29 6 -2 -9 23 4 5 -7 17 2 11 17
2952 17 9 1 -11 -34 -16 5 -12 -37 -7 -13 -12 -1 -14 7 11 -25 8 -32 -25 2 -3 14 5 -15 17 -15 8 -36 9 -9 0 19 0 13 0
2987 0 -20 -4 13 -3 -3 -25 -29 1 2 -28 8 -8 0 4 4 1 10 -11 12 24 19 -17 -15 -19 -8 1 15 -26 8 -50 -18 -46 -11 -3 -6 -15 -2 -6 -21
3026 -21 -6 1 -7 7 -6 -4 12 -1 10 11 7 37 4 -7 28 1 18 -10 11 -26 -2 -35 1 -20 23 -27 -20 -26 -2 -1 -44 -13 -21 -4 -4
3061 -4 -15 13 13 -10 -6 -25 8 23 4 19 -6 4 -19 -12 13 6 0 11 17 -4 -17 -9 8 13 -11 6 -44 -22 -31 -34 -16 -5 21 8 15 -38
3097 -38 -29 -5 -6 -9 29 -11 -5 11 12 8 17 11 -3 0 -18 -3 -15 -22 -25 -6 4 -27 -18 0 20 -15 -8 -5 4 22 10 8 -15 9 19 12 4 18 6
3136 6 2 19 18 -3 8 -5 -7 -19 -20 -34 -15 -13 -24 -9 -7 -4 -7 -15 2 11 -9 -6 1 2 12 -3 25 0 21 14 22 18 17 -11 9 -8 -13 -18 -33 -7
3176 -7 -48 -14 -7 -4 -1 14 3 -6 -21 -3 -24 1 -14 -10 1 -12 10 -3 -7 25 5 12 -18 13 14 19 5 -9 -2 23 5 -3 -2 -4 -11 -1 -9 -14 -3
3215 -3 -4 7 -23 -11 11 14 8 0 -11 6 -22 -6 -14 6 -2 8 14 29 18 4 18 -12 17 -5 -3 12 -8 20 7 4 -3 9 -8 -4 12 0
3251 0 -15 -25 10 26 5 -19 7 21 -7 1 7 0 -17 11 3 9 -16 8 -9 -15 -6 6 2 -8 -16 -2 5 -22 1 -21 -19 -7 0 20 14 3 -6 9
3289 9 19 10 -6 15 25 27 23 45 15 13 15 13 7 29 -3 7 -4 -20 -16 7 3 -28 -4 -19 -13 -21 -21 -8 13 11 8 -7 19 6 7 11 18 33 22
3328 22 18 4 17 1 -8 -8 18 18 3 6 8 -3 -12 -12 9 6 -9 3 -10 -22 -40 -4 -17 2 23 3 6 -1 20 8 2 -8 -4 14 20 11 -11 7
3366 7 16 -1 0 1 -5 -22 -2 -1 -18 5 -4 8 -5 -4 -30 19 -7 -16 26 -1 18 13 24 2 9 -31 -10 5 7 12 -8 -6 14 15 -11 -23 0 -10
3404 -10 6 -30 0 -17 -7 14 -7 2 -15 9 1 17 1 10 -9 0 14 37 3 24 -1 14 2 21 12 -7 -3 -21 -13 7 -6 -2 -4 7 -2
3439 -2 -29 -3 -9 -1 4 -25 -21 -7 -23 -30 0 34 20 30 15 3 23 19 17 -12 1 26 26 10 2 7 4 -5 8 5 -23 -6 -27 -18 1 -3 -26 -28 4
3478 4 -18 8 -19 -11 4 19 -3 -7 -11 8 14 0 15 10 15 21 16 10 -2 5 10 16 14 24 -3 7 10 -7 0 27 6 4 21 -15 16 -3 -15 14 2
3517 2 -18 6 -6 -6 3 -11 -6 -29 29 17 19 -4 -36 5 5 -17 6 -12 17 -15 -9 -1 22 -31 9 27 8 34 3 11 22 31 32 21 16 -4
3553 -4 35 29 10 3 -1 3 15 -14 2 -3 14 -34 -9 18 -1 9 -1 -30 -5 -23 -19 -13 -9 -9 -3 30 12 14 10 1 25 18 16 43 11 -4 4 17 -2
3592 -2 -8 7 20 -8 0 0 23 11 6 -8 29 -3 -24 -9 8 -7 -4 -11 -3 -5 -2 25 -3 -8 1 -3 26 -4 11 22 10 18 0 7 -14 5 5 -7
3630 -7 -8 0 16 -10 -9 -20 0 -9 8 8 10 9 0 -3 -8 6 -17 13 -7 5 -7 28 -11 13 -34 29 21 26 6 14 19 -8 3 0 -9 4 -5 -14 -47 -12
3670 -12 3 22 -7 34 9 15 2 7 17 22 12 0 -18 30 -2 13 -29 -12 -20 2 -13 -28 -2 15 -14 16 -38 -26 6 7 10 -18 0
3703 0 1 1 5 11 9 12 -5 18 -4 10 9 3 6 13 24 10 -2 -4 -20 -17 -3 22 3 -6 -9 -35 -10 -13 -4 -18 -5 -37 -5 -9 -10 -5 -13 -20 12 -1 -6 10
3745 10 27 -4 42 -21 -10 20 30 6 2 32 11 -14 25 -13 0 -3 11 13 -8 -10 9 5 -9 -3 6 -23 -14 1 10 19 -3 3 20 18 10 15 -1
3782 -1 9 4 38 23 4 4 37 -8 24 6 -19 6 -17 -12 20 8 17 -6 9 36 9 42 5 3 15 6 -10 17 18 -13 15 9 39 -6 -3
3817 -3 -4 13 28 -2 -16 -14 -5 -14 -12 7 7 2 -9 3 9 9 -16 -3 -3 -8 18 14 23 -9 23 23 43 29 6 12 -10 37 3 30 29 -3 6 -10 0
3856 0 0 -19 8 0 9 -17 -7 -1 -5 -15 5 -24 -3 8 23 20 10 14 10 6 11 27 -16 6 -8 11 -7 -6 32 24 20 12 18 7 14 -8 5 -1 7 10
3896 10 13 13 -5 -7 3 17 18 0 1 1 -8 7 9 12 4 -10 -19 -4 2 20 29 30 35 10 -11 2 3 -8 -8 4 3 9 -4 12 8 -12 6 5 22 8 37
3937 37 15 -9 -8 7 22 15 -14 -31 -4 0 -12 -19 -13 1 -26 -26 -5 -16 -25 -10 2 -23 11 14 12 25 -1 -9 21 -3 28 20 2 25 16 16 3
3974 3 32 2 -3 8 -19 23 -8 -20 -28 18 -10 -21 -5 -15 15 0 9 0 -14 -4 -3 -5 2 -2 6 -32 3 -40 5 28 -3 3 23 9 -1 16
4010 16 16 43 -4 14 23 -9 -7 -21 -2 16 24 4 4 9 -22 1 -13 -26 14 -18 1 -6 7 -13 -1 12 3 4 -9 25 22 32 -7 17 -13
4045 -13 12 4 -6 -6 20 21 20 13 4 5 -7 -11 36 -4 -14 -21 -17 -7 57 9 2 -16 -4 -8 7 -6 13 33 -26 -2 2 -11 10 -19 -13 2 -17
4082 -17 4 -7 -10 31 -14 9 -18 4 8 -4 21 10 10 -16 -2 4 0 -14 2 -3 -4 -27 10 9 18 -11 37 -4 -1 -5 5 -2 -7 -20 8 16 -5
4119 -5 16 -11 10 -32 -24 -19 -23 -9 -4 -2 6 1 10 27 17 -17 1 14 14 -9 -13 8 -10 5 6 -20 -6 15 13 -7 18 -9 -16 -20 -10 -22 3 -37
4157 -37 -3 -9 -5 -6 -15 5 0 8 -20 -6 -7 -4 7 -46 12 4 0 -4 -11 22 -6 8 10 22 17 8 12 -8 2 14 19 1 15 -19 6 -14 -14 -23 -7 8
4197 8 -4 -13 0 -17 -10 -6 -21 10 17 -6 1 10 10 -7 -5 19 -15 14 -11 4 -1 6 -9 -17 5 13 28 9 7 38 10 9 -1 0 0 20 14 -3 23
4236 23 -8 -8 -5 6 -17 4 -10 -4 10 0 20 0 -5 14 10 17 -6 -45 28 -2 3 11 27 3 -9 36 -4 -9 17 12 -20 -1 18 -21 -14 10
4272 10 0 1 -5 7 -14 -16 -1 -33 0 -18 -40 -30 -7 4 0 -12 0 18 5 2 -3 -12 18 -10 -5 1 14 20 30 6 25 -4 18 3 9 9
4308 9 -6 25 -7 -20 3 -29 5 -9 18 -6 -20 -5 12 -2 1 2 -2 -13 -2 11 -8 1 -3 5 -24 -31 -5 12 1 -16 -37 -8 -21 10
4342 10 -23 -18 -15 -18 -7 2 10 7 -3 -13 0 5 -12 0 6 -5 6 17 -3 15 1 -1 -6 8 -11 13 -19 -28 3 -24 6 -17 5 -18 -22 -2
4378 -2 -10 -11 -9 -3 -16 9 5 15 -2 10 3 -7 9 13 -20 3 24 11 4 16 6 8 -21 -1 11 0 10 -22 29 -12 9 19 -25 -7 3
4413 3 -13 -2 6 -15 -4 -16 -11 4 5 11 0 19 -10 -24 2 -15 -2 -19 14 14 2 -6 12 14 -26 -11 -15 -22 21 -4 -7 -14 -29 2 10 9 -15
4450 -15 14 -25 -5 7 -6 -12 -16 -14 -13 -8 -2 6 11 -6 10 -3 4 -14 29 4 6 -4 16 18 12 11 -18 17 -3 16 -5 30 -32 -6 -12 -4 3 -5 -9
4489 -9 -23 1 18 -9 -1 6 3 -21 -28 -25 12 7 -24 -7 -18 -9 1 13 6 -39 -2 12 -2 10 -9 21 2 14 -4 22 11 3 9 -2 25 11
4525 11 18 -5 9 13 10 -29 -30 -20 2 -1 -20 -26 13 -28 9 -6 -3 -27 -21 -4 -9 0 20 11 2 1 13 17 -16 -21 11 -4 25 -10 2 1 12 19 -6
4564 -6 23 0 1 24 8 5 10 3 -6 -5 22 -17 -21 6 -2 -2 -16 -18 9 -15 -16 -6 11 -6 -5 7 -1 -14 3 -25 22 13 -3 -26 4 -1 0 28 22
4603 22 -9 11 -17 -30 19 23 -3 10 22 -13 -30 -40 7 -3 12 1 -8 -14 3 -13 10 -1 -18 -19 0 -22 -15 11 -29 -24 -9 11 0
4636 0 -3 12 -1 7 10 -12 -15 7 1 26 10 0 13 -19 1 18 -10 25 15 2 -11 -3 12 17 -50 -4 4 -10 -13 -20 -5 2 -16 -17 -1 -3 8
4673 8 -7 -3 11 -9 10 -12 -39 12 -3 -4 8 10 12 1 9 1 2 -4 -2 34 -18 23 27 -14 -10 26 -17 -4 -9 3 15 -32 6 -9 -8 -2 13 10
4711 10 -5 3 26 4 -14 6 -25 -6 -16 10 14 12 14 -3 -2 22 -18 -2 -21 -4 12 35 2 -3 25 1 -9 5 -2 30 14 -6 -7 -10 -4
4746 -4 -19 -5 -6 -6 -2 12 -1 11 20 -22 -20 -19 -4 -5 -17 -17 6 19 11 -20 2 19 8 2 -19 -9 -7 15 18 -10 -3 26 -12 13 -8 -1 -4 16
4784 16 -4 4 27 -6 1 -12 -17 15 -16 -48 -21 -7 -23 -30 -19 -23 -24 -7 -3 -22 7 16 5 -4 7 -7 16 14 13 14 26 -15 17 -9 -29 12
4820 12 17 -5 3 -27 -12 -3 -1 -36 0 22 5 9 -5 3 -4 -24 5 -9 -1 12 -4 -4 -7 17 -13 20 -17 19 -9 -21 -25 12 -5 -8 -6 -2 18
4857 18 -14 -6 1 40 -9 12 4 19 -4 10 9 18 -10 -2 -11 7 2 -12 14 -3 -13 -9 -7 17 19 4 6 7 10 -12 -8 9 -15 -20 -20 13 -2 -9 -13 20
4897 20 0 2 17 0 27 2 19 -19 13 -2 9 -1 22 -7 9 24 -17 5 18 -9 -1 -15 25 4 3 -29 -18 -8 -11 -14 -21 -4 -6 -6
4931 -6 5 -12 -8 -6 -21 30 14 30 10 2 19 17 -12 1 2 -2 26 9 -14 5 -10 3 -7 -26 22 12 -13 22 16 -14 -7 -18 -22 -3 -15
4966 -15 0 4 -10 -22 -7 -5 -20 -6 1 6 1 14 4 -8 -12 17 3 22 -19 17 5 -2 -23 -10 15 3 -1 2 0 -14 -3 -18 -3 0 -11 -17
5002 -17 -21 -3 14 21 -2 -41 -46 1 -13 -4 23 5 -21 -12 3 13 -1 -2 -7 17 8 4 9 11 -5 12 30 6 21 18 -6 -25 0 -8 -32 -14 -13
5039 -13 0 10 3 3 22 -7 10 9 5 3 -22 8 -18 -20 -26 26 -18 3 -4 33 -21 -1 29 7 -1 5 -13 14 -18 11 28 -25 32 0 16
5074 16 -10 16 0 25 -16 19 -3 -28 -38 8 -39 -10 9 -16 -23 6 -21 -15 -32 2 -14 -19 -18 -16 32 -17 0 -37 5 -8 -12 0 8 32
5108 32 -9 26 43 7 58 -27 13 2 5 -12 -9 3 -15 -15 26 10 -19 -12 -13 6 -19 -12 -19 -12 -30 37 -29 9 -22 1 -24 0 -38 0
5142 0 -13 -2 -26 5 17 -3 3 -4 -10 -11 24 -5 2 8 5 18 -17 28 7 5 4 -6 -3 -3 -14 16 -10 17 0 17 7 -4 10 1 2 -17 -15 -7
5180 -7 6 -15 6 -26 -3 15 -4 11 35 26 -7 2 -1 3 20 -2 -3 33 6 33 5 6 25 -31 24 2 29 33 -3 6 1 5 -17 11 -26 0
5216 0 -16 6 -7 6 -6 13 -16 -23 -3 2 15 -6 -10 -4 -20 24 9 -16 7 31 37 -12 12 -3 10 -7 28 18 11 8 6 30 -16 8 36
5251 36 12 28 -17 -11 -10 -16 -4 1 -1 -5 10 -14 1 5 -7 -31 -37 6 -3 -3 17 -11 -2 9 -1 -10 12 7 14 4 5 8 12 1 24 11 5 13 -14 13
5291 13 -1 41 15 1 -27 -2 -35 -7 -9 -14 -22 -2 -7 -19 -3 3 -3 -28 -11 17 13 27 16 21 16 19 -8 3 -4 -6 63 11 20 13 10 -1 -4 3 -3
5330 -3 10 -10 1 4 -18 -1 -1 4 3 -13 6 -4 -8 11 -11 -34 -19 -28 -14 -12 -12 -15 -17 23 -19 -30 -26 14 0 24 22 -16 28 -16 38 11 19
5367 19 18 -6 20 -11 7 1 16 -4 -12 18 -5 -10 -11 2 8 1 21 -4 -8 -1 -19 -19 4 5 -8 8 9 -13 9 18 0 4 1 -16 -18 -1 -28 24
5405 24 13 5 -1 2 22 21 9 54 13 12 7 12 21 -14 17 -3 -8 -14 -12 -10 -6 8 2 10 -23 -23 10 -7 -21 11 12 -7 -14 -15 -2 2 7 12 -6 5 9 16
5447 16 -4 -15 5 12 -18 5 0 27 40 -1 17 28 11 23 24 -14 -12 33 3 -9 -26 -11 -13 -1 4 4 -24 13 -32 -8 -17 -3 0 -7 28
5482 28 -39 -31 -2 13 20 -16 12 3 4 8 13 13 15 -13 -15 -3 14 -2 16 -6 23 5 -13 21 10 12 34 10 4 7 11 -26 -4 -1 -19 -9 23
5519 23 16 -15 1 2 17 17 -19 17 12 -21 -8 -7 29 31 11 3 32 27 25 20 17 8 -7 17 -7 10 21 12 19 -5 -3 -10 2 -7 -2 9 13 -10 -10 -22
5559 -22 -17 -13 -18 -16 0 15 6 9 7 -5 6 41 -17 13 20 15 10 -3 -11 14 18 24 12 -7 -7 -12 -6 10 25 7 31 -18 -8 25 -27 6 -11 -5 6
5598 6 29 -14 -5 3 -7 -4 -1 -4 -22 -24 -4 24 -10 13 29 6 10 -28 19 19 19 21 40 -10 -1 -32 7 -4 -12 2 -2 35 22 -9 0 4 -11 28
5636 28 -9 -1 -3 20 -20 -3 10 -10 -6 8 -20 -16 17 -5 21 -12 31 30 -24 33 -1 25 37 31 17 -4 24 11 -28 -1 -2 22 7 10
5670 10 -3 9 5 -1 10 -2 29 21 19 1 -5 -29 -23 -2 -11 -16 18 -16 5 9 -9 -16 -6 -2 15 20 9 -6 7 19 5 7 13 8 35 2 2 3 19
5709 19 6 30 14 -10 17 2 33 9 44 7 0 8 0 26 3 -2 -5 14 6 14 8 -9 -16 12 -13 6 1 15 6 10 -5 5 -24 -10 10 18 34
5746 34 6 -1 10 23 -23 -15 -3 9 10 5 14 -9 2 24 13 2 7 -13 -19 -10 -2 1 20 -11 -16 -1 -23 3 11 -1 -1 0 24 13 -31 9 -1
5783 -1 -4 -12 -21 -5 8 1 18 0 0 4 18 37 13 20 19 -1 31 -9 3 4 -4 -2 -3 29 -25 -17 11 19 10 -3 -48 -21 1 -2 0 -1 11 -17 30 -1
5823 -1 -24 -2 0 31 13 -26 2 6 16 -1 -1 -14 9 6 13 11 -6 15 -9 9 -17 5 -3 6 -9 -6 -21 -25 -23 11 3 4 -23 -8 -6 -4 -17 8
5861 8 -17 -20 -5 -1 11 -4 1 28 11 11 2 -24 -3 29 5 13 3 -11 12 4 39 24 -3 -22 19 -24 19 3 0 -13 -11 -15 3 -9 -3 12
5897 12 29 -5 -3 1 -21 19 7 -21 -7 25 11 14 14 -26 2 7 -24 -5 32 40 11 28 20 18 1 21 12 5 7 -10 15 -25 11 0 18 -18
5933 -18 1 -10 0 0 23 20 -22 5 -1 -11 8 -21 -10 3 -2 -9 -6 9 18 13 18 8 4 0 29 5 -19 0 16 -12 -15 9 -3 17 1 20
5969 20 20 24 16 -3 -4 -15 -14 -6 6 -17 1 24 -1 -31 -13 -29 -22 4 -8 9 -13 9 -29 -16 11 -12 -14 3 10 25 19 20 24 29 15 19 17 -19
6007 -19 0 23 -2 11 -20 30 -9 -12 5 4 21 -7 20 -1 -3 17 9 0 0 -3 37 -7 -12 -15 -23 -9 -20 0 -5 5 14 7 -14 15 -9 7 9
6044 9 29 21 -1 17 -11 -8 27 -4 -6 -29 9 1 13 -8 16 0 14 8 12 15 2 -2 -18 2 12 -8 3 28 -14 10 22 7 18 5 -5
6079 -5 4 -15 7 13 15 -3 -3 -3 36 20 18 6 -13 9 17 -7 10 1 5 -8 -5 23 0 -2 1 -19 7 3 -25 12 9 -5 12 -11 5 -25 17 -4
6117 -4 -9 21 3 29 -8 15 -2 26 25 0 23 -19 8 3 -15 23 9 -3 -6 24 1 16 11 -16 13 -3 4 10 -28 -20 8 20 4 7 -1 14
6153 14 4 -5 3 -1 -4 14 15 -20 -10 18 41 5 8 -1 -12 3 6 8 -4 7 -3 -20 30 -9 5 12 29 36 -1 13 -9 36 -10 -2 14 4
6189 4 -6 -24 -1 8 -8 -5 -2 -9 -10 -14 2 5 9 20 23 -6 -5 16 5 -8 22 -7 4 27 25 -9 10 26 -2 8 2 0 -2 4 -12 -38 0 21
6227 21 15 9 22 1 -8 7 -1 -5 -34 0 1 -21 -15 -15 -8 12 4 29 9 29 23 -4 9 25 15 11 44 23 25 7 19 -9 -7 2 7 -4 -6 15 26
6266 26 1 13 23 -7 7 -2 -7 -14 2 19 -2 -11 -10 11 -3 24 -20 -25 1 22 14 24 16 3 -7 27 -13 -2 9 3 -10 1 30 -6 12
6301 12 7 30 -1 22 -5 33 26 -5 5 -11 40 7 -8 9 -11 -4 -11 -3 -21 -4 -11 0 -2 -17 32 -9 7 10 8 33 -21 1 21 -32 1
6336 1 -3 1 14 2 16 7 14 -4 6 -4 0 -3 20 -3 -19 -7 0 -9 15 -24 -3 -13 -7 14 -5 -27 4 -6 -11 -4 18 20 -4 8 -8 10 -1
6373 -1 -9 6 23 -28 9 6 17 2 -2 12 2 15 -3 8 3 -3 30 14 -21 15 2 -11 -5 6 9 -19 21 30 -10 -7 -20 3 -14 -24 -10
6408 -10 -20 28 -17 -5 -3 -1 13 8 0 7 -8 16 28 3 -6 0 21 16 19 9 14 -7 7 -12 8 -10 5 8 9 4 9 8 6 4 -5 -6 -9 -12 12 10 -8
6449 -8 16 -23 -3 18 -2 -13 6 -16 32 17 -11 5 6 4 17 44 6 10 26 -11 -4 -2 7 3 46 8 26 4 23 8 18 24 -10 -5 2 7
6485 7 1 3 -3 -11 -6 -10 -8 -20 -7 14 -18 -26 5 5 -27 -4 8 8 7 -1 22 4 -20 36 4 27 8 4 9 13 23 -7 5 -4 -12 12 7 11 5 -11 -12
6526 -12 4 -24 -26 8 16 13 0 -19 -30 -19 29 -5 3 10 -4 -8 6 -1 5 10 14 -9 12 11 -15 12 29 18 -16 -12 -17 7 -30 12 21 13 10 22
6564 22 9 -5 1 5 -3 1 -9 -9 9 -4 9 7 -2 1 39 7 9 8 -33 -20 11 20 -14 12 -6 23 8 12 8 -4 31 20 15 -12 10 29 -4
6601 -4 3 -1 -3 21 -21 -1 1 -18 -33 9 -8 10 -15 -13 -4 4 -3 -9 -10 -6 -6 -4 -6 -7 -10 11 -36 1 -6 -24 7 21 -7 -16 15 29 7 -1 2 -25 5
6642 5 62 -6 28 4 -17 0 -12 -16 -6 -5 -6 2 24 -12 -7 5 -5 12 -17 -25 -1 -23 -10 20 10 -6 -1 8 -9 3 -7 -20 10 -9 4
6677 4 -12 21 25 -27 -5 24 0 -12 36 12 6 -16 21 -1 8 13 6 -5 30 -5 6 21 8 -4 7 -8 -19 -14 -2 7 -5 10 0 3 -12
6712 -12 -3 -1 -22 -6 -6 -3 15 28 15 -5 1 1 10 9 15 5 -28 13 -14 -1 -11 -9 16 -8 13 -12 17 -6 -8 4 -3 10 -16 26 18 21 -20
6749 -20 21 -21 -11 15 -17 -10 12 6 17 0 17 8 -14 12 24 16 4 17 13 1 -2 -1 -5 14 11 -24 8 -26 -3 12 5 11 -20 -11 -8 -4 -6 -17
6787 -17 5 5 -11 14 5 3 8 -33 -11 -9 16 -32 -15 3 32 12 3 -1 0 19 43 4 16 -22 4 33 -7 6 10 16 7 -14 2 -8 7 8
6823 8 13 -15 -10 -21 -22 -13 -13 4 4 3 -4 12 -22 -16 -1 12 -6 2 15 1 6 -5 17 13 -15 -5 -19 10 3 21 1 -25 5 -3 -19 -25 -11 -2 -6
6862 -6 11 -23 33 -2 2 -27 4 -10 -34 16 -47 -13 -14 -1 -14 -3 -8 6 -16 -14 13 20 2 3 0 -10 31 18 15 -11 13 -6 -18 17 -6
6897 -6 0 2 18 8 -20 18 8 2 -4 -12 -6 -4 22 1 -33 25 -13 -12 -10 -31 2 -6 3 20 -7 14 -15 -15 -15 -13 -4 -1 4 8 8 -13 5 -20 19 9
6937 9 8 -34 19 1 5 20 -4 9 5 6 17 1 -1 22 18 7 -10 -17 -16 -23 25 -29 -1 -10 2 20 -34 15 30 6 20 -2 16 -2 14 -8
6973 -8 10 -8 7 32 -6 27 16 21 9 32 -5 -39 -18 8 -10 31 27 -15 18 -15 8 -16 3 -2 0 6 -12 -25 -2 -18 8 -15 -25
7006 -25 3 -8 -12 -19 26 11 16 5 20 -4 -3 -1 8 -9 -3 21 17 -4 31 25 22 19 9 1 -11 -19 -8 3 -16 -8 4 -13 -15 20 -5 -12 -7 2 -26
7045 -26 15 -10 -1 -27 -8 4 -1 -22 -1 13 -2 -4 -30 5 9 -3 -14 22 3 -7 24 -5 25 3 7 -21 -15 13 -18 -5 11 -10 2
7078 2 6 14 -14 -6 13 -4 -15 -8 -13 -24 -3 -5 -25 0 -5 -19 -6 -6 0 13 -22 8 -16 32 18 19 -19 0 -16 7 -11 -3 13 5 1 -7 6 3
7116 3 -15 -19 9 -13 -3 -5 -22 -4 11 11 17 0 -12 13 -9 6 -10 1 -2 -48 5 -15 -1 24 13 10 12 -21 23 -5 22 17 17 20 0 43
7152 43 16 5 29 16 -7 -3 29 -17 -20 -23 13 -11 -19 -7 -6 -21 5 -11 -42 -12 23 -1 -32 -18 8 5 1 10 6 -10 1 7 36 -27 -8
7187 -8 28 12 20 -1 0 8 6 4 -17 -9 12 6 -1 0 -18 -20 -15 5 -9 7 5 -10 3 -24 -3 -17 -30 -26 7 -4 -14 4 -17 -6 -22 -20 -16 -7 10
7226 10 -35 -3 -8 -19 22 8 20 6 9 10 -1 6 13 14 -13 -12 -21 -28 0 -12 5 -23 -1 -3 -11 -29 -6 -13 -8 -14 -4 0 -24 -17 -11 11 7 -14 9
7265 9 21 -19 4 30 -4 2 -25 -19 -20 8 -33 -6 4 17 -17 -2 14 -4 2 -15 -18 3 -34 -25 2 6 0 7 1 -18 0 0 -2 8 -7 7 -3
7302 -3 -5 13 -5 -33 25 -10 15 5 2 15 -4 -11 5 6 9 -8 -12 -9 -8 30 -25 -5 14 1 10 -1 12 8 5 -7 -31 -14 -23 -18 -5 -6 -4 5 13
7341 13 10 -8 -3 -1 -5 -2 13 -5 -9 -30 21 -1 -15 -9 9 8 6 13 1 -9 -6 -9 -4 -13 -2 -18 -2 -10 6 -2 1 1 11 -32 -2 -20 -16 -13 -10 -13 -18 -24
7383 -24 14 -27 -26 -17 1 11 20 -5 -4 -37 -15 -6 -4 -5 9 -3 -13 -2 -18 -5 -14 -22 6 3 -3 -1 -3 23 1 6 8 10 8 -14 8 0 -9 19 -18 7
7423 7 -7 -27 4 -3 -2 5 -45 0 -17 4 -2 -15 -20 -16 -27 7 -13 3 -15 -19 10 14 8 25 -7 1 -6 -5 -24 10 9 -34 19 -5 5 2 2 2 -15
7462 -15 -23 -12 -36 -34 -21 22 20 11 5 -13 -10 33 6 -29 5 15 17 -9 32 15 7 20 -1 39 30 32 -1 -9 3 17 -11 7 19 -4 -25 15
7498 15 -8 15 0 -4 0 -2 -21 13 3 -12 -11 -1 18 -18 -33 10 -10 5 -8 3 -32 6 14 16 23 -6 29 -7 10 1 17 15 11 -6 -7 -1
7534 -1 -2 15 -4 -1 -35 -22 -12 10 1 4 -20 -13 9 -15 -5 -6 3 -17 16 -29 -4 -6 -40 9 -19 5 -4 -25 10 6 -6 18 -17 17 -31 -15
7570 -15 1 15 16 4 -37 -17 4 -14 -18 20 7 18 20 2 4 6 6 18 -17 -13 5 -12 -7 14 34 6 17 4 25 -15 11 25 28 -15 -16
7605 -16 6 -24 -4 10 26 13 2 -25 17 -1 -4 19 -1 16 11 -28 21 5 19 -1 11 11 26 -9 -4 -7 -24 -14 16 -6 1 -8 0 -9 26
7640 26 -12 -23 8 -1 -7 -6 7 21 24 -29 -15 18 7 7 9 23 -12 9 16 19 18 -16 11 14 -5 5 10 -16 4 -13 -7 -3 -8 -12 4 -24 2 4
7678 4 23 8 -5 -13 -3 14 11 0 -4 -10 -3 -16 24 0 7 3 -13 -17 -2 1 27 -14 -35 4 -12 -14 32 -17 10 17 -2 5 -7 -12 1 -19 -13 -21
7716 -21 14 2 -5 7 -16 18 1 -28 -4 1 -18 19 -10 -20 1 -18 -19 9 2 -11 3 8 18 -38 5 -18 17 5 5 -7 16 22 2 5
7750 5 23 -23 7 -8 -24 -4 6 -14 -30 16 -6 -15 -2 11 -7 -11 11 11 -13 -20 -14 -8 25 -5 -5 4 19 -13 -3 5 -24 -1 34 22 28 -3
7786 -3 -8 6 3 -15 -4 7 9 3 -28 -49 4 1 19 -11 -37 -18 -12 -3 -11 -7 17 15 -5 1 23 -10 -20 20 -4 -12 9 13 7 29 15 12 7 6 15 -19
7826 -19 -3 40 -17 32 2 7 31 10 -10 0 -4 2 9 -10 -12 15 -6 -23 -16 -23 4 -16 -21 -4 17 -12 -25 -27 -8 15 6 17 20 -2 -4 3 0
7863 0 -13 22 10 3 7 2 9 7 8 -6 12 10 34 -4 -4 -24 1 13 -20 -7 9 -6 2 0 -11 0 -6 4 34 -23 -12 -25 -15 1 -9 6
7899 6 18 -1 -25 11 30 -1 12 11 10 11 1 5 1 -1 14 3 -22 1 10 9 13 0 5 13 6 -9 -1 4 3 16 -2 -6 -13 -5 -9 -36 4 7 -11 -2 21
7940 21 1 -4 -10 -12 -7 -14 30 -17 8 12 -5 36 -22 7 -4 -8 -30 -30 10 7 7 -4 12 3 8 -6 -4 -19 -11 -6 -17 0 -22 0 -13 -11 11 6 -9
7979 -9 -6 -9 -19 8 12 -32 -10 -13 -5 -24 9 -7 17 14 -5 -2 15 -36 0 -8 15 -3 21 4 -12 -8 -17 3 4 -5 11 28 -43 -13 4 4 2 -10
8017 -10 -1 -28 -12 9 2 0 16 19 6 -4 -15 -13 3 -26 12 0 -11 11 4 26 -6 11 24 7 0 -15 -17 -4 4 -20 10 9 -19 -16 15 -20
8053 -20 -19 23 11 18 -3 -2 -10 2 -3 -8 6 -8 6 -30 7 -11 1 -12 -14 25 4 28 44 14 -2 -8 9 16 -1 -6 -23 -9 6 9 5 5 10
8090 10 -1 1 -8 -21 -8 -21 -2 -13 9 -5 0 -20 11 -13 12 15 -4 0 0 4 -24 -7 -7 14 6 -13 22 16 -22 3 13 3 -17 -1 10
8125 10 -10 -9 12 3 1 -3 -2 5 20 -8 -19 1 -18 26 11 12 -40 -11 -24 -2 -32 -3 10 7 -11 10 12 -2 -13 4 -30 21 2 -10 -14
8160 -14 -12 7 14 -8 9 -31 -14 1 6 9 2 9 -10 5 -9 -22 1 22 -15 -28 -6 -4 2 14 -59 -16 -17 -5 11 -32 7
8191G
##END NTUPLES=NMR FID
##END=
