##TITLE=1H_Pr 5
 D2O
 8 sc, 
 13.3.2024
##JCAMPDX= 6.0         $$ Bruker NMR JCAMP-DX V2.0
##DATA TYPE= NMR FID
##DATA CLASS= NTUPLES
##ORIGIN= UXNMR, Bruker Analytische Messtechnik GmbH
##OWNER= root
$$ XWIN-NMR		Version 3.5
$$ Wed Mar 13 16:36:37 2024 Russian Standard Time (UT+4h)  she@DPX200
##.OBSERVE FREQUENCY= 200.1313
##.OBSERVE NUCLEUS= ^1H
##.DELAY= (6, 6)
##.ACQUISITION MODE= SIMULTANEOUS
##.ACQUISITION SCHEME= undefined
##.AVERAGES= 8
##.DIGITISER RES= 18
##SPECTROMETER/DATA SYSTEM= spect
##.PULSE SEQUENCE= zg30
##.SOLVENT NAME= D2O
##.SHIFT REFERENCE= (INTERNAL, D2O, 0, 15.7039)
##AUDIT TRAIL= $$ (NUMBER, WHEN, WHO, WHERE, WHAT)
$$ ##TITLE= Audit trail, XWIN-NMR		Version 3.5
$$ ##JCAMPDX= 5.01
$$ ##ORIGIN= Bruker BioSpin GmbH
$$ ##OWNER= she
$$ F:/spectra/data/she/nmr/H-F/1/audita.txt
$$ ##AUDIT TRAIL=  $$ (NUMBER, WHEN, WHO, WHERE, WHAT)
(   1,<2024-03-13 16:35:46.70 +0400>,<she>,<DPX200>,
      <created by zg, POWCHK disabled, PULCHK disabled
       configuration hash MD5:
       00 E9 B6 7A A2 85 ED C7 34 08 36 98 17 FE 4E 26
       data hash MD5: 16K
       10 B8 C2 0C A9 E1 1C FC 94 54 30 20 DD 67 FF E0>)
$$ ##END=
$$ 
$$ hash MD5
$$ AE B0 FA 11 64 40 1B FF C2 FB EA 89 EC 47 13 4C
##$RELAX= 
##$RELAX= 
##$RELAX= 
##$RELAX= 
##$RELAX= 
##$RELAX= 
$$ Bruker specific parameters
$$ --------------------------
##$DU= <F:/spectra>
##$EXPNO= 1
##$NAME= <H-F>
##$PROCNO= 1
##$TYPE= <nmr>
##$USER= <she>
##$AMP= (0..31)
100 100 100 100 100 100 100 100 100 100 100 100 100 100 100 100 100 100 
100 100 100 100 100 100 100 100 100 100 100 100 100 100 
##$AQSEQ= 0
##$AQ_mod= 1
##$AUNM= <au_zg>
##$AUTOPOS= <>
##$BF1= 200.13
##$BF2= 200.13
##$BF3= 200.13
##$BF4= 200.13
##$BF5= 200.13
##$BF6= 200.13
##$BF7= 200.13
##$BF8= 200.13
##$BYTORDA= 1
##$CFDGTYP= 0
##$CFRGTYP= 5
##$CHEMSTR= <none>
##$CNST= (0..31)
1 1 145 1 1 1 1 1 1 1 1 1 1 1 1 1 1 1 1 1 1 1 1 1 1 1 1 1 1 1 1 1 
##$CPDPRG= <>
##$CPDPRG1= <>
##$CPDPRG2= <>
##$CPDPRG3= <>
##$CPDPRG4= <mlev>
##$CPDPRG5= <mlev>
##$CPDPRG6= <mlev>
##$CPDPRG7= <mlev>
##$CPDPRG8= <mlev>
##$CPDPRGB= <>
##$CPDPRGT= <>
##$D= (0..31)
0 1.2 0 0 0 0 0 0 0 0.06 0 0.03 0 0 0 0 0.0002 0 0 0 0 0 0 0 0 0 0 0 0 
0 0 0 
##$DATE= 1710333346
##$DBL= (0..7)
120 120 120 120 120 120 120 120 
##$DBP= (0..7)
150 150 150 150 150 150 150 150 
##$DBP07= 0
##$DBPNAM0= <>
##$DBPNAM1= <>
##$DBPNAM2= <>
##$DBPNAM3= <>
##$DBPNAM4= <>
##$DBPNAM5= <>
##$DBPNAM6= <>
##$DBPNAM7= <>
##$DBPOAL= (0..7)
0.5 0.5 0.5 0.5 0.5 0.5 0.5 0.5 
##$DBPOFFS= (0..7)
0 0 0 0 0 0 0 0 
##$DE= 6
##$DECBNUC= <off>
##$DECIM= 32
##$DECNUC= <off>
##$DECSTAT= 4
##$DIGMOD= 1
##$DIGTYP= 9
##$DL= (0..7)
0 120 120 120 120 120 120 120 
##$DP= (0..7)
150 150 150 150 150 150 150 150 
##$DP07= 0
##$DPNAME0= <>
##$DPNAME1= <>
##$DPNAME2= <>
##$DPNAME3= <>
##$DPNAME4= <>
##$DPNAME5= <>
##$DPNAME6= <>
##$DPNAME7= <>
##$DPOAL= (0..7)
0.5 0.5 0.5 0.5 0.5 0.5 0.5 0.5 
##$DPOFFS= (0..7)
0 0 0 0 0 0 0 0 
##$DQDMODE= 0
##$DR= 18
##$DS= 0
##$DSLIST= <SSSSSSSSSSSSSSS>
##$DSPFIRM= 0
$$ [...]
##$SUBNAM2= <"">
##$SUBNAM3= <"">
##$SUBNAM4= <"">
##$SUBNAM5= <"">
##$SUBNAM6= <"">
##$SUBNAM7= <"">
##$SUBNAM8= <"">
##$SUBNAM9= <"">
##$SW= 18.0517328524113
##$SWIBOX= (0..15)
0 0 2 0 0 0 0 0 0 0 0 0 0 0 0 0 
##$SW_h= 3612.71676300578
##$TD= 16384
##$TD0= 1
##$TE= 0
##$TE2= 300
##$TE3= 300
##$TEG= 300
##$TL= (0..7)
0 120 120 120 120 120 120 120 
##$TP= (0..7)
150 150 150 150 150 150 150 150 
##$TP07= 0
##$TPNAME0= <>
##$TPNAME1= <>
##$TPNAME2= <>
##$TPNAME3= <>
##$TPNAME4= <>
##$TPNAME5= <>
##$TPNAME6= <>
##$TPNAME7= <>
##$TPOAL= (0..7)
0.5 0.5 0.5 0.5 0.5 0.5 0.5 0.5 
##$TPOFFS= (0..7)
0 0 0 0 0 0 0 0 
##$TUNHIN= 0
##$TUNHOUT= 0
##$TUNXOUT= 0
##$USERA1= <user>
##$USERA2= <user>
##$USERA3= <user>
##$USERA4= <user>
##$USERA5= <user>
##$V9= 5
##$VALIST= <valist>
##$VCLIST= <CCCCCCCCCCCCCCC>
##$VD= 0
##$VDLIST= <DDDDDDDDDDDDDDD>
##$VPLIST= <PPPPPPPPPPPPPPP>
##$VTLIST= <TTTTTTTTTTTTTTT>
##$WBST= 1024
##$WBSW= 4
##$XGAIN= (0..3)
0 0 0 0 
##$XL= 0
##$YL= 0
##$YMAX_a= 185672
##$YMIN_a= -109106
##$ZGOPTNS= <>
##$ZL1= 120
##$ZL2= 120
##$ZL3= 120
##$ZL4= 120
##$ABSF1= 10
##$ABSF2= 0
##$ABSG= 5
##$ABSL= 3
##$ALPHA= 0
##$AQORDER= 0
##$ASSFAC= 0
##$ASSFACI= 0
##$ASSFACX= 0
##$ASSWID= 0
##$AUNMP= <proc_1d>
##$AZFE= 0.1
##$AZFW= 0.1
##$BCFW= 1
##$BC_mod= 2
##$BYTORDP= 1
##$COROFFS= 0
##$CY= 11.3945322036743
##$DATMOD= 1
##$DC= 2
##$DFILT= <>
##$DTYPP= 0
##$F1P= 15.7292609196834
##$F2P= 12.9074282941183
##$FCOR= 0.5
##$FTSIZE= 0
##$FT_mod= 4
##$GAMMA= 1
##$GB= 0.15
##$INTBC= 1
##$INTSCL= 1
##$ISEN= 128
##$LB= 0.24
##$LEV0= 0
##$LPBIN= 0
##$MAXI= 10000
##$MC2= 0
##$MEAN= 0
##$ME_mod= 0
##$MI= 1.114404
##$NCOEF= 0
##$NC_proc= 0
##$NLEV= 6
##$NOISF1= 3.799351
##$NOISF2= 2.8
##$NSP= 1
##$NTH_PI= 0
##$NZP= 0
##$OFFSET= 15.70392
##$PC= 1
##$PHC0= -25463.77
##$PHC1= 10.18731
##$PH_mod= 1
##$PKNL= yes
##$PPARMOD= 0
##$PSCAL= 0
##$PSIGN= 0
##$REVERSE= no
##$SF= 200.130013532006
##$SI= 16384
##$SIGF1= 3
##$SIGF2= 2
##$SINO= 400
##$SIOLD= 16384
##$SREGLST= <1H.CDCl3>
##$SSB= 0
##$STSI= 0
##$STSR= 0
##$SW_p= 3612.71676300578
##$SYMM= 0
##$S_DEV= 0
##$TDeff= 0
##$TDoff= 0
##$TI= <>
##$TILT= no
##$TM1= 0
##$TM2= 0
##$TOPLEV= 0
##$USERP1= <user>
##$USERP2= <user>
##$USERP3= <user>
##$USERP4= <user>
##$USERP5= <user>
##$WDW= 1
##$XDIM= 8192
##$YMAX_p= 0
##$YMIN_p= 0
$$ End of Bruker specific parameters
$$ ---------------------------------
##NTUPLES= NMR FID
##VAR_NAME=  TIME,          FID/REAL,        FID/IMAG
##SYMBOL=    X,             R,               I
##VAR_TYPE=  INDEPENDENT,   DEPENDENT,       DEPENDENT
##VAR_FORM=  AFFN,          ASDF,            ASDF
##VAR_DIM=   8192,          8192,            8192
##UNITS=     SECONDS,       ARBITRARY UNITS, ARBITRARY UNITS
##FACTOR=    0.0002768,     1,               1
##FIRST=     0,             0,               0
##LAST=      2.2672688,     0,               0
##MIN=       0,             -109106,         0
##MAX=       2.2672688,     185672,          0
$$ Real data points
##PAGE= N=1
##DATA TABLE= (X++(R..R)), XYDATA
0 0 0 0 0 0 0 0 0 0 0 0 0 0 0 0 0 0 0 0 0 -2 6 -8 8 -8 8 -8 9 -16 16 -17 22 -24 25 -30 33 -38 43 -48 55 -63 68
41 68 -76 84 -94 103 -113 126 -138 151 -168 184 -203 223 -247 272 -301 335 -370 414 -465 525 -599
62 -599 690 -805 962 -1179 1508 -2070 3250 -11305 59003 132341 104303 34176 -35875 -67357
76 -67357 -78531 -78391 -70512 -35080 24087 87483 119764 108752 60540 -844 -57542 -91407 -91257
89 -91257 -53462 2581 48779 65000 54194 26199 -11853 -55742 -88330 -86483 -39515 32125
101 32125 89137 102488 75426 33769 341 -23771 -47739 -69184 -70057 -39251 9765 49115
113 49115 60640 45446 13947 -24588 -59671 -74712 -54734 -3032 55419 89509 84918 51467
125 51467 10680 -23649 -50452 -68864 -69592 -43843 179 39339 55049 46792 25168 -1952 -31443
138 -31443 -55202 -57907 -29631 20149 65690 83254 66995 29455 -12276 -48670 -74326 -80066
150 -80066 -55842 -6502 43270 66169 54677 24681 -3862 -23441 -36670 -42776 -33970 -5172
162 -5172 35268 67665 73578 48607 3199 -44627 -78631 -85952 -60720 -10467 41246 67761 59935
175 59935 31426 2718 -17544 -32554 -42724 -38894 -12681 28177 61388 65937 39386 -1691
187 -1691 -37110 -57231 -62685 -53594 -27157 13044 51036 66687 53325 21367 -12518 -36868 -46530
200 -46530 -38330 -12893 20879 46295 49716 30702 2254 -21191 -35477 -44510 -48855 -39674 -9537
213 -9537 32686 63535 64293 36975 310 -27904 -41255 -40167 -26097 -1566 25294 42346 40753
226 40753 21496 -5384 -29350 -45147 -50550 -41436 -14331 24006 55666 62819 43671 12265 -15379
239 -15379 -33267 -41920 -39762 -22658 7513 38092 51963 39583 7445 -27354 -49471 -52815 -39016
252 -39016 -12547 19982 47175 56874 45140 19931 -6519 -27750 -42111 -46190 -33348 -2975
264 -2975 32479 53009 45672 15059 -20359 -42911 -46615 -36152 -16896 8763 36092 54151 51936
277 51936 28726 -3550 -30868 -45234 -45047 -30772 -5050 23741 42503 41123 20496 -7305 -28732
290 -28732 -37239 -34212 -22613 -2554 24268 48065 53919 35096 965 -29607 -43869 -41139 -27760
303 -27760 -8951 11359 28601 35732 28397 9125 -13206 -29430 -34595 -28133 -10995 13736 38057
316 38057 49082 38315 10456 -18882 -36347 -39474 -32963 -20272 -1603 20696 38044 40184 23751
329 23751 -3542 -27580 -37810 -32281 -15249 7285 28831 41844 38912 19847 -6374 -28374
341 -28374 -40108 -40934 -31063 -9819 18717 42927 48714 31308 271 -26790 -37339 -31160 -16525
354 -16525 11 17037 32849 40357 31026 5489 -24683 -44744 -47160 -33014 -8369 18761 39307
367 39307 44836 32590 8255 -16396 -31242 -32859 -24376 -9336 9794 29575 41179 34895 9848
380 9848 -21576 -42530 -44117 -29741 -8357 12673 29390 38073 34789 18840 -4223 -24951 -35114
393 -35114 -31555 -16464 4624 25036 36930 32983 13025 -13212 -32122 -36029 -27697 -14182 1076
406 1076 18092 33720 39954 29946 5715 -20946 -36557 -35037 -20261 -922 16054 27216 29839
419 29839 20966 2552 -17895 -31300 -33035 -24221 -7936 12824 32696 42727 35551 12459 -15383
432 -15383 -34321 -36862 -25970 -9288 6707 20447 29993 30256 16755 -7160 -29944 -39601 -32050
445 -32050 -11741 12482 32169 40651 34588 15840 -8045 -27655 -36283 -32562 -19302 -892 18378
458 18378 33301 36308 22709 -3120 -28178 -38828 -31180 -11988 8742 24654 33259 32716 21470
471 21470 1293 -20933 -36311 -38011 -25643 -4550 17233 32229 35098 23807 2241 -19627
483 -19627 -31123 -28222 -15320 172 14231 25924 32197 27736 9958 -15222 -35630 -40485 -28060
496 -28060 -6266 14022 26337 29342 24107 11553 -5696 -21305 -28430 -23930 -10317 7022 22842
509 22842 31920 29184 13515 -9275 -28913 -36092 -29074 -12934 4417 18351 27129 29402 22464
522 22464 5660 -15531 -30567 -31259 -18079 1706 19511 29546 28787 17146 -1540 -20279 -31747
535 -31747 -31842 -21595 -4873 13311 28471 35640 30253 11599 -13242 -32079 -34877 -21752 -1792
548 -1792 15258 24768 26480 20565 6899 -11714 -28527 -35486 -28357 -9585 12957 30301 36395
561 36395 29588 12244 -9201 -26283 -31653 -24133 -8845 6877 18965 25682 24793 13800 -5517
574 -5517 -25442 -35484 -29741 -11067 10907 26663 31501 26508 14684 -865 -16763 -27617 -28288
587 -28288 -18183 -1627 14803 25640 26879 17170 -867 -19653 -30295 -27725 -13848 4155 18759
600 18759 26158 26249 19812 7264 -9572 -25129 -31706 -24913 -7898 10869 23772 26632 19280 4716
614 4716 -11463 -22958 -25144 -18011 -5082 9384 21497 28278 26781 14912 -5029 -25254 -35197
627 -35197 -28960 -10832 8363 20034 22805 19434 11911 159 -14205 -25575 -26943 -15582 4318
640 4318 23409 32766 28746 13948 -5044 -21546 -29882 -27585 -16189 -804 13267 22728 25789
653 25789 20297 5816 -13328 -28017 -29660 -16570 3995 21427 28429 24486 13685 373 -13029
666 -13029 -24416 -29276 -23675 -8141 10755 24910 28934 21761 6495 -10911 -23159 -25018 -16263
679 -16263 -1752 12172 20990 23031 18281 7592 -7223 -22197 -30402 -26501 -11126 7948 21899
692 21899 26011 21307 10854 -2302 -14960 -22326 -20817 -10431 4220 16935 23095 21064 11695
705 11695 -2429 -17393 -27772 -27942 -16344 1983 18125 25350 23231 14685 3340 -8873 -19138
718 -19138 -23114 -17770 -4412 11492 23092 25003 16282 800 -15112 -25525 -26521 -17728 -2984
731 -2984 11647 21447 24461 21070 11265 -3770 -19399 -27899 -23615 -7905 10619 22752 23830 15388
745 15388 2957 -8970 -18266 -23356 -21638 -11500 4763 20845 29378 26652 13704 -4412 -20411
758 -20411 -27481 -22454 -8666 6444 16426 19222 16093 9116 -1002 -13240 -23681 -25943 -15771
771 -15771 3399 21689 29402 24138 11151 -2531 -13144 -19587 -20918 -15880 -4692 9102 19977
784 19977 22481 15108 1163 -13274 -22323 -22475 -13782 263 13906 21982 22228 16030 5931 -6210
798 -6210 -17833 -24519 -21924 -9923 6234 19037 22882 17175 5234 -7583 -17261 -20873 -16997 -6296
812 -6296 7534 19057 23465 19721 9953 -2802 -15663 -24501 -24707 -14656 1611 16468 23054 19736
826 19736 9380 -2758 -12814 -18603 -18730 -12017 728 14961 24337 23923 14091 -897 -15358 -24525
840 -24525 -24880 -15932 -1365 12389 20207 20115 13686 3556 -7503 -16982 -21311 -17061 -4131 12534
854 12534 24485 25138 14836 -159 -13164 -20791 -22016 -16963 -6572 6360 17371 22209 18731
867 18731 8188 -5297 -16707 -21411 -17223 -5768 8494 19138 21579 15338 4373 -6858 -15738
880 -15738 -20853 -20191 -12153 1655 15746 23442 21269 10806 -2769 -13821 -18697 -16651 -8823 1901
894 1901 12197 18176 17412 10344 -365 -11570 -20278 -22736 -16362 -2236 13613 23306 22491 13020
908 13020 557 -9512 -15207 -16519 -13569 -5858 5700 16920 21760 16458 3366 -11109 -20824
921 -20824 -22367 -15840 -3818 9174 18408 21020 16731 7531 -3710 -13995 -20133 -19134 -10182 3938
935 3938 17186 22662 17336 4532 -8737 -17088 -19024 -15536 -7855 2914 14122 21411 21121 12707
949 12707 -933 -14187 -21741 -20541 -11178 2085 14025 19496 16713 7601 -3167 -11813 -16759 -17317
963 -17317 -12474 -1722 11885 22143 23169 14116 -193 -12980 -19367 -18328 -11847 -2458 7328 15064
977 15064 17568 13052 3084 -8164 -16392 -18693 -14163 -3850 9134 19268 21565 15000 3257 -8243
991 -8243 -15449 -17374 -14523 -7906 1505 11767 18655 17841 8676 -4605 -15412 -19252 -15272 -5936 5357
1006 5357 14869 18962 16444 8364 -2151 -12048 -18411 -19166 -13094 -1725 11297 20070 20067 11016 -2263
1021 -2263 -12970 -17045 -14917 -8583 28 9559 17234 19334 13686 1928 -11129 -20093 -21207 -14328
1035 -14328 -2333 9962 17995 18815 12411 1945 -8043 -14204 -15520 -12293 -4923 5736 16253 21030
1049 21030 16268 3714 -10282 -19221 -19859 -13415 -3743 5789 13224 16966 15516 8217 -2744 -12878
1063 -12878 -17905 -15566 -7194 4278 14598 19044 15359 5213 -6211 -14446 -17040 -14382 -8000 693
1077 693 9936 17168 18772 12558 419 -11787 -18196 -16379 -8338 1606 10250 14948 14511 8883 44
1092 44 -9130 -15565 -17060 -12610 -3076 8403 17615 20111 14214 2552 -9176 -15900 -15685 -10604 -3254
1107 -3254 4504 11672 15875 14197 5696 -6270 -16176 -19387 -14435 -4068 7433 15862 18535 14797
1121 14797 6097 -4404 -13009 -16600 -14567 -7981 1171 10782 17260 16764 8339 -4390 -15130 -18743
1135 -18743 -14311 -4979 4908 12276 15914 15279 9923 522 -10262 -17692 -18149 -11240 -229 10506
1149 10506 16693 16100 8760 -1595 -10641 -14917 -13616 -8079 -273 7983 14765 17201 13270 3338 -8896
1164 -8896 -17589 -18566 -11975 -1837 7356 13251 14495 10974 3658 -5056 -12216 -14876 -11985 -4460 5300
1179 5300 13953 17705 14458 5039 -6638 -15334 -17383 -12828 -4754 3098 9551 13718 14206 9396 -255
1194 -255 -10657 -16724 -15088 -6683 4132 12606 15844 13282 6549 -2154 -10455 -15465 -15403 -10021 -1281
1209 -1281 8177 15161 17055 12118 1799 -9318 -16010 -15312 -8469 870 8844 13339 13605 9699 2301
1224 2301 -6983 -15116 -17877 -13421 -3391 7801 15805 17595 12687 3264 -6750 -13338 -14336 -10284
1238 -10284 -3197 4525 10959 14394 12804 5556 -5090 -14855 -18486 -13986 -3715 6855 13561 15047
1252 15047 12170 6255 -1608 -9309 -14097 -13672 -7911 1286 10039 14807 13560 6633 -3139 -11856 -15838
1267 -15838 -13451 -6089 2709 9812 13654 13828 10094 2565 -6981 -14462 -16149 -10759 -924 8536 13734
1282 13734 12972 7602 34 -7377 -12364 -13519 -9882 -2257 6521 13567 16211 13159 4756 -5927 -14368
1297 -14368 -16533 -11772 -3044 5473 10958 12152 9717 4389 -2796 -10101 -14501 -13240 -5795 4722
1311 4722 13498 16948 13874 5862 -4068 -12049 -15229 -12864 -6469 1320 8137 12427 12818 8474 145
1326 145 -9345 -15589 -14801 -6851 3990 12371 14974 12230 6469 -336 -7450 -13114 -15049 -11422 -2837
1341 -2837 7378 14603 15328 9392 69 -8550 -13127 -12319 -7022 442 7423 11760 12596 9694 3426
1356 3426 -5225 -13128 -16366 -12809 -3957 6099 12824 13905 9886 2962 -4040 -9424 -11724 -10019 -4242
1371 -4242 3659 10686 13808 11636 5044 -3858 -11717 -15276 -12931 -5814 2802 9609 12627 11612 7112
1386 7112 417 -6752 -12089 -12937 -8108 730 9617 14219 12675 6341 -2124 -9599 -13763 -13202 -8104
1401 -8104 -414 7147 12209 13357 10194 3401 -4899 -11832 -14275 -10409 -1719 7660 13288 12751 7391
1416 7391 158 -6526 -11377 -13157 -10755 -4242 4603 12380 15673 12618 4573 -4781 -11586 -13230 -9861
1431 -9861 -3247 3936 9265 11256 9480 4550 -2488 -9947 -14480 -13497 -6185 4070 12546 15495 12207
1446 12207 5000 -2814 -8539 -11173 -10522 -6633 -283 6592 11347 11592 6983 -821 -8683 -13522 -12810
1461 -12810 -6757 1943 9411 12966 11894 7459 1317 -5192 -10486 -12623 -10274 -3405 5374 11877 12704
1476 12704 7781 174 -6630 -10478 -10710 -7737 -2154 4618 10470 13294 11449 5205 -3495 -11146 -14462
1491 -14462 -12002 -4877 3741 10347 12178 9101 3101 -3294 -8253 -10741 -9906 -5287 2062 9506 13859
1506 13859 12908 6667 -2205 -10171 -13920 -12383 -6499 1078 7746 11252 10671 6453 170 -6447 -11190
1521 -11190 -11922 -7547 628 9089 13756 12499 6516 -1256 -7786 -11405 -11479 -8448 -2753 4233 10404
1536 10404 12771 9889 2763 -5424 -11220 -12247 -8088 -678 6859 11327 11362 7407 1438 -4701 -9600
1551 -9600 -11827 -10495 -5274 2362 9729 13376 11131 4213 -3777 -9322 -10737 -8234 -3194 2792 7900
1566 7900 10604 9841 5233 -1767 -8880 -13001 -12072 -6365 1768 8800 12094 10556 5638 -540 -5764
1581 -5764 -8960 -9606 -7033 -1404 5552 11096 12003 7702 -169 -8079 -12652 -12151 -7248 -163 6330 10438
1597 10438 11100 8299 2872 -3431 -8850 -11319 -9632 -3647 4428 10887 12375 8283 926 -6154 -10391
1612 -10391 -10877 -8158 -3238 2905 8851 12395 11464 5683 -2766 -9811 -12427 -9835 -3566 3531 8552
1627 8552 10033 7948 3403 -2141 -7373 -10589 -10388 -6175 1096 8548 12958 12065 6250 -1815 -8283
1642 -8283 -10883 -9419 -5207 247 5406 8923 9366 6391 695 -5862 -10602 -11322 -7219 15 7191
1657 7191 11453 11239 6935 578 -5249 -8971 -9809 -7817 -3282 2973 8627 11206 8712 2378 -5014
1672 -5014 -10022 -10759 -7285 -1463 4496 8650 10195 8570 4077 -2040 -7920 -11118 -10258 -5588 1548
1687 1548 8215 11468 9701 3976 -2865 -8033 -9738 -8099 -3993 1334 6549 10110 10522 6798 -173
1702 -173 -7532 -12070 -11386 -6392 776 6961 10194 9460 5632 180 -5054 -8705 -9589 -6958 -1347 5527
1718 5527 10719 11532 7528 340 -6862 -10774 -10490 -6573 -1206 4200 8170 9683 7984 3296 -3028
1733 -3028 -8392 -10714 -8438 -2539 4496 9649 10655 7450 1675 -4341 -8304 -9453 -7798 -3906 1380
1748 1380 6861 10393 10119 5412 -1793 -8142 -10578 -8524 -3285 2518 6910 8665 7796 4420 -616
1763 -616 -6024 -9767 -10052 -6442 55 6656 10667 10409 5984 -490 -6014 -8889 -8508 -5384 -844 4181
1779 4181 7972 9322 7104 1848 -4823 -9938 -10911 -7318 -914 5488 9439 9835 6841 1930 -3412
1794 -3412 -7409 -9131 -7934 -3820 2281 7938 10625 8637 2879 -4140 -9136 -10200 -7203 -2144 3072
1809 3072 7124 9202 8568 4924 -1113 -7026 -10463 -9684 -4859 1751 7539 9924 8364 3642 -2000
1824 -2000 -6574 -8738 -7921 -4446 573 5592 9209 9702 6448 225 -6391 -10339 -9844 -5523 538 5699
1840 5699 8261 7882 5090 875 -3789 -7543 -8963 -6838 -1762 4570 9249 10158 6874 938 -5066
1855 -5066 -8578 -8798 -6247 -2098 2522 6508 8639 7806 3836 -2091 -7518 -9876 -7878 -2525 3516
1870 3516 7776 9020 7025 2890 -2222 -6451 -8749 -8066 -4785 426 5983 9476 9316 5273 -1064
1885 -1064 -6737 -9380 -7945 -3671 1586 5617 7664 7620 5174 636 -4886 -9102 -9930 -6603 -470 5831
1901 5831 9554 9299 5501 235 -4615 -7478 -7902 -5690 -1626 3352 7387 9070 7123 1971 -4386
1916 -4386 -9081 -10001 -6740 -1130 4383 7864 8484 6411 2537 -2105 -6231 -8443 -7612 -3658 2052 7151
1932 7151 9290 7536 2640 -3223 -7645 -8749 -6634 -2603 1909 5707 7999 7936 5046 -40 -5640
1947 -5640 -9122 -8705 -4669 1253 6069 8163 6969 3653 -663 -4727 -7363 -7591 -5232 -757 4492
1962 4492 8400 9206 6347 876 -4901 -8489 -8588 -5401 -573 3945 6708 7172 5462 1990 -2617 -6807
1978 -6807 -8766 -7060 -2288 3794 8249 9340 6708 1718 -3473 -6949 -7893 -6408 -3045 1395 5577
1993 5577 8093 7617 4020 -1622 -6764 -9209 -7416 -2660 2860 6785 8053 6691 3396 -945 -5079
2008 -5079 -7923 -8179 -5303 -73 5356 8704 8326 4551 -938 -5778 -8006 -7060 -3575 825 4663 6952
2024 6952 7327 5380 1165 -3998 -8136 -9191 -6306 -776 4874 8058 7668 4691 557 -3293 -5918
2039 -5918 -6851 -5616 -2076 2679 6877 8572 6680 1962 -3655 -7567 -8437 -6069 -1883 2578 5829
2054 5829 7155 6173 3311 -896 -5090 -7687 -7187 -3635 1726 6304 8230 6830 2841 -1997 -5875
2069 -5875 -7591 -6724 -3814 299 4435 7241 7675 5229 613 -4446 -7814 -7911 -4567 586 5145 7305
2085 7305 6669 3899 80 -3870 -6784 -7659 -5800 -1574 3681 7639 8721 6049 1107 -3919 -7044
2100 -7044 -7365 -4980 -977 3138 5876 6708 5445 2220 -2376 -6420 -8482 -6959 -2551 3105 7347
2115 7347 8445 6184 1932 -2325 -5296 -6529 -5839 -3276 688 4823 7374 7049 3592 -1609 -6292
2130 -6292 -8312 -6689 -2701 1891 5424 6952 6279 3893 250 -3701 -6717 -7514 -5208 -461 4519
2145 4519 7480 7031 3843 -695 -4543 -6542 -6258 -4035 -514 3327 6384 7426 5832 1925 -2979
2160 -2979 -6822 -8052 -5937 -1398 3359 6400 6661 4493 1144 -2359 -5077 -6541 -5736 -2760 1884
2175 1884 6248 8407 6945 2617 -2593 -6412 -7520 -5880 -2551 1344 4612 6302 5941 3608 -424
2190 -424 -4608 -7283 -7017 -3632 1434 5878 7855 6619 3141 -1158 -4677 -6488 -6410 -4361 -758 3441
2206 3441 6590 7219 4926 552 -4222 -7110 -6943 -3978 426 4356 6428 6272 4205 838 -2914 -5930
2222 -5930 -7259 -6055 -2232 2802 6694 7653 5316 1106 -3150 -5705 -6069 -4407 -1424 2101 5046
2237 5046 6612 5902 2732 -1853 -5930 -7668 -6464 -2741 1994 5655 6860 5499 2492 -1149 -4119
2252 -4119 -5738 -5556 -3483 248 4257 6925 6875 3787 -1097 -5319 -7261 -6263 -3281 539 3845 5837
2268 5837 6118 4416 1150 -2852 -6050 -6967 -4970 -630 3986 6752 6579 3880 -106 -3697 -5773 -6085
2284 -6085 -4550 -1605 2210 5723 7237 5960 2264 -2502 -6157 -7064 -5197 -1394 2769 5442 5998
2299 5998 4565 1691 -1762 -4789 -6419 -5906 -3080 1325 5470 7652 6443 2670 -1880 -5188 -6254
2314 -6254 -5120 -2517 664 3627 5583 5748 3805 -136 -4299 -6931 -6596 -3420 1014 4844 6628
2329 6628 5886 3305 -104 -3292 -5300 -5789 -4459 -1264 2782 5803 6616 4568 558 -3688 -6236 -6087
2345 -6087 -3789 -279 3078 5327 5873 4588 1784 -1829 -5094 -6672 -5696 -2305 2132 5565 6571
2360 6571 4835 1377 -2307 -4770 -5485 -4425 -2094 1068 4276 6321 6080 3229 -1166 -5095 -6928
2375 -6928 -5893 -2699 1209 4402 5719 5026 2852 -267 -3443 -5537 -5729 -3717 -48 3880 6515
2390 6515 6430 3718 -557 -4407 -6233 -5735 -3398 -238 2898 5042 5635 4424 1439 -2490 -5650 -6470
2406 -6470 -4519 -580 3530 5932 5935 3747 499 -2757 -4892 -5518 -4625 -2093 1447 4836 6485 5503
2422 5503 2155 -2054 -5264 -6173 -4428 -1337 1997 4335 5247 4477 2345 -959 -4111 -5993 -5701 -3270
2438 -3270 806 4613 6476 5649 2722 -1025 -3996 -5262 -4732 -2731 104 2927 5029 5578 3921 260
2454 260 -3781 -6301 -6195 -3417 394 3842 5486 5247 3484 765 -2265 -4653 -5587 -4539 -1550 2368
2470 2368 5318 6123 4278 683 -3127 -5409 -5584 -3770 -958 2114 4473 5504 4756 2371 -1260 -4599
2486 -4599 -6194 -5341 -2150 1807 4878 5738 4390 1549 -1664 -4095 -5028 -4515 -2410 624 3860 5953
2502 5953 5884 3256 -764 -4440 -6243 -5286 -2477 852 3464 4687 4527 3009 261 -2749 -5070 -5542
2518 -5542 -3647 -214 3539 5907 5812 3379 -142 -3345 -5107 -5121 -3509 -845 2042 4224 5163 4306
2534 4306 1652 -2045 -4997 -5846 -4163 -786 2873 4993 5241 3670 1073 -1721 -3982 -5213 -4822 -2557
2550 -2557 908 4263 5975 5150 2172 -1630 -4458 -5248 -4053 -1584 1233 3479 4741 4604 2827 -355
2566 -355 -3657 -5766 -5653 -3226 599 4007 5584 4933 2626 -365 -3009 -4481 -4406 -3014 -417 2527
2582 2527 4824 5388 3774 349 -3282 -5635 -5641 -3455 -65 2965 4694 4694 3498 1279 -1479 -4011 -5241
2599 -5241 -4357 -1590 2044 4881 5535 3911 718 -2563 -4570 -4880 -3691 -1488 1357 3726 5109 4750
2615 4750 2625 -732 -3967 -5537 -4774 -2004 1378 3975 4814 3890 1725 -1033 -3315 -4545 -4466 -2886
2631 -2886 73 3302 5442 5401 3241 -212 -3496 -5149 -4694 -2527 202 2598 3993 4192 3103 762
2647 762 -2310 -4652 -5380 -3744 -453 3097 5258 5294 3349 470 -2264 -4107 -4669 -3702 -1540 1297
2663 1297 3726 4956 4212 1591 -1781 -4464 -5252 -3807 -1011 2178 4203 4783 3786 1710 -939 -3307
2679 -3307 -4841 -4789 -2805 488 3697 5284 4626 2011 -1291 -3746 -4505 -3703 -1767 634 2939 4459
2695 4459 4581 3094 154 -3137 -5325 -5346 -3157 229 3202 4565 4253 2538 146 -2215 -3780 -4178
2711 -4178 -3161 -708 2233 4580 5156 3638 533 -2722 -4801 -5003 -3349 -700 1995 3733 4227 3450
2727 3450 1629 -1037 -3488 -4743 -4086 -1587 1734 4362 5074 3641 977 -1794 -3729 -4296 -3720 -2145
2743 -2145 390 3000 4721 4669 2745 -407 -3428 -4840 -4189 -1846 918 3183 4230 3702 2129 -261
2759 -261 -2671 -4328 -4646 -3218 -394 2809 4836 4958 3164 156 -2720 -4231 -4071 -2514 -292 1984
2775 1984 3536 4101 3241 935 -1923 -4329 -5047 -3772 -849 2428 4561 4647 3262 872 -1494 -3233
2791 -3233 -3998 -3555 -1796 868 3386 4606 3952 1504 -1648 -4039 -4677 -3629 -1283 1372 3335 4194
2807 4194 3745 2188 -191 -2690 -4356 -4355 -2672 329 3154 4509 4042 1884 -927 -3051 -3884 -3550 -2171
2824 -2171 60 2306 4119 4487 3340 641 -2508 -4569 -4726 -2874 -87 2407 3746 3643 2402 519
2840 519 -1572 -3338 -4066 -3447 -1196 1826 4203 4900 3564 929 -1956 -3880 -4292 -3232 -1172 1056
2856 1056 2891 3838 3520 1793 -724 -3224 -4464 -3912 -1689 1397 3875 4531 3559 1383 -1017 -2893
2872 -2893 -3794 -3704 -2468 -198 2350 4117 4315 2666 -301 -3072 -4357 -3790 -1771 598 2594 3697
2888 3697 3617 2497 412 -2013 -3948 -4477 -3336 -615 2266 4135 4239 2760 273 -2115 -3471 -3545
2904 -3545 -2528 -791 1463 3229 4103 3384 1267 -1512 -3890 -4649 -3542 -1053 1729 3494 3913 3010
2920 3010 1183 -802 -2544 -3587 -3460 -1925 542 3069 4424 3828 1690 -1199 -3396 -4093 -3361 -1657
2936 -1657 520 2432 3582 3675 2534 233 -2242 -3971 -4024 -2476 143 2674 4008 3673 2051 -307
2952 -307 -2365 -3524 -3553 -2606 -616 1677 3645 4287 3286 931 -1980 -3926 -4121 -2673 -314 1834
2968 1834 3192 3416 2514 932 -1089 -3004 -4008 -3493 -1538 1344 3659 4436 3361 1094 -1359 -3112
2984 -3112 -3588 -2950 -1432 594 2472 3643 3523 1939 -562 -2987 -4170 -3672 -1702 928 2990 3906
3000 3906 3319 1736 -252 -2091 -3290 -3511 -2503 -409 1978 3738 3950 2517 -202 -2594 -3778 -3465
3016 -3465 -1971 50 1897 3125 3416 2761 978 -1374 -3368 -4147 -3201 -858 1812 3519 3691 2579
3032 2579 505 -1527 -2849 -3305 -2651 -1181 937 2928 3946 3398 1529 -1126 -3295 -4052 -3269 -1252
3048 -1252 962 2716 3327 2867 1515 -367 -2189 -3447 -3452 -2123 268 2684 4052 3706 1808 -732
3064 -732 -2691 -3558 -3111 -1826 -52 1787 3085 3511 2555 591 -1914 -3649 -3783 -2298 47 2231
3080 2231 3479 3400 2117 285 -1576 -2957 -3425 -2750 -1036 1233 3141 3900 3052 893 -1559 -3291
3096 -3291 -3564 -2499 -595 1316 2660 3219 2733 1367 -628 -2621 -3751 -3470 -1649 922 3080 3789
3112 3789 3057 1172 -844 -2395 -3037 -2728 -1657 103 1972 3390 3481 2187 -200 -2550 -3817 -3439
3128 -3439 -1811 371 2290 3193 3065 1968 288 -1606 -2995 -3412 -2526 -630 1763 3452 3699 2425
3144 2425 156 -2004 -3250 -3191 -2113 -444 1322 2643 3332 2914 1256 -996 -3018 -3811 -2988 -864
3160 -864 1494 3021 3318 2388 841 -981 -2335 -3078 -2895 -1565 464 2558 3685 3347 1565 -754
3176 -754 -2793 -3484 -2902 -1290 615 2160 2899 2846 1743 -45 -1907 -3240 -3396 -2111 91 2353 3610
3193 3610 3301 1787 -295 -2070 -2999 -2870 -1893 -418 1280 2742 3348 2679 660 -1596 -3295 -3492 -2261
3210 -2261 -215 1853 2889 2932 2192 725 -923 -2437 -3208 -2886 -1287 869 2786 3545 2856 918 -1217
3227 -1217 -2711 -3114 -2406 -966 724 2196 2932 2821 1625 -235 -2281 -3424 -3280 -1657 561 2548
3243 2548 3285 2810 1350 -433 -1838 -2640 -2707 -1955 -267 1708 3131 3375 2163 29 -2135 -3311 -3075
3260 -3075 -1726 105 1658 2624 2775 2083 673 -1157 -2690 -3279 -2506 -685 1487 3070 3280 2185
3276 2185 397 -1412 -2601 -2858 -2203 -848 839 2297 3056 2791 1408 -719 -2607 -3343 -2775 -980
3292 -980 1016 2464 2852 2281 983 -477 -1883 -2871 -2834 -1732 105 2164 3346 3152 1587 -522 -2239
3309 -2239 -2946 -2498 -1375 107 1550 2499 2786 1947 366 -1562 -2949 -3188 -2161 -96 1906 3009
3325 3009 2946 1877 226 -1449 -2445 -2723 -2091 -819 867 2444 3169 2538 749 -1314 -2820 -3127 -2171
3342 -2171 -499 1264 2364 2602 2172 1101 -508 -2064 -3058 -2844 -1381 637 2469 3211 2564 1029
3358 1029 -892 -2186 -2664 -2283 -1196 239 1770 2746 2799 1821 -47 -1969 -3071 -2973 -1648 335 1960
3375 1960 2752 2502 1430 -10 -1382 -2350 -2613 -1993 -499 1391 2834 3137 2150 261 -1745 -2872 -2743
3392 -2743 -1757 -315 1100 2094 2513 2195 989 -748 -2339 -3027 -2447 -775 1218 2572 2854 2033 597
3409 597 -926 -2049 -2557 -2310 -1211 265 1859 2884 2750 1398 -473 -2172 -2916 -2435 -1092 629
3425 629 1922 2514 2223 1308 -91 -1524 -2632 -2820 -1893 -125 1819 2973 2849 1591 -157 -1747 -2437
3442 -2437 -2327 -1476 -247 1123 2249 2629 2090 602 -1339 -2738 -3032 -2057 -295 1493 2536 2558 1746
3459 1746 541 -898 -1976 -2443 -2151 -1008 698 2200 2868 2257 816 -1084 -2434 -2796 -2062 -756
3475 -756 717 1831 2395 2237 1326 -157 -1668 -2686 -2624 -1437 448 2099 2790 2271 917 -516 -1701
3492 -1701 -2269 -2239 -1452 -131 1378 2517 2716 1889 180 -1600 -2671 -2616 -1568 20 1434 2283 2245 1532
3510 1532 323 -960 -2211 -2587 -2093 -658 1124 2512 2852 2047 433 -1246 -2254 -2457 -1743 -636
3526 -636 627 1754 2339 2181 1150 -541 -2079 -2810 -2389 -837 948 2183 2518 1975 848 -470 -1554
3543 -1554 -2260 -2255 -1481 41 1603 2602 2498 1359 -374 -1883 -2526 -2208 -1195 200 1483 2176 2202 1586
3561 1586 282 -1249 -2337 -2617 -1888 -319 1415 2466 2451 1530 67 -1275 -2011 -2132 -1562 -512 832
3578 832 2006 2528 2159 756 -1028 -2378 -2677 -1889 -483 990 1951 2148 1742 783 -420 -1612 -2354
3595 -2354 -2161 -1096 509 1916 2598 2198 865 -682 -1904 -2348 -1952 -1040 269 1406 2179 2179 1449 89
3613 89 -1411 -2423 -2389 -1378 221 1687 2382 2131 1122 -64 -1224 -1995 -2168 -1650 -508 925 2225
3630 2225 2600 1850 281 -1284 -2327 -2326 -1437 -190 1051 1817 2036 1642 642 -679 -1917 -2568 -2066 -831
3648 -831 844 2119 2477 1888 573 -806 -1760 -2053 -1715 -820 370 1514 2199 2169 1117 -371 -1806
3665 -1806 -2590 -2108 -971 634 1701 2150 1886 1055 -92 -1147 -1987 -2125 -1543 -162 1409 2334 2364 1262
3683 1262 -215 -1520 -2151 -2016 -1205 -141 1027 1881 2072 1737 617 -929 -2063 -2383 -1746 -404 1185
3700 1185 2082 2152 1400 337 -893 -1687 -1965 -1710 -759 519 1727 2384 2075 893 -727 -2013 -2332 -1736
3718 -1736 -612 629 1428 1830 1636 929 -179 -1342 -2178 -2176 -1236 276 1688 2409 2052 987 -360 -1502
3736 -1502 -1951 -1809 -1180 -125 1040 1897 2088 1520 158 -1206 -2212 -2206 -1268 28 1405 2008 1901 1284
3754 1284 262 -866 -1709 -2045 -1714 -637 718 1896 2322 1741 358 -1029 -1892 -2001 -1443 -393 678
3771 678 1490 1913 1725 922 -353 -1640 -2274 -2023 -919 599 1669 2087 1689 656 -445 -1315 -1802 -1648
3789 -1648 -1031 -25 1270 2026 2137 1190 -113 -1459 -2188 -1924 -1046 222 1264 1743 1684 1165 226 -810
3807 -810 -1733 -2015 -1574 -360 1050 2074 2146 1319 67 -1167 -1764 -1824 -1257 -460 587 1540 2026 1743 749
3826 749 -646 -1819 -2195 -1633 -445 868 1725 1920 1430 577 -475 -1383 -1866 -1738 -941 265 1471 2154
3844 2154 2007 945 -434 -1583 -2004 -1651 -765 255 1189 1660 1687 1140 72 -1151 -1950 -2081 -1271 77
3862 77 1401 2041 1905 1042 -78 -1029 -1596 -1626 -1262 -366 775 1732 2023 1575 362 -1052 -1911 -2040 -1351
3881 -1351 -199 921 1577 1724 1344 562 -556 -1413 -1944 -1710 -829 519 1655 2054 1587 509 -729
3898 -729 -1593 -1750 -1405 -674 288 1194 1738 1754 1071 -102 -1414 -2051 -1910 -910 364 1481 1840 1549 843
3917 843 -92 -1060 -1519 -1697 -1212 -200 1053 1894 1996 1243 13 -1184 -1893 -1728 -1062 -62 811 1532
3935 1532 1693 1324 451 -651 -1613 -1968 -1542 -373 903 1832 1906 1308 243 -823 -1449 -1606 -1352 -671
3953 -671 333 1291 1900 1718 818 -467 -1586 -1955 -1561 -583 571 1357 1615 1437 757 -168 -1104 -1750 -1765
3972 -1765 -1133 70 1235 1900 1809 980 -265 -1234 -1657 -1535 -930 11 858 1485 1716 1239 313 -888 -1720
3991 -1720 -1939 -1276 -98 1047 1765 1656 1037 185 -649 -1290 -1551 -1382 -618 530 1537 1921 1555 454
4009 454 -780 -1622 -1816 -1288 -395 527 1274 1584 1465 785 -233 -1226 -1860 -1683 -866 352 1416 1802 1477
4028 1477 600 -394 -1207 -1593 -1425 -886 -27 970 1636 1715 1168 33 -1152 -1807 -1775 -934 170 1065 1525
4047 1525 1465 945 131 -687 -1386 -1692 -1222 -367 815 1720 1847 1224 190 -951 -1520 -1562 -1094 -304 551
4066 551 1238 1572 1381 594 -465 -1436 -1851 -1461 -509 689 1489 1714 1259 460 -417 -1148 -1511 -1386 -805
4085 -805 75 1071 1787 1663 918 -269 -1294 -1768 -1439 -688 278 1025 1386 1408 914 165 -803 -1557 -1774 -1227
4105 -1227 -122 1008 1693 1694 952 2 -909 -1371 -1411 -1066 -300 602 1359 1666 1326 465 -679 -1570 -1825 -1304
4125 -1304 -226 720 1372 1500 1153 413 -410 -1113 -1552 -1385 -723 357 1294 1768 1499 584 -533 -1403 -1581
4144 -1581 -1211 -584 253 977 1446 1428 931 -3 -1054 -1661 -1619 -855 210 1123 1578 1410 707 -99 -883 -1362
4164 -1362 -1426 -1018 -208 780 1465 1690 1217 172 -911 -1545 -1577 -971 -87 779 1299 1323 1088 405 -464 -1267
4184 -1267 -1594 -1390 -552 585 1451 1652 1198 314 -607 -1165 -1401 -1111 -506 211 1025 1550 1503 826 -270
4203 -270 -1253 -1736 -1418 -600 393 1161 1416 1295 719 -82 -835 -1344 -1431 -973 -61 866 1607 1535 867 -121 -1017
4224 -1017 -1458 -1315 -824 18 717 1259 1444 1066 313 -633 -1422 -1680 -1232 -232 760 1475 1482 940 174 -575
4244 -575 -1139 -1283 -1121 -529 370 1195 1648 1398 566 -542 -1318 -1585 -1212 -464 409 1085 1320 1175 587 -121
4264 -121 -932 -1446 -1386 -781 129 1116 1594 1357 670 -292 -1057 -1358 -1228 -761 -65 695 1267 1474 1102 156
4284 156 -796 -1504 -1511 -953 79 937 1407 1307 856 138 -670 -1108 -1425 -1115 -415 538 1305 1574 1192 262
4304 262 -701 -1312 -1385 -980 -311 477 1059 1308 1109 592 -318 -1138 -1601 -1338 -639 371 1223 1482 1134 455
4324 455 -326 -941 -1226 -1145 -701 26 828 1429 1516 906 -106 -1106 -1552 -1340 -687 160 866 1253 1229 824
4344 824 181 -583 -1232 -1451 -1001 -235 803 1414 1452 957 60 -785 -1296 -1292 -973 -277 474 1112 1360 1138 534
4365 534 -433 -1199 -1545 -1160 -303 570 1207 1297 928 331 -326 -941 -1284 -1200 -687 139 1066 1457 1359 646 -326
4386 -326 -1092 -1429 -1107 -534 190 862 1204 1184 734 29 -838 -1374 -1411 -872 64 966 1424 1310 801 42 -747
4407 -747 -1123 -1173 -819 -246 555 1208 1389 1070 304 -693 -1371 -1404 -880 -39 669 1140 1162 889 329 -253 -961
4428 -961 -1371 -1186 -534 390 1170 1459 1107 301 -488 -1124 -1223 -952 -446 266 861 1261 1210 704 -66 -934 -1392
4449 -1392 -1309 -674 258 973 1296 1098 517 -47 -751 -1100 -1157 -834 -129 698 1303 1415 932 -56 -920 -1332
4469 -1332 -1306 -711 -58 662 1031 1122 934 370 -422 -1114 -1407 -1038 -268 657 1278 1347 928 205 -504 -987 -1140
4490 -1140 -931 -463 241 904 1283 1214 618 -312 -1082 -1332 -1108 -412 412 1025 1206 965 522 -153 -810 -1151
4510 -1151 -1207 -838 16 828 1365 1261 607 -186 -912 -1192 -1024 -670 -17 551 1083 1147 901 211 -638 -1225
4530 -1225 -1380 -866 -61 760 1219 1199 780 134 -503 -984 -1145 -887 -329 376 1048 1330 1061 375 -513 -1115
4550 -1115 -1302 -838 -232 480 865 1074 957 533 -198 -846 -1255 -1221 -610 300 998 1328 1086 413 -280 -846
4570 -846 -1044 -941 -607 -2 657 1171 1181 772 2 -845 -1269 -1208 -651 107 763 1099 1039 661 86 -559 -999
4591 -999 -1128 -829 -263 593 1167 1339 967 100 -686 -1123 -1156 -787 -170 389 931 1126 948 450 -276 -959
4611 -959 -1376 -1096 -318 454 1057 1225 914 284 -301 -794 -1038 -1005 -617 46 815 1241 1207 623 -205 -914 -1181
4632 -1181 -1081 -499 198 781 1069 1026 664 35 -583 -1157 -1178 -833 -61 738 1252 1211 671 -54 -721 -1033 -1005
4653 -1005 -715 -190 418 935 1174 970 267 -498 -1096 -1294 -885 -196 576 1021 1073 747 264 -349 -828 -1106
4673 -1106 -1032 -438 294 910 1221 1045 370 -404 -988 -1085 -847 -372 241 745 978 995 634 -80 -688 -1187 -1146
4694 -1146 -655 112 895 1213 1101 503 -94 -662 -948 -939 -667 -200 535 1131 1250 828 118 -677 -1161 -1114 -646
4715 -646 16 519 934 988 779 300 -366 -938 -1156 -914 -356 468 1074 1187 852 188 -429 -902 -1004 -810
4735 -810 -338 143 777 1024 1033 615 -191 -820 -1217 -1032 -396 337 836 1096 908 422 -108 -616 -927 -1019 -700
4756 -700 -16 696 1182 1141 628 -160 -796 -1061 -991 -521 -34 516 930 974 755 212 -495 -1030 -1169 -834 -156
4777 -156 555 1019 1099 719 71 -451 -873 -941 -757 -374 294 837 1153 990 381 -392 -957 -1188 -916 -208 370
4798 370 774 970 826 375 -136 -664 -1015 -1034 -533 204 888 1150 973 392 -217 -716 -1010 -886 -535 44
4818 44 554 938 1080 726 48 -613 -1084 -1044 -664 22 644 1029 975 540 47 -467 -782 -940 -754 -282 376
4839 376 959 1111 881 182 -557 -1053 -1004 -664 -146 356 791 895 777 355 -213 -805 -1096 -967 -410 366
4859 366 951 1041 842 333 -292 -698 -928 -866 -438 101 620 1018 937 583 -115 -807 -1067 -998 -486 188 653
4880 653 950 833 558 149 -494 -894 -1031 -776 -124 548 1023 1051 624 -50 -594 -937 -878 -566 -175 305 809
4901 809 990 828 346 -330 -914 -1065 -857 -205 409 840 968 683 250 -309 -675 -889 -855 -447 179 807
4921 807 1059 943 454 -205 -787 -1031 -828 -316 183 667 901 780 541 38 -539 -993 -1003 -625 59 724
4941 724 1035 939 469 -73 -557 -790 -843 -565 -119 412 863 1033 773 206 -546 -999 -957 -641 -60 544 842
4962 842 895 676 229 -317 -679 -925 -839 -354 312 872 1088 824 293 -362 -824 -875 -736 -321 217 638 830
4983 830 835 461 -81 -730 -1039 -925 -499 183 781 937 828 431 -69 -520 -810 -889 -569 -97 528 984 977 634
5005 634 -35 -600 -975 -908 -521 -8 478 756 847 620 192 -347 -873 -1009 -744 -255 434 1000 956 584 118
5026 118 -464 -733 -834 -653 -251 153 717 907 872 439 -246 -834 -1061 -820 -274 322 714 795 659 327 -123
5047 -123 -588 -923 -896 -536 39 659 1036 931 478 -153 -679 -917 -772 -453 19 501 795 835 613 98 -461
5068 -461 -940 -990 -729 20 560 876 866 513 87 -384 -695 -826 -638 -306 306 785 1013 771 216 -426 -841
5089 -841 -928 -706 -177 373 692 835 675 329 -84 -627 -977 -903 -438 206 748 907 817 363 -269 -661 -832
5110 -832 -751 -428 58 527 813 901 575 33 -614 -998 -902 -444 122 612 814 773 498 40 -409 -724 -911
5131 -911 -717 -144 455 896 1007 650 86 -478 -824 -839 -595 -101 313 679 826 680 363 -244 -725 -989
5151 -989 -779 -259 339 807 911 699 234 -248 -609 -791 -770 -414 113 564 885 907 519 -166 -731 -1004 -889
5172 -889 -357 174 672 754 731 464 7 -473 -788 -937 -629 -73 551 937 896 525 -77 -513 -742 -824 -554
5193 -554 -127 339 705 904 736 208 -385 -840 -982 -726 -125 397 833 849 587 222 -252 -594 -833 -717
5213 -717 -343 162 741 996 853 308 -323 -792 -899 -696 -293 204 498 809 766 474 -24 -568 -906 -878 -461
5234 -461 101 640 908 756 428 -68 -492 -719 -766 -545 -101 463 851 909 626 88 -527 -897 -942 -550 40
5255 40 458 681 788 551 155 -254 -691 -887 -723 -265 383 856 985 668 167 -382 -722 -812 -619 -298 226
5276 226 531 803 793 400 -183 -685 -946 -792 -331 296 685 816 666 361 -70 -483 -744 -741 -513 -6 571
5297 571 905 843 428 -104 -634 -859 -750 -461 41 479 755 755 575 153 -364 -815 -1024 -657 -106 490 852
5318 852 848 529 58 -385 -701 -738 -619 -282 272 667 882 758 249 -297 -779 -917 -676 -212 300 648 783
5339 783 676 309 -128 -592 -813 -832 -425 108 635 977 811 388 -171 -652 -818 -717 -392 44 450 735
5359 735 800 532 32 -537 -927 -878 -509 115 564 800 803 531 4 -369 -645 -762 -614 -239 341 818 945
5380 945 713 125 -413 -787 -796 -602 -168 338 611 786 643 256 -179 -677 -849 -824 -313 327 761 891 657
5401 657 227 -321 -592 -731 -650 -402 -5 525 870 847 458 -49 -632 -894 -740 -336 141 639 736 641 411
5422 411 31 -395 -710 -781 -554 -88 477 907 869 543 -26 -479 -797 -743 -480 -120 337 628 780 642 241
5443 241 -306 -767 -878 -676 -139 396 781 766 564 165 -235 -595 -692 -638 -356 84 647 885 799 325 -266
5464 -266 -679 -790 -686 -260 214 494 737 714 391 -6 -526 -806 -853 -545 27 623 886 834 399 -112 -526
5485 -526 -726 -733 -479 -52 365 671 832 668 152 -391 -846 -903 -541 -44 511 727 694 544 151 -190 -580
5506 -580 -764 -698 -251 278 710 887 629 171 -412 -707 -718 -551 -251 193 586 726 658 439 -105 -585 -903
5527 -903 -781 -336 197 619 873 653 305 -108 -491 -668 -669 -433 -12 460 803 849 484 -29 -594 -872 -780
5548 -780 -396 89 411 688 654 536 134 -284 -663 -845 -617 -145 366 792 839 495 84 -353 -685 -748 -490
5569 -490 -205 201 637 804 693 292 -233 -682 -859 -621 -189 363 679 770 603 260 -164 -500 -769 -648
5589 -648 -420 115 586 876 788 341 -228 -635 -771 -660 -300 111 489 619 725 465 91 -423 -794 -820 -510
5610 -510 -18 545 781 720 438 -28 -347 -633 -699 -554 -188 267 671 824 626 139 -389 -727 -788 -512 -75
5631 -75 394 660 688 517 246 -149 -568 -810 -683 -371 255 673 819 597 243 -253 -591 -686 -604 -298 96
5652 96 467 716 701 372 -112 -556 -859 -728 -371 133 562 716 603 413 -39 -372 -664 -706 -493 -72 430
5673 430 783 805 502 22 -528 -756 -649 -446 -30 372 602 710 525 177 -298 -687 -848 -610 -148 367
5693 367 736 776 534 134 -288 -607 -689 -597 -282 115 552 794 685 274 -181 -660 -841 -642 -213 231 563
5714 563 690 553 375 -65 -442 -677 -766 -430 46 519 772 736 375 -168 -484 -711 -667 -352 10 349 605
5735 605 726 555 141 -398 -749 -819 -481 -24 433 677 685 454 70 -251 -572 -635 -611 -198 224 673 791 614
5757 614 150 -367 -655 -709 -528 -161 237 513 698 589 318 -139 -519 -777 -718 -372 138 603 801 594 232
5778 232 -195 -459 -641 -596 -417 23 388 698 751 463 11 -534 -729 -718 -393 119 442 611 629 393 80
5799 80 -301 -595 -702 -561 -126 388 700 771 515 67 -388 -600 -687 -466 -152 220 539 643 582 241 -189
5820 -189 -591 -764 -625 -192 277 609 675 513 201 -177 -541 -655 -618 -378 79 505 731 746 334 -155 -557
5841 -557 -658 -584 -268 45 414 570 688 434 18 -392 -724 -775 -486 3 449 715 678 455 -3 -349 -633
5862 -633 -550 -435 -133 202 568 717 561 162 -353 -688 -699 -482 -75 409 576 582 423 233 -125 -464 -611
5883 -611 -592 -297 172 581 752 587 186 -260 -562 -711 -528 -252 91 460 612 620 404 -24 -453 -680 -682 -364
5905 -364 119 508 694 632 344 -42 -372 -603 -559 -390 -59 347 686 731 544 15 -456 -684 -652 -408 -68
5926 -68 306 542 605 512 164 -215 -582 -737 -538 -222 308 604 702 520 100 -221 -520 -589 -462 -234 87 443
5948 443 642 590 330 -96 -516 -740 -561 -192 181 536 631 510 220 -14 -388 -554 -574 -434 21 431 679
5969 679 655 415 -106 -516 -591 -557 -297 10 347 585 620 532 122 -353 -628 -755 -461 -100 371 651 599 360
5991 360 40 -254 -512 -558 -467 -201 122 558 724 509 214 -278 -604 -607 -496 -107 247 486 577 445 259 -83
6013 -83 -488 -652 -577 -290 156 589 718 593 216 -148 -489 -561 -510 -316 29 333 554 634 378 70 -416 -607
6035 -607 -605 -375 87 418 610 571 394 36 -283 -527 -578 -464 -135 250 595 691 504 70 -316 -578 -614 -402
6057 -402 -86 267 501 524 523 221 -142 -565 -712 -542 -217 218 635 614 535 153 -167 -431 -535 -467 -277 65
6079 65 454 678 617 331 -134 -498 -656 -583 -238 144 404 516 527 338 -7 -316 -576 -624 -463 -9 402 648
6101 648 616 369 -90 -377 -583 -480 -340 -47 241 535 601 517 166 -341 -558 -739 -446 -33 339 556 613
6122 613 460 101 -217 -503 -591 -503 -256 192 463 650 603 236 -218 -533 -595 -488 -143 137 399 519 508 258
6144 258 -96 -464 -616 -647 -304 102 457 667 604 232 -48 -429 -516 -544 -314 -43 313 543 642 448 54 -372
6166 -372 -596 -609 -343 44 322 496 508 331 121 -275 -531 -600 -503 -110 264 630 680 505 -4 -259 -576 -579
6188 -579 -444 -124 168 446 568 488 308 -166 -496 -663 -540 -200 225 441 579 433 248 -110 -366 -496
6208 -496 -524 -341 98 399 621 606 253 -111 -442 -614 -524 -234 108 280 470 491 348 75 -296 -539 -646
6229 -646 -402 -9 336 547 626 374 44 -221 -488 -512 -348 -124 196 484 562 504 156 -255 -576 -646 -437 -91
6251 -91 252 452 545 402 175 -71 -411 -543 -517 -293 107 514 641 511 180 -193 -488 -585 -504 -219 38 295
6273 295 532 517 323 -48 -325 -576 -588 -326 83 451 592 509 306 49 -355 -520 -474 -403 -141 258 538 654
6295 654 451 49 -336 -565 -576 -310 42 275 458 510 393 203 -179 -504 -650 -519 -190 274 563 557 422
6316 422 72 -190 -429 -521 -426 -209 133 366 546 601 301 -84 -415 -605 -509 -241 83 465 541 444 225 -2
6338 -2 -312 -519 -583 -316 6 358 604 598 317 -32 -398 -551 -501 -319 4 230 464 486 392 99 -265 -532 -594
6361 -594 -461 -54 287 563 548 384 45 -266 -420 -496 -433 -173 179 456 622 545 220 -194 -557 -607 -431 -129
6383 -129 190 412 498 425 223 -50 -364 -583 -542 -282 132 481 641 491 220 -104 -407 -480 -491 -288 -49 302
6405 302 489 534 391 -2 -373 -604 -566 -352 35 342 579 528 292 81 -220 -454 -482 -390 -122 249 504 595
6427 595 437 76 -273 -446 -484 -348 -13 193 415 544 438 208 -133 -481 -599 -502 -231 222 472 544 383
6448 383 143 -125 -371 -500 -456 -305 60 440 609 566 281 -36 -375 -610 -493 -302 66 344 549 474 281
6469 281 -1 -263 -448 -570 -414 -22 312 604 584 305 -63 -365 -454 -457 -328 -39 187 423 541 440 165
6490 165 -213 -537 -555 -472 -47 257 457 573 394 119 -193 -409 -521 -466 -226 121 454 637 525 195 -181
6511 -181 -413 -545 -496 -147 122 338 482 450 317 -11 -401 -551 -562 -282 89 441 604 468 264 -87 -350
6532 -350 -455 -447 -268 -75 219 531 587 346 25 -363 -599 -534 -339 -34 305 471 475 355 106 -225 -503 -547
6554 -547 -427 -175 239 437 606 451 69 -262 -449 -519 -367 -68 161 367 496 425 228 -97 -414 -592 -468
6575 -468 -237 199 470 480 462 140 -94 -316 -498 -477 -297 -14 340 575 506 309 -120 -372 -528 -446 -228 50
6597 50 286 449 469 357 6 -310 -501 -558 -396 -85 330 525 563 317 -12 -254 -420 -437 -359 -130 146 451
6619 451 533 436 177 -203 -473 -589 -412 -78 252 387 484 381 214 -71 -357 -511 -481 -313 76 435 566
6640 566 493 198 -106 -430 -479 -390 -200 92 345 514 509 333 -25 -357 -517 -558 -224 63 344 521 425 266
6662 266 11 -238 -443 -505 -329 -81 265 508 540 406 43 -303 -522 -472 -319 -108 192 389 430 359 155 -76
6684 -76 -410 -511 -447 -143 235 482 576 383 121 -174 -380 -461 -345 -211 71 366 466 518 204 -47 -359 -495
6706 -495 -425 -181 156 303 511 389 202 38 -294 -450 -524 -319 2 295 592 585 293 -23 -313 -437 -432 -254
6728 -254 -12 230 380 418 355 88 -252 -485 -547 -364 -61 216 460 472 273 36 -201 -392 -429 -359 -135 143
6750 143 426 578 455 116 -194 -434 -483 -357 -134 154 409 483 374 193 -54 -322 -524 -494 -295 56 393
6771 393 551 402 257 -126 -373 -439 -421 -235 -9 285 472 471 320 62 -343 -544 -492 -281 22 215 433 436
6793 436 296 39 -209 -385 -486 -359 -126 264 460 503 343 85 -280 -455 -441 -289 -18 162 405 419 367
6814 367 230 -84 -410 -564 -434 -138 175 395 482 405 143 -131 -304 -398 -393 -266 21 377 543 449 258 -82
6836 -82 -387 -503 -413 -204 107 326 369 429 252 27 -261 -440 -464 -382 -21 328 473 510 278 -41 -274 -426
6858 -426 -446 -291 -57 177 354 456 361 131 -232 -435 -473 -278 -77 199 393 396 269 97 -134 -379 -451 -425
6880 -425 -260 93 387 552 423 164 -137 -424 -470 -333 -78 77 291 485 421 219 -81 -316 -542 -485 -256
6901 -256 28 333 498 438 235 -67 -329 -411 -440 -274 -96 249 407 506 372 51 -219 -481 -457 -248 32 256
6923 256 416 371 308 107 -184 -382 -485 -411 -136 217 400 470 294 77 -175 -383 -423 -396 -200 78 275 402
6945 402 428 228 -77 -385 -502 -420 -126 157 386 403 356 157 -88 -305 -427 -403 -286 26 285 462 507 240
6967 240 -10 -332 -448 -426 -191 60 196 334 387 269 98 -199 -463 -479 -375 -47 260 471 485 264 3
6988 3 -211 -357 -391 -290 -104 110 369 473 357 183 -187 -408 -497 -327 -87 204 394 355 294 145 -75 -262
7010 -262 -398 -380 -263 78 384 563 455 128 -121 -345 -442 -367 -183 42 255 371 408 238 13 -249 -479
7031 -479 -434 -262 7 329 442 383 190 -23 -177 -360 -408 -316 -91 185 449 528 336 39 -291 -447 -405 -233
7053 -233 -42 163 327 364 319 83 -129 -414 -473 -378 -119 187 415 454 365 65 -137 -375 -400 -283 -183 50
7075 50 279 425 448 193 -131 -380 -447 -403 -199 123 346 369 324 244 -55 -273 -398 -441 -264 -47 288 461 446
7098 446 261 -62 -328 -414 -344 -203 -7 188 317 350 338 83 -150 -451 -473 -299 -72 241 369 340 242 37
7120 37 -173 -330 -307 -275 -140 93 390 475 407 220 -113 -340 -413 -289 -51 101 289 413 359 154 17 -281
7142 -281 -462 -415 -233 94 337 436 412 203 -93 -297 -366 -405 -206 -22 226 407 408 282 -31 -267 -404 -371 -226
7165 -226 37 267 375 351 189 23 -173 -371 -391 -301 -57 186 351 415 274 -10 -223 -371 -406 -227 -82 144
7187 144 319 364 363 172 -91 -377 -448 -355 -100 189 332 413 310 140 -53 -289 -359 -316 -197 71 244 376 408
7210 408 197 -81 -283 -445 -357 -150 83 246 351 372 253 8 -176 -426 -447 -301 -92 267 417 381 245
7231 245 22 -257 -312 -365 -205 -46 160 349 347 347 117 -186 -408 -470 -298 -89 175 364 379 304 83 -116 -338
7254 -338 -317 -359 -189 74 326 408 362 104 -152 -314 -400 -281 -114 93 220 309 327 173 -3 -286 -424 -459 -230
7277 -230 100 326 407 339 158 -19 -169 -347 -288 -264 -21 225 405 407 339 21 -292 -337 -366 -238 4 237 358
7300 358 394 238 65 -174 -325 -430 -322 -160 171 382 437 287 75 -139 -320 -382 -292 -62 70 294 395
7321 395 378 200 -77 -300 -414 -309 -97 115 285 336 279 160 -25 -219 -337 -347 -195 -17 251 386 379 248
7343 248 -96 -298 -406 -325 -189 59 200 282 355 245 27 -170 -334 -393 -273 -65 264 404 356 226 24 -158
7365 -158 -240 -336 -255 -116 176 300 353 363 108 -168 -348 -411 -226 -85 151 305 340 270 160 -54 -231 -327 -346
7388 -346 -183 96 345 426 401 156 -82 -246 -333 -322 -104 9 209 363 396 227 33 -207 -357 -360 -225 81
7410 81 227 370 308 250 -22 -180 -264 -312 -273 -32 127 300 424 250 78 -215 -378 -326 -197 -27 154 297
7432 297 384 298 138 -115 -234 -362 -340 -153 174 324 400 278 62 -88 -262 -382 -287 -115 122 223 378 302
7454 302 203 -20 -304 -340 -374 -56 95 300 338 319 143 25 -161 -300 -263 -186 58 217 432 356 250 27 -231
7477 -231 -341 -295 -195 -65 177 305 318 237 41 -181 -319 -432 -237 -37 227 354 385 203 45 -86 -273
7498 -273 -330 -232 -131 109 309 389 358 119 -107 -315 -399 -282 -79 63 234 331 310 155 -85 -187 -399 -344 -132
7521 -132 26 309 405 287 103 -73 -249 -304 -283 -172 56 181 320 335 227 61 -165 -353 -356 -136 47 249
7543 249 350 336 198 24 -167 -261 -306 -281 -80 123 320 415 212 9 -146 -264 -306 -189 -21 88 265 363
7565 363 313 136 -52 -284 -353 -312 -127 131 322 323 269 79 -112 -180 -300 -267 -210 29 213 351 347 228 -34 -290
7589 -290 -311 -293 -169 74 259 270 253 170 7 -190 -316 -355 -230 -22 232 342 394 184 -28 -163 -273 -319 -183
7612 -183 -95 128 256 368 306 97 -122 -318 -334 -202 -29 178 300 278 225 62 -87 -241 -305 -262 -98 64
7634 64 265 411 322 82 -68 -282 -357 -244 -99 103 219 252 241 201 -23 -218 -309 -334 -142 72 323 375 295
7657 295 199 -66 -143 -300 -319 -212 -74 156 329 288 234 -22 -202 -352 -342 -174 25 219 232 286 262 45 -113
7680 -113 -231 -355 -216 -114 122 315 333 264 92 -200 -291 -264 -186 -87 94 220 318 262 129 -63 -314 -355 -287
7703 -287 -136 43 297 296 212 80 -85 -200 -274 -249 -156 -27 247 375 290 125 -11 -229 -271 -250 -142 19 199
7726 199 255 232 166 -2 -164 -234 -284 -244 0 184 302 308 161 44 -196 -226 -258 -240 -103 108 262 332 266 76
7750 76 -130 -313 -354 -228 -27 119 299 251 210 71 -34 -245 -306 -247 -156 72 254 306 272 145 -103 -275 -292
7773 -292 -264 -117 62 173 286 276 200 28 -267 -303 -327 -173 101 225 345 266 113 -61 -164 -233 -239 -241 -40 180
7797 180 287 301 212 9 -171 -244 -275 -166 2 129 216 314 173 81 -70 -254 -284 -268 -76 115 281 308 190
7820 190 62 -155 -235 -266 -241 -92 73 202 235 249 136 -36 -338 -352 -301 -120 102 267 212 186 154 -23 -159
7843 -159 -262 -231 -168 22 214 260 266 136 -72 -208 -241 -315 -135 -31 170 279 235 214 53 -145 -268 -332 -222
7866 -222 -8 197 274 284 140 -28 -129 -215 -242 -243 -70 84 248 350 236 94 -80 -262 -288 -236 -58 168 229
7889 229 236 188 109 -112 -241 -323 -324 -187 56 228 308 246 68 -52 -177 -258 -281 -137 -60 153 236 289 159 1 -193
7914 -193 -301 -187 -201 60 232 294 181 138 25 -99 -283 -272 -182 -78 150 287 335 173 -59 -201 -268 -225 -146
7937 -146 -2 116 165 215 206 62 -116 -272 -336 -238 -51 153 316 293 223 20 -82 -168 -217 -216 -81 59 171 252
7961 252 261 125 -62 -187 -333 -256 -36 101 101 233 237 152 20 -137 -214 -261 -158 13 196 299 238 129 -87 -169
7985 -169 -240 -239 -157 -66 110 261 341 224 79 -122 -339 -306 -112 -15 152 267 221 162 79 -134 -235 -238 -281 -69 78
8010 78 251 269 205 67 -122 -231 -258 -239 -49 74 167 241 217 129 -44 -186 -276 -281 -91 63 176 309 200 2
8034 2 -73 -206 -273 -166 -181 -42 103 273 283 182 11 -197 -350 -211 -178 13 157 252 204 142 -10 -154 -194 -306
8058 -306 -204 -29 161 247 309 185 -27 -150 -266 -285 -178 -59 78 115 183 210 85 -68 -197 -244 -230 -75 125
8081 125 177 200 191 68 -24 -144 -166 -229 -121 14 218 299 243 95 -49 -212 -213 -188 -74 37 169 228 172 130 -16
8106 -16 -183 -247 -230 -108 19 165 220 219 147 -75 -99 -173 -242 -164 -7 58 242 214 210 68 -177 -195 -231 -119 -11 124
8132 124 166 205 145 48 -121 -193 -266 -223 -70 65 230 310 217 67 -84 -205 -255 -204 -34 85 160 146 203 109 -55
8157 -55 -154 -258 -266 -85 63 215 245 239 131 -50 -137 -180 -225 -132 -16 142 226 180 153 -30 -164 -219 -230 -125 -20
8182 -20 100 155 202 163 59 -36 -163 -296 -222
8191b22
$$ Imaginary data points
##PAGE= N=2
##DATA TABLE= (X++(I..I)), XYDATA
0 0 0 0 0 0 0 0 0 0 0 0 0 0 0 5 -8 8 -8 8 -11 16 -16 22 -24 29 -33 40 -46 52 -60 70 -82 92 -103 117 -132 150
36 150 -168 188 -211 235 -260 289 -322 355 -395 435 -481 529 -583 642 -708 781 -859 950
54 950 -1050 1163 -1291 1437 -1610 1813 -2058 2360 -2740 3239 -3929 4941 -6584 9715 -17871
69 -17871 88082 185672 56636 -38909 -109106 -100619 -81230 -48658 -26482 15747 54070 79518
81 79518 59344 12301 -45347 -77050 -79966 -48069 2781 63574 103734 107171 68274 12395 -41200
94 -41200 -78269 -98325 -90406 -50104 14734 70435 86223 54122 1529 -37769 -46771 -36935 -24067
107 -24067 -10617 14434 51080 79387 75469 37614 -14978 -60144 -86580 -89017 -63847 -13489
119 -13489 43785 79839 75421 36866 -9756 -39557 -45761 -36523 -20024 4805 37351 64303 66260
132 66260 37801 -5952 -44448 -67408 -74362 -63757 -31673 17198 63205 81901 63429 20433
144 20433 -22553 -47581 -51618 -39171 -12649 24965 60779 72415 47235 -2220 -47472 -68231
156 -68231 -64874 -48815 -25856 5025 41099 69065 72401 45813 716 -41604 -63299 -57329 -27317
169 -27317 16428 56370 71654 50857 4633 -40263 -62541 -60699 -46488 -26410 1801 37841
181 37841 68006 72894 45316 -432 -39250 -53913 -45177 -24215 489 26108 46919 50291 28064
194 28064 -11737 -48169 -63971 -55840 -30467 3840 38590 62203 63314 39926 3953 -26175
206 -26175 -39011 -36409 -27752 -16619 1132 26274 46316 43147 12549 -28340 -55121 -55605 -35041
219 -35041 -5662 23655 47179 57798 49560 23485 -9720 -36059 -46692 -42171 -26979 -4344
231 -4344 22433 43631 45609 22860 -12960 -41086 -48367 -37191 -16950 6780 32276 53573 59392
244 59392 41248 3658 -35741 -58220 -55406 -33093 -3248 23967 41446 43131 26424 -2219
256 -2219 -28467 -40697 -37294 -23758 -3624 22222 47858 60086 47023 10532 -31597 -57649
268 -57649 -56747 -35304 -7390 16795 34101 42023 35447 12600 -17695 -39849 -43021 -28472 -4364
281 -4364 21244 41919 50315 40096 12391 -21497 -45783 -50469 -37292 -15639 6384 25879 39909
294 39909 41646 24778 -6356 -35038 -44441 -31274 -6350 17039 32108 37423 32526 16776 -6897
307 -6897 -30357 -43632 -41411 -25712 -3162 19760 37402 43495 32299 5724 -23353 -38807 -33966
320 -33966 -15877 3824 19111 29662 33900 27396 7354 -20507 -43098 -48366 -33997 -7916 18374
333 18374 36631 42808 35246 14733 -11450 -31525 -36767 -27421 -10327 8861 26913 38782 36566
346 36566 15762 -16595 -44001 -51275 -35612 -8265 16646 31843 37907 36272 24372 1466 -25482
359 -25482 -42311 -39689 -19717 6744 28709 39082 34551 15688 -10962 -34401 -43855 -35726 -15354
372 -15354 7655 26373 37912 40429 30370 6605 -23181 -43444 -42657 -22414 4012 23940 32049
385 32049 29160 17616 -385 -20498 -34945 -36631 -23876 -1717 21314 37304 41303 31444 9259
398 9259 -17683 -37236 -39312 -24831 -4168 12428 22139 26265 24503 13372 -7010 -28662 -39041
411 -39041 -30920 -8272 16872 33383 36984 29476 14137 -5957 -25431 -36376 -33488 -18620 876
424 876 18335 29956 32368 22460 1049 -23388 -37996 -34427 -14965 9089 26698 33152 30511
437 30511 20959 4677 -16831 -36199 -42576 -30834 -6275 19157 35052 36824 25098 4352 -17595
450 -17595 -32020 -32963 -20780 -1353 17645 30471 34293 27686 10278 -14458 -37168 -45417 -33441
463 -33441 -7727 17886 32554 33919 25303 10571 -7406 -23859 -32305 -27830 -11213 10697 28707
476 28707 35459 28901 11266 -11722 -31841 -40117 -31931 -11569 10347 24957 30029 27785 19031
489 19031 3297 -16721 -32246 -33734 -18714 5329 25594 32683 26002 11141 -5631 -20568 -30426
502 -30426 -30998 -20358 -1657 17574 30395 33186 25421 8539 -12479 -29165 -33209 -22436 -2821
515 -2821 15708 25425 24955 17138 5056 -9786 -24805 -33410 -28932 -10823 12921 30976 36327 28862
529 28862 12404 -7384 -24174 -31709 -27062 -12792 5119 19859 27057 25227 14505 -3207 -23012
542 -23012 -36007 -33745 -15268 10486 30179 35949 28974 14877 -1680 -17801 -29578 -32019 -22119
555 -22119 -2840 17789 30657 30158 17360 -1986 -20676 -31738 -30319 -16284 4434 22481 31079
568 31079 29230 19734 5084 -12550 -28489 -35149 -27367 -7292 15334 29429 29407 17548 1173
581 1173 -13376 -22808 -25356 -19350 -5328 12397 26493 31006 24709 9838 -9295 -26268 -34060
594 -34060 -28318 -11218 8873 23159 26524 20219 8510 -4109 -15455 -23163 -23461 -13442 4433
607 4433 22318 31211 27172 12905 -5506 -21685 -30121 -27994 -16118 369 15142 23729 24522 18076
621 18076 5645 -10049 -23911 -28956 -20218 -379 20285 30504 26455 13208 -1548 -13891 -23047
634 -23047 -27768 -24441 -11217 8418 26152 33084 25731 8097 -11297 -24370 -26877 -18972 -4084
647 -4084 12029 22878 25042 18962 7185 -7635 -22577 -31970 -29780 -14021 8752 27395 33022
660 33022 24626 8399 -7272 -17654 -21868 -20153 -11880 2162 17582 26738 24567 11557 -6377
673 -6377 -22437 -30491 -27029 -13269 5133 20536 27175 24187 14319 1433 -11193 -20743 -23970 -17966
687 -17966 -3270 14178 25348 24305 12761 -2676 -15890 -23621 -24362 -17219 -3474 12549 24386
700 24386 27218 20409 7270 -7299 -19121 -24577 -21515 -9436 7404 21358 24995 17074 2821
713 2821 -10676 -19505 -22477 -19329 -9577 5120 19839 28380 26260 13966 -3517 -18972 -26561 -23768
727 -23768 -12247 3178 16289 22100 18925 9412 -2399 -13720 -22313 -24359 -16454 699 19717
740 19717 30853 28383 14547 -3010 -16641 -22851 -22026 -15788 -5033 8367 20193 24470 18085
753 18085 3381 -13176 -24805 -26251 -16459 788 17839 26739 24684 14556 1729 -9722 -18481
766 -18481 -23195 -21765 -11799 5013 21331 27802 20183 3477 -12485 -20397 -19769 -13420 -3906 7222
780 7222 17752 23654 21341 10303 -5651 -20079 -26645 -23110 -11267 3998 16712 22318 18928
793 18928 8877 -2846 -12320 -17694 -17914 -11754 461 14865 24512 23908 13154 -2722 -16968 -24281
807 -24281 -23150 -14777 -2116 11177 20610 22236 15390 3246 -8927 -17195 -19757 -15476 -4542 10229
821 10229 22232 24977 16528 1394 -13472 -22256 -23148 -17295 -6851 5819 17611 24162 21379 9718
835 9718 -5619 -17887 -22397 -18046 -6631 7651 19190 22752 16928 4931 -8036 -17792 -22097
848 -22097 -20338 -12149 1226 16063 26037 25254 13063 -4076 -17459 -21602 -17286 -7931 3033 12940
862 12940 19079 18443 10619 -1965 -14805 -22729 -22515 -13907 124 14450 23558 23389 14259 418
876 418 -11713 -17916 -17734 -12619 -3851 7266 17161 20804 15190 2181 -12160 -21408 -21837 -14205 -2114
891 -2114 9987 18552 21173 16849 6866 -5120 -14758 -19346 -17623 -9827 2567 15382 22133 18438
905 18438 5902 -8795 -18492 -19890 -14550 -5802 3867 13049 19998 21315 14062 21 -14713 -23017
919 -23017 -21383 -11593 1646 13282 19288 17551 9262 -2038 -12056 -17942 -18088 -12201 -1275 11697
933 11697 21811 24161 16216 1030 -14149 -22111 -20520 -12189 -1673 7968 15211 18021 14475 4852
947 4852 -7775 -17883 -21078 -15437 -3160 10779 20695 22571 15766 3087 -9864 -18128 -19346 -14949
961 -14949 -6918 2938 13021 19780 18749 8770 -5747 -17450 -20689 -14850 -3825 7482 15463 18383
975 18383 15958 8154 -3157 -14146 -20171 -18848 -10905 497 11848 19264 19205 10959 -1864 -13077
989 -13077 -17808 -14949 -7238 1896 9911 15621 17209 13083 2677 -10560 -20444 -21746 -14205 -1831
1003 -1831 10070 17529 18566 13084 3185 -7266 -14520 -16405 -12737 -4538 5948 15465 20010 16516
1017 16516 5313 -9096 -19791 -21725 -14868 -3829 6566 14055 17633 16305 9284 -2126 -13237
1030 -13237 -19329 -17232 -7876 4817 15372 19530 15974 6180 -6003 -15661 -19145 -15734 -7645 1946
1044 1946 10977 17750 19331 13381 931 -12708 -20365 -18449 -8748 3217 12304 15804 14183 8418
1058 8418 -107 -9728 -16995 -18411 -12482 -1484 10356 18522 19977 13867 2242 -9964 -17242 -17034
1072 -17034 -10685 -1685 6623 12487 14759 12543 5161 -5840 -15893 -19820 -14795 -3294 8779 16646
1086 16646 17999 13559 5238 -4574 -12661 -16393 -14587 -7885 1630 10963 16642 15855 8269 -3433 -14180
1101 -14180 -18683 -14887 -5241 5139 12445 15638 15031 10180 1198 -9768 -18096 -19187 -12141 -370
1115 -370 10950 17129 16218 9423 -502 -10036 -15654 -15321 -9317 39 9216 15473 17294 13446 3800
1130 3800 -8678 -18560 -20587 -13731 -1773 9334 15359 15311 10546 3265 -4963 -12264 -15950 -13426 -4566
1145 -4566 6756 15777 18598 14086 4127 -7565 -16142 -18238 -13545 -4662 4552 11480 14750 13783 8201
1160 8201 -935 -10747 -16835 -15535 -6855 4850 13782 16488 13014 5702 -3236 -11243 -15885 -15252 -9364
1175 -9364 -204 9160 15627 16549 11345 1531 -9095 -15926 -15814 -8720 1571 9947 13566 12567 8419
1190 8419 1888 -6451 -14383 -17783 -13768 -3558 8435 16548 17539 11945 2767 -6200 -12380 -14346 -11382
1205 -11382 -4327 4405 11570 14710 12539 5466 -4556 -14088 -18383 -14967 -5071 6359 14482 16632
1219 16632 13104 6158 -2048 -9585 -14559 -14770 -9046 981 10930 16244 14681 6969 -3473 -12512
1233 -12512 -16722 -14212 -6369 3160 10983 14972 14478 9808 1681 -7784 -15358 -17252 -11635 -643 10125
1248 10125 15515 13671 6857 -1199 -8072 -12517 -13310 -9563 -1913 7266 14454 16521 12434 3435 -6836
1263 -6836 -14434 -16489 -12134 -3341 6097 12200 12979 9381 3400 -3589 -10013 -13895 -12646 -5504 4919
1278 4919 13844 17120 13257 4671 -4940 -11968 -14668 -12748 -7009 925 8643 13401 13226 8024 -377
1293 -377 -9159 -14760 -14187 -7169 3177 11962 15420 12933 6415 -1327 -8341 -13176 -14479 -11146 -3266
1308 -3266 6730 14369 15847 10673 1373 -7921 -13599 -13747 -8396 218 8177 12939 13210 9424 2686
1323 2686 -5551 -13082 -16662 -14026 -5135 6257 14765 16194 10742 2179 -5266 -9920 -11551 -9999 -4948
1338 -4948 2894 10950 15307 13261 5174 -5527 -14017 -16570 -12757 -4675 4269 10945 13478 11511 6205
1353 6205 -604 -7230 -12045 -12787 -8067 909 10011 14715 12883 5684 -3386 -10451 -13645 -12324 -7469
1368 -7469 -288 7405 12934 14116 9993 2191 -6165 -12151 -13429 -9324 -1265 7051 12212 12079 7530
1383 7530 618 -6270 -11333 -13084 -10723 -4232 4758 12818 16077 12709 4275 -5022 -11588 -13422 -10411
1398 -10411 -3896 3787 9735 11925 9667 4052 -3104 -9780 -13511 -12529 -6561 2769 11812 16352 14004
1413 14004 6122 -3297 -10020 -12573 -11212 -6799 -302 6828 11946 12578 7797 -795 -9507 -14282 -13022
1428 -13022 -6484 2251 9795 13537 12641 7822 895 -6051 -11427 -13503 -10900 -3687 5738 12935 14063
1443 14063 8809 -60 -8097 -12182 -11298 -6739 -453 5816 10845 12893 10523 4131 -4300 -11448 -14389
1458 -14389 -11947 -4899 3970 10847 12719 9242 2696 -3944 -8618 -10515 -9130 -4642 2282 9478 13953
1473 13953 12863 5947 -3538 -10977 -13610 -11208 -5745 864 6770 10584 10950 7441 1095 -6277 -11568
1488 -11568 -12215 -7522 625 8844 13598 12916 6983 -1331 -8603 -12247 -11923 -8255 -2333 4591 10383
1503 10383 12829 10223 3411 -4953 -11274 -12750 -8794 -1239 6594 11627 12164 8353 1730 -5456 -10813
1518 -10813 -12827 -10849 -5014 3132 10697 14210 11636 4247 -4229 -9989 -11354 -8408 -2988 2914 7928
1533 7928 10890 10286 5529 -2186 -9841 -13996 -12568 -6166 2438 9893 13252 11479 5572 -1521 -7233
1548 -7233 -9989 -9485 -5962 -404 5721 10436 11472 7584 -287 -8468 -13096 -12149 -6616 556 6949
1563 6949 10797 11211 8229 2606 -4025 -9472 -11667 -9271 -2782 4887 10522 11577 7740 869 -6009
1578 -6009 -10176 -10634 -7838 -2872 3058 8705 12239 11414 5980 -2252 -9651 -12918 -10802 -4374 3284
1593 3284 8944 10703 8495 3497 -2554 -7772 -10539 -9907 -5780 883 8028 12954 12946 7326 -1334 -8923
1609 -8923 -12256 -10619 -5491 533 5776 9145 9786 7097 1159 -6196 -11644 -12217 -7234 702 8219
1624 8219 12189 11410 6782 274 -5737 -9555 -10468 -8297 -3264 3232 9110 11566 9150 2598 -5304
1639 -5304 -10869 -11508 -7315 -636 5559 9449 10383 8159 3340 -2823 -8413 -11417 -10344 -5277 2109
1654 2109 8607 11486 9531 3690 -3127 -8330 -9896 -7828 -3380 1973 6852 10118 10255 6301 -647
1669 -647 -8009 -12171 -11282 -5972 1166 7130 9953 9169 5523 352 -4914 -8771 -9600 -6736 -1112 5454
1685 5454 10343 11386 7749 751 -6697 -11209 -11096 -7082 -1046 4654 8543 9842 8097 3594 -2632
1700 -2632 -8543 -11268 -9077 -2783 4646 9975 10997 7833 1872 -4394 -8892 -10255 -8484 -4107 1905
1715 1905 7656 11177 10404 5392 -2002 -8531 -11284 -9120 -3397 3061 7559 9240 7973 4186 -1122
1730 -1122 -6552 -10171 -10210 -6301 368 7175 11292 10791 6051 -826 -6750 -9670 -8810 -4996 17 4705
1746 4705 7924 8887 6776 1632 -5027 -10220 -11196 -7252 -487 6152 9944 9801 6452 1494 -3533 -7496
1762 -7496 -9358 -7932 -3462 2720 8055 10342 8298 2749 -4018 -9015 -10187 -7338 -2135 3319 7432
1777 7432 9218 8277 4570 -996 -6728 -10417 -9981 -5336 1577 7605 10236 8572 3789 -2049 -6686
1792 -6686 -8854 -7998 -4640 324 5603 9509 10248 6823 416 -6599 -10852 -10449 -5868 592 6045 8718
1808 8718 8298 5490 1064 -4029 -8208 -9652 -7166 -1474 5194 9839 10634 6986 817 -5305 -9157
1823 -9157 -9571 -6654 -1831 3436 7344 8891 7494 3412 -2411 -7729 -10176 -8226 -2564 4006 8667
1838 8667 9681 6926 2004 -2988 -6832 -8595 -7923 -4606 775 6325 9756 9349 4965 -1411 -7058
1853 -7058 -9501 -7903 -3384 1814 5805 7845 7519 4891 232 -5109 -9058 -9778 -6486 -353 5978
1868 5978 9653 9272 5453 181 -4732 -7711 -8014 -5650 -1342 3503 7407 8829 6973 2104 -4155
1883 -4155 -9006 -10191 -7143 -1261 4656 8376 8791 6436 2421 -2093 -6209 -8669 -8007 -4075 2006
1898 2006 7478 9805 7890 2689 -3412 -7772 -8979 -6997 -2930 1955 6216 8622 8279 5074 -349
1913 -349 -6050 -9587 -9255 -5007 1333 6717 8963 7554 3576 -1273 -5438 -7765 -7683 -5050 -424 4875
1929 4875 8799 9452 6266 545 -5444 -9070 -8911 -5338 -112 4547 7085 7224 5180 1584 -2980 -6898
1945 -6898 -8654 -6934 -2020 4160 8645 9410 6310 1237 -3797 -6992 -7914 -6464 -2978 1630 5803
1960 5803 8099 7502 3791 -1736 -6712 -9003 -7378 -2843 2761 6941 8387 6739 3119 -1278 -5218
1975 -5218 -7750 -8046 -5315 -294 5312 8859 8722 4860 -872 -5877 -8179 -7206 -3829 617 4653 7288
1991 7288 7602 5365 1033 -4204 -8340 -9434 -6571 -883 4992 8477 8230 5085 607 -3609 -6497
2006 -6497 -7317 -5708 -2089 2748 7029 8874 6921 2047 -3830 -8073 -9086 -6523 -1709 3477 6785
2021 6785 7618 6008 2809 -1256 -5270 -7783 -7473 -3853 1742 6811 8955 7117 2375 -2839 -6491
2036 -6491 -7532 -6387 -3476 560 4696 7607 7923 5160 148 -5148 -8267 -7767 -4137 905 5188
2051 5188 7133 6571 3766 -183 -4014 -6781 -7546 -5670 -1398 3874 7851 8684 6021 1026 -3983 -7117
2067 -7117 -7484 -5086 -1108 3012 5929 6879 5550 2095 -2431 -6424 -8316 -6928 -2567 3043 7348
2082 7348 8592 6422 2119 -2384 -5676 -6986 -6137 -3401 786 4970 7568 7238 3641 -1711 -6370
2097 -6370 -8339 -6910 -2971 1954 5912 7562 6662 3723 -193 -4132 -6970 -7548 -5257 -593 4527
2112 4527 7840 7701 4211 -911 -5251 -7184 -6364 -3705 -88 3675 6462 7529 5808 1743 -3330
2127 -3330 -7425 -8528 -5941 -1039 3877 6800 6792 4471 902 -2673 -5395 -6529 -5556 -2471 2174 6469
2143 6469 8370 6749 2346 -2917 -6611 -7620 -5864 -2334 1673 4794 6332 5882 3409 -538 -4673
2158 -4673 -7093 -6803 -3666 1244 5861 7967 6783 2960 -1563 -5014 -6707 -6334 -4199 -704 3277
2173 3277 6503 7457 5300 770 -4369 -7372 -7115 -3903 497 4388 6532 6463 4239 877 -3076 -6239
2189 -6239 -7514 -6045 -2081 2945 6934 7939 5604 1255 -3283 -6109 -6426 -4498 -1342 2289 5246
2204 5246 6734 5843 2575 -2095 -6202 -8093 -6695 -2674 2388 6102 7226 5694 2412 -1338 -4397
2219 -4397 -5987 -5691 -3446 402 4487 7187 6972 3572 -1447 -5747 -7468 -6298 -3098 867 4258
2234 4258 6160 6216 4339 945 -3212 -6261 -6962 -4720 -511 3955 6700 6671 3873 -265 -4071 -6123
2250 -6123 -6157 -4310 -1174 2536 5597 7054 5877 2340 -2457 -6198 -7346 -5344 -1263 2935 5427
2265 5427 5949 4495 1653 -1765 -4813 -6402 -5948 -3105 1418 5759 7757 6562 2735 -1908 -5453
2280 -5453 -6565 -5378 -2574 776 3850 5792 5878 3692 -230 -4471 -7094 -6775 -3686 971 5009 7034
2296 7034 6268 3348 -344 -3767 -5716 -6008 -4327 -1108 2822 5922 6839 4886 582 -3996 -6655 -6434
2312 -6434 -3722 93 3528 5473 5832 4577 1714 -2019 -5409 -7130 -5857 -2098 2455 5879 6713
2327 6713 4762 1203 -2532 -5000 -5632 -4448 -1961 1415 4527 6364 5885 3047 -1356 -5318 -7155
2342 -7155 -6128 -2662 1513 4696 5878 5073 2720 -447 -3528 -5476 -5606 -3608 81 3981 6597
2357 6597 6502 3642 -665 -4516 -6342 -5772 -3312 -160 2974 5102 5734 4496 1469 -2587 -5835 -6533
2373 -6533 -4536 -615 3468 6013 6065 3842 545 -2847 -5108 -5860 -4788 -1962 1779 5011 6540 5612
2389 5612 2301 -2006 -5471 -6462 -4774 -1409 2221 4721 5516 4523 2176 -1120 -4245 -6260 -5964 -3229
2405 -3229 1086 4993 6874 5820 2591 -1301 -4354 -5497 -4787 -2669 210 3132 5225 5604 3790
2420 3790 91 -3958 -6470 -6279 -3512 555 4105 5796 5417 3353 499 -2510 -4795 -5528 -4322 -1396
2436 -1396 2381 5338 6163 4419 767 -3253 -5625 -5725 -3732 -638 2466 4592 5397 4633 2250 -1230
2452 -1230 -4628 -6418 -5479 -2216 1956 5037 5832 4295 1374 -1766 -4130 -5034 -4603 -2502 662 4009
2468 4009 6071 5834 3212 -835 -4566 -6277 -5425 -2665 882 3691 5029 4731 2937 168 -2888 -5222
2484 -5222 -5545 -3742 -246 3725 6190 6033 3472 -167 -3656 -5373 -5277 -3475 -684 2215 4482 5383
2500 5383 4412 1553 -2316 -5282 -6039 -4263 -620 3103 5312 5382 3650 966 -1909 -4238 -5436 -4821
2516 -4821 -2383 1218 4477 6039 5118 2082 -1717 -4606 -5442 -4147 -1563 1429 3863 4887 4381 2536
2532 2536 -475 -3596 -5725 -5670 -3293 579 4155 5860 5129 2580 -650 -3300 -4547 -4385 -2902 -437
2548 -437 2542 4900 5419 3761 313 -3505 -5740 -5721 -3360 23 3088 4739 4913 3563 1243 -1716
2564 -1716 -4196 -5280 -4400 -1539 2094 4961 5706 3974 721 -2639 -4777 -5171 -3805 -1287 1580 3934
2580 3934 5177 4755 2633 -815 -4107 -5757 -5064 -2178 1484 4318 5127 3967 1491 -1151 -3392 -4594
2596 -4594 -4609 -2890 210 3580 5707 5633 3243 -480 -3892 -5370 -4797 -2549 282 2747 4238 4345
2612 4345 3086 587 -2501 -4784 -5318 -3720 -331 3234 5407 5380 3351 260 -2628 -4374 -4679 -3490
2628 -3490 -1398 1361 3833 5006 4248 1604 -1901 -4548 -5401 -3890 -905 2366 4442 4838 3696 1637
2644 1637 -1031 -3466 -4948 -4814 -2788 607 3824 5426 4719 2019 -1283 -3721 -4604 -3797 -1823 729
2660 729 3173 4607 4638 2965 5 -3272 -5384 -5389 -3229 78 3296 4893 4555 2591 -57 -2479 -3916
2677 -3916 -4160 -3120 -764 2160 4612 5284 3776 562 -2920 -5196 -5215 -3320 -437 2272 3903 4354
2693 4354 3575 1630 -1100 -3633 -4898 -4164 -1575 1863 4548 5107 3671 851 -2030 -3931 -4608 -3805
2709 -3805 -1901 736 3221 4798 4716 2665 -547 -3545 -4995 -4258 -1952 1095 3511 4401 3686 1825
2725 1825 -525 -2859 -4300 -4514 -3133 -328 2857 5078 5162 3209 -59 -2990 -4360 -4037 -2468 -263
2741 -263 1964 3611 4170 3224 915 -2086 -4478 -5155 -3725 -636 2547 4543 4751 3321 913 -1633
2757 -1633 -3474 -4221 -3635 -1759 953 3450 4722 4047 1598 -1659 -4157 -4867 -3715 -1228 1583 3626
2773 3626 4354 3862 2173 -382 -2895 -4503 -4502 -2751 178 3266 4765 4177 1912 -995 -3230 -4120 -3669
2790 -3669 -2100 98 2444 4224 4621 3251 467 -2652 -4720 -4798 -2974 -88 2516 3987 3879 2486
2806 2486 354 -1858 -3482 -4046 -3183 -1010 1899 4292 4965 3662 850 -2244 -4235 -4483 -3117 -949
2822 -949 1300 3022 3809 3441 1810 -723 -3265 -4563 -3965 -1582 1546 3999 4574 3469 1282 -1183
2838 -1183 -3052 -3974 -3782 -2344 9 2566 4317 4343 2598 -358 -3080 -4369 -3816 -1864 620 2829
2854 2829 3899 3695 2371 200 -2146 -4044 -4538 -3275 -736 2276 4357 4589 2913 209 -2345 -3696
2870 -3696 -3624 -2475 -584 1516 3258 4047 3432 1313 -1661 -4104 -4845 -3640 -887 1905 3698 4071
2886 4071 3049 1177 -918 -2762 -3760 -3511 -1884 715 3220 4449 3780 1570 -1334 -3486 -4301 -3427
2902 -3427 -1548 732 2679 3707 3715 2465 200 -2338 -4036 -4132 -2537 173 2846 4169 3701 1854
2918 1854 -512 -2455 -3578 -3571 -2463 -569 1757 3699 4401 3321 858 -2073 -4025 -4176 -2676 -353
2934 -353 1895 3266 3505 2570 840 -1279 -3162 -4012 -3415 -1372 1438 3675 4404 3449 1179 -1452 -3315
2951 -3315 -3768 -3009 -1407 699 2537 3583 3400 1974 -534 -2978 -4312 -3882 -1758 1066 3258 4051
2967 4051 3271 1557 -475 -2262 -3437 -3597 -2541 -424 2131 3914 4116 2498 -230 -2684 -3903 -3575
2983 -3575 -1922 192 2115 3301 3562 2760 803 -1616 -3568 -4225 -3102 -789 1847 3700 3870 2607
2999 2607 431 -1725 -3052 -3421 -2644 -1043 1011 2954 3892 3434 1555 -1178 -3452 -4272 -3339 -1148
3015 -1148 1265 2898 3423 2812 1464 -406 -2219 -3457 -3485 -2130 348 2898 4116 3677 1736 -787
3031 -787 -2848 -3693 -3211 -1914 25 1864 3169 3541 2538 441 -2027 -3652 -3829 -2414 21 2370
3047 2370 3664 3455 2107 160 -1787 -3021 -3475 -2747 -1029 1287 3275 4025 3212 932 -1677 -3460
3063 -3460 -3678 -2461 -549 1403 2766 3217 2737 1314 -743 -2836 -3859 -3451 -1567 1029 3214 3931
3079 3931 3094 1235 -969 -2609 -3207 -2904 -1583 257 2170 3423 3384 2024 -292 -2671 -3892 -3569
3095 -3569 -1778 550 2478 3414 3072 1871 106 -1681 -2980 -3425 -2560 -628 1791 3544 3767 2386
3111 2386 -30 -2173 -3330 -3204 -2017 -354 1387 2711 3345 2861 1173 -1121 -3104 -3857 -3039 -879
3127 -879 1524 3157 3375 2422 738 -1061 -2502 -3191 -2824 -1467 566 2586 3663 3355 1699 -796
3143 -796 -2909 -3647 -3000 -1271 766 2302 3013 2781 1731 13 -1922 -3326 -3474 -2195 181 2469
3159 2469 3735 3404 1745 -390 -2154 -3022 -2903 -2038 -460 1397 2883 3422 2589 558 -1708 -3368
3175 -3368 -3532 -2335 -155 1874 3020 3078 2220 656 -1176 -2610 -3246 -2785 -1223 963 2844 3712 2829
3192 2829 923 -1351 -2907 -3223 -2372 -802 898 2238 3002 2810 1584 -368 -2405 -3654 -3402 -1674
3208 -1674 714 2676 3341 2760 1248 -550 -1929 -2732 -2759 -1843 -181 1806 3189 3351 2153 -12 -2259
3225 -2259 -3362 -3179 -1813 84 1771 2750 2899 2063 564 -1224 -2663 -3274 -2585 -724 1499 3164
3241 3164 3399 2290 358 -1671 -2787 -2895 -2196 -829 821 2301 3196 2864 1346 -828 -2829 -3517
3257 -3517 -2751 -955 1214 2581 2937 2316 1042 -563 -2021 -2918 -2882 -1677 270 2240 3495 3151 1647
3274 1647 -551 -2317 -3148 -2706 -1400 296 1764 2670 2725 1871 266 -1580 -3006 -3263 -2166 -82 1974
3291 1974 3119 3033 1778 -12 -1585 -2474 -2688 -2097 -776 961 2501 3202 2554 731 -1487 -2893 -3190
3308 -3190 -2107 -343 1378 2431 2717 2182 1018 -657 -2140 -3028 -2733 -1421 618 2466 3222 2674
3324 2674 993 -921 -2250 -2772 -2296 -1120 382 1798 2714 2782 1811 -16 -2050 -3219 -3115 -1637 334
3341 334 2101 2905 2525 1333 -34 -1416 -2401 -2655 -2010 -416 1444 2912 3180 2148 149 -1862 -2886
3358 -2886 -2842 -1781 -239 1275 2348 2649 2158 880 -858 -2376 -3089 -2473 -739 1280 2719 3053 2128
3375 2128 534 -1124 -2243 -2611 -2221 -1123 445 1943 2928 2764 1479 -530 -2292 -3061 -2474 -977
3391 -977 810 2046 2520 2211 1201 -89 -1582 -2601 -2775 -1932 -66 1900 3040 2868 1587 -243
3407 -243 -1827 -2501 -2384 -1528 -198 1222 2310 2623 2041 437 -1402 -2736 -3032 -2089 -280 1527 2626
3424 2626 2674 1836 440 -985 -2030 -2462 -2181 -1013 697 2295 2960 2430 875 -1106 -2544 -2831 -2068
3441 -2068 -629 830 1974 2509 2316 1333 -243 -1768 -2788 -2719 -1396 482 2140 2831 2345 1001 -538
3458 -538 -1813 -2400 -2282 -1371 -18 1432 2561 2784 1803 109 -1724 -2803 -2653 -1597 134 1595 2377
3475 2377 2246 1466 243 -1096 -2190 -2565 -2047 -618 1209 2615 2980 2025 327 -1385 -2414 -2457 -1750
3492 -1750 -616 692 1833 2409 2185 1079 -688 -2191 -2879 -2302 -793 958 2263 2649 2008 811
3508 811 -562 -1731 -2346 -2276 -1370 100 1618 2625 2587 1455 -330 -1871 -2657 -2243 -1031 440 1652
3525 1652 2229 2224 1521 248 -1234 -2413 -2710 -1945 -252 1523 2588 2568 1471 -44 -1369 -2109 -2157 -1561
3543 -1561 -494 863 2079 2612 2145 648 -1091 -2487 -2738 -1953 -455 1113 2063 2331 1765 735 -519
3560 -519 -1728 -2315 -2149 -1091 521 2036 2660 2265 912 -817 -2068 -2414 -1972 -879 382 1472 2167
3577 2167 2212 1492 33 -1548 -2512 -2538 -1416 328 1777 2444 2100 1074 -155 -1379 -2098 -2196 -1599 -389
3595 -389 1110 2321 2630 1844 274 -1354 -2378 -2356 -1464 -117 1178 1937 2128 1629 598 -813 -1939
3612 -1939 -2471 -2148 -833 886 2207 2643 1965 493 -868 -1866 -2131 -1715 -832 392 1547 2223 2208 1199
3630 1199 -393 -1942 -2620 -2233 -895 666 1824 2230 1903 1069 -101 -1245 -2032 -2165 -1515 -76 1483
3647 1483 2395 2353 1364 -180 -1583 -2299 -2082 -1151 -3 1133 1930 2160 1609 510 -933 -2102 -2460 -1747
3665 -1747 -354 1285 2161 2147 1453 198 -964 -1767 -1988 -1618 -686 546 1766 2504 2121 873 -816
3682 -816 -2083 -2377 -1779 -585 734 1625 1982 1709 905 -248 -1429 -2151 -2084 -1209 311 1749 2423 2051
3700 2051 993 -449 -1593 -2082 -1871 -1068 -5 1131 1929 2090 1512 198 -1309 -2291 -2332 -1384 124
3717 124 1436 2115 1962 1225 170 -920 -1726 -2124 -1743 -630 812 2008 2370 1740 310 -1081 -1947
3734 -1947 -2057 -1365 -398 771 1593 2002 1697 859 -481 -1729 -2317 -2053 -888 599 1853 2234 1769 635
3752 635 -500 -1450 -1878 -1642 -971 134 1297 2136 2128 1275 -244 -1652 -2332 -2032 -985 272 1349 1870
3770 1870 1780 1182 154 -925 -1821 -2098 -1535 -245 1187 2152 2099 1270 11 -1163 -1876 -1935 -1304 -342 721
3789 721 1630 1991 1728 664 -705 -1837 -2212 -1746 -468 901 1819 1977 1396 487 -612 -1406 -1867 -1722
3807 -1722 -986 250 1532 2271 2029 929 -538 -1675 -1954 -1540 -691 358 1187 1768 1679 1162 70 -1197
3825 -1197 -2082 -2100 -1235 154 1455 2103 1851 1057 -146 -1113 -1725 -1727 -1238 -319 828 1703 2031 1494 333
3844 333 -1039 -1925 -2070 -1304 -137 1074 1674 1833 1324 514 -495 -1428 -1970 -1701 -742 571 1748 2209
3862 2209 1621 497 -750 -1628 -1859 -1376 -607 360 1316 1822 1788 1010 -232 -1476 -2108 -1917 -890 373
3880 373 1436 1886 1600 782 -235 -1053 -1658 -1730 -1122 -104 1102 1905 2064 1296 -24 -1222 -1963 -1823
3898 -1823 -1031 -53 942 1527 1647 1290 470 -640 -1595 -1993 -1522 -382 951 1820 2018 1309 240 -823
3916 -823 -1507 -1704 -1384 -657 368 1359 1916 1745 772 -493 -1597 -1971 -1602 -538 619 1452 1753 1435
3934 1435 710 -279 -1175 -1771 -1751 -1099 136 1356 2015 1847 925 -341 -1352 -1737 -1474 -847 40 955 1542
3953 1542 1672 1185 248 -938 -1874 -1991 -1264 -34 1166 1734 1689 1032 119 -780 -1422 -1646 -1321 -519 658
3972 658 1615 1937 1494 454 -858 -1714 -1845 -1337 -316 649 1402 1645 1425 674 -287 -1225 -1805 -1714 -850
3991 -850 425 1472 1917 1487 628 -444 -1283 -1546 -1448 -855 20 928 1640 1759 1107 -18 -1234 -1926 -1755
4010 -1755 -967 225 1151 1558 1447 940 125 -751 -1495 -1700 -1298 -287 890 1757 1940 1331 130 -971
4028 -971 -1586 -1599 -1098 -278 594 1336 1606 1325 625 -493 -1450 -1877 -1528 -480 731 1563 1765 1205 378
4047 378 -545 -1174 -1571 -1403 -856 113 1169 1796 1723 845 -338 -1371 -1742 -1436 -626 294 1120 1458 1434 940
4067 940 0 -898 -1668 -1727 -1166 -92 1077 1776 1712 963 -55 -1000 -1430 -1443 -999 -167 643 1347 1666 1269
4087 1269 418 -753 -1628 -1830 -1287 -247 878 1494 1518 1056 356 -422 -1147 -1550 -1439 -719 358 1380
4105 1380 1849 1457 493 -610 -1382 -1569 -1256 -537 276 1075 1503 1487 890 -61 -1054 -1701 -1643 -879 172 1174
4125 1174 1639 1424 730 -252 -967 -1448 -1395 -943 -229 728 1505 1723 1181 212 -947 -1617 -1629 -981 -15 865
4145 865 1313 1342 1083 353 -502 -1317 -1687 -1383 -463 642 1508 1733 1192 355 -650 -1237 -1422 -1177 -471 306
4165 306 1092 1493 1403 770 -325 -1249 -1725 -1418 -646 441 1283 1529 1307 572 -138 -885 -1412 -1487 -979 -34
4185 -34 954 1637 1619 933 -167 -1105 -1528 -1387 -709 61 809 1291 1425 1091 303 -685 -1468 -1672 -1238 -186
4205 -186 872 1476 1453 997 178 -650 -1226 -1340 -1094 -407 405 1197 1599 1376 495 -584 -1387 -1726 -1197 -420
4225 -420 521 1179 1334 1153 560 -166 -896 -1467 -1459 -791 259 1274 1653 1416 614 -390 -1119 -1444 -1216 -733
4245 -733 -9 754 1278 1470 987 76 -934 -1550 -1541 -914 60 952 1384 1339 799 22 -692 -1233 -1424 -1126 -356
4266 -356 514 1379 1646 1248 276 -708 -1417 -1426 -968 -254 528 1080 1272 1138 516 -294 -1140 -1580 -1424 -602 461
4287 461 1291 1604 1179 488 -412 -1048 -1286 -1128 -701 70 914 1467 1418 820 -165 -1094 -1562 -1371 -677 210
4307 210 963 1357 1231 764 127 -671 -1245 -1426 -1019 -207 783 1515 1497 936 49 -861 -1345 -1270 -859 -269 504
4328 504 1100 1434 1198 510 -486 -1241 -1555 -1183 -339 629 1247 1334 964 363 -434 -1015 -1280 -1208 -676 200 1094
4349 1094 1529 1353 627 -387 -1096 -1461 -1167 -507 265 902 1172 1142 737 -6 -802 -1319 -1345 -952 52 995
4369 995 1517 1373 672 -135 -847 -1135 -1202 -861 -228 538 1163 1377 1050 233 -748 -1443 -1475 -956 -104 680 1173
4390 1173 1234 892 343 -378 -1053 -1336 -1188 -465 438 1191 1469 1108 359 -531 -1136 -1311 -1022 -395 295 922
4410 922 1258 1226 653 -146 -1022 -1478 -1360 -642 311 1033 1304 1093 560 -184 -768 -1115 -1156 -795 -106 723 1422
4431 1422 1366 856 -22 -906 -1333 -1304 -746 -21 635 1115 1162 937 314 -518 -1139 -1401 -1066 -270 660 1293 1341
4452 1341 963 102 -605 -1073 -1211 -933 -412 253 970 1300 1186 560 -303 -1174 -1461 -1101 -381 515 1028 1199
4472 1199 957 425 -133 -811 -1221 -1237 -790 63 974 1385 1314 607 -259 -904 -1245 -1095 -573 55 655 1085
4492 1085 1225 874 151 -633 -1276 -1359 -964 -65 787 1255 1186 805 88 -602 -956 -1133 -836 -385 381 1140
4512 1140 1341 1093 319 -605 -1237 -1277 -907 -205 491 919 1115 987 494 -205 -879 -1301 -1184 -536 270 1068
4532 1068 1382 1056 395 -391 -929 -1112 -980 -578 51 714 1166 1219 753 -15 -841 -1337 -1270 -729 180 786
4552 786 1140 1017 625 41 -571 -1070 -1125 -899 -202 567 1244 1383 923 112 -691 -1103 -1085 -725 -131 445 934
4573 934 1107 989 418 -395 -1075 -1362 -1104 -337 520 1082 1226 922 308 -382 -844 -1094 -1013 -537 130 857
4593 857 1259 1153 578 -265 -1006 -1288 -1021 -502 273 791 1053 987 657 48 -618 -1118 -1269 -834 -44 824
4613 824 1297 1195 670 -58 -691 -1020 -1010 -753 -151 434 1018 1163 906 269 -569 -1205 -1296 -891 -169 535 1032
4634 1032 1122 835 225 -392 -892 -1095 -954 -467 315 918 1282 1059 419 -422 -1032 -1187 -916 -343 306 776
4654 776 1080 948 626 -37 -770 -1234 -1198 -654 233 917 1206 1017 444 -240 -689 -977 -1015 -695 -134 606 1093
4675 1093 1210 870 86 -737 -1196 -1201 -660 22 654 985 1011 787 222 -389 -898 -1115 -931 -314 447 1097 1318
4696 1318 924 166 -535 -944 -1012 -781 -294 196 793 1114 1031 512 -221 -935 -1264 -1026 -368 367 891 1042
4716 1042 862 427 -142 -644 -1027 -1044 -660 34 676 1175 1173 619 -100 -769 -1100 -985 -585 60 656 974 1011
4737 1011 724 125 -476 -989 -1140 -812 -147 666 1090 1065 680 34 -519 -840 -932 -739 -257 279 812 1129
4757 1129 954 363 -423 -1040 -1185 -837 -191 382 775 961 864 414 -127 -699 -1045 -999 -469 180 873 1217
4777 1217 1000 387 -293 -831 -1027 -913 -496 42 608 909 1062 661 140 -629 -1056 -1142 -644 14 741 1065
4797 1065 966 587 0 -489 -858 -979 -763 -256 374 1008 1146 858 162 -577 -997 -1045 -702 -127 418 801
4817 801 948 839 407 -220 -863 -1100 -954 -400 326 971 1122 846 284 -304 -771 -992 -814 -473 79 623
4837 623 935 1035 577 -159 -824 -1171 -954 -452 212 734 948 863 542 46 -531 -917 -1047 -745 -67 607
4857 607 1056 1060 637 -21 -603 -912 -905 -579 -137 454 841 933 792 318 -338 -983 -1140 -810 -234 475 905 968
4879 968 656 195 -376 -647 -944 -826 -368 176 791 1075 939 392 -327 -893 -1092 -798 -316 208 672 855
4899 855 878 572 -44 -610 -976 -1014 -613 74 769 1074 943 491 -168 -606 -957 -884 -586 -110 437 876 1002
4920 1002 759 117 -550 -974 -1048 -647 14 562 888 906 600 167 -332 -756 -986 -804 -335 389 917 1101
4940 1101 831 246 -418 -826 -904 -680 -236 210 627 833 835 501 -133 -767 -1054 -959 -487 227 757 926 809
4961 809 383 -169 -622 -829 -875 -587 -40 564 908 1010 606 -34 -646 -1010 -926 -529 54 463 797 854 626
4982 626 199 -342 -822 -986 -791 -190 550 913 1033 655 107 -448 -788 -811 -671 -291 311 693 935 887 383
5003 383 -248 -860 -1010 -849 -253 337 737 911 726 342 -194 -622 -850 -869 -517 132 715 1035 950 469 -150
5024 -150 -639 -888 -775 -406 16 507 815 858 645 147 -450 -946 -1013 -661 -53 619 938 877 506 77 -405
5045 -405 -789 -867 -619 -230 320 798 1007 720 227 -427 -854 -935 -733 -146 411 695 825 672 267 -215 -600
5066 -600 -923 -877 -446 246 774 1011 832 304 -305 -747 -861 -729 -356 63 505 827 920 590 -26 -653 -1052
5087 -1052 -953 -535 129 587 875 777 426 10 -461 -815 -878 -670 -143 453 925 999 641 96 -575 -903 -839
5108 -839 -563 -99 408 709 808 658 285 -272 -731 -974 -786 -240 392 790 899 729 154 -396 -690 -817
5128 -817 -791 -363 57 593 972 890 432 -203 -763 -975 -776 -386 214 625 805 753 440 30 -494 -855 -932
5149 -932 -597 -15 623 976 930 539 -93 -554 -766 -752 -458 -39 375 715 856 669 202 -430 -882 -1016 -697
5170 -697 -61 439 781 820 483 169 -224 -671 -812 -670 -371 200 812 1020 771 293 -304 -797 -868 -663 -286
5191 -286 241 572 804 721 397 -43 -563 -852 -885 -478 100 658 959 799 366 -145 -576 -774 -790 -472 -51
5212 -51 392 792 907 675 33 -538 -966 -927 -526 67 443 777 814 537 171 -309 -682 -899 -678 -234 408
5233 408 853 951 711 117 -377 -827 -813 -556 -272 230 667 863 737 397 -182 -710 -907 -839 -309 280 705
5254 705 818 678 268 -163 -506 -744 -755 -523 39 586 901 843 511 -105 -631 -935 -728 -407 83 445 767
5275 767 796 575 107 -359 -809 -914 -592 -116 502 846 820 539 28 -434 -719 -740 -629 -147 245 690 876
5296 876 723 256 -328 -803 -955 -714 -206 349 730 742 638 277 -206 -518 -797 -830 -502 161 684 924 823
5317 823 340 -224 -656 -872 -664 -338 67 465 785 837 573 58 -530 -865 -868 -527 67 455 871 768 451
5338 451 -4 -429 -732 -782 -625 -206 335 792 931 618 153 -470 -795 -847 -551 -74 312 665 741 643 288
5359 288 -150 -656 -868 -814 -296 324 777 907 685 219 -288 -647 -773 -601 -383 94 524 823 816 423 -177
5380 -177 -668 -918 -829 -361 181 550 843 659 361 -10 -437 -761 -832 -533 -114 445 874 862 501 1 -498
5401 -498 -809 -737 -431 -54 385 688 857 595 228 -332 -748 -931 -685 -120 423 800 772 511 103 -330 -625
5422 -625 -788 -655 -330 231 620 886 776 292 -218 -725 -855 -641 -217 278 600 757 587 376 -18 -469
5442 -469 -812 -769 -461 48 567 924 796 402 -46 -579 -681 -677 -421 -94 360 712 858 606 76 -431 -901
5463 -901 -873 -539 -17 477 740 694 505 115 -329 -615 -820 -648 -209 306 754 930 652 190 -358 -759 -792
5484 -792 -575 -210 230 543 780 709 369 -97 -589 -862 -758 -349 175 665 819 685 252 -214 -483 -704
5504 -704 -698 -509 -58 391 785 834 480 -90 -603 -895 -737 -361 19 453 643 697 441 164 -368 -678 -821
5525 -821 -590 -74 411 800 909 608 62 -404 -678 -668 -533 -136 261 600 795 684 284 -215 -784 -856 -711
5546 -711 -200 313 613 753 540 192 -162 -550 -747 -706 -410 65 633 840 761 349 -173 -639 -741 -647 -330
5567 -330 116 493 706 715 499 30 -415 -844 -828 -531 42 512 833 785 415 1 -490 -641 -708 -526 -154 358
5589 358 702 834 635 110 -432 -825 -807 -515 -71 381 619 715 537 189 -196 -622 -828 -730 -257 268 733
5610 733 832 636 197 -276 -663 -690 -574 -288 125 490 759 759 429 -123 -594 -848 -759 -409 150 563 737 647
5632 647 324 -33 -408 -654 -730 -512 -85 424 771 803 607 -32 -531 -787 -711 -400 -12 341 693 686 555 167
5654 167 -203 -670 -852 -589 -222 346 718 721 483 71 -384 -604 -700 -583 -225 163 554 787 631 303 -172
5675 -172 -633 -816 -595 -237 194 556 701 608 275 -52 -425 -768 -738 -439 31 551 850 752 377 -143 -532
5696 -532 -730 -614 -332 4 343 690 723 457 71 -406 -774 -809 -542 4 463 703 660 390 72 -343 -610
5717 -610 -701 -511 -189 272 675 822 635 174 -354 -699 -753 -553 -74 260 557 688 531 285 -98 -501 -788
5738 -788 -698 -307 235 636 842 630 225 -127 -496 -665 -596 -383 24 410 720 712 437 -38 -554 -778 -739 -398
5760 -398 91 513 682 594 388 53 -306 -602 -710 -503 -95 374 702 798 529 35 -372 -652 -655 -423 -86
5781 -86 266 558 615 570 256 -175 -617 -802 -626 -154 299 615 694 549 182 -196 -505 -684 -604 -380 99 486
5803 486 729 723 314 -117 -602 -726 -553 -297 157 471 628 597 367 59 -419 -664 -732 -455 -34 518 731
5824 731 697 407 -70 -395 -628 -603 -401 -111 290 558 748 548 135 -321 -702 -747 -525 -81 347 534 608
5845 608 488 163 -201 -415 -693 -583 -293 211 587 790 611 187 -250 -578 -729 -517 -182 196 517 642
5865 642 582 409 -11 -480 -746 -716 -294 93 594 696 549 207 -125 -428 -572 -627 -431 -82 352 675 753
5886 753 503 39 -415 -659 -604 -374 41 360 557 588 470 170 -248 -566 -737 -577 -165 317 617 728 542
5907 542 118 -308 -572 -632 -444 -204 144 453 643 621 253 -159 -571 -703 -682 -182 230 516 618 528 206
5928 206 -71 -428 -632 -627 -428 -52 476 675 649 375 -102 -507 -691 -573 -305 108 333 571 594 418 100
5949 100 -295 -656 -678 -427 -38 355 654 663 367 37 -335 -512 -643 -472 -210 197 521 694 520 157 -260
5970 -260 -662 -664 -490 -106 221 510 503 408 239 -158 -478 -679 -633 -294 192 556 722 514 238 -127 -447 -587
5992 -587 -511 -230 -8 383 613 615 424 17 -449 -702 -693 -369 63 502 641 600 306 3 -317 -557 -612 -449
6014 -449 -175 321 683 691 445 39 -346 -607 -620 -352 -45 311 472 518 540 271 -137 -550 -709 -568 -157 250
6036 250 588 616 493 189 -158 -496 -580 -522 -279 59 416 660 577 326 -116 -553 -763 -605 -197 105 429
6057 429 563 491 347 5 -319 -556 -666 -413 19 437 640 651 334 -2 -444 -564 -555 -365 -33 313 531
6078 531 640 512 92 -324 -613 -683 -479 -60 340 606 590 354 80 -228 -499 -598 -539 -225 127 515 719
6099 719 566 199 -230 -564 -658 -489 -165 157 456 580 533 322 -10 -397 -650 -620 -297 115 475 646 579
6120 579 267 -112 -399 -511 -484 -348 -23 350 539 648 464 5 -429 -672 -653 -382 -10 375 589 533 362
6141 362 78 -197 -514 -600 -459 -140 270 568 662 464 7 -350 -502 -557 -350 -141 234 448 562 542 267
6162 267 -167 -558 -680 -565 -129 203 460 573 415 229 -104 -419 -515 -531 -325 -28 407 588 574 323 -92
6183 -92 -447 -630 -526 -216 51 438 584 511 332 89 -248 -571 -628 -431 -18 390 642 614 347 -1 -362
6204 -362 -496 -526 -363 -161 189 524 591 521 143 -226 -545 -598 -435 -33 231 446 582 420 160 -161 -433
6225 -433 -562 -489 -209 110 457 692 508 223 -200 -462 -626 -455 -190 102 396 465 491 399 -1 -387 -622
6246 -622 -557 -319 149 428 647 566 267 -41 -322 -427 -549 -422 -137 297 542 689 417 20 -376 -574 -585
6267 -585 -381 -36 308 481 501 385 170 -177 -488 -576 -480 -159 232 613 622 466 123 -261 -443 -551 -430 -203
6289 -203 57 412 557 514 286 -74 -512 -682 -553 -222 143 436 522 391 273 -60 -296 -494 -507 -374 -45
6310 -45 293 645 617 338 -69 -420 -517 -527 -293 45 281 484 546 407 104 -251 -540 -593 -379 -78 332 541
6332 541 548 373 29 -235 -460 -514 -430 -160 169 440 635 497 174 -197 -491 -598 -429 -128 214 448 579
6353 579 435 234 -58 -337 -545 -580 -268 127 459 568 506 213 -108 -366 -511 -455 -299 65 322 479 565
6374 565 363 21 -325 -609 -567 -344 36 387 509 487 265 -26 -269 -481 -542 -370 -159 230 569 602 406
6395 406 29 -344 -527 -553 -370 -93 182 442 524 462 162 -127 -443 -643 -491 -180 222 469 600 429 185
6416 185 -164 -386 -474 -430 -225 78 297 549 530 344 -94 -424 -569 -542 -246 92 435 481 417 277 -4 -297
6438 -297 -436 -570 -402 -36 368 623 571 347 -4 -332 -482 -480 -264 -49 208 439 533 408 111 -256 -581
6459 -581 -596 -401 -103 234 509 522 404 59 -236 -421 -486 -434 -239 63 478 620 568 203 -161 -521 -619 -438
6481 -438 -140 158 374 463 453 281 -12 -377 -593 -545 -273 132 434 623 468 256 -106 -333 -436 -430 -345 -66
6503 -66 224 513 568 342 76 -331 -537 -541 -350 -10 329 469 512 297 54 -241 -409 -520 -420 -140 256 571
6525 571 643 402 34 -255 -470 -521 -348 -92 180 413 575 502 240 -168 -400 -641 -516 -210 218 439 513
6546 513 407 163 -122 -383 -517 -465 -317 64 322 525 543 358 -66 -438 -535 -496 -217 63 282 436 494 334
6568 334 56 -215 -460 -578 -400 -50 329 599 492 336 22 -285 -436 -493 -314 -48 149 405 557 424
6588 424 171 -267 -509 -570 -407 -59 258 464 494 382 177 -163 -363 -525 -457 -230 106 477 547 550 220 -128
6610 -128 -416 -495 -364 -195 117 344 468 480 318 13 -342 -560 -520 -304 55 367 526 433 267 -26 -286
6631 -286 -450 -436 -330 -83 203 489 534 373 58 -314 -555 -531 -327 -22 213 414 516 323 133 -194 -481
6652 -481 -504 -407 -136 199 500 557 429 155 -213 -457 -464 -323 -219 99 395 511 489 254 -71 -398 -539 -509
6674 -509 -200 143 422 483 332 176 -32 -260 -456 -509 -350 -3 294 546 492 343 -79 -359 -500 -382 -208
6695 -208 22 292 419 437 395 93 -226 -482 -564 -333 -94 340 517 489 318 86 -175 -364 -501 -405 -152 97
6717 97 392 546 459 115 -249 -487 -508 -407 -114 194 361 438 350 260 -50 -346 -507 -486 -272 111 383 595
6739 595 490 155 -98 -282 -456 -400 -201 32 242 424 441 310 67 -288 -517 -504 -321 58 328 499 398
6760 398 222 -24 -191 -390 -461 -367 -160 201 507 518 335 44 -268 -448 -461 -339 -66 234 365 475 374
6781 374 182 -128 -427 -492 -418 -185 168 446 562 444 135 -131 -352 -486 -419 -278 46 343 465 454 259
6802 259 -107 -405 -589 -434 -211 60 348 422 402 249 52 -214 -453 -558 -303 17 283 529 496 313 -47
6823 -47 -261 -422 -391 -283 -42 172 393 497 358 145 -201 -456 -527 -361 -10 230 411 464 305 108 -135
6844 -135 -389 -463 -401 -171 115 394 565 433 139 -183 -463 -433 -367 -106 125 341 425 350 290 22 -351 -512
6866 -512 -443 -286 67 382 527 451 225 -64 -260 -428 -419 -290 -64 222 454 501 327 49 -304 -549 -528 -297
6888 -297 47 270 383 431 268 130 -198 -334 -413 -366 -170 216 500 516 415 25 -227 -444 -420 -268 -136 130
6910 130 338 458 435 217 -70 -375 -494 -466 -112 144 423 442 393 142 -58 -263 -419 -433 -265 5 273 475
6932 475 481 293 -119 -353 -468 -395 -218 92 277 427 426 275 42 -254 -427 -488 -353 -8 268 478 449 321
6954 321 -17 -240 -363 -362 -330 -159 150 318 468 386 159 -159 -472 -547 -406 -140 141 348 364 312 94 -72
6976 -72 -341 -429 -449 -195 101 353 512 444 204 -130 -318 -407 -341 -207 21 287 456 385 282 41 -223 -472
6998 -472 -507 -257 69 350 458 338 220 -17 -235 -375 -396 -328 -93 166 419 426 292 68 -245 -448 -452 -262
7020 -262 -6 174 364 398 351 130 -130 -351 -470 -386 -134 145 414 526 335 123 -215 -322 -417 -332 -136 52
7042 52 316 447 398 130 -124 -377 -463 -389 -181 119 324 331 351 165 -69 -225 -415 -400 -296 7 340 436 500
7065 500 230 -66 -258 -383 -324 -244 -10 244 357 400 298 58 -164 -418 -454 -377 -30 208 452 374 255 23
7087 23 -136 -348 -366 -286 -158 160 375 419 401 190 -191 -384 -432 -353 -110 167 270 416 331 180 -65 -309 -392
7110 -392 -419 -198 137 351 435 370 147 -77 -243 -372 -362 -216 -10 145 396 401 258 4 -247 -525 -448 -216
7132 -216 16 285 357 377 216 38 -193 -331 -398 -337 -102 173 431 467 339 56 -277 -394 -390 -251 -29 140
7154 140 320 390 408 188 -88 -379 -459 -367 -120 212 328 460 295 85 -134 -273 -328 -319 -193 61 299 447
7176 447 424 209 -61 -331 -480 -380 -177 62 268 358 354 206 45 -222 -315 -354 -284 -66 251 438 409 228 -49
7199 -49 -221 -356 -375 -165 -106 198 305 405 308 103 -199 -411 -399 -256 -60 205 393 369 256 64 -95 -271
7221 -271 -428 -305 -194 70 329 430 357 187 -151 -386 -347 -262 -145 90 265 330 374 170 36 -228 -420 -385
7243 -385 -198 46 315 393 296 179 -49 -270 -412 -369 -271 -32 211 337 387 318 -31 -254 -430 -370 -250 -39
7265 -39 199 317 332 225 82 -90 -320 -382 -359 -106 225 399 472 282 27 -167 -334 -344 -207 -115 94 305
7287 305 396 400 195 -43 -320 -427 -337 -123 114 296 390 289 109 -51 -254 -301 -331 -213 -77 276 399 426 281
7310 281 -95 -309 -407 -319 -112 10 233 364 324 252 62 -183 -397 -348 -222 21 230 448 374 223 34 -183
7332 -183 -305 -291 -220 -90 128 283 368 336 156 -112 -363 -361 -324 -98 133 312 288 267 138 -89 -228 -400 -324
7355 -324 -167 113 316 431 387 164 -124 -303 -378 -314 -123 78 202 336 388 227 -1 -218 -437 -406 -223 -19
7377 -19 252 344 333 164 14 -178 -333 -354 -278 -65 169 338 410 268 -3 -180 -369 -405 -237 -34 210 313
7399 313 264 295 88 -73 -253 -398 -289 -123 155 328 386 330 49 -163 -316 -326 -292 -185 73 265 369 352
7421 352 191 -63 -240 -406 -337 -110 114 236 298 288 140 -38 -223 -323 -346 -217 -7 226 408 338 191 -28
7443 -28 -202 -343 -284 -105 -41 101 346 328 210 38 -157 -375 -387 -263 -65 267 366 375 237 24 -142 -282 -276
7466 -276 -276 -109 48 233 449 322 92 -165 -388 -364 -227 -116 104 287 364 266 169 -48 -177 -336 -373 -139
7488 -139 97 255 428 343 142 -50 -273 -341 -251 -145 43 153 355 342 168 15 -204 -376 -384 -157 56 211
7510 211 356 308 139 24 -176 -275 -341 -296 -64 136 397 357 238 44 -211 -311 -317 -238 -35 142 265 347 266
7533 266 134 -138 -277 -388 -350 -105 118 341 379 278 102 -125 -220 -246 -252 -136 11 202 294 341 165 -24 -304
7556 -304 -365 -257 -155 75 207 335 258 170 -15 -205 -315 -339 -239 -2 221 351 320 167 -10 -167 -259 -240
7578 -240 -212 -13 189 227 304 218 55 -164 -347 -409 -256 -2 123 271 238 146 56 -173 -325 -274 -265 -101 69 316
7602 316 390 320 90 -63 -314 -354 -214 -72 69 224 321 311 196 -34 -216 -360 -334 -179 131 307 301 369 99
7625 99 -80 -209 -286 -273 -203 44 207 252 322 236 76 -199 -343 -350 -195 10 212 273 209 162 47 -101 -245 -306
7649 -306 -299 -66 178 276 346 277 16 -178 -272 -271 -221 -45 61 219 329 249 124 -65 -198 -312 -301 -97 133 279
7673 279 317 202 101 -55 -205 -305 -341 -171 26 187 315 278 169 -61 -227 -306 -241 -146 59 237 282 286 246
7696 246 76 -95 -308 -373 -209 -37 262 342 330 152 -2 -120 -190 -320 -216 -69 71 253 387 266 56
7717 56 -150 -322 -367 -161 -49 131 242 293 204 136 -68 -241 -270 -291 -148 117 240 307 311 118 -96 -246 -258 -235
7741 -235 -157 83 180 245 328 203 2 -191 -326 -329 -193 77 249 261 246 136 -39 -118 -255 -281 -190 -30 162 376
7765 376 318 251 -16 -218 -278 -265 -149 -12 142 270 327 215 89 -93 -252 -345 -222 -74 170 358 311 234 87
7788 87 -130 -207 -277 -240 -79 77 243 290 269 116 -91 -290 -357 -236 -18 123 247 229 232 94 -45 -118 -219 -327
7812 -327 -194 -32 222 309 317 115 -13 -173 -246 -224 -121 23 176 270 284 232 24 -153 -254 -267 -226 5 248
7835 248 298 270 148 34 -130 -210 -242 -211 -53 113 279 314 300 62 -187 -301 -332 -208 -56 82 172 269 197 132
7859 132 22 -195 -275 -226 -46 78 300 411 246 87 -42 -183 -253 -224 -149 24 149 264 274 172 27 -214
7881 -214 -343 -266 -105 53 144 220 250 86 -27 -103 -240 -248 -211 -82 167 323 343 118 14 -158 -246 -253 -150 -6
7905 -6 92 235 269 240 109 -79 -295 -296 -260 -47 172 250 290 168 43 -108 -210 -265 -222 -132 -36 152 277 258 118
7930 118 -36 -244 -291 -259 -101 90 128 233 164 159 -20 -105 -226 -281 -178 51 226 301 295 115 -8 -183 -237 -274
7954 -274 -115 -21 144 245 250 274 76 -137 -252 -235 -179 -38 142 277 289 147 -49 -128 -155 -267 -173 -149 66 239
7978 239 291 300 97 -177 -250 -235 -151 -38 92 197 273 211 160 2 -148 -261 -267 -84 105 220 312 200 123 -72
8002 -72 -189 -213 -265 -164 -53 164 247 310 208 2 -244 -274 -286 -142 13 192 206 223 131 9 -88 -206 -269 -199
8026 -199 3 148 299 291 221 10 -87 -239 -215 -159 0 24 224 269 236 107 -86 -247 -290 -217 -22 65 186 213
8050 213 203 58 -70 -174 -259 -208 -180 37 180 307 253 74 -90 -172 -258 -260 -95 122 175 238 216 169 -21 -134
8074 -134 -243 -227 -149 46 159 290 293 142 43 -114 -218 -183 -164 -30 93 204 308 178 64 -143 -252 -295 -192
8097 -192 -55 167 235 200 152 45 -27 -207 -253 -221 -68 105 223 311 251 81 -108 -193 -230 -176 -56 76 184 219
8121 219 223 106 -29 -207 -225 -220 -72 9 156 254 214 86 -59 -134 -170 -198 -168 -26 137 239 239 177 -74 -169 -271
8146 -271 -219 -141 20 121 227 261 147 78 -31 -239 -193 -225 -16 170 280 263 222 37 -136 -224 -182 -125 -99 86
8170 86 187 227 228 94 -69 -242 -238 -217 -59 88 194 193 211 143 -61 -128 -230 -235 -132 19 202
8191B02
##END NTUPLES=NMR FID
##END=
