##TITLE=1H_Pr 5-x-S
 CDCl3, 8 sc, 
 29.8.2019
##JCAMPDX= 6.0         $$ Bruker NMR JCAMP-DX V2.0
##DATA TYPE= NMR FID
##DATA CLASS= NTUPLES
##ORIGIN= UXNMR, Bruker Analytische Messtechnik GmbH
##OWNER= root
$$ XWIN-NMR		Version 3.5
$$ Thu Aug 29 14:27:34 2019 Russian Standard Time (UT+4h)  she@DPX200
##.OBSERVE FREQUENCY= 200.13155
##.OBSERVE NUCLEUS= ^1H
##.DELAY= (6, 6)
##.ACQUISITION MODE= SIMULTANEOUS
##.ACQUISITION SCHEME= undefined
##.AVERAGES= 8
##.DIGITISER RES= 18
##SPECTROMETER/DATA SYSTEM= spect
##.PULSE SEQUENCE= zg30
##.SOLVENT NAME= CDCl3
##.SHIFT REFERENCE= (INTERNAL, CDCl3, 0, 15.7039)
##AUDIT TRAIL= $$ (NUMBER, WHEN, WHO, WHERE, WHAT)
$$ ##TITLE= Audit trail, XWIN-NMR		Version 3.5
$$ ##JCAMPDX= 5.01
$$ ##ORIGIN= Bruker BioSpin GmbH
$$ ##OWNER= she
$$ F:/spectra/data/she/nmr/H-F/1/audita.txt
$$ ##AUDIT TRAIL=  $$ (NUMBER, WHEN, WHO, WHERE, WHAT)
(   1,<2019-08-29 14:26:35.37 +0400>,<she>,<DPX200>,
      <created by zg, POWCHK disabled, PULCHK disabled
       configuration hash MD5:
       00 E9 B6 7A A2 85 ED C7 34 08 36 98 17 FE 4E 26
       data hash MD5: 16K
       83 39 BB 96 89 51 8E 9E 13 EB 14 9B 21 90 14 1C>)
$$ ##END=
$$ 
$$ hash MD5
$$ CD 53 36 EE 88 B1 BA 68 1A F5 49 BD 24 06 8F 3C
##$RELAX= 
##$RELAX= 
##$RELAX= 
##$RELAX= 
##$RELAX= 
##$RELAX= 
$$ Bruker specific parameters
$$ --------------------------
##$DU= <F:/spectra>
##$EXPNO= 1
##$NAME= <H-F>
##$PROCNO= 1
##$TYPE= <nmr>
##$USER= <she>
##$AMP= (0..31)
100 100 100 100 100 100 100 100 100 100 100 100 100 100 100 100 100 100 
100 100 100 100 100 100 100 100 100 100 100 100 100 100 
##$AQSEQ= 0
##$AQ_mod= 1
##$AUNM= <au_zg>
##$AUTOPOS= <>
##$BF1= 200.13
##$BF2= 200.13
##$BF3= 200.13
##$BF4= 200.13
##$BF5= 200.13
##$BF6= 200.13
##$BF7= 200.13
##$BF8= 200.13
##$BYTORDA= 1
##$CFDGTYP= 0
##$CFRGTYP= 5
##$CHEMSTR= <none>
##$CNST= (0..31)
1 1 145 1 1 1 1 1 1 1 1 1 1 1 1 1 1 1 1 1 1 1 1 1 1 1 1 1 1 1 1 1 
##$CPDPRG= <>
##$CPDPRG1= <>
##$CPDPRG2= <>
##$CPDPRG3= <>
##$CPDPRG4= <mlev>
##$CPDPRG5= <mlev>
##$CPDPRG6= <mlev>
##$CPDPRG7= <mlev>
##$CPDPRG8= <mlev>
##$CPDPRGB= <>
##$CPDPRGT= <>
##$D= (0..31)
0 1.2 0 0 0 0 0 0 0 0 0 0.03 0 0 0 0 0 0 0 0 0 0 0 0 0 0 0 0 0 0 0 0 
##$DATE= 1567074394
##$DBL= (0..7)
120 120 120 120 120 120 120 120 
##$DBP= (0..7)
150 150 150 150 150 150 150 150 
##$DBP07= 0
##$DBPNAM0= <>
##$DBPNAM1= <>
##$DBPNAM2= <>
##$DBPNAM3= <>
##$DBPNAM4= <>
##$DBPNAM5= <>
##$DBPNAM6= <>
##$DBPNAM7= <>
##$DBPOAL= (0..7)
0.5 0.5 0.5 0.5 0.5 0.5 0.5 0.5 
##$DBPOFFS= (0..7)
0 0 0 0 0 0 0 0 
##$DE= 6
##$DECBNUC= <off>
##$DECIM= 24
##$DECNUC= <off>
##$DECSTAT= 4
##$DIGMOD= 1
##$DIGTYP= 9
##$DL= (0..7)
0 120 120 120 120 120 120 120 
##$DP= (0..7)
150 150 150 150 150 150 150 150 
##$DP07= 0
##$DPNAME0= <>
##$DPNAME1= <>
##$DPNAME2= <>
##$DPNAME3= <>
##$DPNAME4= <>
##$DPNAME5= <>
##$DPNAME6= <>
##$DPNAME7= <>
##$DPOAL= (0..7)
0.5 0.5 0.5 0.5 0.5 0.5 0.5 0.5 
##$DPOFFS= (0..7)
0 0 0 0 0 0 0 0 
##$DQDMODE= 0
##$DR= 18
##$DS= 0
##$DSLIST= <SSSSSSSSSSSSSSS>
##$DSPFIRM= 0
$$ [...]
##$SUBNAM2= <"">
##$SUBNAM3= <"">
##$SUBNAM4= <"">
##$SUBNAM5= <"">
##$SUBNAM6= <"">
##$SUBNAM7= <"">
##$SUBNAM8= <"">
##$SUBNAM9= <"">
##$SW= 24.9336996594482
##$SWIBOX= (0..15)
0 0 2 0 0 0 0 0 0 0 0 0 0 0 0 0 
##$SW_h= 4990.01996007984
##$TD= 16384
##$TD0= 1
##$TE= 0
##$TE2= 300
##$TE3= 300
##$TEG= 300
##$TL= (0..7)
0 120 120 120 120 120 120 120 
##$TP= (0..7)
150 150 150 150 150 150 150 150 
##$TP07= 0
##$TPNAME0= <>
##$TPNAME1= <>
##$TPNAME2= <>
##$TPNAME3= <>
##$TPNAME4= <>
##$TPNAME5= <>
##$TPNAME6= <>
##$TPNAME7= <>
##$TPOAL= (0..7)
0.5 0.5 0.5 0.5 0.5 0.5 0.5 0.5 
##$TPOFFS= (0..7)
0 0 0 0 0 0 0 0 
##$TUNHIN= 0
##$TUNHOUT= 0
##$TUNXOUT= 0
##$USERA1= <user>
##$USERA2= <user>
##$USERA3= <user>
##$USERA4= <user>
##$USERA5= <user>
##$V9= 5
##$VALIST= <valist>
##$VCLIST= <CCCCCCCCCCCCCCC>
##$VD= 0
##$VDLIST= <DDDDDDDDDDDDDDD>
##$VPLIST= <PPPPPPPPPPPPPPP>
##$VTLIST= <TTTTTTTTTTTTTTT>
##$WBST= 1024
##$WBSW= 4
##$XGAIN= (0..3)
0 0 0 0 
##$XL= 0
##$YL= 0
##$YMAX_a= 88651
##$YMIN_a= -142845
##$ZGOPTNS= <>
##$ZL1= 120
##$ZL2= 120
##$ZL3= 120
##$ZL4= 120
##$ABSF1= 10
##$ABSF2= 0
##$ABSG= 5
##$ABSL= 3
##$ALPHA= 0
##$AQORDER= 0
##$ASSFAC= 0
##$ASSFACI= 0
##$ASSFACX= 0
##$ASSWID= 0
##$AUNMP= <proc_1d>
##$AZFE= 0.1
##$AZFW= 0.1
##$BCFW= 1
##$BC_mod= 2
##$BYTORDP= 1
##$COROFFS= 0
##$CY= 11.3945322036743
##$DATMOD= 1
##$DC= 2
##$DFILT= <>
##$DTYPP= 0
##$F1P= 20.1720416913024
##$F2P= 0.152960286110954
##$FCOR= 0.5
##$FTSIZE= 0
##$FT_mod= 4
##$GAMMA= 1
##$GB= 0.15
##$INTBC= 1
##$INTSCL= 1
##$ISEN= 128
##$LB= 0.24
##$LEV0= 0
##$LPBIN= 0
##$MAXI= 10000
##$MC2= 0
##$MEAN= 0
##$ME_mod= 0
##$MI= 1.114404
##$NCOEF= 0
##$NC_proc= 0
##$NLEV= 6
##$NOISF1= 3.799351
##$NOISF2= 2.8
##$NSP= 1
##$NTH_PI= 0
##$NZP= 0
##$OFFSET= 15.70392
##$PC= 1
##$PHC0= -9222.678
##$PHC1= 28.00096
##$PH_mod= 1
##$PKNL= yes
##$PPARMOD= 0
##$PSCAL= 0
##$PSIGN= 0
##$REVERSE= no
##$SF= 200.130013532006
##$SI= 16384
##$SIGF1= 3
##$SIGF2= 2
##$SINO= 400
##$SIOLD= 16384
##$SREGLST= <1H.CDCl3>
##$SSB= 0
##$STSI= 0
##$STSR= 0
##$SW_p= 3612.71676300578
##$SYMM= 0
##$S_DEV= 0
##$TDeff= 0
##$TDoff= 0
##$TI= <>
##$TILT= no
##$TM1= 0
##$TM2= 0
##$TOPLEV= 0
##$USERP1= <user>
##$USERP2= <user>
##$USERP3= <user>
##$USERP4= <user>
##$USERP5= <user>
##$WDW= 1
##$XDIM= 8192
##$YMAX_p= 0
##$YMIN_p= 0
$$ End of Bruker specific parameters
$$ ---------------------------------
##NTUPLES= NMR FID
##VAR_NAME=  TIME,          FID/REAL,        FID/IMAG
##SYMBOL=    X,             R,               I
##VAR_TYPE=  INDEPENDENT,   DEPENDENT,       DEPENDENT
##VAR_FORM=  AFFN,          ASDF,            ASDF
##VAR_DIM=   8192,          8192,            8192
##UNITS=     SECONDS,       ARBITRARY UNITS, ARBITRARY UNITS
##FACTOR=    0.0002004,     1,               1
##FIRST=     0,             0,               0
##LAST=      1.6414764,     0,               0
##MIN=       0,             -142845,         0
##MAX=       1.6414764,     88651,           0
$$ Real data points
##PAGE= N=1
##DATA TABLE= (X++(R..R)), XYDATA
0@%%%%%%%%Qj6J6j6K4l2L2m0N0n8P2q8J04j20J36j54J79k08K38k71L06l47L94
31B09m42M96n56O19o90P70q55R48j053J166j293J432j583J754j946K161k404K680
49A413k999L374l818M357n027N886p035Q658j1142J5477k5232Q8881k3363j29228
63g9798Q7145Q1304k1329p6577J2462K6502m940j0984K5828r546m0922p489M4163
76B5819P072l5089j2505K5687j736k1323Q377K4975j8491l0511J9451M0560j7290
89A4996m6627M480M7979P930l8424j6609K6967K2006n020j2205o755n673P818
102H63K1663N580k4973j5018J9923K3134p637j9903k81J0346M64k748L558L24
116A5295o683l537K819J354O96K718m043j3708j589J7907P996j9933j9272J1453
$$ plain form
0 0 0 0 0 0 0 0 0 0 8 -8 8 -8 16 -16 16 -24 26 -32 40 -48 56 -64 72 -82 97 -111 127 -144 162 -185 209
31 209 -233 263 -293 326 -364 406 -449 499 -554 612 -681 751 -832 922 -1024 1137 -1267 1413
49 1413 -1586 1788 -2030 2327 -2700 3186 -3849 4809 -6333 9144 -16088 72793 49430 -79798
63 -79798 7347 88651 67322 -9255 3207 29709 24769 13785 39613 30067 -10855 -18344 25819
76 25819 32891 -2198 -14703 10984 9248 -12075 -3698 21277 2786 -27725 -8274 32286 14996
89 14996 -31631 -27151 20828 28758 -9666 -26275 692 22698 17678 5473 -1282 -6955 863
102 863 22526 28106 3133 -11885 8038 31172 23535 3632 3351 13697 14161 11413 14971 15295
116 15295 8612 5075 7894 9248 9944 12662 8619 -5089 -6678 11229 19225 -708 -19980 -8527
130h527K2125n413k1503j870J8071M983j5652j0167Q371J1118l277j0415k529
143a4685Q365P824j603r922m683Q184R590l587r712J978J2821L32j3447l400J7046
158E101J0622j3965j6318Q659K1836K963j9281j1328J0201J6047J262j1556p228
171b985N012R933J436q069o048L737O073l68m522r20M269J063m438l999K967M872
187H013j143n579j481L946K615l673m084K274M377m54n870j598O239M186m437
202C331q200j30Q975O308n451r398Q03R373N318n714p600M49P013N055k958o027
218A147K2O312K769n642l942M482O796k738p486N74Q110J742o695l950M526L735
234I762j949l485Q4J644k45r25q53l01O46J254j730l995J69N924Q74p793n382
$$ plain form
130 -8527 13598 8185 -13318 -15188 2883 7866 -7786 -17953 -9582 1536 -1741 -12156 -14685
143 -14685 -6320 1504 -99 -10021 -14704 -6520 3070 -517 -10229 -8251 4570 4902 -8545 -11945 5101
158 5101 15723 1758 -14560 -5901 15935 18898 -383 -11711 -1510 14537 15799 4243 -2985
171 -2985 2027 11960 13396 5327 -721 3016 9089 8721 4199 3279 7548 8611 4173 174 3141 8013
187 8013 6870 1291 -190 3756 6371 2698 -1386 888 5265 4811 -1059 -2657 3582 7768 3331
202 3331 -4869 -4999 3976 10284 4833 -4565 -3762 5611 10929 5215 -2385 -1936 5077 10132 7174 1147
218 1147 1169 7481 10250 4608 666 5148 11944 9206 1720 2294 10404 12146 5451 1501 6027 9762
234 9762 7813 4328 4412 6056 5811 4886 4033 3732 4378 5632 3902 -93 76 6000 6874 -919 -6301
251f301O821P703m555r377R22Q443J670p316k823L883L084p39k428j066O89K674
267A284K105k787m776K313P818J43p761k398P278M510n035m685L859L785j990
282C663k612J400J981r28q59J4r7l27J942P3l452k296M505L408n296n826L369
299a338O989k009p272o96N573J528m326k745K005K073K01j881j635m7J776K511
315G07j956l972J400N114J35n078j071N017J981l995j724L234K423j444j812R67
331g4J396l0N4j70r47N50K850J43l575j497L850K798l225l931K393L623r00l931
349f23l3K802L56j515j226m11P34J246L46l034j680L166K641k854m329K009M352
366A947J57n002j814M168K551k416l044J037K455J616k288j904R5L481J261k832
$$ plain form
251 -6301 520 8223 3668 -5709 -4787 3656 5326 -1990 -4813 -930 2154 1415 -1013 -2079 -1390 1284
267 1284 3389 602 -4174 -1861 5957 6100 -1661 -4059 3219 7729 2694 -1991 1868 5653 3663
282 3663 1051 2451 4432 3504 2645 2659 2562 2235 4177 4250 798 -1498 3007 6415 1119 -4707 -1338
299 -1338 5651 3642 -3630 -4326 1247 2775 -1551 -4296 -2291 -218 -17 -1898 -3533 -3580 -1804 707
315 707 -1249 -5221 -3821 1293 1428 -3650 -4721 296 2277 -1718 -3442 -208 2215 771 -1041 -74
331 -74 1322 1292 1346 1176 229 779 3629 3772 197 -1300 2550 5348 2123 -1808 585 4208 3308 -623
349 -623 -656 2146 2502 987 -239 -650 84 1330 1676 -1358 -3038 128 2769 -85 -4414 -2405 1947
366 1947 2104 -2898 -4712 -544 2007 -409 -3453 -2416 39 1655 -633 -2537 -2442 1039 2300 -532
382e32l448K905M642j064m986o52N250J981m047l038K585L752m73l656p02K128
398F45K224n19k713j711K805L143j921m183K54M440R03l808k722K533L143j141
414A372l465m9K127J168o20j795n85J617J596j099k934L41L717N17l237j896K944
431b81K616j351l401O38L368P14k513j420J566J970N63j805j745J237L058r0l030
448I4j522L114K593k257l117J025L266L20k716j340J560J918m16j714j282J035
464E61K007j35k187j535K590K104k204l077R94L582J63l659j169K748K228j664
480A347k463k14K531J661j641l062L60L574K027l448l529K244N017o38n045j108
496b387M094L162l089l378J539K851M50k760j709J742K370l14l035o09K263K375
$$ plain form
382 -532 -3980 -1075 3567 2503 -2483 -3135 2115 4096 49 -2989 -404 3348 2875 -781 -1483 645
398 645 2869 2350 -363 -2074 731 3874 1953 -2230 -1976 2464 3367 -441 -3163 -630 2513 1372
414 1372 -2093 -2142 -15 1153 533 -1262 -1847 -230 1366 267 -2667 -2326 1391 1908 -1329 -3225 -281
431 -281 2335 984 -2417 -1779 1589 2303 -210 -1630 -64 1906 2469 664 -1081 156 3214 3124 94
448 94 -1428 1686 4279 2022 -1095 -70 3196 3516 800 -540 1020 2938 2522 808 -474 561
464 561 2568 2433 246 -1289 1301 3405 1201 -1876 -882 2700 2863 -796 -1965 783 3011 1347
480 1347 -1116 -1330 1201 2862 1221 -1841 -1481 2093 4120 672 -2857 -613 4404 3766 -1279 -2387
496 -2387 1707 4869 1780 -1598 -59 2792 3242 482 -1227 515 2885 2571 -464 -1073 1190 3565
512C565k213l654N96M337K10l656k135K980K803k162l243K33L042R23k265j510
528b149K93J965R76j335k170M42K739J157k768k251K358K528j095k718Q37K559
544A368J99j922r83J072J728j69j862p34J532K022n40k410j006K676K207j998
560A180l391Q14L510M03l277q12J774J916q73k122l82J906J374j080j856k95K154
577I43J483j615k331O65K951j45k602p14K683J323j816j691J287K018k16j870
593C53m08Q98J844L42k015j370J798K722q89l060m09L005J534k588k406J857K653
610C861k70l221p16J910K057p22k361j373J970K676j174k878o43L037J318k707
626G64j422J742J951j293k431R82K204j52k255n72K181J247j069k048o5J973J720
$$ plain form
512 3565 1352 -2302 -1706 2631 2841 -815 -2950 30 2833 671 -2572 -2339 703 1626 -639 -2149
528 -2149 -1856 109 1085 -250 -2420 -1978 761 1918 -850 -3101 -743 1785 690 -2028 -1191 1368
544 1368 1567 -355 -1338 -266 1462 1293 -569 -1303 229 2251 1711 -699 -1705 971 3178 1180
560 1180 -2211 -1397 2113 2516 -761 -1573 201 2117 1244 -878 -1260 646 2020 940 -916 -1211 943
577 943 2426 811 -1520 -855 2096 1951 -651 -1365 1318 2641 825 -866 421 2439 2223 353
593 353 -55 843 2687 3029 1014 -356 1442 4164 3275 215 -194 2811 4345 1757 -649 1208 3861
610 3861 3591 370 -346 1564 3621 2899 538 -835 1135 3811 2637 -241 -884 2153 3471 764
626 764 -658 1084 3035 1742 -689 293 2497 2345 90 -482 1699 2946 1877 -171 -236 1737 3457
643C457j445k273K28K773R79k295k331K057K744j131k672j54J796J058j123j147
659E21J64P32J35N1n84l24J83K57P1K8j77J08o84m96Q54Q29m93j259o4Q61R56
680A669j08j190r81P96J493O27k164j419J382K126j56k551n92K084J232p55k217
697g24M66J483L16o91r25p0R12O00q66q51O16P43l96o84L89J110n08j528k66K216
717A342J013j447k295J153J926O18j822j131K51J927L85p67r46j97J705M17j099
734A033r14J266J55n79l20Q65k96p32m93J056Q78j312n11k66J221Q9p82k88m90
753d20R97M29k52j472n05J100J563p11k159N84J104J038p95p67J26M27K5Q82j69
772A025q17m00M36J325l98m10j88L07J13L86L19m10q02N61N07N20j084k20K70
$$ plain form
643 3457 2012 -261 -33 2740 3719 1424 -907 1150 3894 2763 91 -63 1733 2791 1668 521
659 521 685 1417 1552 1603 1019 695 878 1135 1206 1234 1057 1165 481 -15 839 1668 1175 -84 -148 713 1669
680 1669 1561 371 -610 186 1679 2306 142 -1277 105 2231 2075 -476 -1068 1016 2248 1493 -724
697 -724 -258 1225 1541 850 -75 -145 767 1367 501 -350 266 1009 613 -71 318 1428 920 -608 -874 1342
717 1342 2355 908 -1387 -234 1692 2310 488 -643 -392 1535 1920 1153 207 10 1715 2132 1033
734 1033 119 1385 1540 961 641 1506 1210 478 -15 1041 1919 607 96 -170 1051 1140 358 70 -420
753 -420 577 1006 754 -718 -1223 -123 1440 729 -1430 -846 258 1296 501 -266 -140 287 312 1194 1025
772 1025 208 -192 244 1569 1171 761 573 880 993 1379 1698 1288 486 1047 1554 2074 990 770 1040
791A040P02k72lq16n22J021O53l21j662K02J137L56o81q33o0L63L24M26p96n94
811c36L6J172L1q07n80O41L39l3m01K07k16l58L46N26N32j369m8N83P72k90q19
832g2K47K16J41K4M25n86n30P29Q51m44j163L07N35K26n49K95K09l29l94Q93k63
853G68m96n84J266N6n52o00L98K67m68j50O8O5m80K70M95J24o20l67L89M96k37
874A08j28l19qO9L89k69m95j9P30K60o02k82O20K82m97l79N83L98m52J03j78O57
896E71l20r0Qk66O2M3M21k85j04L75M17m19o15M16K75m9m13l55P66K19r2l9p52
919b26K36M22K92q62o60J111L74m81j244O51Q98k04o98l55J007J34p01m81N14
938b73M80J28m17m28J38P44Q1m36n44O05N80k65j123O65O84J02p65m44J010K89
$$ plain form
791 1040 1742 1470 1467 651 129 1150 1803 1482 -180 22 1159 1515 834 1 -59 304 628 1054 258 -336
811 -336 -300 872 903 96 -484 157 496 463 62 269 53 -305 41 567 1099 -270 -318 265 1037 747 -72
832 -72 175 391 532 556 981 395 -135 594 1445 1001 -162 145 680 906 357 652 861 532 138 1031 768
853 768 272 -312 954 1010 458 -142 256 523 55 -95 -27 38 -442 -172 323 447 -173 -540 -151 345 108
874 108 -20 -339 -347 -278 111 -158 -653 -672 58 318 -284 -566 54 336 -161 -540 43 441 -11 92 -86 571
896 571 251 161 169 -97 -35 8 429 144 40 415 832 413 -202 214 489 440 27 -328 438 657 565 526 -226
919 -226 10 432 724 -138 -798 313 687 206 -1038 -387 511 307 -391 -746 261 395 -306 -787 -273
938 -273 207 335 -82 -510 -372 372 453 17 -527 78 658 393 -730 -65 619 721 -44 -488 522 811
958H11m28p61K74P92Q5m91KQ9K80n9o18n0R1P87j28p52k77Q44J31q88r1J96O08
981D47m72l29L40j71j96M94l3o12M4K94J77n57o7M56N28r60l07O38L93l41m44
1002f78J41N91J68j35k00M9M09J38l43k99J24P21K42n01j035J072N32m39m47j09
1022AP75j12l94j37m6O32k04k67k89K95Q20k36r05j05L46K37l64l98k20R40m24
1043e5l91j30M20O9J2m14J6L48k24K39m06j55P07K80l01m38P4Q97l7j075J73P80
1065C89L96q35m56M46P44J52p87j98K84O84K4o10l71M74L91o1p10m1O11L27r34
1086h1k48N97P05l81j083J31J022l42m55m53K80L56lj7r65M86N98J6o17m44M51
1107d47O79m75m24M74O3K59p56J77L65K36J67j27k36j51Q74K3p92m85R47L89l86
$$ plain form
958 811 383 -378 -104 688 773 282 284 373 653 594 -24 -74 17 804 676 -76 -353 491 622 -266 -357 -161 447
981 447 -25 -354 -14 -185 -381 113 80 -532 -488 -194 -17 -574 -641 -185 343 -617 -924 -286 107 -234 -678
1002 -678 -537 54 222 87 -113 -64 345 483 140 -159 -35 686 928 427 -608 464 996 557 110 1
1022 1 776 664 270 133 87 719 515 248 -41 254 1074 838 -67 -172 174 411 47 -351 -571 369 -55
1043 -55 -446 -576 -156 -87 -75 -489 -473 -125 -349 -110 -516 -671 36 316 15 -423 -349 548 511 -564 -391 389
1065 389 785 -50 -506 -60 684 836 49 -149 135 819 843 233 -138 336 727 666 -44 -85 526 853 -81
1086 -81 -329 268 973 592 -491 -360 662 320 -135 -588 -308 48 45 28 -937 -451 147 163 -454 -898 -447
1107 -447 232 -243 -667 -193 -130 129 -627 -450 -85 151 318 191 -45 -196 678 701 -91 -576 371 760 374
1128C74l17J41Q79l02o71K9P61K1l72m58Q9K52J95R3m06j80nP23m47n49j27R15
1150F38j76o78m08P18N09n06l08k31M85p8m13k90O24K79K1l92k47L96J76k50o62
1171g93L85M76L92n59k05O20K78l3n08J92N8N18l57J0k37M21K30k81o38J85Q00
1192I54J24n51n39L99Q81l85p56m3L39J74n18k11K82K78ll38l78K53L34l92l43
1213d39l04N03P50q87p25P87N41K1q06j45M43M43k19p65N51N68J21o15M9K19M18
1234E09r5j67m76L81K55q3l54K44J22O79l43m19J26J11m9R2l09k06L74l2J71n46
1256a5o4O47j57n47nN82K12n46l37J70L12j24k61m29N15L76m48J17p75M49M54
1277A26n3m04J17M31q4j28q22P29N69k00m39J48M74n8n31j6R6L76N5nk98j0M77
$$ plain form
1128 374 57 198 1077 775 104 133 894 915 543 85 174 426 621 714 308 128 123 846 399 -150 -277 638
1150 638 462 -216 -624 94 603 97 -211 -442 43 -35 -448 -738 -114 165 186 -206 -453 -57 119 -131 -793
1171 -793 -408 68 460 -99 -304 316 594 561 53 245 303 821 464 474 237 658 888 607 -31 154 954
1192 954 1078 527 -12 387 1268 883 127 84 423 597 79 -132 150 428 425 87 -291 -38 296 -96 -439
1213 -439 -743 -240 510 -377 -1102 -315 226 247 -559 -704 -261 182 -37 -802 -251 317 438 -177 -128 91 509
1234 509 414 247 -229 152 407 324 -30 214 336 1015 672 253 379 490 441 533 224 18 392 360 531 -15
1256 -15 -79 568 411 -136 -141 441 653 107 -230 -60 252 128 -133 -562 -47 329 -119 -2 -777 -328 126
1277 126 73 -331 -214 217 133 5 -817 -88 481 281 -158 -10 464 406 -125 -141 -45 331 386 381 83 73 550
1300E50L8l26k87M03K89m58k82L74K18q6j15m84L34L60l88q6J99M9qk1l53k5P1
1323c4N67l20o98L61L73K1p73K74M68jm75P8r5K03K28ko48K31L41L21l86l15M54
1346A73J15p9l18K27lN53o67P7K79j00j56J12k43M87n01J31K30n2j18K29M0j26
1368B90k57K14M7J10r3K7j13q3q3J6j33K18n1k89j14J09M16Qp60o8P51P1m17m08
1392e92K32O51l56l9q2j02L77K28n37j59L70J36j08m10M91J68k28L58l90J20K91
1413D19m16k68N49OJ11n15K31K28J41k35L2o9J5M25m76J54m45RM02L7j84j16M44
1436D79n12j70K89l33J38K3N0k64qK29m14K93N5M2L1j7r8q9L20R0j33k08M37K30
1460D60n71j09o9M62J38l2l8K1L7j2O9j12l4Q7K65l52l79K85K17k53qo6K36M8
$$ plain form
1300 550 588 262 -25 378 667 209 -73 301 519 433 318 -166 168 528 140 54 253 302 294 273 -80 -105 -34
1323 -34 533 213 -485 -124 249 270 -503 -229 239 238 -237 -159 -254 -51 177 175 -473 -242 99 420 34 -281 173
1346 173 288 209 -109 118 115 668 1 78 357 257 101 213 -30 457 -44 87 317 265 147 376 416 290
1368 290 33 247 294 404 311 338 225 142 59 75 -58 160 109 -180 -294 -185 231 239 -521 -589 162 233 -184 -592
1392 -592 -360 291 -65 -104 -186 -288 89 317 -220 -379 -9 127 19 -391 100 268 40 398 8 128 419
1413 419 3 -265 284 290 401 -114 117 345 486 251 283 214 229 654 178 332 -113 -104 298 335 151 35 479
1436 479 -33 -203 86 -247 -109 -86 -36 -300 -308 -79 -493 -200 -145 -103 -72 -89 -187 -276 44 134 1 -207 230 460
1460 460 -111 -220 -289 173 311 279 241 262 299 287 356 244 210 297 562 210 -169 116 333 80 72 6 242 290
1484B90j59k0r4J43k72J02M2j19J10L69p57j88N47J61j48l82L15Q4L05p41L11
1505a01k33L75K3m95M69k07M30l58P4j48K10J4Q7r3j97O96n15O9j68K71L56m47
1527A12O2j40o9K46j01j74M09j05r1k81O4R9L57l4l78J3Q6K79l39l9j89M25pn53
1551c48k0L44m7J52j83K40l33J9L56m07k77K37M73m06j0JM62o1p30L49K4K65p
1574I3j54k51n8L03N25n52R9j18M28j08l85J7O82k57m95j57O82j1l66k84L70J77
1596A80J92o92K16L32k2L3m67K83Q2K76k46m48r6M13K17l06j49nJ36M4jj02j27
1619b57J36j05K6j88K67K34o7l61j14O37k3l41L8L7J71m04L25j10L59Q5m06r5
1641a56K42o8K91n11PK92K10j81j97j1L48K07k65k94K75k7k6k93K27j28L41j69
$$ plain form
1484 290 131 111 17 160 -112 -10 32 -87 23 392 -365 -553 -6 155 7 -375 -60 24 329 -412 -101
1505 -101 -334 41 64 -431 38 -169 261 -97 -23 -171 39 53 140 47 -150 546 31 100 -68 203 559 112
1527 112 174 34 -35 211 110 -64 345 240 149 -132 -68 31 388 354 -24 -11 75 354 15 -24 -213 212 205 -348
1551 -348 -368 -24 -71 81 -102 138 -195 -176 180 -227 -504 -267 206 -200 -210 -209 253 192 -538 -189 -165 100 93
1574 93 -61 -312 -370 -67 458 -94 5 -113 315 207 -178 -161 521 264 -231 -388 294 283 -83 -367 3 180
1596 180 372 -320 -104 228 206 239 -228 55 137 413 167 -281 -377 36 253 -53 -202 -207 -71 -27 -28 -130 -257
1619 -257 -121 -226 -200 -388 -121 113 46 -315 -429 208 185 -156 -118 -81 90 -314 11 -99 260 345 -61 -156
1641 -156 86 18 309 -202 -195 97 307 126 -71 -82 266 473 208 -86 189 162 136 -157 70 -58 283 114
1663A14l32J47k4K8p5o0l44N17K46n06K85k8K80o28L65K5l8j58j47K80j03M30
1685B74k67Q4K4R9k3K41m57J15l6K99Nm77M83j62J6J8ql76N16O5n51M3K54M4j02
1710A21l12L01n3L54L7r21M37L89m5n60K92J42K76k34k97j78J52J84j01j78K70
1731G6j38J63j56J15p4M28j68m90O7M9K54k16J01J69k13K67o0l14N48k50j2k08
1753f2K26j14M11k03n13M5L29j44M14m23K37l92K80M8j15L55k46J89n64j30N20
1774A48J11l04OK4j63N27k47l9K48j93K0j59J10M1oj98m8K00K4l7K14o63N16R4
1798B26k33J49O6k31K49p2j10R2K2K01j64k32K31l20L13l15J88J37R5k99J76k34
1820f5K35j03L9k87L35o4j6k6k35K94P2n26M66k36j40J22L91j11l67K69j45P4
$$ plain form
1663 114 -218 -71 -95 -67 -142 -202 -546 -29 217 -289 -4 -32 248 -380 -15 10 -28 -186 -333 -53 -156 274
1685 274 7 91 115 214 191 432 -25 90 54 353 358 -119 364 202 218 236 228 -148 368 433 -118 -75 179 223 121
1710 121 -191 110 57 411 448 -473 -36 353 308 -252 40 182 458 224 -73 -251 -99 85 -16 -194 76
1731 76 -62 101 -55 60 -14 414 246 -244 -177 -128 126 -90 11 180 -33 234 174 -140 408 158 146 -62
1753 -62 164 50 461 258 -255 -210 119 -25 389 -34 203 -189 91 139 24 379 133 322 -242 -372 148
1774 148 259 -45 -39 -15 -178 349 102 63 311 118 138 -21 89 130 124 -74 -122 78 102 65 279 -384 132 226
1798 226 -7 142 208 -23 226 154 44 136 158 359 195 -37 194 -126 187 -128 60 197 292 -7 169 -65
1820 -65 170 67 106 -181 154 90 74 48 -187 107 179 -347 119 -117 -257 -135 256 145 -222 47 -98 -24
1842b4j03J32j49R2j25o2M01J48j26j52p4K16j16j8k12K4L50k5m19M07j33M3n03
1865d28K66L21k48J44PJ76j16j47K19k30n2k0K72L4k02q0j20K19j21K56o4J83
1887B69p7k75p0L05L3k15K4M6J47k10J76k63Q7j40K51j75P6m0M2j35J98j04J8
1910c2q9l8K90l4k12R3K7J22j83J36J04n3j25J77M8j01K05j89l43M96m65O0K44
1933A38j81N27o66L21m8lJ96l22J58n91M15M4l4O3l9m6j59J67o4J29j65Q9k2K23
1957A30l9J40k91q3L27rl15J93j34J88NO0l20K97N0l01L30k99K3K6K04l35K65
1980A12j85L09j90j43L69o7J63p5m21J12n0K72j14l8l9r6J99k40K93l01j15J94
2002e1K89j62J02j45p9J10l09K92M3l04m8L19j5Nk89L65k46K65j72n4L99l71j4
$$ plain form
1842 -24 -127 5 -144 -52 -177 -239 162 310 184 32 -42 174 58 40 -172 -148 202 177 -242 165 32 75 -428
1865 -428 -162 159 -89 55 62 238 122 -25 194 -36 -88 -108 164 198 -4 -84 -204 15 -106 150 86 269
1887 269 192 -83 -153 152 185 -30 -6 40 187 -23 153 -110 -23 -163 88 -87 -11 -51 -9 -144 54 -50 -32
1910 -32 -121 -159 131 97 -115 -22 5 127 -56 80 184 131 6 183 231 130 335 146 -197 299 -166 -106 138
1933 138 -43 484 -182 139 91 88 284 -38 120 -471 -56 -12 -46 17 -22 -68 -227 -60 -124 5 -160 -71 -93 130
1957 130 91 231 -60 -143 184 175 -140 53 -81 107 112 172 -148 149 199 -102 228 -71 -48 -22 182 -153 112
1980 112 -73 236 46 -97 272 205 368 293 -128 -16 -66 206 92 54 15 -81 118 -122 171 -130 -245 -51
2002 -51 238 76 178 33 -46 64 -245 47 90 -214 -262 57 42 47 -242 123 -123 142 -30 -84 315 -56 -70
2025g0R8n1O9J62j61J8o9l9K84k22K89n10K83J60m22J62R2J97l23J44k21K09o2
2048A7l22L42j08J88j7L8r4j51j99N52k89j32L47M3l93J14JK65m30j69M04j08
2070a01L31j31J10o56O53j02K5j19j64J93m8p8QK90j44K48n85L54J74l67o8J89
2092A2l8K67l02K04k13P9J68j39r8j90M20j71L15m25J1j45K66J15m77L78L0M6
2114A13l6k39P7L6J04p9m5r2j59K23J32k7NM8N0k67N2J54p8m20M09P7j14M4j86
2139b18J89J49o9k60L45l56K52L9j79K7J54J30o4o4j49K14k57k0J38P7L52k41
2161A89j12J0M1j49m8K76n8K9J89o25L10R3m62L53j72L47k88J02J41k87k75M91
2183I5j01j12n9J14K20j33k04j24K79J87l89K24N2P2r0m9J36M7j89l91L80J40
$$ plain form
2025 -70 28 -23 46 208 47 65 -4 -43 241 19 308 -202 81 241 -181 -19 73 270 -53 91 -130 79 17
2048 17 -305 37 -71 117 100 138 44 -107 -306 246 -43 -175 172 215 -178 -64 -63 202 -228 -397 7 -101
2070 -101 230 99 209 -447 206 104 129 10 -154 39 -9 -87 -79 211 67 315 -270 84 258 -109 -177 12
2092 12 -26 241 -61 143 -70 9 177 38 -60 -250 170 -1 314 -111 -100 -245 21 136 -341 37 67 113
2114 113 77 -162 -85 -49 55 -24 -69 -161 -320 -97 35 8 13 61 111 -156 -104 50 -28 -448 -39 38 -76 -32 -218
2139 -218 -29 120 51 -209 136 -220 32 71 -108 -81 73 203 139 75 -74 140 -117 -137 1 78 430 189
2161 189 77 87 128 -21 -69 207 149 178 367 -258 52 145 -317 36 -136 211 -77 25 166 -121 -396 95
2183 95 -6 -118 -177 -63 157 24 -180 -304 -25 162 -227 -3 49 121 31 -18 118 165 -24 -415 -35 105
2205A05j31J95k93K05r5%j15p6M15m32J75R9L35k55K2j79K01k05k20K75k6K02
2227B02j01Rl22P8qR8k3j23J68J25j1k54M25j05k79N5l2K2O6j76M65j61r0J39
2251A67m78L03K15j53n9k12M61m14J39m2J85j39l48M30O0N0l6l18J16J22j15j5
2273h1O8N6j27J42k17K93j96K05j32O9m9J28N1j40p8j75M08k29N5j28p5Q5J95
2296A28N1l57Q6K82j42j36k22J53n7J71oK5J35r3K7m18N08M8j97n5n0M04M3n14
2320a86K67J64j46o8k47L37jq0j94L86l26j25J93L04l05O9j51k63K06K70l49J66
2342g9j03J25M3J2l0j44L09l9l6K02k10j07L39j78K01k60r3M00l98P7M2j44k23
2365b94J32K15j47J41J80n42L46p9Q3Lj5j22J4K89m4k19kj08N7K42k64R5K70q8
$$ plain form
2205 105 -26 169 -124 81 -14 -14 -129 -205 210 -222 -47 52 387 132 154 -25 176 -29 -249 26 0 202
2227 202 101 110 -212 -134 -142 -44 -67 -190 -22 103 92 -162 263 158 -121 -66 -98 -76 -10 -186 279 118 28 167
2251 167 -311 -8 207 54 -5 -217 244 -170 -31 -73 112 -27 -375 55 115 165 129 -189 -73 49 -66 -81
2273 -81 -13 43 -84 58 -159 134 -62 143 11 80 31 159 210 70 -8 -183 225 -4 51 -77 -152 -67 128
2296 128 179 -178 -92 190 48 -88 -310 -157 -214 -43 -49 -24 111 18 45 -373 135 183 -14 -69 -119 285 328 -186
2320 -186 81 245 99 31 -216 121 120 40 -154 232 -94 -219 -26 278 -27 42 -109 -372 -166 104 -245 -79
2342 -79 -182 -57 -14 -2 -32 -176 133 94 58 260 50 -57 282 104 305 45 -48 352 -46 31 73 -71 -294
2365 -294 -162 53 -94 47 227 -315 31 -48 35 38 23 -99 -85 204 160 -59 -61 -169 -112 130 -134 -39 231 143
2389A43J52m66L43l27J76J11J17n65O18j20n27O91j85l42KK3K57J05j34J80j81
2410G1k52K55M6j47j12J93j90q8J15l2J45j94L80m6k55J91k63L38j1j59jP2j21
2433f5j3K34j36K73j87j79j25J47J35j54K74j43j06J50m7j94K85j43J47o3k3k24
2455a57M45o23L16O9J63j59k48J28P3K79l25L29l54j9j06K30j89M3K51L29j25
2476C50n80J02O4J06k8N2j57l8L20k14L20l27j21J56j4J45j28P9J6Q7k09r8j0
2499a27J63j15M6J51r5J57o6J41j51j55L7j68K14l4N5l10K22J68O2l8k83J71r9
2522e4K12r7o9j91J43k09J61J09k87K56O8j20M5j18J5M62m17n1K73j0O5r2k02
2545a08J01NJ41l52P8J42J3J1J17k97J5K71m0n3J77m44J13J81L4mj38R5l14K13
$$ plain form
2389 143 295 -171 172 -155 21 132 249 -316 302 182 -345 346 161 -181 -179 -156 101 206 72 252 71
2410 71 -181 74 120 -27 -139 54 -136 -224 -109 -141 4 -190 190 144 -111 80 -183 155 144 -15 -16 56 -65
2433 -65 -78 156 20 293 106 -73 -198 -51 84 -70 204 61 -45 105 58 -136 149 6 153 90 67 -157
2455 -157 288 -335 -19 50 213 54 -194 -66 7 286 -39 290 -64 -83 -189 41 -148 -105 146 475 350
2476 350 -230 -128 -64 42 14 66 -91 -129 191 -23 297 -30 -151 5 -9 136 8 87 103 190 -19 -117 -127
2499 -127 36 -79 -33 118 23 180 114 255 104 -51 -14 -182 32 -2 53 -257 -35 133 195 157 -126 45 -54
2522 -54 158 61 -8 -199 -56 -265 -104 5 -282 -26 42 -78 -33 -151 -136 326 -91 -142 131 121 186 94 -108
2545 -108 -7 -2 139 -213 -135 7 20 31 148 -149 -134 137 97 44 221 -223 -110 71 105 101 -37 58 -256 -43
2569d3J25k64p1L49L9j80k15L06lO2j54O9r8J39O9J46j89q7j90J10L6j69O9K2
2593a22L81l29J02k27Q0m7M02K8J4k74l9J0J23r3M2M9j7P5n03M70kj3j25J39J59
2618B83l41P9j65K95r4j90n9K79j06K78j67j25j8K22k30Q8j11O1P1Q8j61j24J59
2641A2J25l64J46o6J12j50L32j69j34K34j45J84k78K13m4n1qR4K13l56N8M1P6
2664G5p4J27j25k22K31j25J95O7l62K71j03l4K35k33k10J40J95j89m3J89l7M5
2686A3K10l21P1J63k37j96L66JJ24m49K02K77l50L34m43K94J8j24K24j67N3P2
2708A35j56R3N1P5k81l9q5K04Q8p0J95l88K04l6q1L72l97j56N67L9k45j14%k91
2732c16L44K04k08R9J76j85m4K6p0J9k6No6j17M6p8O9K9K03l2K02l83J94j59K38
$$ plain form
2569 -43 82 -182 -253 96 135 -45 -260 46 43 105 -49 20 -78 61 130 276 87 0 -190 -80 -44 -213 -144 -122
2593 -122 259 -70 32 -195 -115 -162 240 268 282 8 -31 -21 102 9 51 100 83 158 -345 125 123 110 -15 124 283
2618 283 -58 21 -144 151 57 -133 -192 87 -19 259 92 -33 -51 171 -59 29 -82 -21 50 138 -23 -147 12
2641 12 137 -227 -81 -147 -35 -185 147 -22 -156 78 -67 117 -161 52 8 -43 -51 43 256 -100 -42 -1 75
2664 75 1 128 3 -219 12 -113 82 149 -213 58 -45 -79 156 -77 -287 -147 48 -141 -184 5 -32 13
2686 13 223 -98 -27 136 -101 -297 69 70 194 -255 -53 224 -126 208 -235 59 77 -47 177 10 63 135
2708 135 -21 72 123 198 -83 -122 -207 -3 85 15 210 -178 26 -10 -91 281 -116 -272 295 334 89 -25 -25 -316
2732 -316 28 232 24 123 299 114 70 96 26 45 19 24 -42 -159 -113 -191 -122 -93 110 78 280 -103 91 -68 170
2757A70k27L1L34k57k01K62L5l79L92j2N2k28p2L77j2k01q3j34J9O6n6J26J15
2780A17m37K71k56K96L4k22j24M00K53k78j44J25j81j22L40oj59L4J39k2m5L34
2802C47l49K39k57L7M19o38K02m00M37k90K69j4n3NP3J78k82J77K08n18m3L11
2824E8pj35j5j73M69l11j11M70l47KJ12j04n1Q8O1J33O8j6j24j19K4L4J03k82
2848a73J05J77k22K29j11j62K69J14j1O3m18J43j2p9N5K03m4m48K75J69J9l04
2870a63K01K1K05k82J22j34Jn7K56n3K06l26o0j12K11j0k03r7J98l7R3j56L11
2893A35n7rJ02m37L19K15j83j64J41j26k52L66j84J78Q7J24l26j93O0M60Nk65
2915dj00J25j5L7K79n77J79L30k82p7K51j75R8o7j28q1L23k82J4K9J40k87L53
$$ plain form
2757 170 -57 -26 308 51 -150 112 147 -232 160 148 200 -28 -100 277 265 64 -19 -153 -134 -68 -124 2 117
2780 117 -320 -49 -305 -9 25 -197 -321 79 332 54 -90 35 -146 -268 72 66 -93 -59 80 58 13 347
2802 347 -2 237 -20 17 436 -202 0 -400 37 -253 16 2 -51 -46 27 205 -77 100 308 -210 -253 58
2824 58 51 -84 -99 -272 197 -114 -225 245 -102 -100 12 -92 -143 -55 6 139 207 191 67 -52 -28 6 109 -173
2848 -173 -68 109 -113 116 5 -157 112 226 215 278 -140 3 -9 -88 -33 170 126 -322 -47 122 141 -163
2870 -163 38 59 264 -18 104 -30 -29 -86 170 117 323 -3 -63 -175 36 26 -177 -274 -76 -113 -20 -176 135
2893 135 78 69 171 -266 53 268 85 -79 62 -64 -316 50 -134 44 131 255 -71 -264 -204 256 261 -4
2915 -4 -104 21 6 43 322 -255 -76 254 -28 -105 146 -29 69 2 -126 -207 116 -166 -152 -123 17 -270 83
2938H3j06j91K23Ml4J06J3l50M34j74j60J81J53j00j88j47K25Q7k5M5l3O5m45
2961c34O20n02J88K63l12P1m3O2k16J22J15j10J16Q8m05L73j36J72k19Oo7M48
2983C00n72J69J78P5j75j38K29q5j66L12N0j20K8l59J3K68k14m5K48k97L02J77
3005A78j66%j84J76K54k28j57J25j57M38m91N80o38J92K05j51J09r7j02nQ9o3
3027i3N0J65o1k93L03j96J64o9j29N4J07O2o9j52q3K70J17m9q0N4l44K35j18L64
3051B09l4k60j54K16J58k60L69j67k19P6RK27J29k33K18m66RL45l30O4NJ81l57
3074b65N05m26K31J27p8Jk15Q8j30L8K62j19K2J72k54M64n09K50k7J26l62L39
3096B40j71j69J06L7p6J89j52K41m69J63K0qJ23j44L7k54L93k13%M7K3L8q6J48
$$ plain form
2938 83 -23 -214 9 13 -21 85 98 -252 182 8 -152 29 182 82 -106 -253 -28 59 34 79 46 111 -334
2961 -334 286 -216 -28 235 -77 -6 -49 13 -203 -81 34 -76 40 128 -277 96 -40 132 -87 -81 -148 300
2983 300 -272 -103 75 150 -25 -163 66 -19 -185 127 177 57 85 -274 -261 7 -207 -252 -4 -301 1 178
3005 178 12 12 -172 4 258 30 -127 -2 -159 279 -212 368 -270 -78 127 -24 85 -12 -114 -119 -30 -93
3027 -93 -43 122 61 -232 71 -125 39 -30 -159 -105 2 64 -5 -157 -240 30 147 98 18 72 -272 -37 -155 209
3051 209 175 -85 -239 -23 135 -125 244 77 -142 -66 -57 170 299 66 284 -182 -173 172 -158 -94 -89 92 -265
3074 -265 240 -186 45 172 94 95 -120 -32 -162 -124 138 19 41 213 -41 423 -86 164 137 263 -99 240
3096 240 69 -100 6 43 -33 156 4 245 -224 -61 -41 -49 74 -70 -33 -287 106 -107 -107 -60 -37 1 -85 63
3120F3N8l98L13J52l1k72J01j66M20j26K47m89O9J11l00L07k75O0k5L32j95J49
3142A05l59L90k66K16k40K53L4l62J86j27M25n87N93m80j34M79l10NN21j35j89
3163A8j99r7L46j1k8q6p4r5J09K90k09q1K73l47P1M83l41%lj05J89j79J07j41
3187a10K74q2j53K04J39m32l7N9K56k65J38K9J65k29L06m37k8L22qp0k03J01L5
3210b6J03p0j92L47Q0r1j35j37K35J46p2N4k96K17j08k87M08j92J30k12J48M6
3232I6k17l5J93j12K02Q8l05J63Q8j28pL1J38j75K0J64j46K1l1j53J07J1j62K88
3256A39k3l50K19K44o44L78K57k17P5j25l1P0M1l22J16Q6j74K38q7J2L02l53J52
3279Cr2q2J97m1j18K74j96J55r8K9k8J63N0l95Q1R2j65P1K16k56K84j23m4P7j21
$$ plain form
3120 63 121 -277 36 188 157 -115 -14 -180 240 114 361 -128 -59 52 -248 59 -216 -156 -181 151 -44 105
3142 105 -254 136 -130 86 -154 99 133 -229 -43 -170 255 -332 261 -219 -353 126 -184 -179 342 207 18
3163 18 -181 -278 68 57 29 -57 -131 -226 -117 173 -36 -117 156 -191 -120 363 22 22 19 -86 103 -76 31 -110
3187 -110 164 82 -71 133 272 -160 -197 -138 118 -147 -9 20 185 -44 262 -175 -203 119 111 41 -162 -61 -26
3210 -26 77 7 -185 162 242 151 16 -121 114 260 188 242 -54 163 55 -232 176 -16 114 -98 50 96
3232 96 -121 -156 37 -75 127 215 -90 73 161 33 26 57 195 20 40 204 58 79 48 -105 2 13 -149 139
3256 139 116 -234 -15 229 -415 -37 220 3 78 -47 -78 -8 33 -289 -173 -87 -261 -23 -110 -98 204 -149 3
3279 3 -89 -171 26 -15 -133 141 -55 100 2 31 3 166 216 -179 -98 -6 -171 -100 116 -140 144 21 -23 54 -67
3304f7r8M76l19j01Q6J93j20r8J59k9J76m18N6K09k44K67p3j53J99q7j04J87L7
3327A34k81R4k5k06M29l80M6k20M41rnMj72o7J07K24J0j16j12L87j36K2l68J50
3351d9o1J81N1rN2j33k9j76o4L86j83Q9j3j16P9n4J56j14j47j40M33j04Rj68L85
3376B61j54m30M48l44K44l0P2N3m9j80M3j94J28K83l53M23m58k27N68j60j39K11
3398A6k24M85Nk29n4J04q2m55L80l14K42Q6q6K95j00j85K25n0N3j17l8K63k15
3421Eo8L37k92k22J06P8J11n8p2J60L0j24J00j92L21m02n3J92rm62N43J29j03
3444E5j73K53k26o6L16k29K43Ll68M47k7m78L04l49R6K08P5j81k11k36R24k89
3466I1j5r0j58Qj17J85R3k9k2J51L2l78K61L89k84n7m0o1j5J04n0l6J13k64J60
$$ plain form
3304 -67 -165 311 -8 -109 -23 170 50 -48 111 82 258 -160 -104 105 -139 128 55 -98 101 14 -90 97 134
3327 134 -147 -53 -78 -284 145 -235 -189 -409 32 23 18 22 -150 -217 -110 114 124 8 -104 283 147 169 -199 -49
3351 -49 -110 71 122 113 165 32 3 -173 -237 149 -34 55 42 -74 5 -49 107 -7 -154 -294 139 35 44 -124 261
3376 261 107 -323 125 -219 25 -5 67 120 71 -109 -66 -260 -132 151 -202 221 -237 -464 104 -56 -195 16
3398 16 -208 277 282 53 -1 103 21 -434 -54 -368 -126 -40 -126 169 69 -116 109 59 112 -5 -43 220 5
3421 5 -63 274 -18 -240 -134 -56 55 -3 -75 85 115 -9 91 -101 220 -182 -235 -43 -52 -514 29 158 55
3444 55 -118 135 -91 -157 159 -70 173 176 -192 255 228 -250 54 -295 -199 9 84 -97 -308 -544 380 91
3466 91 76 -14 -172 -164 -281 -96 -3 -32 -54 97 129 -249 12 401 117 60 20 -41 -56 48 -2 -38 75 -189 -29
3491b9k1R6L2P0l35J97k0K21j06j55J61J54p34L43o8l9J97k70R5R3J02J75P3J1
3515B43j07j83J32j78PJ40j09l9l2Q5J39l29K19j33J41j68L20k76K75j42j38J85
3537E2jpr4J36J05K9k41j08K13j64J56l23O29k77J97J02n67K83j33j55J31j32
3559a69L75q6k48J42m18J63M16O3j58P4n0j19Rk39M8K27q4J41p6L01k76k1k5N7
3583D7l12K50P1p4J07m4J74l8K6l79J8J39J51j22o7j72K45Q8k43J57O8j32J83
3606A41k86L1pJ99k34O6r9N0J01J82k35n5J79m70N07k92M02J27k62o7j58M23o41
3629c98L62L0M9p7k91L91k49J76o3M3J79j53m5R9j93M5M8J64j12j52m7M9J13R
3653b3L77k88M7o8J0j23J40j64q3%N2k1J46L08j93j87p6P3Q4N5l20L50M9Q8j77
$$ plain form
3491 -29 -50 46 78 148 -187 10 -10 211 105 -50 111 265 -469 -126 -194 -233 -36 -306 -211 -118 -16 159 232 243
3515 243 136 -47 85 -93 -86 54 -55 -94 -126 -41 98 -231 -12 -145 -4 -172 148 -128 147 5 -133 52
3537 52 51 44 -50 86 191 220 -21 -129 84 -80 76 -247 382 105 302 404 -163 120 -13 -168 -37 -169
3559 -169 206 120 -128 14 -404 -241 175 238 80 154 104 -15 -6 -245 -197 30 -54 87 11 312 36 15 -10 47
3583 47 -265 -15 56 -18 89 45 219 181 207 -172 -154 -15 136 14 -53 -225 20 108 -135 22 90 -42 141
3606 141 -145 -114 -121 78 -156 -90 -189 -139 -38 144 -91 -146 33 -437 70 -222 180 307 45 -22 -180 243 -398
3629 -398 -36 -6 43 -34 -325 66 -183 -7 -70 -27 152 -1 -46 53 -140 -95 -47 117 5 -147 -194 -145 -32 -23
3653 -23 354 66 113 45 55 -68 72 -92 -175 -175 -123 -144 2 310 117 -70 -146 -73 11 66 -254 96 145 233 56
3678E6k16K16J25Om71J79M72q2k70j01M57j73m14p7M39j57J03M2Lk83K30j56k64
3701c36L42j16M6q8J46J8j16Q5J9M7O0l3j44j27J42L76l73Q1l85L09j26K42k26
3724a57J45J91r7j35M3j59K27n97P78k26J08r0N0P1k35j5J17K28j87M9k50N7Q7
3747Cj12r3O5J04j35r4K35j25r2K11N8m4L09k52j84J67p2O7k6Q3J31o13O04k53
3771e8O1o4K4J86j68k72M81l58K78r9k3k0K11k72J82j01L9k2M9lO8j35j82O06
3795D08l54j27K31m6j75n5M08j55J5j6m07K68k53M58j23j71k0Rl3J62n4J15k89
3818b04L74k19l56K98k4J24R4N9k26K68j61J95l72L00k23M34j87k00j89K64l6
3839A3l3k8J90k23J62N8j76j16J46J1J51j82P6K86l99J6J72j08N3j92J97m6j02
$$ plain form
3678 56 -160 56 181 187 -284 -105 367 285 15 -86 371 198 -216 -293 146 -11 92 134 137 -146 84 -72 -336
3701 -336 6 -110 -64 -152 -6 12 -104 -19 0 47 107 74 -70 -197 -55 321 -52 29 -356 -47 -173 69 -157
3724 -157 -12 179 82 -53 -10 -169 58 -539 239 13 121 31 81 152 -83 -98 19 247 60 109 -141 -84 3
3747 3 -109 -202 -137 -33 -168 -262 -27 -152 -244 -33 25 -19 290 38 -146 21 -51 16 -10 73 204 -409 195 -58
3771 -58 3 -61 -37 149 -19 -291 190 -168 110 11 -12 -32 179 -93 89 -12 27 5 54 51 119 -16 -198 408
3795 408 54 -73 158 112 -63 -118 290 135 150 134 -273 -5 -258 200 77 -94 -114 -105 -138 24 -30 85 -204
3818 -204 170 -49 -405 -107 -131 -7 87 146 -80 188 27 222 -150 150 -73 361 174 -26 -215 49 13
3839 13 -20 -48 142 -81 81 139 -37 -153 -7 4 155 -27 49 335 -64 -48 124 16 69 -123 74 28 -74
3862g4L7K43J1mm45J57J34r3K61J21l84P5M9q8lj89L98m51J24K14j26j75MK80
3886G6K61m18M6K15l30J14k44M33k01J00k12J98L45k60K23l61j3K95j62L21m61
3907c5q2K31j82K46m19L58m01K77J83O1l54PJ88r0q2n2L20j62J12m61M92o9rk44
3931a67jL8j36M60j03J33k20j96k39K59J55qj26K33n3J47Pj42l49K57Rj6qk57
3955c23J73m2O5K7J09K10j92n5K25l31M71k00k59K47m09J60N6nK89ll88K85q2
3978B8P1J32k19J0k0Q4q6J1K1n3K83k99K28l21O5p3j91J18Q8J27J0o5R9k08J29
4003c1K09m07K75L17p2j86J00J58l38l4J16k73M71k32j26LJ53l85K23j49J39J64
4025I5j13J57J7q4j35R2k43K45rL6k32o5L18kp9l62L42N7q1k14K74M8L17n18L46
$$ plain form
3862 -74 -37 206 217 213 -232 -75 59 -34 227 348 -36 39 88 0 -3 -192 206 -245 -121 93 -33 -208 -204 76
3886 76 337 -81 -35 180 -150 -36 -280 153 -48 52 -160 38 383 123 346 -15 -28 267 105 426 -35
3907 -35 -117 114 -68 178 -241 117 -284 -7 176 237 -117 -110 78 -12 -94 -146 174 12 124 -337 155 86 77 -167
3931 -167 -168 -130 -266 194 91 224 4 -192 -431 -172 -17 -25 -151 82 29 176 183 41 -308 -51 -42 -58 -66 -323
3955 -323 -150 -192 -127 -100 9 219 27 -28 197 -134 337 137 -122 125 -284 -124 -68 -73 216 213 -175 110 28
3978 28 99 231 12 22 2 86 0 11 32 -21 262 -37 191 -130 -65 -138 -329 -211 -123 4 14 -51 48 -160 -31
4003 -31 178 -229 46 363 291 105 205 363 25 -9 107 -166 305 73 -53 -50 103 -282 -59 -208 -69 95
4025 95 -18 139 156 72 -63 29 -214 31 22 58 -174 -239 79 77 -2 -364 -22 35 -46 -260 14 62 379 -139 207
4050B07k14L6J08k40K74k55j21K91R7j30l00J5K73O5k55K48m7l8m8L54l41l4K24
4073A69l3l45K63k5k30J42j31P1MK62m10N00l5k10J15j24M29j98l33K38J00m05
4095a86K8J49q8n7J34k3j8n6K26J01K70m24l10J69j04R4K88l45J5L86k73l7j21
4118a82J59J44J3pn9k70K27K1k69K17P0l14J20L49m42K67k73L26r6k04N1Q8j7
4141h1M9K3M07m88k42J68K08k4l06L57P6J4j70J16rn3k99K47k97K72J76o9q0J15
4165A10l27M32n18L48Pj67Q7J72j39K18l21j79M03k52Q2O3j18J59k23J01K52l06
4187a16K01K56k5k85K4k01j7k0L03j82M8n3J24Q1k59J91J35k52L6l12O94m22J84
4210A33o1K41k51L8m55N02q1J6j65K1k64L79n7j18K38m65L17J6K42j65j6j3J32
$$ plain form
4050 207 -7 29 137 -103 171 -84 -205 86 183 53 -247 -232 41 106 -149 99 52 14 -34 320 -21 -55 169
4073 169 136 -209 54 29 -201 -59 -190 -119 -115 147 -263 237 202 -8 107 -17 412 214 -119 119 219 -186
4095 -186 -158 -9 -97 -154 -20 -43 -61 -117 109 210 480 56 -254 -85 -189 -95 193 -152 -137 249 -24 -61 -182
4118 -182 -23 121 134 127 68 -202 25 46 -223 -6 64 -250 -130 219 -223 44 -229 97 1 -203 -152 -64 -81
4141 -81 -32 -9 398 -90 -332 -164 44 20 -286 71 147 161 -9 107 98 45 -254 -7 -304 -32 144 75 -5 110
4165 110 -217 215 -303 45 52 -115 -28 144 5 223 -98 -277 126 -126 -44 19 -99 60 -163 -62 190 -116
4187 -116 85 341 316 31 55 -146 -163 -183 120 -62 -14 -67 57 138 -121 70 205 -47 -11 -323 371 -51 133
4210 133 72 313 62 100 -355 147 66 82 -83 -62 -326 53 -4 -122 116 -349 -32 -16 226 61 45 32 164
4233A64N2n97M83r7n0J64k98J84k69J63K73k78J48q6J09J60j27j06k2K00l45L45
4255A70q3o7K32l07M71n48L27j88m6k38M93k40j97M50k04O8o0j83l8K51j40J03
4277B6p4L39k65P1l20L47K0k15l0Q2QK87m4k26l98L76P1k69RK79j37J93k65j7
4301a52J3j2K35L4K61k69k02j21K04K04j20O9J28k31J21m23Q4L25k21k26L72k28
4323a55L67j12k33J95j05j19mJ17J21j95o5K20P6j24N9qk20o7J11O3P1M16n33
4346a24J16k9K8j39K4Q7Q4j27L61l47J1j14K07j64P1K90m01J69j15K46K39l67
4368Fq9L00l01L9j52L78o4j2k34L22k96L2M26l90m6j32r7L61jj16J32P5k7N9p1
4393A02j19k3O0j91M17k69N7J03N4j77K28l54J38j67J4L29l91L19n4p6j22J7o6
$$ plain form
4233 164 216 -381 102 5 -45 119 -179 5 -264 -101 172 -106 42 -44 65 225 98 -8 -30 170 -175 170
4255 170 87 20 252 -55 416 -132 195 7 -39 -277 216 -24 -221 229 25 93 33 -150 -188 63 -77 26
4277 26 -48 291 26 97 -223 124 144 -71 -101 -19 -11 276 232 6 -392 -16 55 -214 -205 74 -63 130 -135 -152
4301 -152 -139 -151 84 118 379 110 -92 -213 -9 195 75 144 272 41 162 -261 -177 148 -73 -299 73 -155
4323 -155 212 100 -133 62 -43 -162 -166 -49 72 -123 -188 32 108 -16 43 35 -185 -252 -141 -78 -7 409 -124
4346 -124 -8 -37 -9 -148 -124 -37 47 -80 281 -66 -55 -169 38 -126 -55 235 -166 3 -112 134 373 6
4368 6 -83 217 -84 -45 -197 181 117 105 -129 193 -103 -71 355 -35 -81 -213 -310 51 50 -66 66 141 114 173 102
4393 102 -17 -40 20 -171 246 -23 34 137 191 14 242 -112 26 -141 -127 202 -189 130 76 0 -122 -105 -171
4416a71J05k32M68p9m4l48K92k37L99j06J57j03M9k98K58k29K64j22j46j3J53
4437A7J98k97l3J30k1k17J87J60k3j14k4P3K9j35J08K4j28j27O90m25j26K84l50
4460a20J85k36J94j36K60J34k48O0k20J68p8j40K17J40j30j4k00J15K22J09l17
4481c5K47ol43K86j02K4j78K07o6l59L23m7P5k37%K88K02k02K7n4j21Q0k82J14
4505a59K52r0j7J21l10K85j45l19L00R7L3mj83NL6j72J08L78l63N02l76L22k81
4528B0K16j1k99L7q5r5L01j02q6J96Lj62K88k74k58J96J66n7J50m40J77L26J2
4551B19r0k15K0Q6M5L4j41r3L94k53K0J59p5Q5R9l02nl0J40r3J89l51J84M5j18
4576d7r4j8L6M21k59j49K02K08j09m5k22j55J94j70J75R7K47l04O40j012L38j34
$$ plain form
4416 -171 -66 -298 170 91 47 -301 -9 -246 153 47 204 101 150 -148 110 -119 145 23 -123 -136 17
4437 17 215 -82 -115 15 -6 -223 -36 124 101 -13 -37 36 65 -70 38 62 -66 -193 497 72 -54 230 -120
4460 -120 65 -171 23 -113 147 281 33 93 -127 41 -37 -177 40 180 50 36 -164 -49 173 282 -35
4481 -35 212 206 -137 149 47 71 -107 100 34 -325 -2 -49 26 -211 -211 77 279 77 104 50 -71 9 -273 -159
4505 -159 93 3 -14 107 -203 82 -63 -382 -82 15 48 44 -139 -134 -98 -270 -162 216 -147 355 -21 301 20
4528 20 236 225 -74 -37 -122 -217 84 -18 -104 92 95 -67 221 -53 -311 -115 51 -6 144 -296 -119 207 219
4551 219 129 -86 -66 20 65 99 -42 -135 259 6 26 185 110 195 294 -8 -13 -43 97 4 193 -158 26 71 -47
4576 -47 -141 -159 -123 298 39 -110 92 300 191 146 -76 -231 -37 -207 -32 65 312 8 648 -364 -26 -160
4598a60J11J25O4r5p5J84k5j62k3N62n27k7K39l14K12k48J68j78J12J65k51LJ1
4621a29L13k02J75j71j48K76m0K7j44K3J03K43k60J46l08l8j02K13k8n8J9L3Q8
4644C1Q3l63L66L3j0K23n30J30j39K85l3j0k7J14p4J85m54J75p9J52J8j82j71
4667b77L19J85k0nj27l26L51o4N8k80QjK48L04l76K17o0k98k5J12L40k72M6k10
4691a53r6O2o0P6K63N7J92n56J91l5J63J07k99J61p5n8l5P8j24N1J70J7J9q7j2
4716A7M9j18L4M5k60M23j37j76J06L2j71J56k30P7K90j26J45j60j68K03l38L89
4738H2J73r1n20O78m45J18J02J18l47K36K65m34m8M08qn23N33k32J78k35m1R9
4760F6J05l14K10j00j81L93j00K9J1k84lj68J69pQ0R9q8K94k38k74J67O9JQ2n9
$$ plain form
4598 -160 -49 76 140 45 -30 154 129 -33 -56 506 -21 -48 191 -123 89 -159 9 -169 -57 108 -143 -140 -129
4621 -129 184 -18 157 -14 -162 114 74 101 -43 -20 83 326 66 212 -96 -134 -236 -23 -51 -109 -90 -57 31
4644 31 114 -249 117 150 140 363 -167 -37 -176 109 76 66 39 153 79 264 -190 -15 -94 58 76 -106 -277
4667 -277 42 227 207 202 75 -251 100 36 94 -186 -178 -179 69 373 -3 214 154 -144 -169 -57 283 11 57 -153
4691 -153 -249 -187 -247 -171 92 149 341 -215 -24 -59 104 211 -88 73 -2 -60 -95 -17 -141 -90 80 97 116 29 17
4716 17 66 -52 -18 27 -233 190 53 -123 -17 15 -156 0 -230 -153 137 11 156 -4 -172 31 -307 82
4738 82 255 164 -356 322 -123 -5 97 215 -132 104 369 -65 -113 295 287 -236 297 65 243 8 -33 66
4760 66 171 -143 67 -33 -214 179 79 108 119 -165 -168 -336 -167 -174 -94 5 -83 211 -27 -301 -134 -65 -64 18 -41
4785d1J41k62M90l96K06n5j26n3J55r9n5K42K68m41j7K34l28L67j85N8k38K2K26
4808A13n1o3P4q9p7K97Jj02m1K37j66M5m94L03J85j9j49j49J21N4j3j88K99J13
4832B41l97J97O2k16L30M2k92N12m18l42M62j32N0J35Qk4p8j82k3K07l25K52K59
4855C28l95L1o2K67j98M33n45l0p0J94j93j59N75k94L5j12M60l40J71l6k85L04
4877G9l48K92k02K49Mq8J4p5M25l79q1j05J09m7J33j28Q0K11l3K9j7j50k70K61
4901c7N9J69k76Q9J78l29R7J66l27M38k35J34k25L3j22N14o84K89J47r9J0n2J8
4924d5J55n8K64j92J03l58m9N0N8K94j19k12J14j29K17l42N21k04m98L95L72j42
4946A95M4j30l56J78M49n23R6K72m66L80k50p3k1j5J04L45o14O76r2o1n2r7p9
$$ plain form
4785 -41 100 -162 328 -68 138 83 -43 -96 59 -40 -95 147 415 -26 -43 191 -137 230 45 103 -135 -113 113
4808 113 62 -1 73 -16 -93 204 205 103 62 299 133 178 -316 -13 172 153 4 -145 -24 30 17 -171 128 241
4832 241 -156 41 103 -113 217 259 -33 479 61 -281 181 49 99 234 242 218 140 -42 -65 142 -183 69 328
4855 328 -67 -36 -98 169 -29 404 -141 -171 -241 -47 -240 -399 176 -118 -83 -195 265 -75 96 60 -225 79
4877 79 -269 23 -179 70 74 -14 0 -75 350 -29 -110 -215 -106 -153 -20 -148 -68 143 110 139 122 -28 -298 -37
4901 -37 22 191 -85 4 182 -147 -50 116 -211 227 -8 126 -99 -66 -188 326 -358 -69 78 -21 -11 -63 -45
4924 -45 110 52 316 124 227 -131 -180 -130 -72 222 103 -109 5 -124 93 -249 272 68 -430 -35 337 195
4946 195 239 109 -247 -69 380 -143 -47 225 -241 139 -111 -184 -205 -220 -116 229 -385 291 199 138 86 -11 -90
4969i0L2J24j49L44l52O5j70N3K16P9l1j87j8J25m14K00L79k87J91l3k92J17N3
4992d5L04n33K24%J28R3m89M05l32q0N00o8m4J2j93R7L10l37J28j24L35K3m01
5015h7K0r4K15j92J81K3j22Q2J88k29L37m34J85J55l04J94j24K6P4j78r9P3P9
5038c1L77k78K90n08l3K66%J21k28Ko4J60k87J43J66r8N1k07J76K98k05l47L2
5061b04M37n1j85j4k8R7j07M00k56k55n9n9L53k78M17j40j13j66K21p8j09K45
5083F8j96n3J68q9L49J98q96L74L12o4j38m3j76P53p03J63j48j68K42k5J87O6
5105A81p7k33L42l40J26K09K24p52L03M0Q9j6q3J70l37k54O89k61n9M0J67r3k64
5128a89K10LM2J46o2j93J15P9l55L89k86j57K18k03J74n9K12m62M61K31q6k28
$$ plain form
4969 -90 -58 66 -83 261 -91 -26 -196 -143 73 152 121 -66 -84 41 -373 -173 206 -81 110 77 -215 -98 -45
4992 -45 259 -274 -50 -50 78 171 -318 87 -245 -325 175 107 63 75 -118 -21 289 -48 80 -44 291 314 -87
5015 -87 -67 -161 54 -138 43 66 -56 26 214 -15 322 -112 73 228 -76 118 -6 20 94 -84 -183 -110 -31
5038 -31 346 68 358 -150 -183 83 83 204 -24 -22 -86 74 -213 -70 96 -2 49 -158 18 316 111 -236 -204
5061 -204 233 182 -3 -17 -45 52 -55 345 89 -166 -225 -284 69 -209 208 68 -45 -211 10 -68 -177 68
5083 68 -128 -181 -13 -102 247 445 -451 -77 235 171 33 -10 -186 567 -136 27 -121 -289 -47 -72 115 181
5105 181 104 -129 213 -127 -1 208 432 -320 -17 23 112 96 13 183 -154 -408 281 20 -39 1 168 75 -189
5128 -189 21 24 66 212 150 -43 72 151 -204 185 -101 -258 -40 -243 -69 -128 84 -378 83 314 228 0
5150@l3r7K82p4P4m8p6k39J50n9O7J56j05j2O9j3l71M19j07k20J49j77M67K7k38
5175iK88m37M57r2k05L66m73R1J81j17j73j1L09j31j62k1K28k0l37J08l3Q1j74
5198b86J0L70j06L85l53K0M9O2j75J66r6M1j2k09M85l39P8k3k43o7OK64n6Jl8
5223f6j15M38k12k63O08m47l9N6M23k94O6l7K3Lj48k61O08l68q7L85m65K43k25
5246a74K39p1K46j57j25K54k87j63P4L14k90J18k10N63k11J12k40J08m22J4mL51
5268C9k4K16j85j21K28j70k32L17j08J5q5J51R5l24J33J57j37j65K39J48k84M85
5290C88m51j39o1J79K42m82L01J51k28M57m13j81L60j22J25k16J57l26k41L40
5310a60J80r3J53J1m6p8J13j62K71j1k34n8M22l58K53k62J60j92L53l53L90k66
$$ plain form
5150 0 -33 -130 152 78 152 104 28 -211 -61 -120 -53 103 -2 -14 55 42 -329 90 -17 -237 -88 -265 202 229 -9
5175 -9 279 -158 299 207 2 368 -105 -14 167 50 -123 -134 175 44 -118 -139 89 69 -268 -160 -193 -112 -286
5198 -286 -276 94 -12 373 20 40 89 151 -24 142 46 87 75 -134 351 12 90 67 -176 -243 -237 27 -29 -28 -66
5223 -66 -181 257 45 -218 390 -57 -96 -40 383 89 155 118 141 144 -4 -265 343 -25 -112 273 -192 51 -174
5246 -174 65 -6 240 83 -42 212 -75 -238 -164 150 -140 -22 -232 331 120 232 -8 100 -322 -308 -312 39
5268 39 15 231 46 -75 153 -17 -249 68 -40 -25 -110 41 136 -188 -55 102 -35 -200 39 187 -97 388
5290 388 -63 -202 -263 -84 158 -324 -23 128 -100 357 -56 -237 123 1 126 -90 67 -259 -500 -160
5310 -160 20 -73 80 91 45 -33 80 -82 189 178 -56 -114 308 -50 203 -59 101 -91 262 -91 299 33
5332C3k94K96J1R1l3j03j17M30l89m9K48L4J06k42Q0j38J37j33Q2rJ19m12J27
5355a25k7K8l6K11j12R1l9L5j33m2P6m0k17L68J46j08o5M6p8J51p6j23L40n42
5379b71K25N7J42L2l08K00J61k81q1k2M85l23O8k7j1NP7n04L93J16J00K85q1n18
5403h1jK30p8j35J32R8m9j77k03L48p7J83m89L23L10k15M0l2N0j48J90k53j26
5426a60km2R6M03j19k01l73L91J48J6o5m3j28M81m60j69J25Q9J00r4l1K27J58
5449C47k89K69n08K48R4j86l50N01m07L37R2m0L4k85L9K53j79J17m5Jj78L31l24
5472a28J27K87m30K94l13K76k31L18l87k4K55l34K90k06K15J32N6l2l26j33L03
5493IK2r6L2K01l0m0j32J03m7L1j68m5K16J45k32L4l4j2Q2Q8j54j63J00Q9j13
$$ plain form
5332 33 -261 35 46 137 104 1 -116 314 -75 -124 124 158 264 22 102 -36 101 -32 50 41 160 -252 -125
5355 -125 -152 -124 -160 51 -61 30 -9 26 -107 -149 -73 -113 -330 38 184 76 11 57 -21 130 54 -69 271 -271
5379 -271 -46 11 153 185 -123 77 238 -43 -124 -146 339 16 84 57 46 51 128 -376 17 133 233 518 437 -81
5403 -81 -82 148 70 -65 67 165 116 -61 -264 84 7 190 -299 24 334 119 159 127 177 29 219 -34 -160
5426 -160 -162 -204 -108 295 176 -25 -398 -7 141 157 92 49 -79 402 -58 -227 -102 -13 87 -7 -38 189 347
5449 347 58 327 -181 67 161 -25 -375 126 -281 56 148 108 142 -143 -104 149 -30 87 42 43 -135 196 -128
5472 -128 -1 286 -144 150 -163 113 -118 200 -187 -211 44 -290 0 -206 9 141 197 165 -161 -294 9
5493 9 31 -65 -33 168 138 98 -34 69 22 53 -115 -160 56 201 -31 3 -31 -43 39 127 -27 -190 -90 -1 -114
5518a14K31m08J88K08J35j77o1L0j46K17k2k30K14l6l75M32K1PQ3k64j68p7L52
5541D0Ll54O14l09k16K14j97J33K03j3j53M92n44j75L52j17k22M52P7m02k12L82
5563D8r4j81L57Q3j96k03K38O8J7l32K54m7K40k68R1l59J33J87J03K8n18N27J17
5586B93m47N7K4j08M0K07j58J03o1M7J49J41l29N0k53J02K60l30N5J56K1J21k06
5609f6J4J45j34j40K54J2P9O6k58J42l86L41j37L0O4J90k62N1%O3k31J83q9N0
5633a9j33k3K04j93K88l8m59N15k36q7K46KJ62j73J41m8k84m5J86K08j10j36K7
5656ep2J41k53J35L29m43K72j57N2j71L1J20L35J6l04P4k54o8K98j58N04m02j97
5679a77L02L2k61K14r7o1J63J16o4k4m8k14K61J03l01j92K45k93K39j03J99J1
$$ plain form
5518 -114 117 -291 -103 105 240 63 2 32 -114 103 81 -149 65 29 -346 86 107 114 197 -67 -235 -312 40
5541 40 43 -311 303 -6 -222 -8 -205 -72 131 118 -35 457 -87 -262 90 -27 -249 203 280 -122 -334 48
5563 48 -46 -227 130 213 17 -186 52 120 137 -195 59 12 252 -16 75 -284 -151 36 139 167 -351 176 293
5586 293 -154 -97 -73 -181 -141 66 -92 11 -50 -3 146 287 -42 8 -245 -143 117 -213 -158 -2 19 140 -66
5609 -66 -52 93 -41 -181 73 85 164 230 -28 114 -272 69 -68 -38 26 216 -46 5 5 68 -163 20 -69 -19
5633 -19 -152 -175 29 -164 124 86 -373 142 -94 -181 65 67 229 56 197 149 -135 -180 6 214 104 -32 -5
5656 -5 -77 64 -189 -54 275 -168 104 -53 -1 -172 -141 -21 314 330 26 100 -154 -222 76 -82 422 20 -177
5679 -177 125 157 -104 110 13 -48 115 231 167 143 95 -119 142 245 -56 -248 -3 -296 -57 -160 39 50
5701E0k12K93l7Q7o68N28J46j43J31l30k9L03Pj30k58R2L44q3j36J37k40O3J10
5724B5N6P8k05J82j05k84M79p8j25Q9k44r7J87j40L24j31j67o7K96M2l86M13l65
5747b23J75P7%J07J16k87J87j9j73n6k33M35n4l78L06L54m51Q8K4j77Q6J75j89
5770a10J04j7J20m21M65k49Kr1J47M28l90j65r9L25j50K07p8j42J22J0M9on7L2
5794C6n9Q1k43L17J48o34M2L01Q3N3l69K17q3J92R2j92k42M49k79J09J36n09R3
5817b61K23k61L72jm36J66L07o8J69j30l49K26k32L84k58K84K19j46J8l25J40
5838D1j66J92r5J64j38J46o8l81K66j69J85J10K03k14k99jL96j0OJ35m59J09K46
5861A99j53k74L72j35j82k88J74K85J1qj77Q2P2K40j18k56J51J01l13K23K14k70
$$ plain form
5701 50 -162 131 94 181 -487 41 187 44 175 -155 -184 119 126 -4 -262 -170 174 91 -45 92 -148 -85 25
5724 25 81 159 -46 136 31 -253 226 148 23 112 -132 -229 -42 -182 142 11 -156 -223 73 115 -271 142 -223
5747 -223 -48 29 29 136 252 -35 152 133 -40 -96 -329 106 52 -326 -20 334 -117 -29 -5 -182 -96 79 -110
5770 -110 -6 -23 97 -324 141 -108 -106 -197 -50 378 -12 -177 -276 49 -101 106 28 -114 8 18 67 61 4 36
5794 36 -23 58 -185 132 280 -354 -312 -11 72 125 -244 -27 -110 82 174 -18 -260 189 -90 19 155 -354 -261
5817 -261 -38 -299 73 72 -364 -198 109 41 210 80 -269 -43 -275 109 -149 135 354 208 226 -99 41
5838 41 -125 67 -28 136 -2 144 76 -305 -39 -208 -23 87 290 76 -223 -224 172 162 168 303 -156 -47 199
5861 199 46 -228 144 9 -173 -461 -287 -2 9 1 -176 -94 -22 218 100 -156 -5 96 -217 6 220 -50
5883e0K4J81L77r05L34k5k48J17L79r5J12j00k74L64k38m1J10K8o5m7K04K01k98
5906D5M6k12K01k25J2J64k7pJ41k94L11J14n37n6J49J37O0MjL67k60k80L48l35
5930a35J57J1lk3m3K53QM6l25j12R3j33K61Jo7J25o4K27l84n3M44k61Q4M2l38
5955a89J54j33M8J54K13n63L92k37L88j67J1j15jK80l34K93j65J7j63q8M2J76
5977A3K26n04L73k7j04O1J08k62L06j31j47n6J17j35K2M39m13J0J08J26o9j50
5999h9n2J86M1J73n14L62m1k83K72q8O2k61R1J69J53j76k4K44j34j80R7J72p4
6022A06l89K41k2J07r4j4J23J06p9k8j45M8M4m7J45j93K31j96K3j77J60L14l44
6045h0J93l41K14k97M28Q6j94J00k97L56l29nK27k66L9K87j73m3J82j08r6K63
$$ plain form
5883 -50 -26 155 532 -373 -39 -64 -312 -195 184 89 201 101 -173 191 -47 -88 22 50 -15 -62 142 343 45
5906 45 91 -121 80 -145 -133 31 4 -3 138 -156 155 269 -268 -324 -175 -38 22 26 25 392 132 -148 200 -135
5930 -135 22 33 30 7 -36 217 225 271 -54 -166 -73 -206 55 56 -11 114 50 277 -107 -160 284 23 107 149 -189
5955 -189 -35 -168 -120 34 247 -316 76 -161 227 60 71 -44 -45 235 -99 194 29 46 -117 -205 -163 13
5977 13 239 -265 108 81 -23 38 146 -116 190 59 -88 -144 -27 -162 -140 299 -114 -104 4 130 61 -89
5999 -89 -141 45 86 259 -255 107 66 -217 55 -33 29 -232 -141 28 181 5 -19 225 91 -89 8 180 106
6022 106 -283 -42 -64 43 -51 -65 58 164 85 57 -88 -40 4 -43 102 -91 140 -56 -33 -210 -50 264 -80
6045 -80 113 -228 -14 -311 117 203 9 109 -188 168 -161 -166 61 -205 -166 121 -52 -95 87 -21 -117 146
6067A46J31k34k22J33K48j06j7N2o3j89m1M25n8k1m61j89N73j14l06L35j67K30
6089H5J18k4l45J71o3J81n55L48N2L04m22o2K61R4l11K81pm23K47l45K74N06m73
6112a08J02K69j97Q3J98l10k79K28P6q2L2J8j85J67M78m92j14k5Q9PQ6p1k42K35
6136c7K29k67K53Kk15Qk71L39J71k56lJ44N3j0j01j42N7j91N17l28N4K92r5k16
6160a3J2L8n7K9j64L06M8l20K40J58k61l20M59o7l16K38J47J42l27Pk94K77K41
6183B03m38K04jO9j38J24L6j3K16n5l25KJ21P0p7J1J47j56l5p8K05j04L5J00P6
6208A99N6o19L14K19l19J32k31O43j67l53M48m88n4L94j26q2J45l3J72m27J48
6229b9J6mK01m2l43L38k5j37k6j14J94J04k00J54j62K5J9k22K67J07j50K62j73
$$ plain form
6067 146 277 43 -179 -46 202 96 79 131 68 -121 -162 263 205 184 -277 -466 107 -7 -313 22 -145 85
6089 85 203 179 -166 5 -58 123 -432 -84 -32 272 -150 -212 49 143 -168 113 106 -317 -70 -415 -141 365 -108
6112 -108 -6 263 66 149 347 37 -242 -14 62 -20 12 30 -155 12 490 -2 -116 -141 -52 -45 41 -30 -272 -37
6136 -37 192 -75 178 180 -35 -27 -298 41 212 -44 -47 97 150 140 39 -103 -46 -237 280 -48 6 298 203 -13
6160 -13 -1 37 -20 9 -155 151 199 -121 119 277 16 -304 155 88 -228 10 157 299 -28 -21 -315 -38 203
6183 203 -235 -31 -32 37 -101 23 59 46 262 207 -118 -116 5 75 -2 9 156 0 -35 -113 92 -12 23 123 199
6208 199 255 -364 -50 169 -150 -18 -249 394 227 -126 322 -166 -220 174 48 -34 111 78 250 -177 -29
6229 -29 -13 -17 184 142 -201 137 112 -25 -51 -165 29 133 -67 87 -75 -50 -31 -253 14 121 -29 233 60
6252F0J85k24j83L91l96J76Q6j78n7K27o1K8j59K31q5mrR7N6j15M2k74KQ7J11
6277C4n2o4K54l03K8L03l4j87N5M3k17J87k1j17m7J73K6L9j81K09j65m3K49l71
6301b02L25m19K55J34j44k3J54p3p9N4J11k63J37L35l18MJ96j06L9j44L38r8n75
6324c62P38l04j13l8P8Jj52P6P1J04l97J71p7L33J33l10p9k5K5J62q8MQ8K53k41
6349E1J81l94N9K5M2J57j1k09M1J00l2k26M2K25j36J86k13K3K03r0j46R9K5j8
6373a6r6J70l5j78K30k4r8k3K73j80k52n1L33m1p4j05J92r3N1j21K31n0j15j21
6397a93P8k6L3p9K50o48N77K71j18k39K06J18k44K45J33l11L0m7M7K7j29K1K11
6420B13o0l59M06O7j99r1P1k20N0R1M8j42L0R8k18j57N80m34J64O1j49L89l69
$$ plain form
6252 60 245 21 -162 229 -167 9 95 -83 -140 87 26 54 -105 126 41 37 28 125 181 66 108 -166 -164 -77 34
6277 34 -18 -82 172 -131 -103 200 166 -21 34 77 -140 47 26 -91 -138 35 61 100 -81 128 -37 -80 169 -202
6301 -202 123 -296 -41 93 -51 -74 80 7 -72 -18 93 -170 -33 302 -16 -12 184 78 117 -27 311 213 -362
6324 -362 376 72 -41 -79 -1 0 -152 -76 -5 99 -298 -127 -204 129 262 -48 -127 -152 -127 35 -53 -49 39 292 51
6349 51 232 -162 -103 -78 -36 121 110 -99 -58 42 10 -216 -174 51 -85 101 -112 -89 114 24 -122 -23 2 -16
6373 -16 -112 58 23 -155 75 51 -47 -70 203 23 -229 -280 53 12 -62 -167 25 -68 -17 -138 93 43 -72 -193
6397 -193 -115 -141 -108 -187 63 -585 -8 263 145 -94 112 230 -14 231 364 53 83 36 83 110 -19 2 213
6420 213 153 -206 200 267 68 -23 48 -172 -122 -31 17 -125 -95 3 -215 -372 208 -226 -62 -1 -150 239 -130
6443a30K33K7l42Q7J23Rj7j66K33M24m01l44K0K41Q2J6m5K28k76L2p9J56k1L2
6467A22J41m15O0K67k70K45J58l92M3k3L03n1l49j1q0o5M29r8J42l10J77j77K23
6490F9M0o7j23m4J75N6j7j73nJ35l50K24K28q9K62m52K70j89j07J52J66l05nK79
6514A30j3o1L1Q2j0j90o7Q1J38j69n2J44J75j53k39K38K00k72p3J57J78l75m13
6537e33O08kj11j38p1N76j29j43k39J91M8k07L23j8l51K08J10J0k21K89k42J28
6559H6k1pp6j32N3mL6R5j88N06l54K53l25k8J77j42K77Jl75J73J45j21J19j9J32
6584B61l95P8O4J50l05L98k29j36P9J38l09L64k54l7J87q9j30J60k65J82J27m99
6606d60M25J44p4Kj45J52Jj29K41l42K34k3r9j12J49M8K85m52K97J1O7n8j88K92
$$ plain form
6443 -130 103 130 -212 -125 -2 7 -10 -176 57 481 80 -264 -244 -3 79 95 50 278 2 34 -45 111 90 122
6467 122 263 -152 -92 175 -95 150 308 -84 -41 -64 239 188 -161 -172 -252 -317 112 14 156 -154 23 -154 69
6490 69 109 42 -81 -125 50 106 89 -84 -89 46 -304 -80 148 59 321 -131 139 -50 -157 -5 161 -144 -149 130
6514 130 117 56 87 169 159 -31 -98 -17 121 -48 -100 44 219 66 -173 65 265 -7 -80 77 255 -120 -533
6537 -533 75 73 -38 -176 -247 329 200 57 -182 9 57 -150 173 155 -196 12 122 132 -89 200 -42 86
6559 86 65 58 -18 -150 -97 -101 -65 30 -158 348 -6 247 -78 -106 71 -71 206 207 -168 5 150 29 148 129 261
6584 261 -134 -56 8 158 -147 251 22 -114 -35 103 -206 158 -96 -133 54 -35 -165 -5 -270 -88 39 -460
6606 -460 -35 109 35 37 -108 44 45 -84 157 -185 49 26 -73 -185 -36 12 297 -155 142 153 220 162 -26 266
6630B66m24L47l91K04p2K53j84J6K6k16L21k62J48N2J19j63j21j51M63j20m0k17
6652a46K37n1j33J18j81K05j46j20J09N1m1q8K69j08n0J76l16J20Qp6L41k93R5
6675b0l07L37rko9k12L29j4L6o0M5j20k1J14K09j96l36M44J35k12n0n8K79k61
6699a9k6J32N0j91J4N5j47M17m86L22j91J8K12j3QP6Q5l22kJ36j68m15N73J18
6723B36k87J54k19K21m65K71J44p0k40L05J00O1j94j65J80J17l03K80j17m73O61
6744A97l83K73Qj2m52J6P73n21j21J8J63J81n3j78%p7N25k64o2P6l11m4J54L60
6768B66m79K03k01K34Q2k38L3O5L33k50l90L24J11k02Q6j77q8M67k47J82m4p6
6790fk06j43M65l17K85k89J95r5K11L8k19NK00J92j4k69q7K9K06j84m4J56j86
$$ plain form
6630 266 -158 189 -202 2 -70 183 -1 15 41 -175 146 -116 32 84 203 40 -81 -232 231 111 71 -146
6652 -146 91 40 -93 25 -156 49 -97 -217 -108 -57 -98 -186 83 -25 -75 101 -215 -95 -87 -163 178 -115 -20
6675 -20 -327 10 1 -1 -70 -282 47 33 69 9 54 -66 -87 27 236 40 -296 148 283 71 21 -37 242 -19
6699 -19 -45 87 137 -54 -40 15 -132 285 -201 121 -70 -52 160 147 155 231 316 -6 -8 128 -40 -455 118 236
6723 236 -51 103 -116 105 -360 -89 55 -15 -255 50 150 211 17 -148 32 149 -154 126 9 -464 197
6744 197 -186 87 95 83 -369 -353 420 -101 -222 -204 -41 140 87 -91 -91 -168 357 93 31 107 -204 -248 -94 266
6768 266 -213 -10 -211 23 105 -133 -100 -35 298 48 -342 -18 93 -109 -23 -200 -288 179 -68 114 70 -6
6790 -6 -212 -355 110 -207 78 -211 -16 -111 100 138 -81 -76 124 316 302 33 -54 -25 181 -3 -47 109 -77
6813g7K42l69M69j32Ol48N93m81J47r8m5J32m1K21j23j38K07m02j42K88m5k8J26
6836c8K17r1k91K11K38k07l78K34R6J32k46q9L29q1n3J80m38M5L07L5K91J3l38
6859G8r2m4J0p4q5R3j38L31k92K45j6n6l3r7K08o3n3K04k81o9J94J45k63n3J28
6884g3J06J08k88oK44j02M59n07J79l2n04M59j85J42k5J27M3j42k58J44J55N1
6906I5j70J97j23k50M19ko6K3j96J94n66M22Jm6J04N2oJ00j51j44k0L9J92J27
6930B25J01l34K26k74o2j0N35l63J02j20l0j72N13m46Q4K1R1R9Kl65M11k31K10
6953B13N3j47o4k84K64O2k32J56j97K73k39K29k99K42j83K20k2j00J26k34m7O9
6975a41K19j26J43R6J8k49L01l83K8J35J34l3l36J14O5N7N8k49p3L55n0K0p5k13
$$ plain form
6813 -77 165 -204 265 133 139 -209 384 -97 50 -48 -93 39 -2 219 96 -42 165 -237 -379 -91 -136 -164 -38
6836 -38 179 88 -203 8 246 39 -339 -105 -9 123 -123 -212 117 36 -17 163 -275 -230 77 112 403 416 78
6859 78 -14 -58 -48 -122 -207 -114 -252 79 -213 32 16 -40 -73 -170 38 -25 -78 126 -155 -224 -30 115 -148 -201 -73
6884 -73 33 141 -147 -153 91 -11 448 -59 120 88 -416 43 -142 0 -25 102 145 3 -255 -111 44 95
6906 95 -75 122 -1 -251 168 166 100 123 -73 121 -445 -23 -22 -68 36 88 82 182 31 -113 -133 -94 98 225
6930 225 326 -8 218 -56 -118 -128 407 44 146 26 -4 -176 337 -109 -25 -4 87 186 188 -177 234 3 213
6953 213 266 119 55 -229 35 97 -135 21 -176 97 -142 87 -212 30 -153 67 45 -55 71 -163 -210 -141
6975 -141 78 -48 95 191 209 -40 261 -122 -94 41 175 142 -194 -80 -15 42 100 -149 -222 133 83 103 28 -185
6999a85J56n8L12k51j0J11m74O82p41L38J90j13J90n8k39J80p6J55j41j86J38
7020h0L22m41L43J9k55K54k58J69N6q8p5M9m1N0L5k10L42m14L38k36L23k18j79
7043a95J03P5J19q1j1J62l20o9M42j50q5J59m04%M52k64K08J71j23J19j59J02
7065B51k36K2L60l02k29K11O8o04N36j15J59k83J48M6R4k22J51k61M7L47l88L70
7087A70m93M13J64j71j69j59L73j90K16l41R8K20q9p9j1J3k5j41J60O7j40K13
7109I9m74M00O5K08l44j48N1J80k03K25j98J86k72K99J9q8n3M6J86l86M53k98
7131d7M5m9K37k55L0J82l00o8K00r9L66J05l69K03p1j80M86n52p2n7L50J49j63
7154G1k49j83K61J49m5L2l99K97l77M68M0k42L56j65m50J15J83j8J68q3k08P0
$$ plain form
6999 -185 -29 -87 225 -26 -36 75 -399 283 -458 -120 70 -43 147 89 -150 30 -46 109 -32 -218 -80
7020 -80 242 -199 144 163 -92 162 -96 73 129 41 -34 15 -26 24 59 -151 191 -223 115 -121 202 -16 -195
7043 -195 -92 -17 102 21 10 172 -148 -217 225 75 -10 149 -255 -255 197 -67 141 312 189 308 149 251
7065 251 15 37 397 95 -134 77 145 -459 77 -38 121 -162 -14 32 126 -96 55 -206 -159 188 -200 170
7087 170 -323 90 254 83 -86 -245 128 -62 154 -187 -89 131 42 -37 -48 -35 -60 -201 -41 26 -114 99
7109 99 -375 25 90 298 -46 -194 -143 37 -166 59 -139 47 -225 74 93 5 -48 -2 184 -202 251 -47
7131 -47 -2 -51 186 -69 -39 143 -157 -225 -25 -124 242 347 -22 181 110 -70 416 -136 -208 -265 85 234 71
7154 71 -178 -361 -100 49 4 36 -363 -66 -443 25 65 -177 179 14 -436 -321 -138 -156 12 -71 -279 -209
7176b09L63j72l05Q2J4O8O8L8J98M0l71M93k77l29L70K26l22Q3j84L2L6o2N2P2
7200Dj54J41j57K08j08K42L8J01l31M9L9k96J20Qr9J75L68o06J34R0O9q9L06r9
7224A53j24R8J95m26k1K0K68J46j98J71po79N04j79K10l15J30J5R5N0m9l38L01
7247B0K16m74N61l98m7NK39j17M3J04j05l68K81L3j13K9J33P5j60L00k11L27l94
7270b1k2q6J0J14J10k75K28k4j45j02K55K8j42k9O7J61N5j77N4j88K52j00n8M54
7294D19n2m94J87K9L9J84l19J81l98J88o7Q1K6J43k1N1m51K55l40R2L49j70LJ05
7318B0l0j75J70o2NK6j03L48j53J3l8j74K30k21J72j0O8N9n1l41J17J63rJ11m73
7343c38K11M58l35R9n85L87k4J65r1m4R6j9K64k37j21P3L58M8l73j22j8k4K48
$$ plain form
7176 -209 154 -18 -323 -241 -227 -159 -91 -53 145 185 -186 307 30 -299 71 297 -25 58 -126 -94 -58 -120 -68 4
7200 4 -150 -9 -166 42 -66 176 214 315 -16 33 72 -224 -104 -96 -195 -20 348 -258 -124 -34 35 -54 252 153
7224 153 29 127 322 -104 -125 -105 163 309 111 282 275 -404 100 -79 131 -184 -54 -39 56 106 57 -281 20
7247 20 236 -238 323 -75 -122 -117 122 5 48 152 47 -321 -40 -7 -120 -91 42 117 -43 257 46 373 -21
7270 -21 -43 -129 -119 -5 105 -170 58 34 -111 -213 42 70 -72 -101 -34 127 182 5 59 -129 123 23 -35 419
7294 419 367 -127 60 89 128 312 -7 174 -224 -36 -103 -22 4 147 126 177 -274 -19 -359 -267 82 -88 -85 20
7318 20 -10 -185 -15 -77 -72 -46 -149 199 46 59 21 -153 77 -144 28 18 86 145 94 -247 -130 33 24 135 -338
7343 -338 -127 331 -4 95 -490 -103 -127 38 -53 -97 -1 -20 244 7 -114 -41 317 365 -8 -130 -148 -172 76
7366G6j30J53P6l61K73m15K42M12k09n1k50k1J71jk01M13j70K16l78M21l0K1k13
7389D4q7N76o68j44j02M50l20J53K63j17q7R4k9r4RJ26N6j19K05n89O3L76q7J23
7413I5q7L1l8j64K07j59J20L02n83L12M1m7j19K07J31j33k39J86K19k90K46l20
7435h2J14J43q5K8k74M6K29K08l08p5m3J86m02L51J7M0L8J27l43J15Q9j79r4j78
7459c32O0J5N72n34K32K49l53r6K91J5j76J08J89m4k74K97l97K26j36l06L41J35
7481H2j88k1j16L26l23J14J3j80N03m26K40J12j64K00ml87L08j73K80k6k85L15
7503B00l84Q4K19J07o2k19J47qj87K94K2j15k45K14N0m2l24L61j44J23j3J89l06
7526c9K3N0J83m44L43k22K6j23L87k75m7k61M21L5K10j53j31K82k39r6j69L80
$$ plain form
7366 76 -54 99 175 -186 87 -328 -86 326 117 66 -184 -205 -34 -35 -236 177 7 223 -155 266 236 257 44
7389 44 -43 533 -135 -279 -381 69 -251 -98 165 48 -39 55 26 -68 -59 67 123 4 209 -380 -317 59 -28 95
7413 95 8 39 1 -163 44 -115 5 307 -276 36 77 30 -89 118 249 116 -123 63 282 -8 238 -82
7435 -82 32 175 90 118 -156 -110 119 327 19 -56 -99 87 -315 36 53 93 131 258 -85 30 119 -60 -154 -332
7459 -332 -272 -257 315 -219 13 262 -91 -187 104 119 -57 51 240 196 -78 219 -178 48 -88 -394 -53 82
7481 82 -106 -127 -243 83 -240 -126 -113 -293 210 -216 24 136 -28 172 168 -219 89 -84 196 170 -115 200
7503 200 -184 -100 119 226 164 -55 92 84 -103 191 213 98 -147 67 117 75 -249 112 -32 91 78 267 -39
7526 -39 -16 34 217 -227 116 -106 -80 -203 184 -91 -138 -399 22 57 267 114 -17 265 26 -70 -239 141
7548A41j19R0j69J2l1k49L36J64k1l42nJ07m9M60m50K2Q0J80l03L67R4m39N1p5
7572a48K54j28J28j19n0k50L12J29J89m37N98m10N3K29o85K04R1J0rj8J8j70K70
7595F1qj5L86n86K48k14K56k09K08J09j70rM8j61N0j3r2L6R6J79k91j49P9K61
7619A00j8Np4K3p9j3O3J45j30K8J60n0q8j77%J06o8j48q6M68j77J13l65o1j07
7644d30L62J60l47L19j14J59K4l20J43J20j84L37k44r6M58k56j01j27J11J81j99
7665d4K22m16K65J36j14n5M38m68L14l87L23J05k16o8j17L28l15K23M8k28l0%
7687e6j99K49J33k10J69q1J92M7n28M20l15J9L01l16K18K43o42K95K88Qm06M1
7709a30J2K16k20mL81J41o25K04k19O7L21R4j13j4J21p8l12L12k10Q2j88L14k12
$$ plain form
7548 141 22 112 -57 -45 -76 -325 11 175 154 -188 -193 -86 -135 325 -125 -103 -23 157 -146 221 315 -124 -73 -148
7572 -148 106 -22 106 -13 -63 -313 -1 128 317 -120 478 68 121 350 -335 -131 -40 -30 -39 -57 -39 -209 61
7595 61 53 38 424 -162 86 -128 128 -81 127 236 66 57 105 -56 -6 -19 -111 -75 21 200 -91 -240 -161 100
7619 100 82 87 13 36 -43 -56 7 152 22 50 210 160 72 -105 -105 1 -67 -215 -301 167 -10 103 -262 -323 -430
7644 -430 -68 92 -255 64 -50 109 133 -187 -44 76 -108 229 -15 -111 347 91 -10 -137 -26 155 -44
7665 -44 178 -238 27 163 49 -6 432 -36 278 -109 214 319 103 35 -82 246 -69 154 202 -26 -56 -56
7687 -56 -255 -6 127 -83 86 5 197 244 -284 136 -179 -160 141 -175 43 286 -356 -61 227 235 -171 -130
7709 -130 -118 98 -122 -126 255 396 -229 -25 -244 -177 144 238 125 111 232 154 -158 154 -56 26 -162 152 -60
7732f0K28j78M0J88k39J60O0n45O7L83j11j7j9J3L4J01j00R4o2j00j81L38j30
7755c6p4k0J23L3J2k4J94j08k94K61K71m51J30j6J10J6Kl71O28j78j46J01K9K07
7779C99m61j15J62K21p00N22K8L0o8k5J57p5k01M25k11l85O7L45nn0Lk22K94j10
7803B5O1J52k92R1l51L23K16p5j68m36L79m7J70k52M16j63r1QP2K7J78k34j00
7826i1rqL15j30k7k32J41J7j54K84q9k28MK66q7K4K48M9k91K49k94j28L33l10
7850a48K86k77J28l8L00n56L34k84M32m5r9n6M4l2J16k%K00m48P3L0K53j80k96
7874b65J26MJ27K27M1o26M03J62l32J73j57K06L2l3q5K9L2o1J19k88O19n95N95
7897D53m04o2qJM3j94J61Q3L02l20j11L71k05p8m52O37k22j87L30p2j90J23J27
$$ plain form
7732 -60 168 -10 30 218 -21 139 199 -346 -279 104 -7 -24 -43 -30 4 105 5 99 37 -63 -244 94 -36
7755 -36 -110 -130 -7 26 38 14 208 100 -194 67 338 -113 17 1 111 127 129 -242 386 208 62 163 192 399
7779 399 -62 -177 -15 206 -494 28 56 86 18 -7 150 75 -126 299 88 -297 -230 115 110 60 63 -159 135 25
7803 25 86 238 -54 37 -314 9 225 150 -18 -454 -75 -122 48 -204 212 49 -42 -34 38 65 243 9 -91
7826 -91 -100 -108 207 77 50 -182 -41 -24 -178 106 17 -211 -207 59 -28 -4 244 293 2 251 -43 -171 162 -148
7850 -148 138 -139 -11 -49 251 -305 29 -255 177 132 33 -23 21 -11 105 103 103 303 -145 -72 -42 211 31 -265
7874 -265 -139 -135 -8 219 260 -366 37 199 -133 40 -117 89 121 88 3 32 64 3 122 -166 453 -142 453
7897 453 49 -13 -21 -20 23 -171 -10 73 375 55 -56 315 110 32 -420 217 -5 -192 138 66 -124 -1 126
7920A26rj79K30J2m21L32k30K89j31j20k04j5K97K43j82k68J16Q1o6k3P1j61k05
7943d17K45J89R8k05L74m20J83P5n4J38l06J7R2q4P1L5l24O21m62K28r2j54Q3
7966f9O8J84k05P5L69p96M14m50P4M52J58m31J73O1l03L51k58J5l8J17n1J37p5
7989b8ON1j43r5j5N8M7N2OK12l75M35l50L04j54P8j3j22M28n52L89k00j22J55
8013E2L4k25q3J46M8n8M8QO0NJ35l8j72n8j15J00J16j17K1rj22L86j99K91m79
8038b25K12j97J06J42q5K17m25J16J83l8J2k44J70J20P4k3k04P0p2J1J33k40J93
8061Fk05LK40j38L74n08l9K14J6J64J29n01R8K29K55m64M40m44J09QN0O7k50N48
8085D01p81O06m8l04P7L4MN6k0j45J65OJ88m94L04L2K5k54K82m87M24k27n4j54
$$ plain form
7920 126 117 -62 168 180 -241 91 -139 150 19 -101 -305 -320 -23 220 38 -230 -114 -33 -99 -122 -51 -212 -417
7943 -417 -172 17 115 -90 284 -136 47 122 68 206 -100 -83 9 -75 -4 31 -293 328 -134 94 2 -152 -69
7966 -69 -1 183 -22 53 422 -374 40 -410 -336 116 274 -157 16 77 -226 125 -133 -118 -156 -39 -90 47 -28
7989 -28 -22 29 -114 -209 -224 -166 -119 -67 -61 151 -224 211 -139 165 11 89 76 -46 382 -170 219 19 -103 52
8013 52 86 -139 -222 -76 -28 -86 -38 -30 30 35 170 132 -40 -98 -213 -113 3 -114 -93 -102 -224 162 -37 254 -225
8038 -225 -13 -210 -104 38 -47 170 -255 -139 44 6 18 -226 -56 64 138 115 -89 -19 -91 -80 53 -187 6
8061 6 -199 -196 44 -94 280 -228 -267 -53 -37 127 256 -245 -147 82 337 -127 313 -131 -22 -14 36 103 -147 401
8085 401 -380 226 178 -126 -49 -15 -11 45 25 -120 45 51 239 -255 49 81 106 -148 134 -353 71 -156 -210 -364
8109c64K87J80K4l8j6J36k16K28O1l27J17j46J58l54J07R7J7J13O8p1L4l78RL25
8133E1J19l6k93N8K52q7j51j4O3L8m5n2J94l05L85J55m28N3q2j24O42l20l92L73
8157E4q5j16J36k18K90l02L87l95Q8N3R5j08j3K02q8J63j53Mk43K94L40l40L9
8180H4J30k15K3m4J12j18l25L55Q2l14K39
$$ plain form
8109 -364 -77 103 127 89 73 209 -7 221 282 -45 72 -74 84 -270 -163 -66 -49 64 132 61 95 -283 -274 51
8133 51 170 134 -159 -101 151 64 -87 -101 -38 0 -45 -97 97 -208 177 332 -96 -43 -125 -249 393 73 -319 54
8157 54 -31 -147 -11 -229 61 -241 146 -249 -161 -108 -13 -121 -134 68 -20 143 -10 -6 -249 45 385 45 84
8180 84 214 -1 22 -22 90 -28 -353 2 84 -230 9
8191I
$$ Imaginary data points
##PAGE= N=2
##DATA TABLE= (X++(I..I)), XYDATA
0@%%%%%%%%%%%Qj6J6j6J6j8K6l2L3m1M8n5O4p3Q5r5J08j24J40j56J75j97K22k46
35a28K72l04L39l78M18m61N11n68O29o94P69q56R54j067J199j353J539j769K058
54A110k436K957l721M950p249J2973n1370j00059J08663R6123m4121q5714J7595
67e0299M8560l885j9362J6228l537l3521J488M6304Q222l7975j0456L1991P356
80A114k0651O704K4686j2768k4846K0547L7132j8597m2280J1895M9994L444m2517
93f143j1628L4160K1506j5860j8481k292L308R803J4835k087k5090j0891K2592
106A3732J9983j5318k3327K151J4649P06o710L61O44o845k554N113K253j988l24
121B526l513r112J496J5737M444j9849j4649J6246K1745p979k1682J463K0135
$$ plain form
0 0 0 0 0 0 0 0 0 0 0 0 0 8 -8 8 -8 8 -10 16 -16 17 -24 24 -31 33 -40 45 -50 58 -66 74 -82 93 -104 118 -128
35 -128 144 -160 179 -199 219 -242 269 -299 330 -364 405 -451 503 -564 635 -718 821 -948 1110
54 1110 -1326 1631 -2090 2860 -4389 8584 -42786 -142845 -34182 61941 17820 -67894 -50299
67 -50299 -1739 -5624 -24986 -8758 -12295 -45816 -44328 1976 10198 -27777 -38233 -6242 1114
80 1114 -19537 -12833 11853 -915 -25761 -5214 31918 13321 -28959 -17064 32930 36374 -6143
93 -6143 -17771 16389 37895 22035 3554 1262 4570 14373 29208 27121 2031 -8860 13732
106 13732 33715 18397 -4930 -2779 11870 12576 5866 6227 6871 26 -2528 2585 4838 2850 2526
121 2526 -987 -10099 -8603 7134 11578 -8271 -22920 -6674 15071 7092 -14590 -13127 7008
134G008L928j6744p516J2738J1404n568r876Q43R754N750m435r619j239R410P669
149A3507n230r501K767J1037o62j3072j880J5338O621j6514j3482J1627J9221
162A9777l825k1403q526J4763J4763m527j5207n767Q304Q153k148r880m964N863
176d624N912k453n294j008M029L50m639l134M107M872k321n597j13N268J863l782
192f564l208K952N002j548m972M37N976L687n597o433K758R687L859p620p815
207i399L562J0411K323p518o520L143Q444K639m904n870J285O460J236n300l669
222c677N131N493l780p593J531Q213K86p767k938N409L930l261l561R22J695q2
238d9j019J61k10R51M60q24k470J187N260p8o754k921P718O849n612q600L211
$$ plain form
134 7008 10936 -5808 -13324 -586 10818 5250 -4626 -3783 5971 11721 7286 -2333 -3572 5838 13507
149 13507 8277 -1224 1543 12580 11918 -1154 -3034 12304 18925 2411 -11071 556 19777
162 19777 15952 -5451 -13977 786 15549 11022 -4185 -9952 -1648 6505 4357 -5523 -10487 -4624
176 -4624 1288 -1165 -6459 -7467 -3438 -3088 -7727 -10861 -6754 -1882 -4203 -9800 -9913 -4645 -2782 -6564
192 -6564 -9772 -6820 -1818 -3366 -8338 -7901 -1925 1762 -3835 -10268 -7510 2177 6036 -1584 -9399
207 -9399 -5837 4574 6897 -621 -7141 -3998 4446 7085 2181 -3689 -2404 4056 5292 -8 -3677
222 -3677 1454 6947 3167 -4426 -2895 5318 5604 -2163 -5101 308 4238 977 -2584 -1662 33 -49
238 -49 -1068 -907 -1117 -166 294 -530 -3000 -1813 3447 3369 -3385 -6306 1412 8261 2649 -5951 -2740
255b740R384R05p972j936N893L722k554k712L39J431K254J265l180l084L012N938
271I965q01p883j907Q005L588o689m672L993M469l020l600J590K060j667k055
286A376L05N04n33N77m94k933j048M001K263m932n000M510O199k871p218P56O391
303A853J319n042k295L335K771j208j730o12P32K330J713k423k598J587N065l80
319D417n311m96N211J453m148k233L416K552k663k093J467J724o98r81m5q19K41
336I94J798j30l896j110M148K053m221l544L175L288j990l854O14K911N73k334
352a525j348Q06J206O84n56j753j119L120K415k723l888K452M910n59n371m11
368c660M767K279l479k594J723L324K51k580j519R64L356M15l323k433L004M233
$$ plain form
255 -2740 6644 7549 -423 -2359 3534 7256 4702 1990 2329 3760 6014 7279 4099 1015 4027 9965
271 9965 9164 1281 -626 7379 10967 4278 -394 3599 8068 5048 1448 3038 5098 3431 1376
286 1376 1681 2185 1652 2229 1735 -1198 -2246 1755 4018 -914 -5914 -1404 4795 1924 -5294 -4538 1853
303 1853 3172 -1870 -4165 -830 1941 733 -997 -1609 -877 1453 3166 743 -1855 -268 4797 4417
319 4417 -894 -1390 3821 5274 1126 -1107 2309 4861 2198 105 1572 3296 2598 1617 1572 753 994
336 994 2792 2662 -1234 -2344 1804 3857 -364 -3908 -733 2555 565 -3289 -2675 236 809 -1525
352 -1525 -2873 -2067 -861 -177 -733 -2486 -3605 -485 1930 -793 -4681 -2229 2681 2122 -3249 -3660
368 -3660 1107 3386 -93 -2687 -964 2360 2611 31 -1488 -524 2832 3247 -76 -2509 495 4728
384D728k326n188M64M893J842m782l006L238L682j549l864m74L130J205j538k640
400b185q47K733K138k173l560N43M493K63m015j996K859L340j940k950RK925Q25
417D62j606j841N76J967N76j164k417J364K921M15l394j566L320K735k079l479
433c210J202L606M0k519j581K062K190j009j987j154J671K648j283l072n01L506
449F09J589k951k804J148L602k79l203q18K097J428r61k020j25J090J585l30k476
466b819l05K412J930k097k795J472L659p14l460m56L043J916k028k496Q43K886
482I91J084k149k559J453L388O91l649k603K973M380j364n286k74N116K022m064
498A50l418K254L570q73k940q82K275J826j240k729l72K909J535k586k565J611
$$ plain form
384 4728 2402 -2786 -2322 2571 4413 -369 -3375 -137 3545 1996 -1868 -2342 788 1993 455 -2185
400 -2185 -3032 -299 1839 -334 -3894 -3351 1142 1405 -2610 -4606 -1747 1593 -347 -3297 -3288 -363 462
417 462 -1144 -2985 -2409 -442 134 -1030 -3447 -2083 838 1253 -2141 -3707 -387 2348 269 -3210
433 -3210 -2008 1598 1638 -881 -2462 -400 1790 781 -1206 -2360 -689 1959 676 -2396 -2897 609
449 609 2198 -753 -3557 -2409 1193 914 -2289 -3107 -1010 418 -543 -2563 -2688 -1598 -13 -343 -2819
466 -2819 -3124 -712 1218 -879 -3674 -2202 1457 743 -2717 -3173 -130 1786 -242 -2738 -1895 991
482 991 2075 -74 -2633 -1180 2208 2899 -750 -3353 -380 4000 2636 -2650 -2924 2192 4214 150
498 150 -3268 -1014 2556 1683 -1257 -2139 136 1962 722 -2007 -2379 530 2065 -521 -3086 -1475
514a475L277km300j105L562K611k908k773J182K896Q52k709j521J522K181M67
530A757k062j923J335K626J76k642j339K521K261k086k333J078K114j8k078m85
546a098J325J089o84j641n10J491R05k52k445m85K200J525k016k693J174K952
562H37%l362n40K316J581j407k070j37K281R03j425j814L61K411R02k207j887
579c257J539K559n58k669l71K425J058k199j249J095K214n02j821n97J535J507
595G09l80k318q35J657J956o10l483N66K944J066l161j740J933K509j193l020
611c400K3K521J214q79k312n25K444K071j637k668M9L231J175k988j187J975K331
628A438j656k099J459K271l05k620l02K566J077j696j375L73K294N21j559j722
$$ plain form
514 -1475 1802 1800 -2500 -3605 -43 2568 -340 -3113 -1931 965 1817 -892 -2413 -891 1290 1757
530 1757 -305 -2228 -893 1733 1909 -733 -2072 449 2710 624 -1709 -631 1483 1465 -613 -1098
546 -1098 227 1316 632 -1009 -1519 -28 877 625 -1820 -2305 -105 1420 -596 -3289 -2115 837
562 837 837 -2525 -3065 -749 832 -575 -2645 -2782 -501 402 -1023 -2837 -2476 -65 837 -1370 -3257
579 -3257 -1718 841 283 -2386 -2757 -332 726 -1473 -2722 -1627 587 85 -1736 -2333 -798 709
595 709 329 -1989 -2824 -1167 789 179 -3304 -2738 206 1272 -1889 -3629 -1696 813 -380 -3400
611 -3400 -3377 -856 358 -521 -2833 -3358 -914 1157 -480 -3148 -3099 132 1307 -1681 -2868 -893 1438
628 1438 -218 -2317 -858 1413 1108 -1512 -1814 752 1829 133 -1242 -869 1425 1946 387 -1335
644a335Q34K424r4k297j377J924K510j276k470M0K054J131j585j086J88R58L40
661H83k20q23L75r3P34o5m1l69N92q68j28R22N92o71j249K37J319N87p36j133
681a55l93J298J169m33j509j290J881K106j196k178l78J931J376j696j393N20
697c40J684j40j120m98K73P80J43o78j77j0N71k54r34P18J082m16j669K25K255
716A495M27j954j832J235K584J9k229j284J042J777o7j427j020M55J128K11j171
733f11j73M54N27j154p1O64K15j110k00R43K52k72j445P16J066J51j010n21L91
752a188O54P46p97p44J8J151J145r09j500K85J352P77j058l59K0P34M9L00J97
771H73j117J41N36J361p54q08j68N74L95k11L0o08l9K9J010m83o84l80L64P85
$$ plain form
644 -1335 -501 1923 1829 -468 -1845 79 2589 1313 -1157 -1117 937 2068 483 -603 -415 543 883
661 883 663 -160 215 122 856 791 750 381 973 105 -23 899 1491 820 -429 -192 1127 1714 978 -155
681 -155 -548 750 1919 1486 -23 -1313 568 2674 1478 -700 -1078 853 2229 533 -860 -340
697 -340 1344 1204 84 -414 -141 639 782 104 -73 -83 488 234 -700 18 1100 684 -985 -760 1495
716 1495 1922 -32 -1864 -629 1955 1974 -255 -1539 -497 1280 1213 -214 -1234 -779 349 560 -611
733 -611 -784 -330 197 -957 -1028 -364 -149 -1259 -1459 -516 -264 -536 -1981 -1265 -199 -48 -1058 -1579 -1188
752 -1188 -534 212 -585 -1329 -1311 -160 985 76 -1424 -1139 213 990 -68 -427 -407 327 376 676 873
771 873 -244 -103 433 1794 1040 232 64 638 1033 822 852 244 205 234 1244 761 77 -303 61 846
791H46l97l42m69o3Q95P64r63j039J08J113M16j087o57O59N11L92k40m93o20R66
811C00O34p3p12l75Q22O40m35n45M39j52j02kP15j33o29k1P19P17m33j150L32
832E56N98l5j31J66m76o20Q18N74n48r15M94Q46j68j152K13L35k38q2k8K63m74
853dp1L68J87q50J62J36L83l41j75M15j15m82M2N56J86p93k4L98J44q4j01J42
875G9o6K9O80k67j066L89P34L92j003J0O47J15n54k2M36J72l94o07N71N11o89
896I7J56k22M13J11r7k74l87K09L11M05n54m73N6Q39k41m94k23O07R3l09p1k40
918b88K60R5J00m54k23M47O94n36q26L74J169n82p94q5J270J90p19n56N13N87
938F36l96k74j22M60M51J10p62k53O75O61n95o97J34J143l16p15m11J022j76l68
$$ plain form
791 846 449 107 -362 -425 470 1234 271 -768 -660 453 869 -218 -875 -216 295 687 447 -46 -666 300
811 300 934 861 149 -226 596 1236 801 256 695 543 441 439 1154 1021 392 371 1090 1807 1374 224 556
832 556 1154 1119 988 1154 678 58 876 1450 902 -13 481 1327 1159 7 220 555 317 235 207 470 -4
853 -4 -75 293 480 -370 -208 -72 311 -30 -205 210 95 -387 -345 211 397 -396 -420 -22 122 38 -63 79
875 79 13 42 722 455 -611 -222 512 904 -99 -89 558 673 119 97 533 705 311 -296 275 786 97
896 97 253 31 444 555 458 184 -203 6 317 722 168 -305 -249 590 349 -145 -368 239 332 23 -48 -288
918 -288 -28 67 167 -287 -510 -63 631 95 -731 -357 812 230 -564 -649 621 811 92 -464 49 636
938 636 240 -34 -156 304 755 865 103 -150 525 1186 591 -106 28 1171 855 140 -271 751 575 207
958B07k58J39J99M28m09m25L45J86J53r11q1N18L86m33p17j48J035J94q21l39
978g52P31j7l37N7K59k3k01L7L5k1J84K39J81l80o25Q36M55n26n64P98P01l26
1000G41o95j58O30K34k05l67k59N20K33l36m06P5Q26M8q66m25L42J009p72q83
1020g14L02R44L3p66n63M95P21n35m78J12J69J88k37l79r4M80L72m47n59L27Q44
1041B15m8q35P1L32N98l06m66K16J94J35j34q0j58M89M27q89j47K57J175o00p49
1062c03J95P33L22n04p62M66M71O1p72q9M98N54o75m87j35N78Q2k75o57K03P69
1083B73J28p93n29Q88K92o36n69j16J191l78l47k97M35O64l70k26l30L65M18k5
1103C8o67J06M21M46l70o05K08P03K44n97k11N90J14M88o59j04J9M28K4m36l49
$$ plain form
958 207 -51 88 287 715 306 -119 226 412 565 -346 -427 91 477 44 -673 -821 214 408 -413 -752
978 -752 -21 -38 -375 -318 -59 -82 -283 -246 -211 -232 -48 191 372 -8 -633 203 658 132 -432 366 1067 741
1000 741 46 -112 518 752 547 180 -79 441 674 338 -68 7 833 881 15 -410 -68 941 169 -714
1020 -714 -412 532 565 -201 -764 -269 452 -83 -561 -449 -280 -92 -329 -708 -802 -322 50 -397 -956 -629 215
1041 215 167 -668 -597 -265 333 27 -439 -223 -29 106 -28 -108 -266 223 650 -239 -386 -129 1046 446 -303
1062 -303 -108 625 947 443 -319 147 618 679 -93 -182 316 870 195 -292 -427 151 233 -42 -699 -496 273
1083 273 401 -392 -921 -33 259 -377 -946 -1062 129 -249 -596 -893 -458 206 -164 -390 -720 -355 63 38
1103 38 -629 -523 -102 344 -26 -631 -423 280 524 -73 -284 306 420 908 249 145 164 592 616 180 -169
1124a69P81K15o89n41K80N03l0n87o4M30K39l32n87l9P7N00k69k73l30P98R5p23
1146g15k49J36Q39k81p97M02O11K86o81j90j14O75l3k60k34J88N02q8l8k55O32
1167C36J45m05j47r0J180k27p45k71O63K64p28j99N0R21k70j74j69j57L84L25
1187F86n44n26k62J112j66r12m1J72Q69n23m96J08N14%m00j72N4K71j8l93o8M81
1209b54M37m44m32j97Q28M01n99m89P72P22m26n14P6N21J49m62k30QO02K72k03
1230E38p26L20P21m34k22k42M26K87j54l51k46O94Q9n52j49k50O02l09j36j12
1250b06K31L1k06J3l27j13O61l71l18K85L03J31m49p04O59K74R1m48K85%O9K27
1272A18l44j50K32K96M82q18l4L27M25o26k70N71J32R5m50J13O10J95r11lQ9O05
$$ plain form
1124 -169 612 827 138 -403 -123 380 350 -237 -301 129 368 36 -551 -590 -513 -13 -282 -555 -885 -87 8 -715
1146 -715 -964 -828 11 -270 -1067 -665 -54 232 -449 -639 -753 -78 -111 -371 -605 -417 85 -3 -41 -296 336
1167 336 481 76 -71 -161 1019 792 47 -224 439 703 -25 -224 -174 747 477 303 134 -23 361 686
1187 686 142 -384 -646 466 300 -612 -653 -481 388 -135 -631 -523 -9 -9 -409 -581 -527 -256 -274 -667 -735 -254
1209 -254 183 -261 -693 -890 -62 339 -260 -749 23 745 319 -195 -119 402 551 89 -141 -133 469 741 538
1230 538 -188 132 853 419 197 -45 381 668 514 163 -83 611 700 148 -1 -251 351 42 -94 -206
1250 -206 25 56 -150 -137 -464 -577 84 -287 -605 -320 -17 114 -335 -1039 -380 -106 -15 -463 -178 -178 -109 118
1272 118 -226 -376 -144 152 634 -184 -218 109 534 -92 -362 209 341 436 -14 99 709 904 -7 -10 79 684
1294F84m89n23Q5N25P8K85o89k64N89K65l53p64N59L18N5n24l20K39K97q3%k18
1316b48K11K4l9j19K3L9N46q62q2K55K65r5j74l21O84J58l43Q3j05K59J63l58
1338c6J88L7J49q4r2j54N40J59m82l57MM76O4M1k10J2L13nQ2n45L29j92J27l58
1362Fj55K36M1K56m92n5Q4j54L08k20J03K23l10j85J74P0m8j53j07L40k34L15
1384D3J0m92L4M29K91k55l19K55M31l6n04rK65R8rO0l77N44p0q0k11J05J18Pr0
1409B38j24K09J06j07m22L5M99k32k50o4k7L70m37J61k72L56j75jP9k65M25N1
1431A53k20j42n6Q6J38l46O6P1K47J3q4k11J58K93K23l10O9l0r2J08Q9j98M37
1454D62k5l00k24K66K71l85Q7k6P1J56M0l84p7K05N3J34k75J07Q2o9j07m06L62
$$ plain form
1294 684 195 -328 -243 282 360 645 -44 -308 281 546 193 -571 -12 306 361 -163 -483 -244 53 -30 -30 -248
1316 -248 -37 -13 -52 -171 -148 -109 437 -425 -507 -252 13 -82 -256 -577 107 265 -78 5 -100 159 322 -36
1338 -36 152 189 338 254 162 8 548 707 225 -132 -128 348 412 453 243 255 568 563 645 100 429 237 364 6
1362 6 -149 87 128 384 -108 -163 -79 -233 75 -145 -42 181 -129 -314 -140 -70 -118 -271 -378 -38 -272 43
1384 43 53 -439 -405 24 315 60 -259 -4 427 391 -113 -122 143 241 232 292 -85 459 389 309 98 203 321 328 238
1409 238 114 323 429 322 -100 -65 434 202 -48 -112 -139 231 -206 -45 -317 39 -136 -137 -58 -323 102 153
1431 153 -67 -209 -265 -179 -41 -387 -321 -250 -3 10 -74 -285 -127 166 389 79 148 118 26 134 223 25 462
1454 462 437 137 -87 179 450 65 152 126 197 353 393 9 -68 137 190 324 49 156 238 169 62 -344 18
1477A8n1R5m23M46k44K42k50P7k61M48k78p5M31l24J52J52m52L38j94K67Nl67
1499b48R4K06L78j81n10L38L85k04k73r6L34km2j14J18k02L28R5o65K09M92l31
1521A09N2p1K28N0j00n07L70K46j61l88L28l66L57k6j59k98K57L23j37k99j42
1542c34M75k4m87J67J56J17k15m6Q4N7Q0o9K5j82J78M28j38l58J70O7N7o1j75
1565b8J33O2J73l49N4K2L58l7m89N8K51N9o5j59J80k9ml75K17m2M42l15j28l8
1589d9M55r3m06J7k31K87L3j32k12M00J75n08l47O18q8p7M3k87J96M08L1l01j53
1612b21K49M20l37j95J46J91J0nn89L76J15j18Ok01K27K50L8n47K1M10m27M39
1634B58n18J89L80k79l7p1J78j7j77p4m9R1M03k08j15j26K88J04k58j7k81N74
$$ plain form
1477 18 -33 62 -361 85 -159 83 -167 -90 -351 97 -181 -256 175 -149 3 155 -297 41 -153 114 119 -248
1499 -248 -154 52 430 249 -261 77 462 258 -15 -111 223 221 179 65 183 -19 309 404 -261 -52 440 109
1521 109 161 90 318 368 268 -239 131 377 216 -172 156 -210 147 121 -38 -336 -79 244 107 -192 -334
1542 -334 141 117 -370 -203 -47 70 -145 -191 -107 -50 30 -39 -14 -196 -18 410 272 -86 84 151 208 147 -28
1565 -28 105 167 340 -9 45 67 425 388 -101 -43 208 267 202 43 223 194 190 -185 32 -10 432 117 -11 -49
1589 -49 406 313 -93 -76 -307 -20 13 -119 -331 69 244 -264 -611 7 -81 -158 -115 -402 -206 202 233 -68 -221
1612 -221 28 448 111 -84 62 253 263 258 -331 45 160 42 48 -153 74 324 362 -185 -164 246 -181 258
1634 258 -260 -71 309 30 -7 -78 100 83 -94 -168 -217 -126 277 69 -46 -172 116 220 -38 -55 -336 238
1656B38j57l10k19M36K50j08m30K36J78j41L64n80P5K58j55j98K23J2j29J60j27
1677a24M5K90n5r7L9k56K76M9J49k79l82M24r1J80l26J56J85Kj83j46J92k09j7
1700a78J5J42k22L6J61N6l5k2K75n31q3M54O1l40O5m1K11K66j28m03M12M0m68
1723b57J40o0k25M19p8q9O2N23J3o77K10M4J19rO0l96O4J66J1n2l6K64M0j99j90
1748a33Q0K03j71L39l22o0M92n16N1j28N6K16r6m8r3O7M7m08M05J6J76l47J2n4
1772b16O54k98K2l13n6K08J73m10J27J28K36n79K73P9J85P1l76J09k15M37k81
1793d2L88n76J14N07k94Q0j52o8O1l5j95J88K40M5l43N9kK12k69J06j82L41j32
1816E1K02n36J06K99o4j34k4k93N09J51l24k40L46Q8k57M9K4P1J17o9k55j35M99
$$ plain form
1656 238 81 -229 -448 -12 238 130 -300 -64 114 -27 337 -243 -168 90 -65 -263 -40 -28 -157 3 -124
1677 -124 -79 211 156 59 98 -158 118 167 316 37 -345 79 -12 168 -158 -2 183 185 2 -144 48 -161 -178
1700 -178 -163 -21 -243 -207 -46 10 -25 -47 228 -303 -386 68 129 -211 -146 -187 24 290 162 -241 171 211 -257
1723 -257 -117 -177 -402 17 -61 -150 -88 435 448 -229 -19 25 144 135 195 -201 -137 29 40 -12 -48 216 256 57 -133
1748 -133 -53 150 -21 318 -4 -64 428 -88 -37 -165 -109 107 11 -37 -130 -63 -16 -424 -19 -3 173 -174 -162 -216
1772 -216 438 140 162 -151 -207 1 174 -236 -109 19 255 -324 -51 28 213 284 -92 17 -198 239 -42
1793 -42 346 -230 -116 391 97 177 25 -43 18 -17 -212 -24 216 261 -82 -23 -25 187 -82 24 -158 183 51
1816 51 253 -283 -177 122 58 -76 -100 -393 116 267 -57 -297 49 137 -120 -71 -47 24 141 72 -183 -318 181
1839A81J26j8l26m9K59K68o45J46L67j27k84K8M6R3M8J82k63K3r0L5J10j01J12
1862A21m52L56j28KK97k23K5J0k98O60k00k03L1j1P9j17r2M0j9J61j32L8J80j85
1886f0j6L8KK1J89k79J36l48M05j75K10j90K23q6k32K86M8j67J33j74K73p4k64
1909a01K85j07J58m61L93J31j94M7q9J33J32k47k82K45K0J8L6rj52K67p1L1ll07
1933a27J33J83m01O5k20L12k55N2K00p6J74n4N0K9n1J6R7L73l86j10J06k32K36
1956A14r1K51L7m49J9K57K02l52P6j3J95P7m05L09k86Jj5K5R5J45Jj13l98L20
1980BP3J49n21N25q3l72J76L83k89j51N7k12J34qK14Q2j53j26k1j64K35J8NJn3
2005i9j57R7P0J97o9O2j66k3L45j87L65m17k30N00l03j68K31K22l01P5J01m61
$$ plain form
1839 181 307 289 -37 -86 173 441 -204 -58 309 182 -102 -74 -28 65 113 295 32 55 -35 0 110 9 121
1862 121 -331 25 -103 -101 196 -27 -2 8 -290 370 170 -33 -2 -13 66 -51 -143 -103 -122 39 -93 -55 125 -60
1886 -60 -76 -38 -36 -15 174 -105 31 -317 88 -87 123 -67 156 70 -162 124 172 5 138 -36 237 163 -101
1909 -101 184 77 235 -226 167 298 104 151 62 195 327 80 -202 43 63 81 117 108 -44 223 152 183 180 -127
1933 -127 6 189 -212 -147 -367 -55 -310 -258 -58 -134 40 -14 36 65 14 30 127 500 114 4 110 -122 114
1956 114 23 274 311 -138 -119 138 340 -12 64 51 246 323 -82 227 -59 -58 -73 -48 47 192 193 80 -318 2
1980 2 75 224 -297 228 145 -227 -51 332 43 -108 -51 -263 -129 -137 77 159 6 -120 -141 -305 -70 -52 -47 -46 -99
2005 -99 -256 -159 -89 108 39 101 -65 -88 257 70 435 18 -212 288 -15 -183 48 270 -31 44 145 -316
2027c16M97k30L11j75j42r2K5M2J76J63k95Lk8K36k54L23l99J61O4J60l3j89j57
2050a49j90K08K17l32L14j09J93J36l33p8J2K68k85K19JR8r3k76L12M7l0M0n32
2073c42O36J02m18q6L75n4pl75j86Q06n17J77q3j25R6oK02m28K14J69J55m2p4
2096A89l61J79rm2R4N9K04m17K4J73l51K04J33k18K99j00m29N84j84j60M7K23
2118A41j84j4j69K05MkJ79k4j28k57L31k46M63m71N10k19l34L86r1p8m4j43k4
2141b09M60j45L1j31J94m28K89k94K86k1l4R5j57K30r9L2k81K62k91j34L31j51
2163a65L35j11N3q6j73J71qk24O5L16j86ok09M05k38j64K26r3P9j00L72k52l9
2186c2K4J18l00L15k7L6j63K0j52K79l08n5N93k45j01J85j87K45l12LMK11m05
$$ plain form
2027 -316 181 -49 262 87 -55 -147 -122 -80 96 259 -36 -33 -61 175 -79 244 -155 6 70 230 197 8 -149
2050 -149 -339 -131 86 -246 68 -41 152 288 -45 -123 -111 157 -128 91 92 190 97 -179 133 180 150 190 -342
2073 -342 294 396 -22 -108 267 213 206 -169 -355 451 -66 111 28 -97 -1 -7 195 -233 -19 150 305 263 189
2096 189 -172 7 -2 -44 50 109 313 -104 -80 93 -258 -54 79 -139 160 60 -369 215 31 -129 -82 141
2118 141 -43 -57 -226 -21 -17 -19 160 136 8 -249 82 -164 299 -172 338 119 -215 171 80 2 -42 -185 -209
2141 -209 251 106 137 6 200 -228 61 -233 53 32 -2 93 -64 166 67 99 -182 80 -211 -345 -14 -165
2163 -165 170 59 112 26 -147 24 16 -208 -143 173 -13 -19 -228 177 -61 -225 1 -92 -13 -113 259 7 -32
2186 -32 -8 110 -190 125 98 134 -29 -9 -161 118 -190 -245 348 103 2 187 0 245 -67 -64 -60 151 -254
2209b54K43L5J05m00K75m5N7k89J88J38j01k63K96j35j86K20k05L65m8J66j61
2230AK92o07M57j80lj18L41j12j84J96j56q6M95j15o82N19j22k4J87k75J96O0
2252H0n7M9K71m88K29p8J87k27j38K19r9m2J60M8j24l54K50J56ONP8k1k29N49
2276D30n70L33l80J98j37K17Qk25r5J94j34lN2K20k80K0J48l77L00P7K67j09l47
2299a93J96L7k16K62o4j18J55j61M85n17N6K1K30K75j24l81j26J43q1L31k37K25
2321A98k22k09J98j2j51L01l53K91n13M82j68K26l2j32qK47l57J00L58m00N5o7
2343a68L3m9J02N5J28l20M42j82k45K22j60N53k08m3L8j82j9j8J98N7j80l56L82
2366H0k67L69J69n18J34L03k23J0j2j3j48J14M8P8j5o2J33j79N6J47k29j30M0
$$ plain form
2209 -254 -11 24 129 -271 4 -41 16 -273 -85 53 -48 -311 -15 -150 -336 -116 -321 44 -4 162 1
2230 1 293 -314 143 -37 -40 -158 183 71 -113 83 -73 -159 336 221 -461 58 -64 -88 99 -176 20 80
2252 80 23 72 343 -145 84 6 193 -34 -172 47 -52 -94 66 114 -10 -364 -114 42 48 53 131 110 -119 430
2276 430 -140 193 -187 11 -126 91 99 -126 -221 -27 -161 -164 -112 108 -172 -152 -4 -381 -81 -4 263 154 -193
2299 -193 3 40 -176 86 22 -96 59 -102 383 -134 -78 -57 173 448 324 -57 -183 -40 -121 210 -27 198
2321 198 -24 -233 -35 -47 -198 103 -250 41 -472 10 -158 68 36 -96 -104 143 -214 -114 244 -156 -101 -168
2343 -168 -135 -184 -82 -27 101 -219 223 41 -204 18 -142 411 203 160 198 16 -3 -21 177 234 54 -302 80
2366 80 -187 182 351 -167 -33 270 47 57 45 32 -116 -2 46 124 109 47 180 1 57 204 -25 -155 -115
2389a15J0L67j27j81R5qj4M9j14o9J97k25l7J82L12j50k17j47N05q5o1K9n8r3
2413D5j48n9J21K03l9j96J67j29L87m02o5K55k49p3J58N3n2j20J48O7j14j05Q2
2436f5j91K51K47l75R2K19m8J36j61nj09j74PJ54oj71K65q1J45j76p8L5N0l9k11
2461b89K73k08K03J88P3k63q7J07j6L26m03j16K36j5P2j98J37N22o01M1K07k70
2483h1j09J69rL51j97K43o81L96j07J30j58j24N4p0K95j08j14r7K08K88k4k87
2505c2J07j52r7mK33j13l6K66m75M67k31k04J96J19J58k67K40l59K75l25N27m31
2527a38K65k10J05N7n7rN3l27K56J78j2j64j53L98m08Q0K02O5k46J92k25K9o7
2550a36j76K37P1M29k95j98N3k94L59n9n7j49J14k94M47J55j50j54j93J57p2J70
$$ plain form
2389 -115 -105 262 135 -46 49 41 27 76 -38 -107 90 -135 -172 10 322 172 -45 -192 313 228 167 196 138 45
2413 45 -103 -162 -41 162 123 -73 94 -35 352 -50 -115 140 -109 -182 -24 29 -23 -143 5 72 -42 -147 -65
2436 -65 -256 -5 242 -133 -41 178 130 266 105 100 -9 -183 -176 -22 -28 -199 66 -15 130 -46 -124 -89 -39 -78 -289
2461 -289 -16 -224 -21 167 240 -23 -110 -3 -19 307 -96 -212 24 9 81 -117 20 542 -59 -18 189 -81
2483 -81 -190 -21 -30 321 124 367 -314 82 -25 105 -53 -177 -123 -193 102 -6 -120 -217 -9 279 255 -32
2505 -32 75 -77 -174 -178 55 -58 -94 172 -303 164 -67 -271 -75 44 202 -65 175 -184 91 -234 293 -138
2527 -138 127 -83 22 79 22 13 66 -261 -5 173 161 -3 -156 242 -166 -86 116 181 -65 127 -98 -69 -136
2550 -136 -312 -75 -4 425 130 -68 -15 -309 50 -9 -66 -215 -101 -395 52 207 57 -97 -290 -133 -205 -35
2572c5K07q7M0K08k43k04K83lk93j17J50j18Q7p0R2q4N5K24k06K3O8J20r0L93
2596D00m39L07q0k4j98N7k32M2L17j17Q7J05k52k99N32m81M14n3j48M1k11L22
2618I0p7J69l26J69j98k1K78qK08m09K2N14n41j53K88K50l01kjj71L08jj04o8
2642h5p1K79n2k29L75l83L00K1j67M2k95L35j65n6j21K36J34J25k94L33m73J53
2664e8J50o3p6Q5q2R7LK22j67k56L25L1k21j80m5O2P4r1K34K17k07m35M91n6J77
2689B31m8J37j35l17J86J21j01K58m52M47n28J45Q4J6J24j97J23p9mL9M3q3J23
2712A33k91Ok46J89P9K93j13p1J67l11j0j53J07L83Q9j28M4N9k22k63L75l01j77
2735c62J81Q7M46k84j0M6nj58J77l4k89L90k2r6K25k95L09j47k24l7K49J92k32
$$ plain form
2572 -35 172 85 125 333 90 -114 169 166 -127 -244 -94 -212 -125 -195 -103 -187 -132 92 -114 -91 -23 97 7 400
2596 400 -39 268 188 164 -34 23 -209 -167 150 33 120 225 -27 -326 206 -275 139 86 -62 -21 -232 90
2618 90 13 182 -144 25 -173 -194 84 76 284 -125 -103 411 -130 -283 5 255 -46 -48 -49 -220 88 87 -17 -85
2642 -85 -156 123 71 -158 217 -166 134 155 -12 30 -265 70 -95 -151 -272 -36 98 223 -71 262 -211 -58
2664 -58 92 29 -47 38 -44 53 56 278 111 -145 180 211 -10 -190 -235 -173 -99 -190 44 261 54 -381 110 54 231
2689 231 183 320 185 -132 54 175 74 332 -120 327 -201 -56 28 44 168 -29 94 15 11 50 93 10 133
2712 133 -158 -152 -398 -209 -130 163 50 -21 146 -165 -175 -328 -221 162 251 123 167 226 4 -259 116 -185 -362
2735 -362 -181 -94 352 68 58 104 99 -59 118 84 -205 185 163 67 292 -3 306 159 -65 -102 147 339 107
2758A07j49L7J02j79R5k41M40k74N4n6K78j59J2L6n36M07j36J36j19K0J88L2r7
2781bK81k85j83M25j80j21j45L64k08JJ19k25N16j31j1J08j63m24k3M2M13m9k26
2804a07J98k08J78k7J72k36o7j00J03n5K68K4j54j85M61m8l91M93j18k37K26j14
2826G6Q1k14j35K61o7j98j71K07J59j74J73M9J31o9l03J78L2Pm2L6j04J11j71
2849a47LJ31k98M31j58qm3J39k39R4M0M04n31m1J5J76J53j98M2L5K96j82m12L29
2873C1p2j01R4o8L59m65J45K43p6j03k83L17K72m81J52M8j35N8j22R2J4K16L9
2896A74qr8Qq5R4J00k23P0j08J02j17J87k69j6J93N1k64M6L51j49J6k07K16N8
2920A22k45J95k70J62O7k61J81M21j86n53L93j09J5J07n7J7K11j99P2o0J5M9o8
$$ plain form
2758 107 -42 -5 97 -82 13 -228 212 -62 -8 -64 214 55 67 103 -433 -26 -162 -26 -145 -125 63 95 -2
2781 -2 279 -6 -189 236 56 -65 -210 154 -54 -53 66 -159 357 226 215 323 160 -264 -287 -245 168 119 -107
2804 -107 91 -117 61 34 206 -30 -97 -197 -94 -149 119 143 -11 -196 265 217 -174 319 201 -36 190 76
2826 76 157 -57 -192 69 2 -196 -367 -160 -1 -175 -2 47 178 109 -194 -16 16 23 -19 17 -87 24 -147
2849 -147 -144 -13 -311 120 -38 -46 -89 50 -189 -95 -55 349 -182 -223 -208 -32 121 -77 -35 0 296 114 -298 31
2873 31 -41 -142 -48 -116 243 -222 -77 166 90 -13 -296 21 293 -188 -36 12 -123 -65 -187 -95 -81 135 174
2896 174 166 68 76 -9 85 185 -38 32 -76 26 -91 96 -173 -189 4 55 -209 -163 188 39 55 -152 64 122
2920 122 -123 72 -198 -36 31 -230 -49 372 186 -367 26 -83 -68 39 -18 -1 210 11 83 23 38 87 19
2943A9J1P9J21j77l8N6N5j72R8O8l18J49J56m60J49J64Q4m8j54K66k81R0l0L8
2967g5l06K93J56j21K44j82j08N2K01j70J83k1j40K4J89k54l07O87j16l7k32L94
2989C54l08k01K45N1K7m02J23O0K24j59k11J68n5J03P7j69j2J92J4j84l1p8L74
3012B02m97L67M7j63J13j46L7J49j99J47%j74P4L03k26j81J93n57N85K02k70k0
3034a4J61j94j07K57k50J91K62n92M20j64j78P4O9K5J60m99M08J80m31J65K92
3055B35l67j87L93j27l3J10l72K69l5J94K08l09K35l38J58P5o3q5p5P8j28K17
3077E3K62q2k10L4n8j23J4K38l7j93n0M6J20m3j80K88k13L26k29J39j25J62O4
3100B03l3j07j78M66m25K66l59J59%j2o8m5J47J94k64j66L36k23J50L9Q8l20K64
$$ plain form
2943 19 30 109 230 53 15 71 126 -46 52 120 -198 -49 107 -353 -204 -40 44 -4 -158 108 -173 -83 -113 -75
2967 -75 -381 -88 68 -53 191 9 -99 -47 154 -16 167 146 6 30 219 -35 -342 345 229 192 -40 354
2989 354 46 -155 90 141 168 -234 -111 -51 173 14 -197 -29 -84 19 96 -73 -85 107 121 -63 -94 -172 202
3012 202 -295 72 119 -44 69 -77 -40 109 -90 57 57 -117 -43 260 34 -147 46 -511 74 276 6 -14
3034 -14 147 -47 -154 103 -147 44 306 -286 134 -30 -208 -134 -65 -40 120 -379 29 209 -222 -57 235
3055 235 -132 -319 74 -53 -86 24 -348 -79 -114 80 288 -21 214 -124 34 109 46 -39 -114 -36 -164 53
3077 53 315 233 23 57 -1 -124 -110 128 91 -102 -152 -106 14 -29 -209 79 -134 192 -37 102 -23 139 203
3100 203 170 63 -115 351 -74 192 -167 -8 -8 -20 -88 -133 14 208 -56 -222 114 -109 41 80 168 -152 112
3123A12k02L7j06J59L75l75m5M32m56Q3m5nJ09j32K90m5k45K00m13J6J86N9L6
3146B5j79n7L20J11K9l35K12l71L5K68q8J30k70N29l89OJ22j34M3L63k78k68J34
3169d2j9K66k03j59M23r7k25K91o25M02K58J98l42J30n07J84k58K67J5j5J46p2
3191A6lj10L53m91L93K0j09j38K68M5l90K00j29Nq5J06j20K13k40L55PP1k22Q4
3215I9j75p4J83k05m2J63QJ8m0n8m4J25R4k21MJ59j64q7J89Mn4K03j55k3k9j8
3241a40J2mJ98k09lJ03J49k46J34L07j06J45l52k90Q2J71k0J18m0P8K5j72K8M8
3265A6K7Q4P8o1r7q6OL46k57j66M32m22K77n48M42J52k26L8j37L7P6j01K91j17
3289H4l40M61l25K45k57M25k41j06J72k09R4J85j56qj05M1q6K80j56n9mK3j37
$$ plain form
3123 112 -90 -53 -159 0 375 0 -45 387 -69 14 -31 -36 73 -59 231 186 -59 141 -272 -256 -70 -11 25
3146 25 -154 -211 109 220 249 -86 126 -245 -210 58 -30 100 -170 359 -30 -24 98 -36 7 370 92 -176 -42
3169 -42 -61 205 2 -157 266 169 -56 235 -390 12 270 468 126 256 -251 -67 -325 -58 -43 -58 88 16
3191 16 13 -97 256 -235 158 178 69 -69 199 244 -146 54 -75 -70 -155 -49 -169 44 -196 159 166 237 15 99
3215 99 -76 -150 33 -172 -214 -51 -43 -25 -65 -123 -167 -42 52 -169 -165 -6 -170 -257 -68 -64 -118 85 -70 -93 -122 -140
3241 -140 -128 -132 66 -143 -146 -43 106 -140 -6 301 195 340 -12 -302 -220 -49 -69 49 9 87 112 -60 -32 16
3265 16 43 127 205 144 47 -39 -33 313 56 -110 322 -100 177 -371 71 223 -3 35 -102 -65 11 -90 201 84
3289 84 -256 205 -120 125 -132 293 52 -54 118 -91 3 188 32 24 -81 -40 -126 154 -2 -61 -65 -42 -179
3312a79L39m51L49j3k43K28l41P2Q6J71J22j77K00m61P0L79k65m0K12l19K00M4
3334a7p8K64k36J20k24K94j05r4P1J1K06j53rK11kj18k48NL84m98L28J92j77r0
3358C7l14L08r6K14j90k6O2L5j51J92k40M42n0j17k71j13K24J20R9J25k49J51
3380A92k83R5k2p2k5n1K84k04J07j17J40M5P2k24M00m79j55N00r0l04N72o14M08
3403A75l78L10r9k1o7J52p0Q2m1j40j11M14j9l01K65M7j13J04j4j91J47l38J64
3426d3Pj79M90k84J06O7K3k00J7L08j84j09Po1J76qj04QK53m04K18k37r7J67K8
3451c5L02m05M6K81k58J77k03K85k25K04J8j12L5k26J21j61R5J18o7O9q3r9N2
3474g1J40j35J16N4k9k6j67J14j03K12n0j99J79j4j32p2K04K28m59J67n9o4K60
$$ plain form
3312 -179 160 -291 58 45 -198 30 -311 -239 -153 18 140 -37 163 -298 -228 151 -114 -154 58 -261 -61 -17
3334 -17 -95 169 -67 53 -171 123 18 -76 -5 6 212 59 50 261 259 141 -107 -102 282 -216 112 304 127 37
3358 37 -277 31 -65 149 -41 -67 -5 30 -121 71 -169 273 223 106 -165 -278 -54 66 165 290 41 192
3380 192 -91 4 -18 -90 -115 -166 118 -86 21 -96 44 89 161 -63 337 -142 -297 203 113 -191 381 -233 175
3403 175 -203 107 8 -13 -80 72 2 84 43 -97 -208 206 187 -114 151 198 85 189 175 -16 131 -207 -43
3426 -43 -36 -215 275 -9 97 164 187 -13 4 312 128 19 26 -35 141 133 29 37 290 -114 104 -133 -230 -63 -35
3451 -35 267 -138 -92 189 -69 108 -95 190 -35 169 187 75 110 -116 5 -156 -61 57 -10 59 -24 -123 -71
3474 -71 69 -66 50 104 75 49 -118 -4 -107 105 55 -144 35 21 -111 -183 21 249 -210 -43 -102 -166 94
3497I4j06K88l43j9k1K53N6q2l4K34k51k98j41K24K04j46L2K11o5M8N0j43m7j13
3521a15J44j13L0Q3l02M46r4l62J17J53j95K58J15l62k1m6L5J90q5J84j13O7n5
3544d1J55lk21K78k01p5R0j5j3J65J79j64l49M0L46p8k53L27l97J32K24m4m2k44
3568b04P4K54j04p1J85l79NK36J66m44K77m6j4L74n96M96m58J58P0k33N24l97
3590a27M82k61n9J22j30j31j26K43k23j28J70P0K91j05J3p1J7j53J30L30nl57
3612hj31L80n04J31l3j81L82K0nk76L07j60j32J58Q1m9J78n60L72m3rJ56RJ80
3636B63k52K5J2j70K05jN7k69L33m51J14L87j08r7J05J21j66q9j02j82JM84m42
3659b22K6L22j07j06P8K2J85j77Ln2J49k55k30K32J04J79k53n6k9QK86j25pm03
$$ plain form
3497 94 -12 276 -67 -86 -107 146 202 120 86 320 69 -229 -370 -146 58 -88 -56 155 90 138 188 45 -2 -115
3521 -115 29 -84 -54 29 -273 173 79 -283 -166 -13 -208 50 165 -197 -218 -264 -229 -39 -124 60 -53 14 -41
3544 -41 114 111 -110 168 -33 -108 -18 -33 -46 119 298 134 -215 -175 171 93 -160 167 -230 -98 126 82 40 -204
3568 -204 -130 124 20 -51 134 -245 -240 -4 162 -282 -5 -51 -65 309 -287 209 -249 -91 -21 -254 270 -127
3590 -127 355 94 35 157 27 -104 -230 13 -210 -338 -168 -98 193 88 101 30 47 -106 24 354 349 -8
3612 -8 -139 241 -263 -132 -165 -346 36 56 51 -225 82 -78 -210 -52 29 -20 158 -402 -30 -73 -82 74 83 263
3636 263 11 36 48 -122 83 82 139 -130 203 -248 -134 253 145 48 153 274 108 19 -83 -265 -264 220 -222
3659 -222 -196 126 19 -87 -9 13 198 21 24 -28 121 -134 -364 -132 -28 151 -102 -158 -187 -179 107 -18 -25 -428
3683d28O83l47K00m11M98M3l66K54q6k20L28j79j5R2J00J12j04R1k21Q7k76J24
3705d1R4k00K02l46K76K30q8l37N07j34k9l94L37m33K88K02j59o6r7J51J63K8
3727A54j54PL7J45m23J45J37r9m0K43q7K10m33R8o5J59K4k06L09k75M4j72L66
3750A24m21L57M6j0p8j13m5K34n4K5k4L2k88N96k58p6M8j07K48m15o2K57Q4l58
3774b58M32k99J69J47j15j45k36M09n7j2K27l99Q7p5j2L38k87n1M07n3j69o3j37
3797a52O1j31K45Q3k61K84l77M8L83j06k60K65J40l71L24j37m7J6o3j19J70L66
3819C61l61j21J39k64K95J46j04l3M1k16M83k60k67J12P1jL8m2J29k08L0ko9N8
3843d5j74O03n69K51q2j88L28j95N6j08p7N7J07J34o4K5k7r4j7J92N2O7l4k19
$$ plain form
3683 -428 255 -92 108 -303 195 238 -128 126 40 -180 148 -31 -46 46 146 258 154 245 24 111 -165 -41
3705 -41 53 -147 55 -291 -15 215 127 -210 297 163 134 -260 77 -356 -68 134 -25 -91 -188 -37 126 154
3727 154 0 7 44 189 -234 -89 48 -51 -91 152 65 275 -158 -60 -125 34 58 -148 161 -114 -70 -242 124
3750 124 -297 60 106 96 18 -95 -140 94 40 65 41 73 -215 381 123 47 95 -12 236 -179 -241 16 100 -258
3774 -258 174 -125 44 191 76 -69 -305 104 47 35 262 -137 -50 -125 -137 201 -86 -137 270 217 48 -15 -152
3797 -152 -91 -222 23 106 -155 129 -248 -200 183 77 -183 82 222 -149 175 38 -9 7 -56 -175 -5 361
3819 361 0 -121 18 -246 49 195 91 58 99 -117 366 106 -161 -49 22 21 59 17 146 -62 -32 -34 -103 -45
3843 -45 -219 384 -185 66 -16 -204 124 -71 -15 -123 -200 -143 -36 98 34 59 32 -62 -79 113 165 232 198 -21
3867b1N5j23K54J25l14J93k62J98p6j99J08Q5n0N7j56J48l76p0P67m35J97j8l4
3890E3J34M3j60R3l21J65l51J97J29j49L21n9p0j04L05p9q3J67m72M17m33K17
3912d0K0j54J04j19J64q4J9j12k8r0O20j30m09K48k6J02lM2p8J06m35L40J24k09
3936b8m1N0%j15J31m2N7j54k30L79N9J31k95L6K9k45J3J94jM4J10J17l24N7K01
3961A33j42OL4j0K6j86J15lK07k09K15l88J00J51k65J75K94m3m86J45r2L68j47
3984bp2q8J73J48n01L56J57m49K77j34L43j69r2k30J63K38l3k7K6O9k43J66k09
$$ plain form
3867 -21 34 -89 165 290 -24 169 -93 105 29 -170 -62 23 -27 30 -126 22 -354 -424 343 -92 105 87 53
3890 53 187 230 70 163 -158 7 -344 -147 -18 -167 154 95 25 -79 226 147 64 231 -241 176 -257 -40
3912 -40 -20 -174 -70 -189 -25 -109 -90 -202 -230 -320 300 170 -239 9 -17 85 82 124 46 152 -283 57 181 -28
3936 -28 -69 -19 -19 -134 -3 -45 12 -142 -372 7 66 197 -98 -62 -33 -278 -265 -71 -72 -28 82 199 -125 -68 133
3961 133 -9 -3 31 21 47 -139 -24 -27 180 -29 186 -202 -102 49 -216 -41 253 210 -276 -131 -223 145 -2
3984 -2 -74 -162 11 159 -342 14 171 -278 -1 -135 208 39 -53 -283 -120 118 85 58 84 153 -90 76 -133
$$ [...]
8191d9
##END NTUPLES=NMR FID
##END=
