##TITLE=1H_Pr 5-en
 CDCl3, 8 sc, 
 26.2.2020
##JCAMPDX= 6.0         $$ Bruker NMR JCAMP-DX V2.0
##DATA TYPE= NMR FID
##DATA CLASS= NTUPLES
##ORIGIN= UXNMR, Bruker Analytische Messtechnik GmbH
##OWNER= root
$$ XWIN-NMR		Version 3.5
$$ Wed Feb 26 16:51:47 2020 Russian Standard Time (UT+4h)  she@DPX200
##.OBSERVE FREQUENCY= 200.1315
##.OBSERVE NUCLEUS= ^1H
##.DELAY= (6, 6)
##.ACQUISITION MODE= SIMULTANEOUS
##.ACQUISITION SCHEME= undefined
##.AVERAGES= 8
##.DIGITISER RES= 18
##SPECTROMETER/DATA SYSTEM= spect
##.PULSE SEQUENCE= zg30
##.SOLVENT NAME= D2O
##.SHIFT REFERENCE= (INTERNAL, D2O, 0, 15.7039)
##AUDIT TRAIL= $$ (NUMBER, WHEN, WHO, WHERE, WHAT)
$$ ##TITLE= Audit trail, XWIN-NMR		Version 3.5
$$ ##JCAMPDX= 5.01
$$ ##ORIGIN= Bruker BioSpin GmbH
$$ ##OWNER= she
$$ F:/spectra/data/she/nmr/H-F/1/audita.txt
$$ ##AUDIT TRAIL=  $$ (NUMBER, WHEN, WHO, WHERE, WHAT)
(   1,<2020-02-26 16:50:37.75 +0400>,<she>,<DPX200>,
      <created by zg, POWCHK disabled, PULCHK disabled
       configuration hash MD5:
       00 E9 B6 7A A2 85 ED C7 34 08 36 98 17 FE 4E 26
       data hash MD5: 16K
       C8 8C E0 38 D1 93 7A EA 64 CE 2A 2E 08 86 6A 58>)
$$ ##END=
$$ 
$$ hash MD5
$$ 36 05 1A 80 69 5B A7 B5 06 F4 35 39 15 9C CB DF
##$RELAX= 
##$RELAX= 
##$RELAX= 
##$RELAX= 
##$RELAX= 
##$RELAX= 
$$ Bruker specific parameters
$$ --------------------------
##$DU= <F:/spectra>
##$EXPNO= 1
##$NAME= <H-F>
##$PROCNO= 1
##$TYPE= <nmr>
##$USER= <she>
##$AMP= (0..31)
100 100 100 100 100 100 100 100 100 100 100 100 100 100 100 100 100 100 
100 100 100 100 100 100 100 100 100 100 100 100 100 100 
##$AQSEQ= 0
##$AQ_mod= 1
##$AUNM= <au_zg>
##$AUTOPOS= <>
##$BF1= 200.13
##$BF2= 200.13
##$BF3= 200.13
##$BF4= 200.13
##$BF5= 200.13
##$BF6= 200.13
##$BF7= 200.13
##$BF8= 200.13
##$BYTORDA= 1
##$CFDGTYP= 0
##$CFRGTYP= 5
##$CHEMSTR= <none>
##$CNST= (0..31)
1 1 145 1 1 1 1 1 1 1 1 1 1 1 1 1 1 1 1 1 1 1 1 1 1 1 1 1 1 1 1 1 
##$CPDPRG= <>
##$CPDPRG1= <>
##$CPDPRG2= <>
##$CPDPRG3= <>
##$CPDPRG4= <mlev>
##$CPDPRG5= <mlev>
##$CPDPRG6= <mlev>
##$CPDPRG7= <mlev>
##$CPDPRG8= <mlev>
##$CPDPRGB= <>
##$CPDPRGT= <>
##$D= (0..31)
0 1.2 0 0 0 0 0 0 0 0.06 0 0.03 0 0 0 0 0.0002 0 0 0 0 0 0 0 0 0 0 0 0 
0 0 0 
##$DATE= 1582721436
##$DBL= (0..7)
120 120 120 120 120 120 120 120 
##$DBP= (0..7)
150 150 150 150 150 150 150 150 
##$DBP07= 0
##$DBPNAM0= <>
##$DBPNAM1= <>
##$DBPNAM2= <>
##$DBPNAM3= <>
##$DBPNAM4= <>
##$DBPNAM5= <>
##$DBPNAM6= <>
##$DBPNAM7= <>
##$DBPOAL= (0..7)
0.5 0.5 0.5 0.5 0.5 0.5 0.5 0.5 
##$DBPOFFS= (0..7)
0 0 0 0 0 0 0 0 
##$DE= 6
##$DECBNUC= <off>
##$DECIM= 24
##$DECNUC= <off>
##$DECSTAT= 4
##$DIGMOD= 1
##$DIGTYP= 9
##$DL= (0..7)
0 120 120 120 120 120 120 120 
##$DP= (0..7)
150 150 150 150 150 150 150 150 
##$DP07= 0
##$DPNAME0= <>
##$DPNAME1= <>
##$DPNAME2= <>
##$DPNAME3= <>
##$DPNAME4= <>
##$DPNAME5= <>
##$DPNAME6= <>
##$DPNAME7= <>
##$DPOAL= (0..7)
0.5 0.5 0.5 0.5 0.5 0.5 0.5 0.5 
##$DPOFFS= (0..7)
0 0 0 0 0 0 0 0 
##$DQDMODE= 0
##$DR= 18
##$DS= 0
##$DSLIST= <SSSSSSSSSSSSSSS>
##$DSPFIRM= 0
$$ [...]
##$SUBNAM2= <"">
##$SUBNAM3= <"">
##$SUBNAM4= <"">
##$SUBNAM5= <"">
##$SUBNAM6= <"">
##$SUBNAM7= <"">
##$SUBNAM8= <"">
##$SUBNAM9= <"">
##$SW= 24.9337058887773
##$SWIBOX= (0..15)
0 0 2 0 0 0 0 0 0 0 0 0 0 0 0 0 
##$SW_h= 4990.01996007984
##$TD= 16384
##$TD0= 1
##$TE= 0
##$TE2= 300
##$TE3= 300
##$TEG= 300
##$TL= (0..7)
0 120 120 120 120 120 120 120 
##$TP= (0..7)
150 150 150 150 150 150 150 150 
##$TP07= 0
##$TPNAME0= <>
##$TPNAME1= <>
##$TPNAME2= <>
##$TPNAME3= <>
##$TPNAME4= <>
##$TPNAME5= <>
##$TPNAME6= <>
##$TPNAME7= <>
##$TPOAL= (0..7)
0.5 0.5 0.5 0.5 0.5 0.5 0.5 0.5 
##$TPOFFS= (0..7)
0 0 0 0 0 0 0 0 
##$TUNHIN= 0
##$TUNHOUT= 0
##$TUNXOUT= 0
##$USERA1= <user>
##$USERA2= <user>
##$USERA3= <user>
##$USERA4= <user>
##$USERA5= <user>
##$V9= 5
##$VALIST= <valist>
##$VCLIST= <CCCCCCCCCCCCCCC>
##$VD= 0
##$VDLIST= <DDDDDDDDDDDDDDD>
##$VPLIST= <PPPPPPPPPPPPPPP>
##$VTLIST= <TTTTTTTTTTTTTTT>
##$WBST= 1024
##$WBSW= 4
##$XGAIN= (0..3)
0 0 0 0 
##$XL= 0
##$YL= 0
##$YMAX_a= 45801
##$YMIN_a= -46489
##$ZGOPTNS= <>
##$ZL1= 120
##$ZL2= 120
##$ZL3= 120
##$ZL4= 120
##$ABSF1= 10
##$ABSF2= 0
##$ABSG= 5
##$ABSL= 3
##$ALPHA= 0
##$AQORDER= 0
##$ASSFAC= 0
##$ASSFACI= 0
##$ASSFACX= 0
##$ASSWID= 0
##$AUNMP= <proc_1d>
##$AZFE= 0.1
##$AZFW= 0.1
##$BCFW= 1
##$BC_mod= 2
##$BYTORDP= 1
##$COROFFS= 0
##$CY= 11.3945322036743
##$DATMOD= 1
##$DC= 2
##$DFILT= <>
##$DTYPP= 0
##$F1P= 16.9975609425685
##$F2P= -3.02152046262296
##$FCOR= 0.5
##$FTSIZE= 0
##$FT_mod= 4
##$GAMMA= 1
##$GB= 0.15
##$INTBC= 1
##$INTSCL= 1
##$ISEN= 128
##$LB= 0.24
##$LEV0= 0
##$LPBIN= 0
##$MAXI= 10000
##$MC2= 0
##$MEAN= 0
##$ME_mod= 0
##$MI= 1.114404
##$NCOEF= 0
##$NC_proc= 0
##$NLEV= 6
##$NOISF1= 3.799351
##$NOISF2= 2.8
##$NSP= 1
##$NTH_PI= 0
##$NZP= 0
##$OFFSET= 15.70392
##$PC= 1
##$PHC0= -9884.41
##$PHC1= 38.20082
##$PH_mod= 1
##$PKNL= yes
##$PPARMOD= 0
##$PSCAL= 0
##$PSIGN= 0
##$REVERSE= no
##$SF= 200.130013532006
##$SI= 16384
##$SIGF1= 3
##$SIGF2= 2
##$SINO= 400
##$SIOLD= 16384
##$SREGLST= <1H.CDCl3>
##$SSB= 0
##$STSI= 0
##$STSR= 0
##$SW_p= 3612.71676300578
##$SYMM= 0
##$S_DEV= 0
##$TDeff= 0
##$TDoff= 0
##$TI= <>
##$TILT= no
##$TM1= 0
##$TM2= 0
##$TOPLEV= 0
##$USERP1= <user>
##$USERP2= <user>
##$USERP3= <user>
##$USERP4= <user>
##$USERP5= <user>
##$WDW= 1
##$XDIM= 8192
##$YMAX_p= 0
##$YMIN_p= 0
$$ End of Bruker specific parameters
$$ ---------------------------------
##NTUPLES= NMR FID
##VAR_NAME=  TIME,          FID/REAL,        FID/IMAG
##SYMBOL=    X,             R,               I
##VAR_TYPE=  INDEPENDENT,   DEPENDENT,       DEPENDENT
##VAR_FORM=  AFFN,          ASDF,            ASDF
##VAR_DIM=   8192,          8192,            8192
##UNITS=     SECONDS,       ARBITRARY UNITS, ARBITRARY UNITS
##FACTOR=    0.0002004,     1,               1
##FIRST=     0,             0,               0
##LAST=      1.6414764,     0,               0
##MIN=       0,             -46489,          0
##MAX=       1.6414764,     45801,           0
$$ Real data points
##PAGE= N=1
##DATA TABLE= (X++(R..R)), XYDATA
0@%%%%%%%%%%%%%%Qj6J6j6J6j6J6k4L2l2L6m4M8n6O4p2Q0q8J02j14J25j38J54
37H1j73J94k15K37k61K90l22L57l95M37m87N45o12O89p83Q98j041J227j480J849
57A035k433L493o046K2740K7012n6147k9980L1863M3403j8221m4673k332M3959
70A3673K0225k7017k9719R359K3307J346j6552m735R233P742J47j365o191j0709
84a1256q86J7162J1981j4586k0735J0113K9282r0l6270j7831L1357L4289j6449
97A6081m0775N80M1498J5188l6933l1810K2462M0720k623l7347j2083K8314K0739
110B4011j7954k5989M501K3808P525j3545j0559L603O710R92k018l132m057J673
124d431J1134O837j1918j7215M527K2280N169k2650j5043J9493K5759r718l2490
$$ y = [0, 0, 0, 0, 0, 0, 0, 0, 0, 0, 0, 0, 0, 0, 0, 8, -8, 8, -8, 8, -8, 8, -16, 16, -16, 20, -24, 24, -32, 32, -40, 40, -48, 54, -60, 65, -73, 81, -92, 102, -113, 124, -137, 153, -169, 188, -207, 230, -257, 288, -324, 365, -418, 480, -561, 666, -814, 1035, -1398, 2095, -3951, 18789, 45801, -10346, -40326, -8463, 34940, 16719, -27954, -30286, 13673, 33898, 6881, -22838, -13479, 9828, 11174, -5378, -10113, -880, 6862, 7009, 5644, -547, -11256, -12142, 5020, 17001, 2415, -18320, -8207, 21075, 20985, -15285, -33116, -1759, 32530, 16081, -24694, -24114, 17384, 32572, -4361, -36171, -13709, 27011, 24388, -12959, -25042, 3272, 24011, 6057, -19932, -15431, 8377, 15902, 2357, -8202, -4599, 2111, 3103, 1085, -2047, -6104, -4431, 6703, 13540, 1622, -15593, -11066, 11214, 16383, -6267, -21310, -1817, 23942, 14224, -18266]
137a8266n418K9979J8311k1284k5810J0784K9660J869k7806j4324J8393K0340
149A6428o780j9068j506J5006P123r006r934Q53O871M465J86l577n288m75P280
164B578N219p525j1472L680J6786N017j6334j3566J0886J8604l831k1156m706
177a5820K0359J4249j3750k0090M063J9983L935j6868r977J1790J4236m125j3874
190e889k895R100N572m132n092P14L484J960J60k202m549j532N843O360l610r430
206f138P9J1200M666j1281j0748P451J5087q54j5484n262J3424J0296r667j4366
220a1597L553J5421L190j2637p564Q425R439m275r946m9Q229L256m681l610J820
235a026K074q56n47Q59r17j904K099M499j122o985k034P424N430o164q397L727
$$ y = [-18266, -23684, 6295, 24606, 3322, -22488, -11704, 17956, 19825, -7981, -22305, -3912, 16428, 9648, -9420, -10926, 4080, 11203, 2197, -7737, -6884, -13, 4452, 4638, 1061, -4227, -4702, 2578, 7797, 272, -11200, -7520, 9266, 14283, -2051, -15617, -4731, 13873, 10042, -11114, -15820, 4539, 18788, 5038, -15052, -10989, 8994, 12929, -3939, -13916, -2126, 12110, 7985, -5889, -8784, 316, 5888, 1756, -3336, -2622, 862, 2822, 2982, 780, -3769, -5301, 542, 6902, 3292, -6138, -6059, 5141, 9807, -1474, -12222, -4771, 10316, 9462, -6022, -11284, 2140, 12436, 2769, -11597, -8044, 7377, 10567, -2070, -9634, -1209, 8230, 3955, -5991, -6040, 2189, 5445, 764, -2846, -1026, 1048, 192, -355, 504, -413, -2317, -218, 4281, 3159, -3826, -5860, 1564, 6994, 830, -7567, -3840]
251c840J0908L64j1650n456R559R258n776j1116J611J1537K789j0060o670O578
265a964Q420k641q018k80O701K304m777l426K410K856q62j297R82L08j901k21
281a406K878O78l987k143M592M690l506o866J021P791J814p668m755O378P569
296G080l456r037k49Q520L340o886n549M599O976j592o880j195N322K666l493
311A66l030K039K909p67k103J84R52p95n49J756J159k204k139K240L306j729m759
328c364J43N548K207n018m212L616N624j688o474q02O165L301m529m779K450N184
344C372n11m956j329L914K562k269k693R38K121l00j560R3R99k49n95R00Q77j408
362i4j812J220K647m89l221n53L505J974l144l451J878M251k67m295j263L800
$$ y = [-3840, 7068, 7432, -4218, -9674, -115, 9143, 3367, -7749, -6138, 5399, 8188, -1872, -8542, -1964, 6456, 3815, -4203, -4483, 2218, 4522, -255, -3681, -1271, 1585, 723, -574, 408, 716, -1185, -1406, 1472, 2150, -1837, -3980, 612, 5302, 1796, -5070, -4049, 3742, 5556, -2112, -6867, -489, 7080, 3624, -5413, -5662, 2858, 6198, -688, -6237, -1638, 5338, 3746, -3134, -4329, 993, 3659, 166, -2864, -825, 2084, 1317, -786, -602, 350, -445, -994, 762, 1921, -283, -2422, -182, 3124, 1395, -3364, -3221, 2327, 4534, -484, -4696, -1080, 4544, 2856, -3618, -4420, 1745, 5046, 517, -4262, -1812, 3372, 2861, -2095, -3424, 490, 3052, 783, -1910, -972, 1149, 849, -711, -618, 381, 132, -463, 437, 1314, -94, -1906, -686, 1961, 1472, -1749, -2302, 1203, 3177, 33, -3418, -1540, 2711, 2444, -1851, -3114, 686]
378F86K638k706l568J122L695L15l093j270K283J794j409j915N09J526k3r64L2
395c48O69k41o95M59Q69n89j289N06J872M9k166r06K025J722j518k396P54K799
413A576L27k731j393K103K067j211k363L17K299N79j871j191J145J376m83j192
429f46R7R24J37o05j70K86m3k59L03N32l34q31J39J089J61j278o49J225J263p86
449E55j648J49J739M91j593j110J169J586m73j657k31J400P02r92j002M86J073
466F44O4q35l71M06L92r6k44j02M1J58K84J8m77m13L76P53n7r56l23R46Q22p11
488C19j303J51J431M96j208j044P65J410j57j479n44J121J057n08j179j27J017
505B18O15o13r11NQ42N24m09p69j27O67O06l50q93j94Q95P67m94j119j14J128
$$ y = [686, 3324, 618, -2950, -1828, 1867, 2182, -911, -2181, 102, 1896, 487, -1428, -919, 607, 584, -380, -348, 321, 80, -615, -156, 713, 124, -1165, -659, 1213, 1262, -904, -1810, 215, 1937, 419, -1977, -1223, 1576, 1903, -828, -2221, -118, 1949, 738, -1625, -1308, 991, 1570, -301, -1492, -347, 1029, 546, -646, -549, 375, 512, -93, -263, 23, -20, -279, 24, 556, 222, -609, -470, 619, 780, -498, -1147, 78, 1341, 555, -1093, -944, 795, 1286, -307, -1417, -248, 1338, 865, -792, -1023, 377, 1079, 87, -915, -429, 644, 708, -127, -498, -92, 300, 204, -40, -142, -101, 57, 341, 359, -118, -531, -155, 598, 541, -415, -738, 208, 1030, 319, -984, -833, 598, 1094, -114, -1158, -393, 1017, 860, -619, -1163, -42, 1015, 507, -672, -799, 218, 833, 220, -691, -686, 156, 680, 271, -498, -625, 42, 648, 298, -595, -789, 106, 873, 379, -740, -854, 274]
525B74P38q12j223K19J382N24j140j132N46J404K00j287q55P84J266m9j263o68
543a092Q12J161r7j217o58Q60J178j48j335o56J035J306l37j575n39J348J294
560A340p23j693j72J659J059j116j615K36J728O56j329j308N94J546K82j282r74
577a112O13J258J58j029p86M40J067L41q67j018K35J274O20j049j321L93J709
594I26N16j622j444J034K028n3k146r57J746J786r61k231r7K136J087j547j731
611a530O88J922K28j681r80J034J312k36j179l77P15O30j50n23l57P7N20N22k14
630D21r72m07J010J133o37j701j40J912J120j595j960P91K437K56k433j315J927
647a53K159j035k556l5K437R98j934j684J181J967l36j885l38J500P49j038q41
$$ y = [274, 1012, 200, -1023, -804, 578, 1102, -38, -1170, -624, 780, 980, -307, -1162, -378, 888, 839, -424, -1092, -280, 881, 784, -433, -1091, -231, 947, 799, -536, -1192, -157, 1149, 812, -763, -1302, 46, 1340, 617, -1076, -1248, 411, 1470, 354, -1261, -1025, 703, 1359, 30, -1278, -684, 862, 1144, -138, -1112, -499, 759, 917, -112, -898, -458, 609, 950, 83, -935, -700, 574, 1194, 145, -1176, -783, 926, 1442, -180, -1624, -590, 1438, 1385, -761, -1718, 28, 1814, 853, -1378, -1475, 661, 1748, 201, -1530, -842, 1080, 1308, -373, -1353, -319, 993, 757, -422, -799, -84, 546, 396, -127, -484, -407, 113, 635, 421, -551, -958, 52, 1185, 548, -1153, -1293, 619, 1739, 144, -1816, -1025, 1412, 1668, -765, -2080, -153, 2006, 971, -1585, -1620, 817, 1815, -119, -1803, -622, 1345, 1009, -876, -1214, 286, 1035, -3, -844]
664h44N91P52l54n27L15M00m73m41O62P03p55j133O12J587j22j910n79J927J400
683A811j591k105Q56K605J09k651j152K254K023j472k573M79K698N57k396j389
699a937J754J943r61k104J63J941M72j506q44J038R59o37r15M07P49l05o35L36
717h2O55m07q06L71J063k04j337j71J507P03j457j281J139J781n58k149j87K150
735G30J059j801j783J121K213k48k290o58J935J406j215j807L54J765M21j359
751a57r38P20J099q7q49l98L97N19J18l33m94p1N45N91l08r33k34R91Q22p08j283
772i91J28J476N93j287j241P05J635P5j624q78J184J458m00j661m64J338J199
789A245o45j551k62J392J087p30j569k08J504J140r20j756l3J865J062j360j834
$$ y = [-844, -253, 499, 145, -382, -67, 333, -140, -581, 81, 784, 29, -1104, -492, 1095, 973, -937, -1516, 411, 1811, 220, -1885, -1029, 1576, 1685, -966, -2118, 136, 2159, 687, -1886, -1407, 1291, 1848, -548, -1937, -183, 1760, 799, -1305, -1142, 799, 1271, -235, -1079, -41, 918, 281, -634, -227, 522, 217, -418, -82, 573, 166, -640, -269, 794, 590, -747, -918, 589, 1292, -165, -1446, -307, 1474, 916, -1233, -1420, 730, 1789, -12, -1795, -674, 1539, 1291, -999, -1657, 278, 1684, 469, -1338, -984, 781, 1202, -157, -1095, -375, 724, 637, -212, -610, -213, 306, 424, 91, -403, -474, 71, 662, 354, -579, -813, 178, 1000, 292, -991, -863, 613, 1206, -81, -1322, -617, 1018, 1093, -531, -1409, -225, 1233, 833, -828, -1292, 46, 1245, 600, -951, -1213, 179, 1266, 536, -1033, -1241, 263, 1403, 483, -1273, -1306, 559, 1621, 261, -1573]
806a573M41K111O40j787j557R99K022N7j901j018J254J599l08j625o00J116J198
823A068k87j247n73P65J143O6j191r41O96J536K22j635j251J132K051j23k338
840i07j113K007K171j040k765k62K724J533k029k473Q77K805M43k487j532J602
856d46K107m67k093n67J512J227o12j321k64Q78Q03j19q11o65L22J147M92j075
874D8j366M79J898N35j907j621J305K433k14k707j075K303K163j319k785M5K735
891I50J201k088k068J017K351J27k037j055J279J487l51j363m33Q05Q11p2p10
908a49n48J76Q17N53o24j179jJ449Q50j234j615N32K091M40k042j444J467K178
926A717n09k414n76K128J508j378k031L88K047N58j605j167Q44J383n7j145n16
$$ y = [-1573, -1132, 979, 1619, -168, -1725, -726, 1296, 1353, -548, -1566, -312, 1287, 979, -646, -1246, -130, 1068, 781, -466, -1039, -274, 869, 935, -256, -1197, -501, 1035, 1257, -378, -1629, -497, 1554, 1431, -907, -2020, -13, 2158, 1118, -1647, -1909, 815, 2348, 319, -2154, -1277, 1528, 1971, -516, -2048, -446, 1661, 1194, -899, -1466, 46, 1273, 661, -660, -924, -46, 757, 638, -173, -838, -516, 631, 1123, 48, -1318, -839, 1059, 1594, -313, -1934, -629, 1804, 1590, -1117, -2192, 111, 2274, 955, -1830, -1785, 950, 2151, 63, -2005, -988, 1363, 1490, -547, -1602, -323, 1164, 813, -550, -983, -178, 633, 561, -149, -697, -521, 296, 849, 225, -954, -955, 494, 1344, 110, -1505, -973, 1118, 1558, -484, -1928, -461, 1717, 1208, -1206, -1782, 346, 1854, 476, -1555, -1167, 880, 1438, -167, -1334, -490, 893, 836, -309, -825]
943h25O10P09J8n23m66O1N80M99l29r17k19J004Q85p26j391R3J618O41j405j361
963a444Q54J804o3j839p65J493J393q51j662P6J578O11j183j028N94J137l4r21
981b50l46N11M90r6l59j77N2K31K82m4n08l13N11P17k87r94j74J084O93q67j173
1002a017M27J430J55j396p58J084J200n92j383k2J329N35j003r01N59R93j05q60
1020c25k61O04L90k89l64L6K06L9K8K0j78k24K03M55n5o40k24O82N76n45q72K13
1042e25J058K19j043o41Q10R92m21j154l9J089M78q58p81N05Q94j11q16k01O07
1061F2L67l30l93J03K83K3j19Kk7j29R3K88lm49k03N15M68m11p29J53Q90K01q81
1084b26n77P04Q74l58j046m5J004M50p96p32M64Q74j07q11k13O33M11m03m23J50
$$ y = [-825, -215, 494, 512, -11, -477, -416, 164, 663, 334, -583, -802, 202, 1087, 361, -1030, -937, 681, 1322, -83, -1444, -590, 1214, 1151, -688, -1453, 40, 1433, 582, -1080, -1004, 574, 1185, 2, -1026, -432, 705, 671, -250, -596, -85, 405, 309, -50, -227, -175, 56, 338, 294, -214, -527, -16, 701, 414, -580, -754, 330, 1023, 156, -1017, -590, 840, 995, -401, -1159, -75, 1125, 533, -850, -872, 457, 992, -11, -912, -353, 640, 535, -325, -586, 18, 408, 119, -245, -209, -3, 36, 64, 84, -94, -318, -115, 340, 285, -355, -579, 103, 679, 134, -738, -525, 533, 752, -291, -932, -122, 870, 449, -705, -744, 345, 823, -35, -816, -311, 583, 472, -344, -545, 62, 429, 99, -294, -191, 92, 115, -4, -2, -29, -158, -65, 223, 220, -229, -432, 83, 551, 140, -589, -436, 454, 655, -226, -803, -99, 775, 417, -629, -674, 330, 780, -16, -748, -284, 590, 483, -328, -541, 92, 503, 100, -323, -173]
1104a73L74jk37k5J08m3m7J63R6k74k38L02M29j97o16j3P07L03o65o18M79Q32
1126F46j68r25j97Q55N13o31p53K95Q55J8p57l21N96M75l52n09J05M36N4l30r0
1147a85J86O9j29MJ42n7k38P3L26K2m25j78M31L80l56n53J70O64J08o79l54N37
1169d2N91l22p00N2O79K06n47m07L44N10j29m78n5L57J68k25j84J07J29m7o1O9
1191A5rj31J8K03N4k81j52K74K91j94m05O0M39J40m32k88L24M11j44m53k6M36
1213A50J57l05k81J99K85o5k35j3J68M2j03k4O2k1p6J02J01j04k13P7L05K5l67
1236a34j54L71L15k99m66J61N39M7n40k51M56M20l20n28J41N34K5m59j63L50K33
1257B78k58k53J87K23j63k19J90K33j89l31K09M11j15n41j6O25K21o42m67N53
$$ y = [-173, 201, 200, -37, -62, 46, 3, -44, 119, 215, -59, -297, 5, 434, 237, -379, -392, 315, 618, -47, -665, -186, 646, 478, -447, -644, 211, 724, 93, -660, -365, 490, 508, -249, -570, 26, 501, 149, -360, -255, 181, 235, -95, -185, 1, 70, -59, -55, 87, 30, -208, -135, 191, 213, -212, -390, 41, 421, 65, -488, -318, 346, 454, -225, -579, -42, 549, 227, -473, -421, 258, 464, -83, -490, -146, 364, 235, -243, -298, 59, 227, 2, -182, -75, 54, 7, -54, 15, 6, -125, -107, 96, 150, -131, -283, -9, 282, 88, -317, -257, 182, 322, -110, -398, -74, 337, 193, -260, -286, 150, 307, 2, -279, -80, 205, 140, -95, -108, 60, 102, -1, -25, 37, 16, -60, 42, 143, 39, -174, -97, 208, 233, -134, -288, 83, 398, 99, -367, -206, 333, 380, -160, -411, 45, 465, 145, -383, -242, 292, 317, -142, -305, 45, 278, 20, -233, -46, 177, 14, -205, -15, 218, 29, -302, -93, 318, 203, -338, -354, 271, 492, -150, -617, -64]
1277f4P00l54q72O6R45K61q73n68O67Q07m10q98Q8Q85J88p62l93N75N03l87n27
1298d23K28N05j44m81J13N01r1n76J3O91J21p85l51Q11O51o83r66M13J193j7j278
1319e55m36J188Q39q83j168M66J304jj242m04J040O79p29q20M35Q26j71p38K4
1338c46O28N5n78n9N87Q3o47j75P32L53p78o11P08R23m98j175J40J308L06j286
1358c30p63J059J169o90j385J87J420L04j240p30R42R42n26j004J76Q86N9o82
1376b06j74N03J52m05o5M42Kn88o2P64K83q81o40Q30J042n89j355J31J523M29
1396A136j448r67J109J386o12j562L1J498M83j218q30Q24R70m24r34J56P35on81
1415b54K1M91j06n35J47P22j01r83j04J141N24j190r86R71J453n55j749o9J833
$$ y = [-64, 636, 282, -590, -524, 421, 682, -191, -759, -92, 715, 305, -593, -505, 380, 568, -194, -587, -12, 491, 104, -423, -195, 310, 166, -315, -202, 299, 208, -368, -355, 336, 457, -328, -679, 132, 783, 100, -866, -453, 740, 723, -555, -991, 197, 1036, 153, -1015, -549, 755, 754, -488, -892, 148, 827, 98, -722, -287, 539, 368, -370, -346, 282, 337, -241, -300, 287, 370, -277, -452, 280, 633, -145, -756, -48, 875, 377, -798, -658, 650, 956, -330, -1093, -34, 1135, 445, -940, -753, 667, 971, -269, -999, -57, 885, 359, -645, -469, 417, 476, -206, -380, 123, 275, -130, -195, 247, 249, -339, -401, 363, 646, -235, -875, -45, 997, 408, -947, -816, 707, 1136, -312, -1279, -170, 1216, 604, -958, -927, 571, 1054, -164, -994, -170, 800, 376, -558, -402, 333, 327, -254, -233, 258, 152, -383, -236, 486, 385, -598, -702, 439, 963, -227, -1213, -242, 1211, 656, -1093, -1162, 671]
1434F71P25j629j293J140J700n15j839j07J675O62j325r95Q92J121m66j077J91
1451d69R10o1p47L8P20q0q15P0J002R1j205m13J290R09j218j399Q59J851k80k089
1471a036m22K022J147j637j766J034K108k86k132m47J882R95j399j368Q68J459
1487A022l83j335J7J122J81r43k28Q47K32q83k66R91M39j085p65J085J194r02
1505C40j621M79J944J39k018q56J816J528j342k015O46K214J43k108q43J716J365
1522A527j177j618N77J621o7j422k92J154M37q88m95P53M68p02n17P57O29q08
1540f3q72P57J204n40j509R8J751M29j748j043J461J607r53j969K86K055M18j869
1558e00j042J468J458r08j627L30J561J64j339m87J047O39p58o51N58O34m86o04
$$ y = [671, 1396, -233, -1526, -386, 1314, 799, -1040, -1147, 528, 1190, -135, -1130, -238, 883, 417, -660, -469, 441, 380, -367, -329, 391, 311, -504, -434, 568, 659, -546, -959, 331, 1240, 22, -1377, -518, 1333, 1053, -1036, -1458, 564, 1711, 74, -1692, -658, 1450, 1164, -968, -1415, 467, 1462, 63, -1305, -437, 1022, 639, -696, -679, 443, 624, -319, -547, 300, 532, -351, -617, 374, 813, -272, -1037, 48, 1242, 340, -1281, -802, 1142, 1281, -737, -1593, 223, 1751, 409, -1606, -960, 1254, 1397, -711, -1554, 162, 1527, 350, -1268, -691, 930, 863, -559, -851, 303, 740, -148, -643, 110, 578, -124, -641, 116, 745, -63, -935, -178, 1026, 486, -1023, -925, 826, 1255, -493, -1536, -75, 1532, 579, -1390, -1104, 951, 1369, -500, -1542, -74, 1384, 476, -1151, -821, 740, 904, -435, -922, 125, 764, 6, -645, -87, 547, 61, -543]
1576e43M89O66m93q53M52J076k36j302j28J439N89j378j092J103J525o27j806
1593a119L2J826N92j585j143J152J491o09j586M4J472M08j193o88Q54P95n31p68
1611e56K95O86k04n95J87O01j93p00J76Q49j5j024k52J097O15r99j010P39J340
1630A037l37j507j69J476O83j233j096Q26J334l39j368j31J215N02r48p20O36
1647a39P87l60p33J46O40n3n52J5N24l2n70OO32J14p47l03P85N75p01q82M99J093
1669G44j51j195k70J149O72r16r88N68J161j66j141k31R71N37p19p07M46P13j81
1688B96o34K5N19L5m21l7L94L5m40m8N21J33n97k95N99N36n26p55L21R19j1r75
1710d06l38R06O51o96q93L89R82k7r77k73Q08N10n77o30L28O37j04n71k1M66P7
$$ y = [-543, -54, 612, 119, -734, -282, 794, 558, -744, -872, 567, 1156, -222, -1314, -211, 1314, 687, -1119, -1087, 739, 1331, -254, -1397, -245, 1246, 637, -949, -905, 567, 975, -218, -906, -52, 743, 212, -556, -261, 425, 221, -374, -187, 414, 221, -479, -303, 546, 531, -493, -745, 352, 967, -32, -1042, -303, 1037, 700, -807, -976, 500, 1183, -50, -1146, -320, 1014, 675, -693, -824, 391, 893, -55, -775, -139, 648, 288, -445, -299, 341, 288, -264, -249, 275, 243, -327, -321, 311, 425, -322, -625, 160, 735, 34, -848, -349, 744, 593, -602, -872, 277, 949, 33, -955, -387, 774, 608, -533, -764, 207, 744, 25, -682, -236, 477, 296, -338, -313, 206, 241, -180, -217, 177, 212, -228, -276, 245, 378, -219, -514, 85, 621, 95, -660, -339, 580, 569, -406, -744, 162, 813, 117, -776, -387, 595, 568, -409, -682, 126, 636, 59, -571, -243, 394, 290, -281, -302, 164, 241]
1731B41l81q2L43Q4l56r8M14J89m81l07M62N11l80o87K10Q03O6q37l66P36O40
1752G24n24q23K35Q85Q3q46l38O69N29m39o14K00O01j8n06r5L85J47l09j49K75
1773G2J39k78j63L17K04l28l34L08M70k12n92L0O63J88o44m38N34O00k91p31M9
1794d37P56J80o22m19M65N30k48n52M9M95J04m01j73K93J74j72j66J61J16j69
1814c6j21K00J59k22k44K04L56j38m69J5N08J79n09l43L85N00j89o01k0N95K11
1835D20m91l67L31M24j24m48j8L62J33k58j57J76J27j20r0J20O0j60m7J83J31
1856A87k28k18K20L37j34m37OM79J76m57l43L54M74j76n33k4N32K03m32l51K91
1877g4M17j44l92j8L41R5k56j19J82J08j43j05J62Q3k02j12K32J88k31l02J84
$$ y = [241, -140, -222, 121, 205, -151, -249, 165, 354, -127, -434, 28, 539, 159, -528, -318, 485, 551, -286, -652, 84, 724, 200, -623, -388, 497, 580, -266, -604, 65, 594, 155, -459, -259, 342, 324, -182, -277, 108, 255, -54, -203, 72, 211, -67, -230, 87, 291, -37, -371, -63, 407, 195, -397, -367, 296, 484, -160, -598, -64, 536, 245, -486, -437, 319, 499, -123, -542, -77, 453, 205, -347, -298, 197, 301, -100, -273, 20, 194, 22, -144, 17, 133, -36, -157, 43, 202, -20, -264, -60, 296, 158, -311, -296, 212, 391, -118, -461, -76, 424, 235, -366, -386, 209, 420, -71, -438, -107, 317, 193, -255, -273, 89, 222, -36, -193, -17, 110, -10, -100, 20, 80, -80, -127, 56, 187, -41, -259, -39, 298, 164, -273, -267, 212, 388, -69, -412, -58, 416, 240, -293, -317, 215, 418, -14, -365, -74, 343, 199, -193, -211, 130, 225, -31, -150, 32, 140, -3, -108, 54, 137, -65, -177, 55, 243, 12, -290, -106]
1898a06M06p7m78q5M77K82m27m36K82N52r2n81j33N44L08m03m32K22N05o3m75
1919b10q0L76J95k91k28J97K19j27k14J28J92j24k20J33K61r3l47K4M18Q5m38
1940a44k54L91M23k70n43Q6O03J17n67l40M57M84k63n61L6N59J33m51k80L00L42
1961B58j57l12J9K76L7j96l5J53Lj34K7J70j3k54k6L26J28l33k72K74M38j55n39
1984c17j7N41K31m66m16L22N16r5n61j01M78K77l36l75J72L82nl26q4K02J09q3
2006D8r4L1K5n9N3J20p4k19J5L09R6l41k57L09M10j78n19k6N33K55m59m29K99
2029a52N39p4n56j27M56L08l42l56J42L69Pk83j04J75J15r6m1L4k3p6R4J70j26
2052E3k67L2L71J35m25l17L49M91j80o20n9O27L28n35n32L21O61q6o36j81N33
$$ y = [-106, 300, 223, -255, -340, 137, 419, -8, -444, -162, 390, 298, -283, -416, 128, 436, 33, -399, -177, 328, 265, -210, -290, 86, 281, -10, -238, -41, 178, 51, -163, -35, 157, 33, -187, -54, 207, 114, -233, -209, 209, 294, -144, -398, -7, 416, 146, -397, -311, 292, 409, -158, -498, -41, 443, 180, -381, -345, 214, 347, -104, -384, -84, 258, 101, -211, -192, 84, 121, -75, -110, 43, 46, -88, -61, 109, 96, -158, -184, 142, 270, -63, -335, -61, 377, 222, -317, -334, 207, 438, -28, -444, -122, 394, 299, -262, -363, 115, 392, 56, -319, -147, 235, 230, -96, -180, 22, 131, 48, -46, -15, 10, -49, 4, 124, 50, -169, -154, 155, 251, -90, -347, -38, 372, 194, -325, -351, 182, 437, -22, -451, -152, 387, 313, -243, -370, 86, 394, 52, -304, -162, 207, 214, -69, -173, 2, 117, 21, -20, 14, -9, -85, 9, 179, 53, -214, -182, 189, 324, -101, -418, -69, 422, 242, -378, -437, 190, 518, -17, -549, -228, 433, 347, -289, -470, 63]
2073F3L69l53m36J26M33J8l24j19K09J13j15o4J03j3j52Q3K18j7l46q4M23K43
2095C78l92m64K90O49q4p01k30O87M85m96o90K30P89O2p37l36N70N24l35n90Q1
2116c10N51J10m31k21K76K35j60j73R8J02j24l7J85O1k92j58L42L16k72n28J65
2137b65O57N7o86l49O09O09l94p75P2Q35K60p43n12M96O84k11p00o6O06K56m11
2158B9l56K19L38o7k45j9J54m7n3J13P7k11j69K65L23k36n08Q8O27J55o36m32
2180e91N11O69k63q17o7Q08L82o55o25L79P53p8p23j98N60L76l34m26J22L65K9
2201A77k36q1J09L1k7R8M1k11j49K47L33j88n07J6O18K35n95n14M35P46j64q42
2223d28j72P69M97n65p25K71P85O8p11l17M96M80k46m86QL86J12k18j22O3O3k
$$ y = [63, 432, 79, -357, -231, 202, 220, -104, -223, -14, 99, -16, -80, 23, 10, -142, -59, 159, 142, -204, -288, 135, 378, -14, -478, -188, 461, 377, -324, -554, 133, 618, 122, -568, -338, 451, 513, -224, -560, 10, 534, 199, -391, -310, 241, 351, -80, -301, -25, 210, 50, -123, -25, 77, -47, -84, 101, 162, -130, -288, 54, 370, 98, -430, -265, 392, 449, -237, -586, 23, 632, 238, -537, -465, 370, 630, -113, -625, -129, 555, 344, -356, -422, 184, 440, 29, -327, -108, 230, 163, -82, -101, 53, 6, -47, 66, 143, -68, -237, 28, 351, 115, -393, -305, 322, 477, -159, -591, -80, 589, 326, -491, -558, 250, 632, -23, -648, -269, 484, 406, -317, -515, 45, 421, 87, -339, -217, 148, 177, -59, -140, -31, 0, -27, 71, 112, -99, -248, -1, 332, 144, -363, -347, 271, 506, -89, -603, -168, 578, 414, -428, -600, 169, 666, 101, -624, -353, 432, 500, -211, -528, -32, 448, 202, -284, -276, 110, 222, 4, -118, -55, 8, 6]
2245FP1K4j81j65K28L37j59m90m6O01K87n37n59L51P53o3q12k63P14N54m65p44
2267e58J69P71J60o59m04M35N26j68n04n5L71J81j96j89L6R8K8M1K0j69j28J80
2289a4L02r5m67p5N04L26m45n56K35P20K7p17l49N95N99l57p26N8P01K30n45m43
2311d92L31M96p1m69r7L23J92j50k02M8R1K1K5J9j10j45J36K86m5l87j31M17L38
2334D24l41n18J41O50Q9o16l70M87N81k69o59rO21K78n00m39K66M97m0m59j18
2355c04L31J95j64k02L9J24OnQn6j11Q1K08J6l15j52L46L13k55m78R5N47J61n32
2379a04l67L85N42j80o09q2N92K85m41m24K38M88m2m32j34L27K23j77k38O6J68
2400H4kp1j6Mm5OJ60J2k05j42K35K57j67l91L8M56J45m31l46L16M85j29n57r5
$$ y = [6, 77, 101, -80, -245, -17, 320, 161, -329, -375, 226, 513, -24, -583, -232, 521, 458, -354, -617, 97, 651, 186, -558, -389, 382, 542, -117, -521, -86, 440, 272, -232, -287, 84, 265, 69, -120, -84, 14, 42, 83, 103, -66, -194, -14, 288, 193, -274, -349, 155, 481, 36, -520, -285, 435, 462, -255, -604, -9, 590, 233, -493, -435, 266, 496, -49, -492, -161, 335, 264, -205, -302, 21, 213, 63, -139, -91, 0, 21, 46, 65, -45, -190, -54, 232, 187, -200, -331, 86, 424, 83, -435, -294, 356, 445, -171, -541, -54, 527, 258, -401, -410, 211, 489, -11, -450, -184, 313, 273, -186, -304, 27, 222, 58, -144, -105, 19, 25, 20, 28, -28, -139, -58, 150, 166, -149, -301, 45, 358, 103, -375, -280, 267, 428, -104, -471, -86, 456, 276, -333, -415, 177, 462, 21, -403, -165, 323, 281, -151, -285, 42, 265, 88, -150, -84, 84, 82, 11, -5, -1, -46, -40, 120, 132, -73, -215, 20, 277, 110, -281, -243, 213, 358, -73, -419, -103, 382, 253, -304, -399]
2424c99N21K91l82m24J88M84Mm44j54L09K65j80k68N0J90O1j25m0M3j3NR3J9j45
2448e1j16J62K26j16l28j0L81J66l49l23K40M57r0m85j28M59K92l28m15J43M50
2469B37L0l89j84K84K57j36k74L3K07M8j25p0M1J7LN5Qj12q8J46J96j14k79nL44
2494A30J53l28k99K26M33p1m63j15M13K97k89l99J10M35O0l74k00K41K96j19k58
2515a21l2K28Q2j24r7L6L2NL6Qr5p9J17J84q9k61j6K93J66k72l08J75L93j7m20
2540a76j56L60K94k28l87P0L98R1l52k01K25K73q2k72k3J97J05j26j01L9N9J7
2562B4j0K7p4n4O0J58l5k06n6K29J79k10k84J09L59L7l65j94K88L20j78l78J3
2585b41L78J24k97k50J98K87n8k73o7K01J24j14j33L5J07j1k0kk4k9L0J09j4j50
$$ y = [-399, 122, 413, 31, -393, -205, 279, 283, -161, -315, -6, 259, 79, -189, -139, 51, 112, -13, -53, -10, -23, -18, 75, 94, -51, -167, -5, 221, 105, -223, -233, 148, 314, -35, -358, -118, 339, 249, -236, -364, 95, 387, 59, -356, -213, 237, 267, -122, -306, -22, 235, 99, -175, -142, 65, 113, -12, -82, -41, -24, -21, 34, 42, -70, -158, -12, 184, 70, -209, -214, 130, 283, -45, -344, -118, 315, 244, -219, -334, 79, 376, 87, -312, -202, 233, 293, -81, -281, -40, 256, 137, -121, -153, 75, 157, 33, -64, -28, 4, 9, 45, 53, -42, -121, -4, 180, 91, -170, -186, 107, 273, 1, -307, -132, 261, 244, -176, -332, 28, 322, 94, -293, -223, 175, 266, -86, -287, -62, 211, 129, -143, -166, 31, 136, 10, -91, -52, 7, 24, 14, 41, -33, -87, -27, 131, 96, -110, -166, 63, 242, 32, -252, -143, 216, 253, -112, -306, -18, 302, 124, -254, -241, 137, 261, -36, -286, -88, 199, 141, -132, -199, 2, 126, 12, -121, -86, 21, 10, -10, -12, -36, -65, -35, 74, 60, -90]
2609i0o5J73J62j33k53O1K96P0k81k21K20L14r4l40o4L40J75k33k86J33K99Ok78
2632h9r7J94J49o7j73NJ18K8l0m5rjK2O1Qj23p9J33J53q9k30MK63J15k54k23J56
2659a00L21k8l35j23L09K15j93k88N2L16N3k31j41J33J77m8j47j4Q6O1m9k3j4
2682a1k4K8P5J0j16j04J28J70n2k56l6K64J58k18k61J26L01K3l12j57K50K43j27
2705A02k87J0K57J00k05j58J21J48k4j19j5L7K3KL9l5q8j5J52Q0j58j84J29K68
2729A80k3l07j06L00K30k11l25P2L81P5l48j84K37K69j14k98J4K52Q2j94j02Q7
2751c3J10l7o6L0J5n8KJ15J4j73q8J98J97j86k78P2L63N6l69k20L22L43j98m15
2775b84K6M29J36l80k42K61L08j22l25MK91P5k03j13J51Q6r6q0J14N1j47n8J71
$$ y = [-90, -155, 18, 180, 47, -206, -145, 151, 221, -60, -281, -61, 253, 159, -181, -245, 95, 270, 37, -249, -116, 183, 189, -89, -186, 8, 157, 90, -83, -78, 40, 68, 38, -7, -16, -17, 5, 66, 74, -49, -128, 5, 158, 69, -161, -157, 106, 221, -33, -256, -100, 221, 193, -142, -265, 44, 259, 66, -222, -170, 146, 199, -32, -173, -40, 137, 89, -58, -72, 14, 75, 26, 3, -11, -35, -7, 68, 78, -38, -142, -14, 156, 104, -152, -188, 76, 234, 16, -245, -119, 182, 205, -107, -264, -14, 229, 102, -185, -175, 82, 182, -23, -181, -60, 88, 64, -55, -70, -33, -10, -8, 31, -4, -92, -107, 45, 125, -33, -217, -88, 180, 157, -150, -256, 44, 274, 63, -262, -190, 191, 266, -82, -266, -29, 240, 126, -172, -158, 94, 176, -18, -120, -33, 77, 40, -26, 4, 19, -39, -37, 78, 92, -81, -169, 29, 226, 40, -238, -166, 197, 253, -116, -336, -14, 329, 131, -284, -258, 171, 307, -73, -315, -54, 254, 132, -193, -189, 102, 177, -26, -139, 12, 98, 2, -78, 36, 87, -60, -118, 53]
2798E3J45k04k17J93K98r9l91m4M33J98l94l54L03M51j42n00n5M82K26m14l51
2819c83K84M09j36m12rL61J19l08j56K24J67j71j78J64J68j42j99J42K50j45k92
2840b43O9L78J8m06j54M01L15l41m39K09N29l1n38j69N06L28l95m37K19N04m7
2861B76n00j06M36K22l36k77K19K95j21k70O1K42l9k46K7K57j2k69m0L20Q9l32
2883a04j99L01L42k51m39J10N26M7n26k56M88M05l39n12J59N55M2n16k18M24L19
2904C58k78l69J37L71l3k97m0K26O7j69p5J79L0j87l6K34O6k57j83L08K80k52
2926H0m09J23M88N4n16k46M70M20l18n71J35N74J17n43k97L96M00j98m47M8L84
2947A44P4k64j48J54J46j00o4P9rj23L1K03J7k98j13L24K89k92m47J71N49M9n81
$$ y = [53, 198, -6, -223, -30, 268, 169, -222, -266, 167, 365, -29, -383, -80, 371, 229, -271, -326, 156, 382, -32, -383, -99, 310, 174, -238, -247, 114, 233, -75, -231, -7, 160, -11, -189, -25, 143, 1, -198, -56, 194, 49, -243, -174, 204, 222, -184, -338, 63, 378, 37, -402, -193, 336, 305, -233, -402, 104, 432, 37, -400, -181, 323, 276, -224, -330, 106, 328, -8, -285, -66, 229, 108, -162, -101, 141, 102, -144, -117, 140, 128, -141, -181, 139, 228, -104, -303, -2, 340, 89, -350, -240, 286, 333, -193, -449, 39, 444, 105, -407, -248, 307, 349, -167, -385, 39, 358, 80, -289, -152, 219, 186, -111, -151, 75, 142, -27, -102, 77, 107, -80, -116, 118, 184, -73, -256, 52, 332, 80, -329, -206, 282, 336, -180, -426, 44, 464, 146, -425, -290, 284, 401, -142, -439, -43, 357, 159, -288, -240, 144, 218, -46, -194, -40, 106, 6, -58, 21, 12, -111, -80, 123, 140, -158, -271, 53, 342, 50, -397, -226, 323, 372, -209]
2970b09k66N01M76l16o04P8O18J78n35l65L53M60j41m54n1L70J45k27j82R2J34
2991E5k8l9M1n5j02N3K58l2l49j10L75L14l13m96J55N98R7o04l47M79N51k53o71
3014d23mO53K52m94m57L13N03o0m68j21L34K19j65k09M3J08L4j6L8q0j31O4K78
3037B11%l43j91L73L73k61n33O0O03J84n72m18L93O02j56o64j06N95L37m35m80
3058d28J91M97L4m27j61K75K27j27k02K7J18Qk0M2m5j34K7K28P9k86k28K68L77
3081C40j58m79l6N13K64m48m46K59N73m2n70j88M81L70l16m65J06M71O2l68j96
3102b73K41K29j15j83J2J24pl5L8Kj00n0J75J05j74k32J49L14l2l77j23L65K87
3125C40k89m05J34M68L8m53k12L74L57k50l83N8L91P9l24j60K24J90j02j90M4
$$ y = [-209, -475, 26, 502, 186, -418, -340, 278, 456, -79, -444, -91, 369, 228, -226, -277, 93, 238, 11, -171, -79, 55, 27, -12, 29, -26, -128, -75, 183, 151, -198, -308, 67, 381, 68, -428, -273, 325, 422, -182, -529, -50, 501, 248, -423, -427, 226, 478, -16, -473, -160, 343, 283, -185, -306, 28, 247, 82, -127, -84, 24, 58, 42, 80, 0, -131, -67, 211, 211, -132, -323, 50, 423, 162, -371, -311, 292, 476, -96, -514, -121, 481, 325, -339, -445, 150, 487, 52, -428, -237, 260, 294, -133, -294, -19, 208, 81, -121, -94, 24, 32, 12, 54, 9, -125, -98, 130, 209, -77, -305, -37, 340, 182, -297, -333, 180, 444, -4, -450, -191, 382, 340, -230, -418, 63, 433, 117, -348, -242, 229, 291, -77, -273, -32, 197, 82, -101, -89, 35, 28, -7, 31, 33, -67, -117, 58, 163, -11, -243, -94, 220, 188, -189, -312, 53, 340, 51, -354, -220, 248, 286, -167, -379, -5, 352, 102, -281, -223, 168, 247, -77, -237, -13, 177, 75, -115, -71]
3146g1J56k4q6RO8m1q4Q4J09p8j70L8K42J7k52j32K41K37j72l22P2L60M4l30j93
3171b78K63K96j73l35M2L30P9k84j78K20J93j03k23L8J94J5j48k4R2L4q4j0Q5
3194D1J5j13j8J30P2j54j24J41J97j18k37L2K71P3k60j69K06K41j13k84kL03R3
3217B23k57j72J60K41q9k38rK10N7j47j13R3J18n5q4K2P0l1o1O1M2o6p3O8J30
3242A00n6j59j0J94P1j75j48J36K07o6k45j8K33J19j87j93J11K28pk14p2J68J26
3265A43r6j46L4J29K9r5m0L3M0jrkk9j1M8M7n3j02J2J37M8j33j16R5J57k1j91
3292i3p9J87J25j16j77M6K02M1j80j00J01J53l7j44k6Q9Q2l5q2qO1L6%m3m8K1
3318b4O2K6n5p5L2J02L3j30o9P8J14mj42m3J10J00o4j47J8J45L6r8r6M0J14J0
$$ y = [-71, 85, 61, -25, -16, 52, 11, -73, 11, 120, 42, -128, -90, 152, 169, -83, -215, 26, 263, 91, -231, -159, 201, 245, -85, -278, -15, 281, 108, -227, -185, 145, 224, -60, -238, -18, 175, 72, -151, -113, 81, 96, -52, -76, 16, 50, -34, -44, 41, 56, -57, -75, 55, 127, -27, -151, -10, 187, 69, -168, -136, 135, 208, -52, -221, -15, 226, 113, -171, -173, 130, 223, -34, -206, -46, 195, 106, -132, -141, 69, 126, -21, -134, -41, 77, 22, -62, -40, 30, -1, -62, -1, 41, -25, -98, -30, 100, 44, -115, -125, 69, 140, -35, -183, -47, 160, 94, -151, -169, 64, 183, -4, -197, -86, 142, 135, -79, -151, 17, 143, 47, -99, -65, 64, 93, -2, -42, -9, 31, 30, 21, 19, -10, -21, 27, 74, 21, -81, -69, 68, 116, -17, -133, -38, 119, 98, -93, -172, 15, 140, 24, -153, -107, 95, 136, -44, -144, -43, 110, 73, -71, -97, -8, 74, 39, -43, -51, 10, 46, 46, 3, -45, -24, 38, 64, 9, -66, -34, 68, 101, -29, -98, -20, 94, 90, -52, -95, 15, 115, 51, -96, -78, 67, 103, 5, -91, -51, 63, 73]
3344G3p9o5L9N3J1m4m3lN6M8n5p6J9R0M4q6q6K8J25L1j19r4R8J30j6j59l5J30
3372A5R9q4j16J6J35K7j02o2N5O7ln6k6L0J5Nlml7JP7J3q7o2N9J30k7j68l8J69
3402C8J06j16j81O0J99L5k19r2J72J61q3k01KJ78O6j45j08Q8J27m7q6nO7Ql8J8
3428DK4m0m2N7Q6k9j39MJ54O3j66j44J52K27q5k59l0K60J37k09k36J16K83j2k75
3453i9j04K31J65j33k12M1K05Rj31p1Q5N7n8j3K1j2m1J4J21k4j46n0J74J38j74
3478gk12J04K88kk87j52K59K64j76l14K5L37J11k75k13J69K79n4k51n4J81J15
3500A35j03j19J8J04J9l2ml9m1N1J23l4j78m7J80J68j56k69N3L35P1k97k38K16
3524h4L52r7l70p2L33J99k10k94O2L19O9k36j76J31J81Nj36o7L8R5M8l6j01p8
$$ y = [73, -6, -71, -32, 21, 32, -12, -55, -58, -2, 46, -9, -85, -66, 24, 68, -18, -104, -76, 49, 80, -39, -133, -35, 95, 79, -80, -115, 15, 114, 30, -86, -70, 65, 92, -10, -72, -17, 50, 47, -9, -35, -5, 10, 15, 12, 8, -29, -28, 49, 62, -25, -87, -28, 102, 75, -93, -131, 38, 144, 28, -153, -93, 106, 141, -78, -170, 2, 163, 80, -121, -119, 59, 125, -20, -128, -40, 87, 40, -46, -51, 16, 24, -14, 4, 28, -12, -54, 3, 89, 60, -79, -75, 79, 142, -24, -168, -16, 211, 126, -133, -163, 97, 234, 25, -211, -95, 188, 176, -99, -203, 28, 193, 60, -152, -111, 94, 103, -28, -99, -14, 43, -15, -28, -7, -19, -60, -46, 75, 51, -95, -145, 29, 167, -7, -219, -115, 173, 171, -116, -268, -9, 255, 79, -235, -210, 127, 238, -37, -250, -81, 198, 144, -107, -161, 20, 135, 32, -87, -69, 35, 54, 22, 18, -21, -62, -11, 112, 78, -100, -147, 33, 201, 45, -224, -171, 164, 235, -62, -300, -84, 268, 171, -199, -271, 62, 261, 51, -243, -181, 138, 207, -29, -205, -74, 107, 112, -24, -91, -53, 42, 90, 54, -47, -125]
3548a25J09J64k1k48q1K47K11j72l19L2L65J33l18k81K00L77j8m05j32L01K73
3569B92j61l25QK72J35j83j84M6J60O9q9j23l1P8J27L3j73j37J18K25J8l10j55
3592b90K75L03j38m12l2M03K33l18l69J56M30N2m00j95K66L08j17l18m4K63J43
3613A99j45j61JJ21O7j7o3q5lJ51J03j37k08K1L11J07l12k59K09L97n8m46j47
3636c54M10L23k77m34O6M61J32l97k77K50L51p9l39o3K45J56j38j50K6J02L2j5
3658C1j3o9o0J03J63o5k41n8K93K06k41l44J15M36N7m30k51L59M06k08m71j7M81
3681A82J87l85l17J95M13n8l60q1K38J77j39j74L2J31Rn3J4j8o8K3J49J7j93j18
3705a97J99K42j45l57L2M06J30l80l04K92M18j23m77p1M56K36l35l72J89M08r
$$ y = [-125, -16, 148, 127, -121, -202, 45, 256, 84, -235, -203, 162, 295, -23, -304, -104, 273, 255, -150, -282, 19, 292, 131, -194, -186, 86, 221, 38, -146, -100, 60, 129, 40, -83, -114, -36, 91, 124, -49, -186, -68, 157, 175, -135, -290, -15, 288, 150, -262, -294, 109, 342, 24, -345, -189, 241, 293, -107, -302, -36, 272, 155, -163, -207, 56, 199, 54, -107, -106, 15, 82, 65, 2, -83, -86, 65, 168, 31, -177, -156, 155, 262, -50, -309, -100, 297, 239, -207, -354, 56, 379, 102, -332, -266, 195, 327, -70, -347, -97, 254, 175, -164, -227, 18, 174, 36, -114, -88, 14, 46, 31, 18, -51, -111, -8, 155, 90, -151, -209, 84, 290, 49, -295, -180, 256, 313, -117, -368, -9, 397, 189, -282, -299, 182, 369, -16, -333, -138, 275, 217, -143, -224, 14, 191, 52, -122, -90, 41, 50, -3, 11, -7, -75, -52, 97, 114, -79, -197, 2, 244, 99, -258, -226, 180, 310, -70, -374, -82, 336, 213, -264, -335, 121, 357, 22, -350, -161, 247, 238]
3726B38l73j16K77K03j66k12O7J58Nr3nM3l9l0J04M3j30j42J55K28j09l15j4L46
3750A23J74l34l13K14M26n5m62j29M30K72l18l79J61M08K6l74j60K74K37j56k45
3771a80M5K06K7j20m4N3J4l0N8L6r3j06J10J96n1k89m3L32J69k93l01K00M03l2
3795B67m64j27L90K98k80m00J23M19P3m01j91K72K71j27k88J7K11O3j33q3N8N0
3817A8j6J1J7n6r4Q9J63m8k44m3K85J76k62k94J65L84j8m05j57L65L14k43m11
3840c04Q0M24R4l46k37K47K92j04k92l1K32J01j42j04N1P6j6nJ2m2p4N2J66k9
3864A01k26n7K38J93k20k99J02L74M4l80k10L12L42j99l84QL99J28k89k64J91
3885i6K98n3k89m9K12J16j17j28N5O9Ol0J5j3n8K5J30J3j92p4J86K03j48k86L6
$$ y = [238, -135, -251, 26, 229, 63, -149, -82, 76, 81, -12, -17, 26, -13, -43, 61, 104, -26, -168, -13, 215, 106, -209, -223, 123, 297, -37, -350, -136, 290, 235, -227, -356, 74, 346, 28, -351, -190, 218, 244, -130, -290, -16, 221, 65, -180, -135, 71, 98, -22, -66, -13, 1, -29, 29, 65, -28, -134, -24, 172, 121, -168, -211, 121, 290, -3, -304, -104, 299, 267, -197, -324, 66, 364, 84, -316, -193, 226, 299, -102, -293, -21, 250, 123, -165, -148, 63, 126, -7, -90, -32, 18, 2, 13, 30, -26, -120, -31, 132, 84, -160, -203, 82, 258, -4, -298, -133, 251, 233, -172, -329, 36, 350, 107, -304, -224, 200, 294, -52, -289, -42, 250, 146, -146, -177, 55, 156, 14, -90, -39, 37, 21, 16, 28, -14, -88, -36, 130, 101, -125, -182, 56, 249, 29, -270, -168, 206, 250, -130, -340, -28, 314, 115, -269, -261, 138, 266, -23, -287, -96, 202, 149, -140, -189, 23, 139, 22, -106, -51, 18, 24, -6, 9, -4, -62, -37, 93, 106, -86, -160, 26, 229, 81, -205, -169]
3910a69L28R5l11k11K24L25j13l56m8L15J90k59k69J45K80j1k53r3J91J30r4j23
3932h7RR8J2l7Npm3J5Q5K7j29q5J19J66q2k26pK68J01k25j91J51K48m1k77q3K79
3959F3J57j76k20P8K22K6k01r2J26J33o3r9rQ4Rk7j2%k5%O8K8r2q1Q7J26n5j80
3987a25j1J96R9j80j60R6K28m0k19o3K05J33j41j81O9J73K7j63m8R4R5o5q9L3
4011c7O1Jl7ML0l4j3M7M5o1p1M9J11k7j37m1J52Q6j16j51P2J94rj83p6J49J29
4038A37r3j66L9J68J7j43o8R0R5m9r0OO9J3m1k3K6Qk5RL7j9n3OQ3po9m3Q5Q8o2
4069B5j19J8J41K9j24q3J04J09l6j50PJ35M7j10q2O1J06j8j04nO4L7m2m3L2K8
4095B7l0j1K9nj9j1L6Pm0m0L5N1rp7j5Q1M2n8r1N1Q6rp7l6P1N8m1q1K8N7K6m6
$$ y = [-169, 159, 254, -57, -268, -44, 281, 168, -188, -236, 79, 269, 10, -259, -114, 166, 155, -98, -191, 0, 130, 36, -87, -78, 20, 32, -5, 0, -7, -50, -35, 50, 77, -52, -137, -18, 148, 66, -160, -167, 101, 202, -23, -214, -63, 185, 144, -133, -216, 63, 220, 44, -176, -98, 124, 150, -51, -143, -17, 116, 53, -46, -55, 29, 38, 11, -1, -1, -26, -26, 42, 70, -22, -103, -16, 110, 55, -125, -136, 60, 159, -21, -181, -85, 143, 103, -116, -179, 26, 159, 18, -163, -94, 79, 106, -57, -105, -11, 84, 19, -70, -37, 24, 25, -12, -8, 22, -12, -25, 22, 67, 6, -65, -16, 95, 68, -69, -110, 42, 128, 12, -139, -67, 127, 118, -65, -141, 8, 137, 44, -122, -83, 85, 102, -41, -109, -19, 76, 27, -63, -57, 12, 25, -16, -39, -13, -5, -30, -21, 16, -3, -56, -50, 33, 26, -43, -86, -1, 87, 25, -94, -76, 65, 94, -30, -113, -9, 100, 64, -86, -79, 56, 103, -7, -89, -28, 78, 60, -44, -49, 15, 52, 10, -33, -1, 27, -3, -14, 15, 10, -9, -20, 16, 23, -17, -57, -22, 29, 20, -57, -72, 9, 51, -7, -98, -47, 39, 30, -47, -83, -12, 46, 5, -76, -48, 9, 35, -11]
4127a1m5M1N6j8l8j2L8Oj7MJkLLQj4j7J2K4Kk9j9J5L9k9l0LL8J7m0l7M1L8k3l4
4162b6rL8Mpj9j3L6Lj0j5mNROrpJ7LJ5m7JK3K0ol2J0J7J9j8j1J0J4kj4j5J9J9
4199B4j1j9QNOj0JlJ0j0PLj0jlOKl6RK4J3k8k3L9K1j9m4KM5j1j6k2L5K3j5m5O
4236c7N1Kk0l0K0K6ml2jL6Jj7nnK8j4JJOj2nK1Rj2k9K9J2pk9rL2M4m7m2K4O1j0
4273C7p8kN5J9l2n1J5O0kn6k0M2K8km1j5J9K1j2j8JJ6J6Rnk7qK3M2k1m5j7P0L3
4307E4m7n4K7O3K5r6l2N3P1j8r2%P1M3n5n4PO9J0m1l5J0L4K1m2k2RK5K8jo0rM5
4340GL8k3p0j2P0M6n1p9J3J09Qp1q4O2Q3Kr0l9O3Q2k4r0j2P0M9k7n4j6N9L5l7
4371A7m1k0N7M5k2n5m4N6O9k1r0j9P7P4o2r4PR7N0p0j04M3J02K1r5p2M0J05jq9
$$ y = [-11, -56, -15, 41, 23, -15, -27, 11, 17, 0, 4, 5, 3, 6, 9, 17, 3, -14, -2, 22, 24, -5, -24, -9, 30, 1, -29, -26, 12, 29, -11, -48, -7, 31, 8, -26, -35, 3, 7, 0, -19, -32, 4, 7, -3, -18, -22, -17, -8, -2, -11, -18, -1, 2, 17, -30, -29, -6, 14, 8, -24, -14, 3, 22, 4, -7, 3, 17, 15, 1, -14, 5, 24, 13, -6, 2, 7, 13, 3, 4, 1, 11, 1, 8, 11, 1, 0, -3, 3, 5, -31, -22, 2, 15, -13, -36, 3, 24, 5, -39, -37, 8, -3, -19, -41, -6, 17, 2, -43, -37, 14, 16, -4, -34, -14, 12, 8, -24, -25, 11, 12, -5, -10, -15, 13, -1, 0, 1, 7, -5, -10, 11, 20, 8, -21, 8, 20, 13, -16, -25, 7, 51, 4, -38, -14, 47, 37, -41, -43, 12, 31, -1, -52, -37, 23, 21, -35, -55, -13, 15, 13, -28, -43, -24, -3, -15, -33, -32, -16, 0, 9, 4, -23, -31, -8, 34, 13, -32, -49, 21, 54, 7, -47, -20, 43, 68, -28, -60, -7, 64, 46, -46, -46, 25, 68, 13, -41, -34, 35, 45, 4, -31, -21, 13, 34, -8, -30, -21, 4, 32, 31, -29, -38, 7, 45, 22, -48, -60, 10, 56, 5, -74, -61, 48, 56, -15, -99, -37, 46, 48, -42, -81, -18, 64, 40, -50, -62, 8, 57, 30, -24, -40, 19, 54, 17, -24, -44, 13, 58, 36, -19, -63, -7, 62, 41, -49, -68, 9, 83, 21, -73, -66, 31, 81, 11, -93, -50, 52, 73, -22, -94, -54, 51, 50, -39]
4401c9m4N3P1lp7l6N0O2qo5m1M5P7qp8m9N9R9j1r9m8Q6R7m3j16j3R2R5p6j13J3
4432f8J19M0q5q7L2J03K2p4n9N2N7J6o5o2K9P2K3n4p5J9P5N0q4q4L3J13J6j08
4460c4q6P9J29j8j32o9J24J11m7j45j4J32O3p7r7K0J10J7o5o9L6O7L1o8l6kN2
4487A2M5k1q1rO4P4m7j10MJ25N2r3j24M0J62L1j53r0J07J19l7j33l7J14P7p1j02
4514h2J2Q8M3o6p6M2N3K5n9l1ML9L5j4n0l6N3P1j3r0k4Q1P2n3r7pJ32O1j20r9
4544a06N1J43jj33o1J10R4m6j32J0J06N3q5o6K2P2J4m7m2J1M8Rj2l4k7L4N4op2
4573c9l7O7P2l4r6k4R9O5o8j05K3J20K1r9p1P5J00l3r1k6R1O6o5q0K0P7K4m7l7
4602c2J4L0L0k7l7pK5M8qn5k0N1N1l2q6j1P0P6p7o6KJ07J6q7p0O1Q0k0q7l0Q3
$$ y = [-39, -83, -30, 41, 38, -39, -75, -25, 37, 29, -36, -77, -32, 45, 37, -41, -90, -31, 68, 57, -42, -90, -4, 93, 50, -66, -79, 13, 108, 32, -81, -68, 51, 91, 6, -81, -49, 54, 76, 2, -57, -5, 52, 68, 3, -59, -30, 42, 65, 11, -64, -45, 30, 80, -4, -88, -55, 58, 74, -34, -120, -41, 88, 70, -62, -131, -7, 104, 57, -88, -102, 30, 93, 16, -81, -61, 49, 66, 1, -68, -32, 35, 66, -2, -38, -40, 12, 57, 36, -45, -54, 10, 84, 37, -73, -69, 56, 108, 15, -109, -69, 93, 124, -29, -119, -12, 107, 70, -63, -100, 14, 91, 20, -82, -70, 18, 61, -5, -81, -39, 14, 39, -20, -51, -47, -8, 27, 13, -37, -73, -20, 51, 38, -52, -76, 5, 77, 24, -73, -80, 52, 113, -7, -106, -55, 88, 87, -46, -107, 3, 97, 51, -81, -71, 35, 88, 3, -63, -41, 31, 45, -2, -44, -33, 15, 24, 12, -22, -49, -15, 39, 33, -39, -76, -9, 63, 29, -67, -91, 8, 73, 5, -100, -77, 43, 64, -35, -106, -31, 69, 36, -55, -81, 10, 76, 11, -69, -49, 28, 52, 5, -32, -18, 12, 42, 15, -22, -29, -4, 44, 36, -19, -39, 12, 63, 31, -55, -66, 4, 80, 3, -63, -61, 46, 62, -25, -95, -34, 46, 26, -61, -91, -8]
4633hN0l3o9MN4L3l2l7j4M6K0k1l0j4L3K9Ml8l3K7P5j5q3k6R1N1m5q5J6R4L7q5
4665do8O3Q3k5q6k1P5N6n9n6J4N6J4l3m3J5J3K3k8j1j2K1K4J6m4l8K2P0np2m3
4696h3P2Q3m9j00J0R2M1q2p3L6J02Jp6m3O5O7l8o7qQ3K0o0k4K2M8%m1NKLJ2Mj6
4729Hj7oN4J2n9m2M2O6j2q4k2O9N5n3q6K0R7J8j04m8P2O9k0r6MP0L2m8m2J1M0
4760@J0k1rj2K1J5Nj4k2J1L4J2m5k7M4N0j8p0k6P9M8n2p4J4P6K3p6l7M7N6lp4
4792c5j0O6K5l8m8K0M1ok3nj0J6J7nk2j7J5L0J7n6l5K7P4j3o8k4Q2L9m9o9K3Q2
4824D1J2p5m3O4P8l5r6J6N8M0n1l4K2K6Ok6rJ3%J3Kj5k5jL8K6m2n2L5N2Op4m2
4857g2P7N0m6q8K4Q7K8r2n7O6Q2k7r0pP9M0o7m3K0N2Lm8J2J9rmoJ0j8%K0K4k0
$$ y = [-8, 42, 9, -60, -56, -2, 31, -1, -38, -52, -6, 14, -7, -37, -51, -18, 11, 15, -23, -56, -29, 46, 31, -52, -78, 13, 64, 19, -66, -50, 44, 81, -4, -72, -9, 74, 49, -37, -58, 17, 73, 14, -42, -28, 28, 42, 9, -34, -19, -6, 17, -11, -22, -34, -13, 11, 27, -17, -55, -33, 37, 32, -40, -83, -11, 72, 23, -77, -67, 25, 66, -16, -89, -53, 49, 50, -26, -69, -4, 63, 25, -42, -50, 33, 53, -7, -31, -9, 39, 39, -2, 3, 5, 8, 20, 24, 8, -9, -15, 39, 51, -8, -50, -8, 58, 46, -38, -60, 9, 64, 11, -75, -55, 42, 60, -44, -92, -20, 49, 29, -67, -63, 7, 39, -9, -51, -40, 0, 10, -11, -20, -32, -11, 4, 9, -5, -27, -16, 18, 30, -15, -42, 2, 52, 34, -36, -62, 17, 65, 13, -61, -47, 29, 52, -24, -61, -14, 42, 39, -35, -45, 21, 46, 8, -40, -20, 21, 15, -8, -13, -23, -7, 10, 5, -17, -34, -19, 11, 28, -28, -63, -36, 38, 25, -43, -67, 15, 54, 5, -64, -41, 41, 53, -22, -65, -1, 77, 42, -54, -38, 20, 60, 9, -25, -3, 23, 29, 3, -6, 7, 7, 20, 22, 7, -18, -19, 19, 45, 3, -49, -14, 38, 44, -30, -72, 5, 55, 9, -79, -55, 32, 60, -32, -89, -23, 59, 32, -58, -65, 14, 54, -13, -56, -36, 16, 19, -29, -17, 2, -7, -11, -17, -7, -25, -25, -5, 19, -1]
4890am0J3P5Mp6k7L2Q9l9p3j7Q7M7o7p7N7Q4k5q8j8P4M7n8n6K3M2Rm6nOK3KrJ
4924gk0j0J8K1Nm2j1O4J2m8m4M0P2j3q5k0R2L2n0o7J8Q3Mo9k3M1N9l5m2ML3K6
4956C8k8k0KK2LnmNj6J1K5k1l7kM6K2m6l8K8N4ko9k4L9N8l9q9M1O6J5n5l2L6K9
4990A3km7LL1J7k5j4J0J1Oj%j1MJ0K1jl4j9N1J6l6l2J4P0j4n7k5N0L4j8o8QN5
5024B0J4l6l5L2L0j4k9LJ7J0j1qj4KJQRj2k4J2K3Nl1j4L8L2m3m4K0O4%n4j3L7
5058eL3qn2J0L2J9l1j3J8K4rk4LJ8%jKLj6LJJ2mm4K7L6j1m4oK4L8k9l9OO4j4m5
5095b2j3L9K8k9l4rN5Mm4j2K6K5j1k8J9NMl1J9J3j7nkK8Ll1QJ8K9m4k4L1M9j9
5129B8n9J6M2J6n4nJ8N0k8m4j0M6K0m2k5K5L4k7k8NL6j7k9PJ9J1k7nJ9K1l6j8
$$ y = [-1, -41, -28, 47, 51, -25, -52, -20, 69, 30, -43, -60, 27, 74, 7, -70, -13, 71, 46, -42, -60, 14, 61, 3, -53, -30, 12, 21, -25, -30, -24, -1, 1, -8, -7, -27, -37, -19, 2, 7, -35, -46, 18, 30, -18, -62, -22, 50, 37, -48, -68, 24, 56, 6, -61, -43, 40, 44, -25, -48, -7, 52, 17, -25, -21, 12, 38, 10, -10, -8, 14, 17, 12, 8, 13, -3, 8, 33, 12, -25, -27, 19, 41, -5, -43, -15, 39, 37, -32, -56, -17, 41, 2, -87, -46, 20, 35, -20, -52, -16, 13, 11, -36, -33, -2, 15, -10, -24, -14, -3, 3, 2, 2, -9, -5, 5, 26, 25, -9, -28, 23, 39, 3, -29, -15, 55, 41, -16, -41, 9, 43, 25, -43, -35, 20, 34, -2, -37, -5, 25, 11, -18, -15, 2, 12, 1, -7, -21, -19, -18, -10, -1, -13, -37, -25, -2, 3, -28, -42, -4, 28, -15, -59, -39, 25, 25, -29, -42, -5, 28, 20, -32, -22, 10, 29, -2, -15, 3, 27, 18, -6, -3, 15, 15, 14, 16, 19, 3, 6, 7, 19, 15, -29, -2, 34, 23, -21, -27, -3, 35, 6, -33, -27, 37, 23, -22, -35, 4, 32, 3, -31, -40, 15, 19, -25, -37, -11, 14, 3, -25, -6, -1, 3, -28, -9, 4, -13, -18, -20, 8, 11, -20, -12, 6, 35, -9, -33, -2, 47, 28, -31, -15, 27, 43, -11, -16, 2, 52, 24, -20, -30, 16, 36, -6, -31, -6, 28, 1, -27, -22, 14, -3, -32, -25, -6, 5, -22, -27, -8, 13, -23, -41]
5161d1L7K1k4l9K0M1Jo3MM7M1n3m9M8N2j4o4jO5J2n1k4K8N1k0m5J4K5Qk5k4L4
5193A2J6k2k6K7J5j0l1J7K5j4l6K0K3Rm8rL0K6l3k8J1N3j9n3JN3J2m0l8K5N2j1
5225Il4qK9J7k6j9L2N%j3J8J1j6rJ5Rj9k7K6L2j2m4lN1J8l0m9L9K6pn2LM2K3m2
5260ek4J4M3jn2lK8Qnl4K7K2k7k5K0J7j2j0PJ9k2k9K3L2jn3JN0K6n1l4L7N3nn5
5295b1k4P5K3n4n5N7N2k4m6qN0J2k4k6K6J1Jl4KK6rk6JK9om5K1L5nl6k0L5L7l0
5329@n6K2P4j5n4j7M5M8m1o2J7N7J6o1k0M2L9m5l0K2M5rm2J2K1Mj9LJ5Nl0NK5
5362A6L0n0l0N4K5k5n6K7M2J5n6k2M2L7l5n0kO0J3m2m8M1L9l0l7J6L3Rl1j4J4
5393a5J8j4%J0lpKOJ9k8j6K7L0k6l6NN6mm1k3L2N7l1n0J1M9J2m5k9K9K3mj9j4
$$ y = [-41, -4, 17, -7, -46, -26, 15, 16, -47, -43, 4, 45, -8, -57, -9, 43, 29, -35, -36, 29, 41, -10, -34, -6, 45, 25, -20, -6, 19, 27, 2, -22, 12, 28, 6, -20, 7, 22, 12, -19, -2, 23, 9, -27, -7, 16, 25, -23, -32, -2, 24, -9, -37, -26, 27, 8, -45, -44, 9, 21, -19, -57, -32, 20, 9, -25, -33, -4, 13, -13, -32, 0, 5, 5, -8, 10, 21, 5, -4, 11, 20, 1, -26, 0, 32, 20, -24, -27, 24, 42, 12, -37, 2, 28, 21, -31, -28, 14, 37, -5, -29, -15, 28, 27, -25, -28, 0, 8, 3, -31, -4, 18, -9, -34, -14, 3, -9, -19, -12, 7, -15, -44, -21, 11, 10, -43, -42, 8, 34, -17, -51, -14, 39, 34, -21, -45, 30, 53, -1, -56, 1, 53, 29, -17, -25, 25, 37, 13, -13, 13, 24, 25, -9, -7, 19, 10, -16, -15, 14, 8, -37, -16, 19, 14, -22, -42, -7, 30, 0, -56, -34, 40, 25, -29, -46, -1, 47, 6, -56, -39, 18, 34, -27, -47, -5, 34, -11, -41, -19, 26, 17, -25, -13, 8, 12, -7, -4, 11, 16, -14, -9, 16, 46, -4, -34, 20, 45, 20, -36, -9, 33, 48, -8, -30, 12, 49, 14, -36, -38, 22, 35, -7, -55, -14, 25, -5, -42, -26, 7, 16, -15, -29, -15, 3, -11, -11, -1, -4, -11, -9, -3, 16, -12, -28, -1, 29, 3, -33, -28, 28, 24, -17, -40, -8, 49, 18, -32, -21, 28, 40, -5, -34, -5, 18, 14, -5, -19]
5427a9K4K0k1pJPj5KJ1Mj3lK1Lk8j6L4K0k7l7lN0J2l9l0K6M5nn3nN5Rm2j4J2K8
5463GPl3nK7J5pk3J4J8j2lKJ0j3KRJ7k2l1L0K4j2l6qL3L3l4m1L1L9j0n0j5L9L3
5498C5l0l6J3M1oj9k1K5PprmnLnQMj5QJ7Kk0j4RK8Ll6pK7M6l1m0K6M6j6k2l9M6
5536A2K6k0m0KM2Jj8l1L3J3jk5kJ6j7JQjqpK2J7l2l4L4K0Lm1qK9L7l4k6j7N2J2
5572A8k0k8K0L9j7k7j6L3J1j9j8K4K%okjKJ1J1lj0j3J8J3j3j4j2L8Qk3k3J6M1
5606D0j5l8pL5J6k4m1J8L2jl1j7K4Olj0j4L1j4Pj3QpQOlj2LNL3k0k2OL5Nk8l2
5643c4K2K2Rm0NK5L5k2m2LL2J1l1k1K1J4Oj6jJ9j0LNok5J9Rll2MJ7J8rl2k0M9
5679DJ4l7k6QM2J3n1k5M1K8j8l3J0M3oj8j4KL0loJ4qj0J2Roj9MK3Mk2k5J9M0j1
$$ y = [-19, 5, 25, 4, -3, -2, 5, -10, -8, 3, 7, -6, -9, 12, 15, -13, -29, 5, 25, -2, -39, -42, 8, 20, -19, -49, -23, 22, 17, -36, -41, 14, 23, -19, -33, -21, 7, 14, -19, -24, 3, 18, 11, -12, 2, 20, 8, 5, 7, 17, 4, 6, 15, 32, 10, -21, 9, 33, 21, -15, -23, 10, 43, 9, -32, -1, 38, 28, -22, -37, 2, 35, 5, -31, -18, 23, 17, -2, -23, 2, 9, 2, -7, -11, -16, -13, -18, -10, -6, -21, -13, 4, 6, -14, -28, -19, 9, 12, -24, -31, -4, 42, 11, -29, -3, 43, 27, 5, -34, 12, 38, 18, -22, -20, 22, 23, 5, -26, 7, 20, 19, -6, -8, 8, -9, -8, 0, -1, -9, -16, 6, 23, -9, -43, -9, 11, 14, -27, -35, -6, 31, -3, -29, -46, 6, 18, -2, -30, -10, 29, 12, -15, -31, 2, 13, -6, -24, 0, 2, 2, -4, -6, -7, -5, 6, 17, 14, 4, -9, 9, 22, 9, -5, -17, 21, 29, 6, -17, -1, 40, 25, -13, -20, 15, 31, 7, -34, -16, 16, 15, -16, -33, -9, -3, -6, -16, -30, 1, -13, -6, -19, -11, -18, -10, -4, -7, -19, -16, -11, 22, 2, -20, -14, 21, 26, -2, -34, -12, 10, 19, -21, -16, 9, 44, 22, -20, -17, 15, 26, -5, -26, -5, 9, 15, -1, -2, 17, 7, 10, 15, 9, -16, 3, 12, 9, -23, -19, -2, 16, 7, -25, -45, 4, 18, -19, -45, -37, 5, 18, -33, -58, -17, 11, -7, -40, -30, 13, 7, -11, -25, -23, 7, 4, -2, 12, 4, -6, 6, 15, 9, -10, -6, 17, 21, -1, -26, -7, 33, 22]
5715B2m8KM3K8l3n5J6N6On2k5L8M1k0l7j1M8J4l3k7K8Qj2j5PJ5j6j0J2jmj3J7
5748a1J6j7k3kN5J1m8l1M5M2j3p0J9N1L3n7l3L0M8rn6jM2K7l9j4kL8j0k8kJ2K0
5781B3k3Jjj1j4J8K7rl3MK3K8k8o0L8M0ko3nL5M0k3n5K2N4%n2j8L7L3k0m1OK6
5815cJ9j9j8J2J8Ll2K3OnrK0j2qj4K6J6rl7J7L1Rl1m1M9K9k3m8lN6J1m3k8K5L8
5850B5k5l3J5K0K1l0k0PJ3Rj9lPPmJ5Lk1J3JJ7j4j9pL9%l0j1L2J7j7l2mM9K0n4
5886a3k0M6Onk5%K0J5j4j7KK3j1j1Qj2JQJ3mk0j0K6J1k9k6J8K0J2l5k2M2K3k3
5920cl9KN0J1k3l7K4K8%l9LM1mk2j3J6J4Oj8mJ3oJ1kMlj9%L3j1l9J4L7J4m0k6
5956b7J3L9km7qM5K0k7l8J4M7j3m0rL1J9rl5lM0j3j2PpPoj1J9Pj9J1J3j1j5J0
$$ y = [22, -26, -24, 19, 47, 14, -41, -25, 31, 37, -15, -40, -2, 39, 19, -18, -29, 19, 33, 0, -27, 1, 9, -3, -18, -11, 4, -12, -22, -10, -11, -15, -28, -11, 5, -12, -35, -37, 18, 29, -19, -50, -5, 37, 24, -46, -27, 24, 57, 0, -33, -3, 45, 36, -20, -21, 21, 48, 9, -5, -7, 31, 21, -7, -9, 3, 23, 0, 1, 0, -11, -25, -7, 20, 11, -22, -18, 5, 33, 5, -55, -17, 23, 21, -42, -47, -12, 28, 5, -50, -28, 26, 26, -26, -44, -7, 26, 6, -35, -29, -3, 16, -3, -21, -9, 9, 12, -20, 3, 9, 4, -5, 15, 3, -5, -19, 7, 23, 14, -23, -6, 25, 34, 3, -38, 11, 40, 17, -31, -34, 22, 33, -10, -38, -13, 25, 0, -33, -18, 2, 23, -7, -27, -20, -7, 2, -17, -20, -13, -6, -10, 5, 8, -13, 0, 1, 18, 4, -15, -22, 17, 17, -13, -24, 8, 25, 8, -24, -28, 21, 41, -13, -33, 13, 19, 14, -11, -11, 9, 24, 10, -7, -5, 18, 7, -4, 4, -8, -7, 1, 14, 10, -10, -20, 6, 17, -12, -38, -20, 0, 12, -23, -45, -3, 20, -3, -42, -40, 10, 21, -2, -39, -15, 13, 13, -26, -23, 18, 14, -8, -21, -5, 9, 15, -3, -7, 6, 0, 11, 9, 13, 10, -9, -9, 24, 13, -26, -12, 25, 39, -1, -27, -14, 25, 23, -24, -32, 13, 33, 6, -32, -18, 29, 16, -24, -33, -2, 17, 8, -27, -30, 10, -3, -15, -8, -15, -8, -14, -25, -6, 1, -18, -7, 6, -5, -20, -10]
5991a0J4K9l4k7K9K2Ml3rK2M0k4m7K0L2Ol5k4L8K9j4m7J7J9Rk8j8J3J1Ok0j0J1
6024ikLJ2pmj6K0ooj7K0K0Jk6k6L6K3j9l2NL2Qj5j7J1K7kk6%QK0j1j7KL1jj5J
6062FmK5qrNj6MJ4j1kj7QK4rk3JnL5j4l7J4J9J6k4k7J3J6Mj6j6K3J8%l0jJ6J3
6099EooqMK0Jrj0J0NMoqJ0J0Mk9NMJ8jk4rL5kj5noL0Jj6j7J2J9j8nmJ9lj1qlJ2
6142aJj5j5QPPJ4l0j1J3K0kk0j2K0K2Jm2J0J5L5k9k6J0L2Qk0j9J1L1rmj9K0J7
6177B8rk9J2j2K9rj5j0J8K1pk4PJ0J2kk0pJ2J0lk3nJ3J5jl8LL5J3k1k2MPJ3k1
6213a6j5J7J5kk1kQJ2jj%lJ7Kj7QJ3j0OnmQJ1Qj7k0J6J6Kl1oK6J4k4k4RJ6J8k7
6252dj4J2K1j2j8JJ7j2lPj2KkJ9rkj3K3Mj4j2JK3j3j2mK2Rj4pJK1Lj1j7J1J2M
$$ y = [-10, 4, 33, -1, -28, 1, 23, 27, -6, -15, 7, 47, 23, -24, -4, 28, 34, -1, -25, 13, 42, 28, -19, -2, 17, 26, -2, -20, -7, 4, 10, -10, -20, -9, -11, -8, 4, -3, -7, -23, -3, -9, -15, -32, -12, 8, 9, -17, -43, -7, 16, -3, -35, -30, 2, 10, -5, -22, -11, 16, 14, -12, -12, -4, 16, 5, -12, -10, 21, 20, 5, 6, 2, 27, 19, 10, 15, -1, 3, 17, 6, 4, -13, -5, 19, 10, -13, -12, -17, 18, 4, -33, -19, 0, 16, -8, -35, -22, -6, -2, -18, -34, -11, 7, 7, -23, -24, -8, 5, -1, -7, -15, -11, 9, 10, 1, -9, 1, 6, 10, 4, -4, 6, 16, 20, -9, -4, 0, 18, 17, -7, -16, 19, 17, 2, -3, -9, 21, 22, 6, -11, 1, 20, 2, -3, -7, 12, 9, -2, -10, -13, -1, 0, -15, -30, -22, -15, -8, 6, -24, -35, -22, -2, -4, -24, -36, -16, 6, 7, -35, -25, -10, 25, -4, -30, -20, 12, 20, 0, -19, -8, 23, 14, 10, -9, 11, 28, 19, -10, 2, -10, 19, 10, -5, -15, 3, 24, 17, -7, 0, 10, 22, 20, 0, -7, 5, 15, 12, -11, -16, -3, 12, 11, -27, -24, 11, 24, 3, -19, -15, -8, 5, -16, -31, -14, 1, -1, -22, -24, -16, -4, -5, -6, -6, -9, 8, 10, -7, 1, 14, 4, 10, 5, 1, 9, 20, 28, 11, -9, 7, 23, 25, -6, -12, 14, 28, 4, -20, -11, 5, 23, -4, -18, -6, 15, 3, -15, -14, 3, -9, -12, -5, -17, -15, -17, 2, -7, -9, -22, 1, 5, -9, -21, -20, 3, -10, -22, -26, -4, 5, -9, -16, -15, 6, 9, -2, -19, -8, 4, 8]
6290HpmJ5KmkKnJ5%j4%kQjkrljQj4nMONnrORqqj5J7J4j3qKJ5jj7KK3j0Oo%JMm
6339ekMkPjPj8kJ0K1oj7J0kJ3j1rOK2lk8oL1pj9rJ8J1%k4oJ7korjOK%KmqnK0p
6384a2nrJ4J3ok1JK2J4l1j0K4K7j2j6mK5J2k0j3J7J2rj9nJ7Pj0lJ1J6k5j3ORo
6420bLoPj4oK0JJk3LJ6Oj9j6J6J2ml8J1K6J9k5l0K2J8%l0J1J2Mj6Pj7K0J4nj0
6457a2NPj6J1JljJ6J9qk8kK3Oj6qJ1%J3k6oK8Rk3j2QOkk4j2K8J7j3j7%J9Pj1J
6496eqrK2j7Kjj2J3J6Mm0K2J3Jj0k8J6M1Jl9NK5J5j8l6J8L3Rk6k0J8POk2Q%jQ
6534A1MLj6j0KK1j6k1RL6j7k2k6M0J5k3k4QM2j2rk5K1K2k8j7J4K4J3l0j3K1J9
6567A6j3j7J0J4%k4J1J1olkP%l1K6K0rqj4J7L2k0l3NM1ll5j3J2M6pl5j0K6%j6
$$ y = [8, 1, -3, 12, 14, 10, 8, 10, 5, 20, 20, 6, 6, 4, 12, 11, 9, 0, -3, -4, 4, -10, -15, -11, -5, 0, -5, -14, -8, 1, -7, -15, -30, -13, 1, -12, -20, -18, -3, -4, -21, -19, 4, -6, 0, -6, -6, -5, -1, -5, -7, -3, -5, 2, 1, 8, -10, -12, -2, 19, 13, -4, 6, 4, 17, 6, -3, 3, 25, 22, -6, -12, 19, 12, -7, -16, 2, 13, 13, -11, -17, 0, -2, -8, -17, -18, -12, -10, -10, -8, -12, -20, -25, -5, -12, -17, -26, -12, 1, -5, -26, -25, -3, 11, -20, -30, -6, 21, 9, -7, -11, 14, 26, 6, -7, 10, 22, 13, -6, -11, 6, 13, 3, 0, 11, 27, 2, -11, -5, 4, -2, 1, -5, 2, -12, -18, 2, 3, 4, -19, -16, 0, 6, -13, -29, -13, -1, -5, -43, -32, -6, 13, -12, -42, -20, -2, -2, -32, -21, -9, -5, -21, -14, -31, -11, 3, -2, -12, -7, 0, -16, -5, -4, -7, -8, 8, 27, 19, -9, -11, 12, 18, 2, -6, 5, 5, 18, -8, -14, 14, 23, 0, -12, -4, 2, 0, -24, -36, -8, 9, -4, -21, -21, -2, 5, -6, -5, -13, -22, 0, -17, -15, -16, -28, -15, 1, 5, -35, -13, 0, 1, -9, -37, -21, 20, 21, -18, -13, 12, 27, 9, -27, -9, 24, 33, 7, -13, 5, 12, 18, -4, 4, 4, 3, 11, 15, 18, 2, -8, -6, 15, -1, -22, -13, 23, 6, -16, -42, -2, 13, -10, -34, -26, 16, 4, -5, -30, -9, 13, -15, -32, -18, 6, 19, -11, -24, -3, 16, 3, -14, -4, 10, 10, -14, -3, 8, 2, -1, -3, 4, 4, -27, -1, 19, 10, 2, -12, 5, 37, 17, -16, -11, 30, 27, -8, -21, -9, 37, 30, -5, -15, 11, 11, -5]
6603eqRPNk9kK6j2ljJ3jj4LJ2nj0j3J4L2l4j6K8K6j2j7j5K9J6k8k2K2L4qk7rK5
6640A0Onk7J1K0nj1jnK1j2NqOj4KJ6kj4j0K9Mj6k0PK1pj3j5K8J8k9k3J2L8k1k4
6677b8%K0J0lk6QJ3J5j7kmJ1Pj4PJ0j1NK3k2%oJ9J9l1j4J3J5kj5j6L3J5k8k8R
6713a5L9Jl5j0J3J7pk4oL2%k3nJ6Oj1OpJnJ7Kqj1LJ0Kj7loL4Lj8j3K2K6k3k0Q
6752iL0Ll3j9M0K0j4j9MMJ1nj4LJ0Jj3LKljNnrj8L1Jlk3OJ7Lk5j8K9K3k9k2NL4
6792CJ2l5qK2K8j0l6mK3J6j8j4K2Kkj2MMNJoMQj4J4mJk3LL1Mk0j9K8J0Pn0K2J4
6831A3Rj6l3K0J4pk7LK1J1j1k7J8Rjj4j2NJ2Qj2nKmMMJnORJ0qj5jL2Jk6LK1Jj8
6872ePkJ2Mj1j2J1K3k1j8JJ4K2k2k7K4J3j4J3j4l%NlqLK%LqKrROk5J6LJ8k6oM
$$ y = [-5, -13, -4, 3, 8, -21, -23, 3, -9, -12, -13, 0, -1, -15, -12, 0, -5, -15, -28, -14, 18, -16, -32, -4, 22, 10, -7, -22, 7, 23, -5, -27, -5, 29, 21, -6, -15, 10, 16, 11, -16, -5, 15, 10, -1, -2, -7, 14, 2, 7, -1, 5, -9, -7, 9, 7, -7, -17, 12, 16, 0, -20, -13, 8, 1, -12, -27, 1, 19, -10, -33, -21, 17, -4, -28, -28, -8, 2, -1, -27, -19, -6, 9, -8, -10, -14, -3, 4, -10, -3, 7, -4, 1, 24, 2, 2, -4, 15, 34, 3, -11, 2, 17, 15, 0, -16, 17, 32, 4, -24, -15, 24, 25, -10, -20, -7, 10, 3, -21, -27, 5, 5, -18, -23, -7, -1, -12, -6, -13, -12, -17, 0, 2, -6, -17, -14, -4, -2, -19, -22, -28, 6, 9, -9, -22, 0, 26, 3, -17, -9, 21, 24, -9, -28, 12, 32, 18, -1, 3, 7, 18, 13, -1, 2, 12, 13, 0, 3, 5, 2, 1, 6, 1, -8, -26, 5, 6, 3, -20, -14, 3, 6, -19, -37, -8, 15, -14, -36, -31, 3, 15, -20, -28, -6, 22, 12, -24, -28, -5, 11, -7, -21, 1, 3, 1, -11, -7, -3, 2, 3, -3, 1, 9, -5, 9, 5, 6, -17, -14, 17, 21, 1, -18, 10, 20, 27, -23, -1, 13, 22, 6, -27, -7, 7, 0, -27, -24, -3, 8, -3, -30, -12, -3, -4, -18, -30, -25, -13, -5, -17, -22, -20, -24, -20, -16, -15, -20, -14, -5, 5, -3, -18, -19, 13, 14, -12, -9, 12, 13, -5, 2, 0, 12, 16, 5, -7, 4, 27, 6, -12, -11, 3, 25, 3, -24, 0, 13, -1, 12, -2, -5, -5, 0, -3, -11, -8, -6, -6, -3, -11, -9, -18, -9, -3, -28, -12, -9, 9, -17, -23, -19]
6913a9QK1k9nJ1K3j6j7nL5J0j1j6kRJ9j8ooK1J3j1oLpJ6nj6LLK7k0k2%J9J8j5
6950Gm1PL0Kj5j2lK3Kk1PlJ4oj6oK5Qoj4KJ8J0k1j0PMMoj0pPJ8Kj9J4PK0j0j9
6990gJJ6Rlk9pM0qLk6K0Mnlrj0K0Ok9PmJ9qj2krK5Jk0qJ2J0J2k2j7K2J2kk4%J4
7031a1J8j6opL9jj7j3mQK5k7PqK0pj1%MRJ4j8J6j9J0Oj6njK8lk0ojK7Jk8JJ3K1
7071B2k5j3j0J8J3k4j3ML0ol0JJ5J1lOk2PJ0J1k1M%QK0j0j7mJ9J1lj0LJ3Kj7j3
7108a3J2J3Jj4JJ0Prk6MK4pnqJ0jK3k8j6K3Oj5LrmlROj7PRlj1nMNQJk2NK1Pj2
7151ij0OJqPjK0QOj3j4J7qMjJ2pJ6kj6%NoQj4j0OJ1Jj4qJ0J4j8lpK1nj3rJ4Rq
7194hj9J2OJqMk0L0mrNnKjJ0rKLJRkrMPmkJ%QQj5MJ4Kk1j1J5J6j1Kj4J5pjMkq
$$ y = [-19, -11, 10, -19, -24, -13, 10, -6, -23, -28, 7, 17, 6, -10, -12, -3, 16, -2, -8, -14, 7, 20, 9, 3, 6, -1, 15, 10, -6, -3, 0, 27, 7, -15, -15, 4, 22, 7, -34, -27, 3, 5, -10, -22, -25, -2, 0, -21, -14, -17, -3, -9, -25, -31, -6, 2, -4, -18, -16, 2, 12, -9, -19, -12, -8, -4, -10, -20, -27, -20, -2, 0, -19, -5, 2, 22, 12, -7, -6, 10, 19, 16, -13, -20, 20, 12, 15, -11, 9, 13, 8, 5, -4, -14, 6, 12, -17, -10, -14, 5, -3, -15, -17, -26, -1, 0, -20, -28, -16, -6, 6, -16, -33, -11, 1, -1, -25, -25, -11, 7, -9, -15, -22, 17, 16, -1, -14, -18, -10, 15, -12, -5, -13, 7, 0, -11, -11, -7, 2, 16, -2, 14, -5, 5, 11, -5, -10, -11, 17, 14, -6, -12, -13, 14, 15, -13, -12, 1, 22, -3, -16, -26, -8, 5, -19, -32, -28, 2, -4, -34, -33, -18, -7, -10, -4, -26, -19, -9, 2, -19, -15, -15, -7, 13, 3, -14, -18, 1, 12, 9, -1, 2, 15, 17, 0, -13, -1, 12, 13, -1, 0, 10, 17, 8, -18, -14, 10, 3, -2, -10, 0, -1, 22, -6, -22, 1, 7, -8, -5, -14, -18, -21, -12, -6, -23, -16, -7, -10, -21, -26, -22, -17, -9, -8, -30, -25, -4, 3, -9, -19, -13, -12, -20, -13, -14, 6, 14, 20, 7, -7, 10, 2, 6, 5, 17, 10, 26, 24, 8, 8, 13, 7, 15, 1, -9, -3, 8, 9, -5, -13, -3, 11, -7, -10, -17, 4, -1, -14, -23, -9, 0, -8, -27, -15, -9, -8, -16, -12, -32, -2, -6, -15, -10, -15, -13, -14, -4, -13, -11, -8, -7, 2, 0, -9, -5, 2, -2, -4, -3, -3, 5, 13, -2, 2, 16, 18, -3, -14, 1, 17, 6, 8, -6, 9, 2, 1, 5, 3, -5]
7241eJ1j4pPj8J4OnloLMjj4J3J3lj3oJ1MNrj6L1Ok0j0RJ6lj0j2J6J6mj5QJ2j3
7281bOj0mJ6j3J6kPj0j0K3oj0j8K6lrj0JJ3Nk1nK1lkk3lK0Oj7qJ4PqLj2JJJ2j4
7322b5J3OqlJ2JKL%Kj5J7qJ5j2jkKJ0lj7J9J1k0oJ1J4mj9oJ4Nrj2K1rnLLJj5k
7364a6JPJj3OQjonLLNk9J9J2j2mqK6qmKMJ2Jj0j9L9ooj2JK6jj0lORj3LnnPJrQ
7410Enj8J3J3oj5jJ7jj3jO%Kj3lK3nk4QNkJ3j2Mkkj4J6nmK5j9mJ3moMJ1nJJ1L
7453Ijj4kJ5Nj7%J8J4j9oLK1j1k2mJ8Qk0ljNJ5k0rjMOj1J5%j0kK1l2J5rJJ8j3
7493a6j1J0J5Qj8q%J9Qj7NROk1j1J6J1%moJ3Knj0QkJ7j0mJnlJ8j0koJRnjmKRj2
7537dj7NJ6j2j6JJ1J2oj6mK3j0Mj7J2jJ6j4OLLnQkj1LJ8pLqJ0J1k1RpJ9Kj6j7
$$ y = [-5, 6, -8, -15, -8, -26, -12, -6, -11, -14, -20, -17, -13, -14, -28, -15, -2, -5, -18, -24, -13, -9, -4, -13, -29, 2, 8, -12, -22, -13, 3, 0, -10, -22, -6, 10, 6, -9, -1, 11, -2, 4, -6, -10, 6, -7, 9, 7, 14, 4, -6, 17, 11, 1, -17, 9, 6, -3, -13, -12, 1, 6, -15, -20, 1, -2, -4, -27, -30, -10, -4, -21, -29, -15, -8, -16, -13, -25, -24, -23, -11, -25, -12, -6, -14, -17, -5, -4, -2, 1, 1, 3, -12, 5, -3, 12, 0, -1, -3, -1, 9, 6, -11, 8, 19, -1, -7, 4, 18, 14, -5, -11, 3, 8, -1, -13, 8, -1, -6, -3, 0, 1, -14, -16, -15, -8, -7, -20, -14, -6, -7, -13, -18, -15, -12, -7, -36, -17, -5, -17, -21, -29, -3, -11, -15, -13, -9, 3, 4, -6, -25, 14, 8, 2, -10, -9, 17, 16, 6, 3, 9, 18, 5, 8, 3, -2, 5, 6, -3, 5, 0, -18, -5, 8, 2, -13, -14, 3, 2, -11, -12, -6, -6, -4, -17, -20, 3, -2, -26, -18, -13, -15, -2, -14, -10, -12, -14, -28, -12, -17, -21, 4, -15, -19, -6, -10, -16, -12, -1, -6, -5, 6, 9, 8, -6, -8, 7, 12, -5, -5, 13, 27, 8, 2, 5, 26, 15, -7, -11, 7, 15, -5, -8, -9, -4, 11, -9, -18, -19, -15, -9, -20, -5, -5, -15, -17, 4, -28, -13, -22, -21, -3, -16, -27, -17, -2, 6, -12, -20, -20, -1, 7, -10, -5, 4, 10, -11, -22, -6, 5, 5, 1, -5, 8, 10, 5, -5, 3, 1, 18, 8, 4, 5, 0, -3, 15, 5, 3, -3, -2, 7, 2, 1, -3, -1, 8, -4, -21, -16, 0, -12, -28, -27, -16, -4, -10, -26, -30, -7, -17, -13, -30, -18, -19, -3, -17, -11, -8, -5, -10, -2, -4, -15, -12, 6, -1, 2, -6, 4, 15, -6, 3, -4, 15, 17, 1, -16]
7577a6QJ2J2k2mQJ1pk1J0K0mMj0j2J1lj1QJ0kj8NqrJ4J2Mk4j6J8J2koj7K7klp
7616a8%J8J%j2%K2j1j1J1J3jj0j0J4N%j2J1%j0jOjkjQnMk0PLPj0MKMj2Jj0LJ6
7658Cok0J0Qmj6J3pJ4lj4MNJkMLMj4J3nLlJ0OpoJ5JJ3k0lMJ7j4j8J5J3jj0rKJ4
7701A3lj2LJRk9KLJ4j3LoJJ4rnkjpQJ4j0LnJ6j2j4QNJ5jj7J5kRqrJJ4mNj7K0p
7745CQk6lK8nLrJ0nnlJ3j1NjJ3nk3J8Omj2qJJ7j0%JlOj3j2J2KRj9JPLpj2KL3o
7789aoj4J6jJJJ2m%nJ2j8O%J5Jj6mK3kmpjK7k6Lk1K1J3j4nmJ0Rj3krJ5%j8nQR
7832Bj6%jJ4j4QLnj0qK5mjj8RJ3Mj9J0RQj8j3J8RrnKQK3j0j7RrK4lj0NJk4J4J
7874EklQj4J4rk3K3J3j1qKkK1k9jJ3kj9mPL0j3j0j7QJ4%JpJPolMLJ0Mj3MnPkJ
$$ y = [-16, -8, 4, 16, -6, -10, -2, 9, 2, -19, -9, 11, 7, 11, 1, -11, 0, -3, -14, -6, 4, 2, -16, -11, -19, -28, -14, -2, 2, -22, -38, -20, -8, -10, -16, -33, -6, -8, -11, -18, -18, 0, 1, 1, -11, -11, 11, 0, -11, 0, 13, 12, 2, -8, 6, 11, 11, -1, 10, 10, 0, -1, 5, 4, 2, 1, 9, 4, 8, -12, -5, -2, 5, -5, -1, 1, 5, -7, -6, -16, -13, 3, -3, -23, -13, -5, -9, -25, -12, -19, -5, -8, -22, -18, -13, -12, -14, -10, -7, -3, -17, -4, -9, -6, -9, 1, 7, 0, -6, 9, 10, 23, 3, 0, 4, 21, 7, -11, 4, 17, 16, 6, -3, -1, 13, 10, -2, 1, 2, 11, -18, -16, -13, 1, -12, -9, -15, -14, 0, -9, -14, -16, -17, -24, -16, -2, -12, -9, -14, 2, -10, -24, -16, -11, 4, 3, -14, 1, -1, 8, 0, -9, -8, 6, 2, 7, -10, 10, 3, 11, -15, -18, 10, 5, 8, -1, 9, 4, -1, -4, 9, -2, 3, 2, 15, 10, -13, 5, 11, 7, -5, -13, -12, 5, -5, -5, -4, -7, -1, -14, -26, -14, -12, -3, -22, -21, -14, -11, -18, -30, -28, 5, -1, -7, -21, -5, -6, -5, -4, 8, 4, 4, -1, 11, -7, -1, -1, 14, 15, -1, -5, 18, 16, 12, 5, 4, 31, 5, 8, -13, 8, 21, 7, 2, -2, 8, 17, 4, 2, -7, 8, 8, -10, -15, -7, 2, -14, -14, -15, -1, -15, -7, -4, -9, -19, -27, -2, -6, -7, -25, -16, -3, 1, -18, -8, 1, 9, -9, -22, -4, 5, -4, -9, -7, 1, 24, 14, -3, 6, -3, 21, 18, 8, 13, 14, -10, 4, 5, 3, 0, 8, -6, 8, -1, -24, -1, 12, 1, -7, -5, -7, 14, -15, -16, -3, -5, -24, -28, -21, 9, -4, -14, -31, -23, -9, -9, -8, -15, -14, -7, -13, -16, -12, -9, 1, 5, -8, -4, -9, -2, -4, -3]
7918cj1J7mNjpJ0kjnJ%L4k2j2JJ7nj2j1J8jlk4KK3j3KnMmLp%LkmJ7j4JnJ2n%J
7963a2lNK1k0nJ5Lqj9J2K1j6JlJ3rQj4J5jj%LmlJ4kmMmlLjqLOmrkjPj3oOrK1K
8010ak8jJ8jkrMKKjQlJ4Oj7J1nmJ2JJ2j9%K5j1j6MJ5Jj2qkNlPj9J1J6mqKNj0J1
8054HprJ5Qj1omnjPM%kj0R%rj6J8K%j3KJ6Knj0K2krqPMJ1qj2K0Mj1OkNJ0rkoJ5
8101A8j1jkOmnJn%J%NPj9J2j3jPj5J0K3j5k0J0NJ1k1lLJ2pnMKNMj6NJ0npJ3Jj1
8145a1RJ3Oj0j1j1K3Jj3%J9J0l2K0j4J3Rj4qmK1lj3J0jj2PqkQj2okJ3roNJknj
8186b2J3JqoJ8
$$ y = [-3, -14, 3, -1, 4, 3, -4, 6, 4, 3, -2, -1, -1, 33, 11, -1, 0, 17, 12, 0, -11, 7, 6, 3, -21, -19, 4, -9, -7, -12, -8, -12, -9, -16, -16, -13, -15, -19, -2, -16, -15, -20, -8, -13, -13, -12, -15, -10, 11, -9, -14, 1, 4, -4, -23, -11, 10, -6, -5, -8, 5, -4, 4, -10, 5, 4, 3, 3, 6, 2, -1, 13, 11, 7, 11, 7, 4, 7, 6, -2, 1, 7, 3, -6, -8, -9, -2, -15, -21, -15, -24, -3, -1, -29, -30, -12, -13, -15, -24, -20, -18, -16, -17, -9, -12, 2, 8, -9, 2, -3, -7, 5, 6, 18, -1, -1, 24, 13, -3, 1, 16, 17, 5, -3, -5, 0, -3, 4, -15, -4, 12, 8, 0, 2, 7, -3, 8, 1, -8, 7, 15, 4, -2, -6, -11, -12, -5, -1, -1, -3, -13, -4, -4, -13, -29, -11, -9, -9, -22, -20, -4, -2, -7, -17, 5, 3, -6, -14, -7, -3, 8, 0, -12, 8, 12, 1, 7, 5, 10, 20, 11, 9, 3, 18, 7, 6, 4, 10, 6, 1, 2, -3, -3, -2, -2, 3, 10, -9, 3, -10, -11, -4, -19, -9, 14, -1, -21, -11, -6, 5, -16, -19, -16, -4, -11, -16, -12, -10, -5, -1, -17, -12, -2, -7, -14, -1, 0, -11, -2, 11, 17, 7, -4, -15, 8, 9, -4, -4, 15, 25, -7, 13, -1, 12, 21, 7, -1, -5, 16, 13, 0, 10, 9, -3, 4, -4, -6, 2, -10, -16, -18, -5, -14, -20, -15, -14, -16, -21, -22, -9, -8, -16, -22, -4]
8191d
$$ Imaginary data points
##PAGE= N=2
##DATA TABLE= (X++(I..I)), XYDATA
0@%%%%%%%%%%%%%%JrJ6j6J6j6J6k4L2l2L4m2M8n6O4p2Q1q9J04j17J26j38J55j75
38i3J97k17K39k66K94l25L61m01M45m95N53o18O93p82Q91j026J197j424J739k210
58a248L001m660J3656k7738k9500M7034L5878k3121m5727R617M4770J2642l7703
71c099k6395J6925K8098l264j9171l595J3507O472m496o186m278m833M226J5127
85I038O786j6624j6517J2450K4875o313l3624q310L5620K7019k4502l8721Q324
98b0499M1531P102m0253k3727L0972L7864j2449m0295n665L3032J6887k3405k3923
111b2828J1571K6132K261j9278j0355P955Q997p90m361k255o83L193P921J763
125I243j2680j2377Q963K0563L29k2833r950K1693K0445j5584l0112K365L2385
$$ y = [0, 0, 0, 0, 0, 0, 0, 0, 0, 0, 0, 0, 0, 0, 0, 1, -8, 8, -8, 8, -8, 8, -16, 16, -16, 18, -24, 24, -32, 32, -40, 41, -48, 56, -61, 65, -73, 82, -93, 104, -113, 126, -140, 154, -171, 190, -211, 234, -261, 292, -326, 367, -415, 476, -550, 647, -777, 962, -1248, 1753, -2907, 10749, -16989, -46489, 545, 36423, 13302, -32425, -22808, 21962, 34604, -3099, -29494, -12569, 15529, 12265, -6906, -10501, 3006, 9478, 4982, -1204, -5482, -10315, -6089, 9038, 15824, -800, -17317, -4867, 20008, 13695, -19929, -28239, 7381, 34400, 9898, -28823, -20499, 21032, 28134, -12119, -35846, -4874, 32990, 20541, -19754, -25419, 7613, 24500, 1095, -22828, -11257, 14875, 17136, -2142, -12497, -4542, 4455, 3665, -696, -2951, -3634, -441, 7480, 9243, -3437, -15814, -6851, 13712, 14041, -8792, -18742, 2951, 23396, 7812, -22300, -19935, 12450]
138A2450J2536k6015k2630J6194K8203m776k9698q526K3855J8421j2373k0316
150a2675K203J7222M541j2330r081N004R202K526l411m756l192J649O529K712
164F143p735q177O310J4604K93j7392r653J3974J6508p451k0117j51K1382R622
178A8160j7774j7924Q927K0627K67j8641p110J4658J2462q200j4776J98J1776
191B650M840o433n526K296M457P51j916k586k483P46N717M091n005q139J911J0413
207E784K060j1632p683R903J3350m292j5750k373J4639P862j1797j2556O900J5419
221I834k3j4387n760J0549Q705o343r919K125R406J934o553l794L003K892j138
236E31j256P66j80j171J654L069j941n949k62P479L794o937o938N138R765j913
$$ y = [12450, 24986, -1029, -23659, -7465, 20738, 15962, -13736, -22262, 1593, 20014, 7641, -12675, -10472, 6750, 11291, -1039, -10120, -5116, 4086, 6612, 3201, -1555, -4747, -3098, 3431, 6143, -1592, -9769, -3459, 11145, 11438, -5954, -15607, -1633, 14875, 7424, -12693, -12844, 8538, 18160, 386, -17538, -8611, 12016, 12283, -6358, -13468, 1190, 13652, 5452, -9324, -9126, 2650, 7490, 1057, -4469, -2173, 2284, 3035, 1119, -1467, -3950, -3204, 2513, 6604, 1599, -6540, -4629, 5784, 7844, -3788, -11471, -1568, 11782, 7490, -8260, -10633, 4006, 11868, 71, -12485, -5585, 9834, 9811, -4576, -10336, 213, 8918, 2575, -7344, -5219, 4187, 6121, -432, -4226, -1223, 1669, 531, -725, 41, -139, -1310, 344, 3413, 1472, -4477, -4739, 2740, 6534, -403, -7341, -2203, 7562, 5649]
252E649j1617k930J0928P585p757j0400L721J1501N69j1092m914Q512P897m541
266C111q399J052P425J389n825l008L612L325j424k089P28O66j426j65K365L52
282A689l416j253M445L340m271n918K365P518L74p837l232P201O265n117q546
297f393J610Q983J903p783m546N817O412l171p156Q5O193K104m357k934K751L028
313B546j360k604L64J480l41n98J288P87k052j650K252K677k103m064J079N317
329C018R96n447l291M382M990k722o156N14O507K133n467m194L496N071j453n167
345b790m50M547K063l126k779J517K456n67j836J76J259r4p53N36O42j209j320
362a728J409K267q75k967J2L416J211l443k752K597L948j070m346n30M092J981
$$ y = [5649, -5968, -8898, 2030, 9615, 1858, -8542, -4821, 6680, 7249, -3843, -8757, -245, 7652, 3111, -5288, -4236, 3189, 4578, -1247, -4255, -643, 2682, 1258, -831, -103, 563, -863, -1028, 1337, 1689, -1727, -2980, 1465, 4805, 534, -5384, -3019, 4499, 4873, -2964, -6196, 1005, 7270, 2153, -6393, -4783, 4200, 6103, -1680, -6226, -409, 6003, 2832, -4324, -4239, 1954, 4058, -299, -3233, -482, 2546, 1186, -1418, -1054, 426, 85, -513, 775, 1562, -490, -2140, 112, 2789, 686, -3378, -2299, 3018, 4014, -1433, -4724, -342, 4648, 1926, -4230, -3716, 2791, 4924, -543, -4737, -1241, 3830, 2377, -2790, -3240, 1307, 3370, 244, -2535, -1018, 1438, 871, -965, -789, 470, 376, -377, 159, 801, -408, -1728, -319, 1948, 1073, -1894, -1882, 1534, 2745, -698, -3450, -853, 3095, 2025, -2321, -2851, 1241, 3222]
378C222l324l203J959L747l48l440q44K697J589j863j907R43J779j87j247j8P80
395C35j53o53L63P50n27j052O05J575k74k075m73K155J337j796k074J178K647
412A868k35k845q75K460J795j664k264P49K373J41k137r39J519J366p89j321K44
429e54J074M2p66j77M30R4k19J80L71l46o91K60R62j7j208l81J299R65j055j493
449a230M66J725J78j686q08J416J395q25j692Q9J569M93j210q73P42J091k22j002
467c84k51O12M09k51l13j2J61J36R8p9m18k17M67O05k31q59j23R64N67q93j079
488a091M72J395J82j360p81J006J244m89j473k08J355Q49q36j164K00J132L88
505H21q48p90L25R24K79o44o90J20P70L82n50p75R6R45M96p34r78J87J178M54
$$ y = [3222, -102, -3305, -1346, 2401, 2053, -1387, -2231, 466, 2055, 192, -1715, -772, 1007, 820, -427, -445, 335, 182, -471, -108, 642, 115, -937, -332, 1243, 969, -1106, -1579, 576, 1913, 117, -1957, -779, 1868, 1633, -1212, -2087, 373, 2168, 504, -1760, -1011, 1362, 1503, -634, -1573, -54, 1312, 523, -798, -554, 520, 562, -204, -381, 49, 143, -76, 104, 475, 129, -562, -302, 660, 643, -565, -946, 353, 1318, 263, -1230, -764, 961, 1139, -547, -1355, 61, 1456, 631, -1061, -972, 597, 1090, -120, -993, -251, 840, 618, -384, -635, -23, 386, 135, -178, -190, -29, 107, 205, 126, -292, -509, -42, 563, 332, -527, -650, 314, 881, -12, -1091, -619, 776, 958, -402, -1183, -177, 1067, 578, -895, -1103, 252, 1101, 265, -899, -699, 433, 821, -27, -817, -492, 432, 711, 67, -623, -503, 267, 649, 99, -676, -580, 365, 861, 127, -851, -664, 514, 968]
525I68r96j022N28J364J65j317q56Q80J303j71j397n57J066J122m41j312l28J088
543H7R51m68j252k81J083R52n20j330k23J226J023p19j495j07J538R49j078j560
561a224K95J719O43j438j388O93J743K34j585j027J001J488j72j471o66R97J170
578A012k31j193n09P66R79n1j038p22N90J199J89j232r92P56J579L1j739r94J385
597b15J791n58k176m37J982J401j381k068M31K252O35j907j476J146J888k24j852
614g68o43J395J208o40j286j15R62N68m14o39j40L36M98K25m33p84o5J053P65
633A083q85j436K78J875O08j822j554J246K256k86k502p98K247J776j510k424
649a848M98K571N34k228j380J553J900p51j979j9J713N87j289q20P85Q28m20o58
$$ y = [968, -28, -1050, -522, 842, 1007, -310, -1166, -286, 1017, 846, -551, -1108, -42, 1080, 639, -673, -1001, 87, 1038, 570, -682, -963, 120, 1072, 552, -778, -1001, 225, 1248, 529, -966, -1073, 465, 1414, 336, -1224, -929, 790, 1433, -5, -1393, -700, 1043, 1277, -308, -1335, -334, 1154, 982, -489, -1155, -158, 1012, 781, -412, -921, -155, 824, 773, -265, -987, -397, 802, 991, -241, -1233, -477, 1102, 1133, -606, -1600, -215, 1576, 1018, -1158, -1595, 387, 1788, 407, -1661, -1230, 1022, 1657, -250, -1726, -580, 1308, 1084, -768, -1411, -16, 1192, 552, -734, -849, 113, 681, 267, -372, -512, -176, 322, 547, 114, -670, -735, 318, 1083, 198, -1238, -960, 915, 1523, -299, -1853, -607, 1649, 1363, -1139, -1937, 310, 2086, 576, -1848, -1350, 1221, 1755, -473, -1853, -300, 1600, 849, -1130, -1149, 564, 1151, -138, -958, -173, 655, 235, -423]
667d23L22M44l83l89N87N41p41q87P16J378m06j793j97J968R79j797j775J258
685e98K409l96k663o48K497J621j911k338J000K688N1k597j010K109J687j372
701E29k056N54K042J91j748o93J274R29q35r45M96Q36l44o75L23O15l79p29M08
720b07R33l05j227N0J441M13j504r94J325J539q78j979K14K174O23k012j448J484
738c58K039o96k290k20K163J071j603j672P98J822O4j622p16J069J078l96j022
755d91j97O27N15j29m59l43J64N48L42m57p97N4J001N47r17j078M65J428K11j423
775c89r31J022J487l47j667m87J450J221q02j632k7J553Q77j030j432J84J537
792E87P21j115j391K91J593P02j271j506M90J880N54j680j495R43K049J11k023
$$ y = [-423, -101, 343, -40, -429, 158, 699, -42, -929, -213, 1165, 759, -1034, -1231, 737, 1716, -81, -1856, -598, 1811, 1415, -1248, -1896, 601, 2222, 311, -2027, -1027, 1661, 1712, -885, -1895, 214, 1901, 529, -1527, -973, 1069, 1260, -488, -1181, 93, 1022, 187, -758, -262, 574, 230, -445, -122, 493, 114, -615, -207, 726, 421, -806, -756, 685, 1098, -406, -1400, -75, 1464, 586, -1393, -1179, 995, 1618, -394, -1842, -358, 1681, 985, -1305, -1525, 638, 1709, 106, -1566, -768, 1054, 1118, -504, -1220, -151, 927, 531, -491, -688, -61, 454, 325, -134, -477, -313, 235, 577, 120, -677, -623, 378, 925, 8, -1070, -605, 823, 1034, -389, -1320, -298, 1189, 842, -825, -1312, 138, 1359, 557, -1075, -1102, 451, 1328, 298, -1134, -950, 587, 1308, 193, -1198, -907, 686, 1388, 117, -1389, -899, 981, 1535, -145, -1640, -697, 1352, 1463, -560]
809e60j161J458J862m68k040n78J621J364p88j680j67J428R52p27j292j80J073
826A17R23l91j239n15J000J305k72j668p66J462J698o67k284m70K243J680j589
843E67k539M21K833Q99k438k064J484K730k08k725j040K080J906j020k194q1J854
860D65R78j108j354J67J156N87n24q72l07O38R64N3j201r40Q34J685J9j974j127
879a861J681K096q03k655m36K589J654j859k546O95K831O12k480j709J599K294
895A702m29k274o44J712J320p96j483p4J112O91m44q09k69M74P52J64p68q99L59
914f03J381M06j412j247R49J908p1k144r57J830J845j016k360l4K350J065j788
931A02j842R03K100J16j886r10J254J329m45j303k66R01O64k91o87k52L06N68
$$ y = [-560, -1721, -263, 1599, 1131, -909, -1487, 134, 1498, 710, -970, -1137, 291, 1243, 516, -776, -956, 117, 1040, 649, -590, -1105, -105, 1200, 928, -740, -1506, -44, 1654, 987, -1297, -1767, 476, 2156, 567, -1972, -1551, 1282, 2181, -257, -2321, -837, 1893, 1685, -1040, -2080, 0, 1906, 886, -1308, -1389, 465, 1443, 335, -1019, -852, 304, 891, 367, -505, -812, -174, 790, 843, -358, -1298, -464, 1221, 1240, -734, -1861, -180, 1916, 1113, -1542, -1978, 611, 2265, 406, -2140, -1445, 1386, 1998, -482, -2191, -592, 1702, 1273, -1001, -1645, 67, 1387, 591, -892, -966, 146, 837, 393, -416, -685, -211, 541, 705, -63, -962, -603, 778, 1184, -228, -1475, -526, 1382, 1311, -833, -1790, 40, 1885, 869, -1491, -1525, 825, 1890, 102, -1740, -837, 1263, 1379, -507, -1417, -163, 1166, 721, -582, -848, 53, 717, 426, -261, -513, -207, 361]
949C61K36n01p44P2J026N29r19j134M46J535K75j565j018J155J621m66j880l48
967a319J701J103j171j598M60J681K90j413q55R01J108k92j063j92P28M61k94
984B36m77n0K27K25J11j51m27j24N60M95m23q85P6J056M50j008r58O71J328j41
1004G91j457m70J288R99q60j334K85J391K91j192p41Q07R62l19r54r4P63L36m37
1023E5m12J56L00J5q7m1r4j04K09L27j39n73m7O85L90o22p47M10R89kj090m38
1045h60R57Q27o31j085J88J153K87j023o35O81Q54k94q92m1P33L03m81m11K13
1064a57L70l9j95l4L7n6O7K21n4l93p1M91L29m79o10L08Q18J0r06l79Q08P46n45
1087B87r76J56J040K61r23o11O50Q16k81q53o5P27L26n23m33K46M27o2l15k2J63
$$ y = [361, 597, 96, -648, -576, 450, 979, 60, -1074, -628, 907, 1182, -383, -1401, -246, 1375, 909, -971, -1319, 382, 1485, 314, -1284, -824, 857, 1147, -266, -1121, -220, 888, 596, -467, -659, 69, 530, 236, -241, -291, -64, 161, 272, 121, -306, -430, 130, 625, 202, -683, -607, 449, 899, -109, -1067, -396, 932, 791, -666, -1136, 152, 1151, 291, -1043, -758, 633, 924, -268, -1009, -202, 760, 441, -513, -607, 156, 492, 55, -357, -201, 99, 114, 27, -14, -108, -212, -3, 324, 185, -388, -435, 250, 640, 18, -729, -319, 670, 668, -422, -860, 97, 924, 293, -792, -604, 549, 836, -187, -822, -141, 713, 419, -473, -514, 219, 522, 41, -370, -157, 213, 174, -21, -55, -18, -74, -7, 214, 160, -233, -304, 187, 516, 37, -573, -265, 553, 563, -343, -722, 86, 832, 287, -689, -533, 507, 768, -155, -766, -116, 700, 419, -434, -499, 228, 554, 31, -402, -156, 271, 209, -106, -128, 35]
1108C5Jp1J18M0k32j59L07L33k68n45J06O97J38p12m70O01P43l31r16j1R12L74
1130F90p66o78M89Q14j29q08j87O80M02m65n08K41M76k9l72q4K47J02j54l0J29
1151F0m3j68P0K86m1l81q6M37K72m13m64K76O14m3o67k36O32M73m49o44J86P06
1173C77Q8o42l17M72M60k35n14L6M29J20k94j83J60J55n8r8M4J4q5L0J79Rk63
1196a16r1K79K32k40l49J21M50M5m60k18L75L75k50m44P9M45Q8l61k19K21K96
1217B58j09k75kK21L7j48k1P1on4N5Q2j05j61R3K69k7l55r4L77K48l53m16K49
1241a66N06n1n66j48N09L44l89m84K27N33m5m86j19M11K01l06k50K26K42j61k31
1262b03J67K35j95k66J90L77j81m72N6O02J14o50l38O01N83m59p85K00R37R5r33
$$ y = [35, 36, -35, 83, 123, -109, -268, 39, 372, 104, -441, -335, 362, 500, -212, -682, -81, 662, 331, -585, -596, 316, 690, -76, -754, -265, 549, 420, -388, -575, 105, 507, 42, -466, -225, 251, 222, -150, -234, 13, 115, -39, -69, 60, 17, -151, -81, 205, 164, -217, -303, 134, 406, -7, -471, -195, 419, 376, -291, -527, 105, 578, 129, -515, -329, 377, 465, -177, -494, -22, 438, 203, -311, -275, 154, 274, -20, -203, -43, 112, 54, -44, 0, 14, -71, -41, 138, 147, -116, -207, 72, 304, 64, -285, -164, 286, 331, -129, -347, 28, 403, 153, -291, -212, 233, 321, -40, -259, -38, 258, 149, -126, -128, 93, 130, -18, -39, 32, 26, -28, 27, 109, 4, -157, -64, 205, 178, -177, -271, 106, 354, 1, -415, -166, 340, 289, -277, -425, 84, 428, 39, -445, -218, 315, 270, -216, -335, 76, 277, -29, -279, -53, 189, 28, -203, -36, 199, 4, -262, -72, 305, 124, -348, -292, 310, 424, -226, -564, 37, 620, 161, -624, -424, 513, 608, -325]
1283c25m08P56P05n33q76K47R06Q4q59k99O71M60m83n32L23N27j95m94J35M88
1303B98j09n41P5O43L0p44k23Q04N08p61q16N68J096k32j248k09J255O57j049
1322Bj030O80J250k17j292k19J151N73q77p82N66Q44k90p82P1O93J3n86n4N69
1342B83P2o18j18O71K61p63m73P55P52o01j055L11J271O4j321n38J206R70q96
1361B33j294M43J424O6j347n40J114Q59p38r98L49R45l0p92j26N65J87m41j04
1380b25M11L1n18l1O94J59q37m50Q69Q38p40j208L72J470J48j522p06J310J194
1399A259q70j504L07J567K56j394o92J033R38o07r76K50Q57o5o54j4N39o2m97
1418c29J29O21j46q43K7J058L02j185p44J115J224p91j619K53J827L95j757j027
$$ y = [-325, -733, 23, 728, 195, -681, -434, 472, 556, -303, -602, 69, 529, 46, -486, -163, 364, 169, -325, -190, 298, 189, -352, -277, 366, 396, -348, -571, 233, 741, -20, -836, -268, 828, 596, -652, -861, 394, 1051, 2, -1028, -348, 902, 685, -607, -826, 325, 898, 21, -761, -195, 649, 359, -423, -352, 341, 354, -232, -286, 283, 355, -263, -381, 290, 551, -212, -685, 70, 822, 221, -834, -523, 748, 812, -509, -1047, 159, 1129, 233, -1061, -618, 806, 872, -475, -1015, 99, 958, 220, -778, -429, 516, 486, -306, -432, 133, 320, -121, -225, 186, 217, -301, -332, 362, 521, -316, -766, 103, 941, 201, -1007, -635, 835, 983, -539, -1245, 65, 1259, 389, -1115, -808, 759, 1015, -379, -1071, -38, 900, 293, -683, -433, 424, 359, -295, -309, 230, 168, -329, -200, 421, 275, -568, -541, 517, 819, -366, -1110, 5, 1229, 438, -1181, -928, 899, 1294, -463, -1490]
1436a490J408J548q52j797K01J794M08j541q34J098J090o84j090L13R80r3q39
1453c80M4P36p6p49Q1R14k7j096k45J266O59j276j161J067J642n94k013o3K085
1472H14Q17j882j481J369J977o79k162q7K043P51j661j221J134J427n89j419J63
1489f86J265R5j037k13Q82K24q45k33R26L30j050n70J108R51j006j418P04J805
1507A232j75k022m93J956J217j635j793J006K162k59k205n01J939J135j469j519
1523a424Q68J649l12j541j32J278L98j009m86Q01M88p06m72P21N40p89p39Q08
1541e9J034o68j378L69J649J35j762p40J630J349j220j833O29K070P5k016p29
1558a465J662J288j170j590N93J641n5j456l52J183N79q91o43O26O43n01n95M65
$$ y = [-1490, -82, 1466, 614, -1183, -982, 812, 1220, -321, -1155, -57, 1033, 349, -741, -428, 552, 459, -380, -336, 400, 324, -425, -344, 570, 543, -553, -798, 468, 1127, -149, -1310, -243, 1399, 805, -1208, -1271, 814, 1631, -251, -1732, -363, 1614, 935, -1227, -1314, 729, 1480, -181, -1402, -268, 1159, 570, -849, -686, 579, 674, -363, -576, 306, 530, -315, -548, 378, 708, -342, -912, 196, 1147, 141, -1277, -573, 1232, 1057, -965, -1458, 498, 1715, 80, -1713, -707, 1455, 1196, -1009, -1510, 429, 1564, 95, -1424, -556, 1093, 781, -760, -892, 386, 784, -225, -711, 90, 578, -128, -600, 121, 661, -128, -867, -59, 975, 307, -1071, -702, 947, 1082, -680, -1420, 210, 1559, 339, -1494, -865, 1205, 1280, -736, -1465, 197, 1485, 315, -1275, -682, 959, 904, -552, -904, 279, 858, -33, -676, -50, 593, 92, -503, -38]
1576c8O29n02p46M76R45l40j209Q1J387L52j433q41J253J332q96j676L35J847
1594I56K83j736q84J395J332q68j573L10J559J99j342n75J012P74o83p88M00P22
1612D93k38o34K00N82k04o44K14P61j07r30j05J065M14j060q04Q91J169n56j443
1631i36Q8J506M39j375r21J039J238n83j387J14J318L43j109o38P82P75m69p83
1649e59K32O86p6n92L3N12k8n34L8N97N7p16j87P61M41p52p12O05R98l28j174
1670f98n4J199M82j052q52P55J101l66j180m7J111L76q66o17N80P19l05o93R3
1689c14N87K9m80m3L90M4m12l6M86P5n56k10O03M28o04o41M39Q49j69r70j62R65
1711B98N03q41p63N52R52k01r98j29Q93M10o89n86M54O39k03o18L9N17N9m13q7
$$ y = [-38, 591, 89, -657, -181, 764, 424, -785, -704, 683, 1035, -398, -1239, 14, 1346, 450, -1226, -891, 956, 1239, -497, -1381, 14, 1346, 478, -1095, -785, 774, 973, -369, -944, 68, 842, 159, -629, -229, 493, 255, -379, -179, 403, 199, -445, -231, 530, 423, -507, -612, 453, 867, -193, -997, -106, 1063, 507, -936, -848, 658, 1097, -278, -1199, -160, 1078, 495, -892, -778, 540, 883, -226, -864, -82, 693, 224, -559, -327, 359, 283, -309, -276, 236, 208, -326, -288, 309, 366, -350, -537, 224, 665, -87, -799, -194, 804, 476, -698, -752, 447, 929, -123, -975, -220, 881, 515, -665, -712, 399, 775, -91, -708, -128, 591, 286, -407, -314, 273, 302, -178, -221, 169, 213, -199, -235, 251, 326, -230, -440, 163, 591, -13, -654, -215, 634, 465, -505, -667, 298, 801, -40, -803, -251, 701, 500, -498, -627, 266, 676, -13, -599, -145, 494, 291, -327, -288, 229, 288, -125, -212]
1732b12L47R6l58q4L88J28m38k35M64M09m29o08K98P63o2q62k17Q22N03o68p28
1753f83L90Q72r0q70k29P50M65n57n87L02O19r4n69m7M56J38l58j57K86J53k82
1774i2j29K88J79l27k80L24M13k56n45J35O39Q1o82l06O20N20m23o97J94P53P2
1795D81o97l19N66M80l68n35J42N26L6m49j47L22K08k40j74J56J56j64j30J83
1815C3J48k22k14K46L05j90m20Q8M94Q4n23k63M56M42l15n54J00N99J16n39k98
1836d27M00M14k24m47O0M07P5l13j42K16J38j22j06J03O1j27l9J65Q6k39j53K48
1858C4K71j89m01Q5M72P8m78k58M11M13k70n17N9N56J16m98k84L69M02k30m09
1879b68N7L61O5l07j12K20J27j43j26J43J00j76q9K01J48k37k30K07L49j32m42
$$ y = [-212, 135, 231, -127, -211, 177, 305, -133, -368, 96, 505, 76, -532, -234, 529, 467, -395, -612, 210, 713, 45, -683, -293, 579, 489, -381, -610, 140, 605, 48, -539, -237, 382, 288, -281, -328, 128, 266, -92, -249, 37, 190, -92, -221, 67, 246, -81, -361, -37, 376, 120, -425, -290, 349, 430, -252, -558, 62, 582, 159, -538, -344, 409, 481, -216, -535, 31, 511, 143, -392, -250, 276, 312, -137, -284, 38, 246, 6, -168, -12, 144, -20, -150, 33, 181, -41, -255, -9, 296, 106, -314, -226, 268, 352, -171, -434, 22, 464, 149, -405, -305, 294, 410, -129, -427, -27, 387, 163, -284, -224, 183, 258, -55, -197, 19, 157, 35, -71, 32, 93, -34, -73, 92, 178, -61, -214, 34, 305, 116, -285, -200, 272, 350, -128, -386, 25, 438, 168, -349, -290, 266, 382, -116, -400, -31, 371, 141, -268, -211, 150, 215, -92, -204, 16, 143, 0, -126, 17, 117, -59, -148, 53, 201, -36, -266, -59, 290, 158, -284]
1900b84j3M92J99m76l69L53N21j74n86l2N84K21m75l91L30M73j51m75l5M34J43
1921B89l34k21K41K28j66j96J19J87j15k02J23K48j35l25Q8L79N0m47j92M49L28
1942C96l29m94J84N94J4o01k21N16M18l66n34J56N62P0n07k27L80L21k18l61R5
1963a52L14J0k39m3J79K5j31NJ60l0k14nL02O8l26k09L17L37k29m76Q0N36J27
1986D06n18l29M00M70k00n58MN23J91m21l31K51L97r9l58l5K48J23j52j12O2N3
2008A5k9K5Q2q6j60O0K67K8l53j53L32L39k50m76P6N44J37m97l60L93N04j97n52
2031c11m5N31K13l95l38K14L82n3l37o1K40J13j37r7O7Jl5O6Q6r6k19Q4L28L8
2055B39m18k04M02L97k65n74O8O36J89n92m32M31O04j83o68o1N88L03m40m29K39
$$ y = [-284, -297, 195, 394, -82, -451, -98, 423, 249, -337, -369, 215, 436, -39, -430, -100, 373, 222, -253, -288, 146, 289, -45, -266, -25, 203, 37, -159, -40, 147, 32, -170, -47, 201, 66, -259, -171, 208, 258, -189, -381, 68, 396, 67, -427, -243, 351, 365, -236, -457, 59, 477, 111, -423, -267, 295, 365, -142, -369, 11, 332, 114, -247, -152, 162, 172, -67, -110, 69, 94, -37, -32, 128, 98, -116, -121, 181, 249, -77, -286, 31, 368, 139, -337, -257, 279, 406, -112, -441, -41, 429, 229, -329, -325, 198, 389, -32, -363, -112, 285, 186, -172, -207, 41, 164, 12, -100, -38, 15, -14, 11, 93, 7, -153, -93, 174, 202, -151, -304, 28, 367, 117, -359, -283, 261, 398, -99, -459, -66, 438, 241, -311, -356, 175, 388, -7, -345, -131, 251, 198, -139, -200, 40, 153, 16, -81, -14, -13, -48, 18, 104, 8, -211, -127, 201, 239, -179, -383, 19, 416, 151, -423, -355, 281, 470, -122, -554, -123, 481, 298, -370, -431, 157, 460, 20, -409, -170]
2076a70M64o3l68q8K71J27j57q5J09%j03N6J87p8k72j4L84J55m26l46L45N54j78
2099C04o95p1P08L70o13o07L83P38p5p79k12O71M47m65n77K18N70J8m95j68L43
2120A3K46k08k16J22J29r3m6J38L4k40r4L31K23l30m15K53N77n4o99k05O69M98
2142F33n21p17K47Q35R0q00l91O16O16l75p00P2O57J82n20l22L08L65j35l03K1
2163a42K01j3q8O7N8j87j14K60K48k71m06J46N93L2o46l05N89N74l97p74J18Q43
2185C86K12p46n28N38P08k23p51o8O56L00m51m16K10M29l8l15n2J63N2m5K9K2
2207G2j58p7K36K44k49m26J27N87Q7o37l66N30O49l22q09mQ15L57o96o16M28P61
2229E33r8p65k04O21M24l85m99J23M47O4k92j60J47J12k9J2Oj42r6K40K34j96
$$ y = [-170, 294, 231, -137, -225, 46, 173, 16, -69, 40, 40, -63, -7, 180, 102, -170, -184, 200, 355, -71, -417, -72, 482, 304, -391, -462, 246, 616, 3, -604, -221, 517, 442, -337, -549, 122, 569, 104, -473, -255, 315, 333, -162, -330, 13, 259, 51, -165, -43, 86, -7, -53, 85, 119, -121, -215, 116, 339, 9, -406, -153, 424, 370, -329, -534, 135, 633, 112, -605, -358, 477, 567, -233, -624, -8, 608, 233, -467, -395, 262, 444, -76, -398, -90, 275, 140, -163, -142, 59, 46, -42, 25, 83, -104, -218, 42, 290, 19, -387, -241, 352, 384, -262, -567, 22, 596, 199, -575, -457, 386, 598, -148, -676, -138, 570, 347, -404, -472, 184, 484, 33, -383, -173, 256, 218, -97, -149, 14, 66, 21, 50, 72, -86, -163, 73, 317, 68, -358, -231, 356, 443, -194, -560, -30, 619, 297, -512, -516, 299, 656, -40, -656, -228, 533, 435, -330, -534, 87, 511, 126, -373, -250, 197, 261, -31, -191, -44, 68, 39, 51, 57, -85, -181, 59, 293, 97]
2251I7m27P3N62J57n79m30M67O58k11p97j09P84M33o24o74L24P80J1p55k85N66
2272B1M76l09n35M6M60J13k70k12J24J37Rk6j3j15o0J73K18j69l67J8M88K03n05
2295i5m37L58O51j11p34j97O81M72m70o77K15P21J07o45l52M43N01k19m91k2M13
2316A12J62k58j75P0J64j5k3on8q8J26K16r6l60k9M16K25l83m31K51N87l0o49
2339b72k33N82M73l97o41J37O57J63n81l65L97M68j64m86l9L97J83k44k12R2J66
2360H1j0q1Pj7n2P2J71n4k68o7L29K32k95m06J80N16L0n48k62M72M54k96n76O3
2384c25O04J92n30l68L25M64j10m77o2L85J93k58k45J22J97k2j22j5L8l2K5R2
2406G1Qj82r7K42J96k03l43R4M51P2m74k39L82M28k29n35K5N53J92m68l76L12
$$ y = [97, -330, -257, 305, 462, -117, -547, -80, 578, 367, -430, -539, 245, 678, 54, -620, -296, 484, 495, -260, -545, 21, 497, 188, -347, -301, 159, 272, 2, -210, -86, 51, 60, 34, 21, -94, -154, 19, 237, 68, -299, -281, 207, 410, -95, -532, -174, 477, 366, -368, -565, 116, 588, 118, -559, -344, 377, 484, -161, -513, -70, 431, 212, -279, -301, 112, 274, 16, -159, -89, 75, 60, 37, 31, -27, -115, 11, 227, 131, -229, -258, 158, 383, 0, -431, -180, 407, 377, -272, -505, 77, 550, 153, -488, -351, 306, 469, -112, -477, -80, 388, 224, -262, -301, 96, 279, 35, -177, -85, 81, 71, -10, -3, -20, -72, 0, 171, 117, -151, -218, 111, 343, 48, -358, -178, 338, 368, -180, -442, 30, 484, 188, -388, -325, 279, 471, -59, -427, -102, 362, 252, -225, -287, 98, 291, 33, -212, -90, 107, 85, -37, -52, -14, -46, -21, 71, 79, -103, -200, 42, 238, 35, -308, -214, 237, 309, -165, -404, -22, 406, 177, -358, -333, 220, 412, -56, -432, -120]
2428a20M65r8m75p7L85K05k28k77J06K29K2j70m4P8K4k0N7j5j02p5J52J71j33
2451F0k98O8L75O2l76k47L17L91j73m78k6M94K14l96l74K53M39n4m39j18L54K30
2473B78k13k84Q2K38M0j66o6Q0N2j8L8j4r7m7J43J44j35k55O3L39P9l56k29K85
2497a9L69j25m65m1M52K22l75l56J93M47l7m16j35L28K29j67k87K6K53O3j80r0
2519a11P8O3lj5J3q4l8J19J15j00k21M2K83J00l10k32K28L44q5m02o8L85K40k97
2543D4l58J56L95J4l77j61K79K61j51k68L2K18P9j66j02O9R9k3m2Ml8l8Q3J11
2567A20p6j80j0K40R9k30k23J65L29l8l64j15L26K58k44l47R8L85O2l52j96K48
2589d5K84j20k84OK19J10j62j41Q5J31j3o3monJ1P9k6j21k9J57J23j48k16Q8K92
$$ y = [-120, 345, 247, -228, -305, 80, 285, 57, -220, -114, 115, 137, -33, -77, 1, 25, 5, 62, 47, -55, -130, 22, 193, 60, -238, -170, 205, 267, -109, -356, -39, 352, 179, -299, -325, 169, 383, -13, -387, -134, 305, 251, -188, -306, 48, 278, 65, -219, -137, 101, 141, -25, -91, -11, 41, 23, 61, 47, -50, -97, 46, 190, 55, -200, -137, 202, 281, -75, -304, -19, 350, 225, -240, -281, 171, 393, 18, -338, -145, 302, 265, -151, -286, 42, 271, 104, -183, -157, 96, 159, -21, -111, -33, 30, 27, 12, 25, -59, -97, 22, 137, 37, -184, -142, 141, 241, -69, -301, -73, 271, 186, -216, -284, 101, 341, 44, -314, -158, 237, 251, -126, -287, -8, 253, 102, -166, -134, 84, 163, -3, -105, -36, 63, 40, -2, 2, -36, -74, 9, 120, 44, -136, -146, 94, 193, -37, -260, -95, 234, 196, -168, -283, 43, 301, 57, -290, -192, 193, 255, -97, -293, -45, 239, 119, -165, -159, 60, 170, 8, -133, -48, 83, 70, 7, 3, -3, -8, 3, 82, 56, -65, -94, 63, 186, 38, -178, -90, 202]
2615B02J0l11j38K55K70j58l40K3L43J21l00k33J73L05o2k83p0K24J42j33j64
2636a24M7J15L2p6m8L0RK4L5j3j03l1J34J17j28j95O4K42O6k64j84K22K83j15
2660A39l27k1K98J67k29k77J36L00J1k80j00J82J63q9j56j5J34M3m8o4KjL2P0
2684G0l0j00p1J41J44j05k21K1K50J15k55k22J76K90m8l25r4K99K06k06k68N8
2706a75K95N8k31j40J51J57n0j33qP8M1l6mk1m1J3J23M9j64j29J46K31q0k87m1
2731a98L01J72k38k98J22L80j6l55j36K98K43j76l05M9K86O2k34j05J21J39p8
2752C4p6J4M4l0j2P3J2j48m0J83J34j83k39J37L10Jl79j31L51K89k75l70J09M27
2776B35N4m03j82L19K95k19l19O5L09M5k52r9J74J25j41p7R4P1j30o3J63R2j99
$$ y = [202, 212, -99, -237, 18, 288, 130, -210, -187, 156, 277, -23, -256, -83, 222, 160, -123, -193, 31, 173, 40, -124, -77, 38, 70, -6, -54, -24, -15, 9, 44, 31, -72, -103, 31, 148, 20, -175, -111, 131, 197, -67, -251, -29, 254, 139, -188, -209, 89, 256, 27, -250, -114, 186, 197, -83, -183, -1, 162, 73, -83, -98, 36, 79, 31, -33, -31, -32, 0, 70, 40, -60, -131, 10, 154, 49, -172, -151, 99, 214, -41, -263, -87, 203, 155, -170, -264, 35, 241, 35, -233, -175, 120, 178, -53, -193, -42, 115, 65, -68, -76, 2, 43, 7, 3, -18, -59, -46, 77, 126, -38, -167, -21, 210, 130, -157, -198, 103, 275, 37, -261, -139, 241, 225, -130, -266, 32, 275, 99, -206, -157, 129, 191, -43, -148, -27, 112, 34, -42, -28, 16, -14, -26, 47, 59, -89, -129, 54, 188, 5, -234, -97, 213, 214, -165, -296, 55, 344, 69, -301, -192, 235, 289, -114, -296, 23, 318, 99, -220, -155, 154, 199, -53, -152, 22, 147, 6, -71, 23, 94, -36, -99, 64, 156, -43]
2799d3j66J98K46j40l34K4M13J10m27k57L40M08k15n05N1N11J28m51k75L41L70
2820C27j94m23P4L90N6l28j44K61J76k05j55J66J56j44j90J55K18j30k76R7L50
2841B37l1m06q1M31K26l77l75K66M98j34n44n2N39K48m72l90L11M77j41n03k2
2862b95M56J65l74k44K57K88j68k86Q7K65m0k44J3K49ok76%L00O8l47j52L42K81
2885C39l02l81J84M97m5n31j42N10L27m23m54K53N47n7n58j21M86K70l54l52J88
2906a19L78o3l45k2K63Q0k12p8J67N1j70l7J99N6k44j26K81K30k88l43K02M48
2928C08m4n24j47N12L42m15m98K27N70J9n73k19M74L71l13m40J29M31K6l30j32
2949b26K26J45j14j07P5L7r9J8J66jk47p4L19J92l09l61K29N01n5n76j60N37M02
$$ y = [-43, -209, -11, 235, 95, -239, -215, 198, 308, -119, -376, -36, 372, 157, -348, -297, 214, 342, -109, -384, -43, 327, 133, -290, -216, 174, 230, -98, -242, 19, 195, -10, -165, 1, 157, 13, -177, -22, 196, 66, -210, -113, 237, 206, -200, -281, 150, 376, -1, -376, -110, 388, 254, -290, -342, 197, 445, -27, -417, -106, 371, 230, -273, -295, 161, 326, -48, -292, -35, 253, 85, -201, -114, 151, 111, -133, -120, 129, 123, -153, -153, 147, 215, -132, -284, 58, 339, 37, -344, -160, 337, 292, -239, -381, 129, 456, 33, -421, -168, 379, 322, -236, -357, 129, 399, 45, -307, -119, 259, 196, -149, -171, 92, 172, -40, -118, 49, 100, -70, -107, 92, 148, -96, -222, 59, 289, 1, -342, -140, 308, 264, -260, -407, 105, 447, 32, -466, -239, 331, 350, -223, -442, 32, 403, 90, -350, -221, 210, 236, -94, -226, 0, 145, 31, -76, -1, 36, -63, -45, 121, 120, -127, -201, 118, 310, 1, -360, -131, 370, 315, -261, -421, 116, 518]
2972E18m08n70J85O30N9n88k78M43M30k54m84N4M27R8k92j70J49J57n8p1K1j9
2994b1p9P8J78n9k87m4L50K41l63l98K36N60j5o34k28N60M70l79o19J12O91J37
3016D87n97l67M11M88j87m85l5L90J98k56k30J14J52Jo9Jl7q0Q8K08n0l24r7L75
3040I9K69l31m59J81N83O2o17l03M94N25k95o39K2O56K12n06m27L18N08j03m74
3061b25r4L65K07j99k29Q6J62j0m6rj8q0M5J88Pk67j26K63L10k12m39O4N13J49
3085D05m94l61L60N31j73n88p4N53K71l99m21J92M86l1m18j29K96K13j58k10N3
3106i6J45Rr8L0L4q3k4J48P6j82j77J75K86r2l65n0M11J91l36l60K26M58o1m61
3130a96j26M11K84k89l85J40M01J9l64j18K45J91j45k09O1J81k6j17RQ3m2o9N7
$$ y = [518, 110, -460, -275, 355, 414, -174, -452, -9, 421, 167, -317, -263, 164, 262, -30, -200, -51, 106, 48, -23, -2, -21, -100, -22, 156, 97, -190, -234, 116, 357, -6, -404, -168, 392, 377, -257, -485, 75, 545, 166, -453, -341, 350, 487, -110, -477, -66, 422, 235, -250, -285, 105, 303, 47, -183, -69, 83, 84, 15, 16, -21, -101, -13, 195, 145, -179, -276, 99, 368, 37, -422, -241, 342, 404, -213, -516, -22, 503, 208, -431, -409, 247, 459, -47, -474, -156, 352, 249, -225, -319, 46, 253, 54, -175, -89, 73, 63, 17, 8, -10, -90, -45, 143, 150, -117, -243, 20, 330, 118, -321, -257, 256, 405, -89, -450, -90, 441, 268, -320, -394, 159, 430, 31, -390, -198, 288, 257, -161, -290, 6, 219, 61, -149, -96, 49, 58, -40, -10, 24, -59, -83, 65, 141, -41, -218, -43, 243, 151, -214, -264, 147, 338, 2, -358, -132, 326, 265, -196, -322, 89, 373, 84, -301, -161, 240, 259, -105, -223, 22, 213, 68, -141, -80, 101, 75, -42, -33, 50, 8, -61, -4]
3153dR6o7j62O2K04nk51p6K57J91k26k88J40L45Jl79j21L33K19k17l17J06L34
3176A75K9l01j35K46K09j71k10P2J98oj69k7J44K3j11j3J02nq5k9J35K9j46o6
3200a12J44J50j43k04O1K58J7k76j03K23K19j72k76O0L10L2k77j42K15K15j22
3221G7k53L9K19M7j77j06J31J13p4r2L6O1k9l2M3L0n2n6P9R0o2j36J8J87M8k14
3247f5j03J69J77j08k19K1K57O2k04j74J62K12o5k22l9J91J09j33j38M5J52mj06
3270b3m1N5L3j0j6j7Nk5N2L3n5o7K4J16J6j29q5J06J54n6j74l5J91J00j41j77
3296a66Q4K02Qj86q3J35J39o7j51jJ12P1o6q7J0P1L7l0n1k3M3M9po6m4M9R1rj15
3325e1m8Q6J10m8j41j6J38P4j00j28L5J47J6j10p6O3J12j9r9l8N8O7pn9l8M4N8
$$ y = [-4, 92, 25, -137, -75, 129, 124, -127, -203, 54, 245, 19, -269, -129, 216, 217, -162, -283, 50, 269, 52, -265, -159, 175, 204, -97, -232, 14, 223, 52, -158, -86, 112, 106, -63, -90, 54, 77, -34, -47, 55, 50, -35, -64, 71, 100, -46, -112, 32, 182, 39, -165, -104, 154, 171, -105, -208, 15, 234, 62, -214, -154, 156, 188, -89, -231, -16, 199, 77, -176, -137, 82, 129, -48, -154, -23, 90, 16, -76, -40, 21, -8, -40, 3, 33, -19, -75, 4, 94, 32, -104, -86, 101, 149, -65, -168, 1, 178, 70, -149, -128, 129, 191, -13, -187, -25, 187, 122, -100, -139, 52, 161, 28, -110, -65, 87, 83, -23, -64, -9, 24, 14, -2, -19, -14, -39, 13, 46, -9, -76, -52, 64, 80, -49, -134, -28, 126, 70, -104, -139, 52, 152, 11, -166, -82, 120, 128, -58, -141, -6, 133, 66, -85, -86, 26, 97, 31, -56, -46, 25, 62, 32, -19, -42, 1, 50, 43, -23, -67, -18, 73, 64, -51, -99, -13, 97, 49, -92, -108, 30, 104, 4, -124, -89, 58, 74, -36, -112, -49, 63, 44, -55, -93, -35, 32, 25, -34, -72, -28, 30]
3352C0Km8m8K0Q3L4q0q5N2J28J0j26q5J05J26m8j54lJ46P2j14j18N7J34mj19n3
3379h6Q3Q4l1q4ML1K4j0mj6k3OO9Pr9k8O2J00m9j44nJ58Q0j44j44R3K01rk12q3
3409a69J94J43j33j74L9J94K6j57q7J17J22o0j23K1Q8On7J1M2m6k5L5O3m3j12
3434h5J5J73K1j73j15J74J72j15k33RK85P6k44k00J78K51p9k72l7K49J35j85j85
3457a85R5K03j8j60n4J11O2o6k6L3J5m8J7Q1k9j13j5J68R3j76j84J48K46k9l05
3482a36p3K77J99k16k88Q1L47N0l15j63K16K51j02k70j4K32Q8j51j33M7J20J8
3504F5o6j4qj4M6O8m4j41j8J87J15j73k25J09K95J8l34j46K89K80j58l78K0L58
3528A31J55k84k68J47L15j1k71j08J83J73n9j69l3R7Q6Jo6r1lJ16J10q2k16j2
$$ y = [30, 32, -16, -64, -44, 39, 73, -7, -92, -40, 88, 98, -28, -113, -8, 118, 70, -84, -87, 59, 131, 17, -101, -44, 90, 86, -33, -86, -3, 81, 50, -34, -30, 1, 25, 15, 11, -5, -28, -22, 47, 54, -45, -73, -11, 89, 40, -104, -109, 49, 129, -15, -159, -66, 135, 126, -86, -169, 25, 168, 35, -139, -100, 94, 120, -37, -124, -7, 115, 55, -68, -47, 41, 47, -10, 1, 43, -3, -28, 7, 70, 27, -85, -70, 103, 124, -49, -164, 10, 182, 67, -166, -157, 128, 204, -40, -240, -62, 189, 110, -162, -199, 50, 185, 0, -185, -90, 113, 95, -65, -119, -8, 54, -12, -38, -5, 10, -38, -21, 60, 31, -82, -97, 71, 164, -12, -196, -48, 198, 169, -136, -209, 68, 267, 51, -237, -156, 191, 241, -74, -237, -21, 230, 128, -142, -156, 76, 164, 13, -120, -73, 47, 65, -1, -15, -23, -37, 9, 77, 33, -108, -126, 61, 176, 3, -222, -113, 182, 200, -134, -280, 9, 289, 131, -247, -227, 131, 286, 2, -266, -119, 196, 185, -86, -194, -11, 162, 103, -66, -99, -2, 84, 85, 19, -72, -75, 41, 151, 69, -147, -159]
3552a59K57J43k21k78J11L61M5l61k13K77L37j12m03o4L36K28k41k95P4L02O0
3573A84k13j64J00J82J8j24r6L0R0J07m9j55o4J32K11o9k72q1K96K38k16l62N6
3596b21M23J34l74l14K56M10p5m12j28L41K73j89l46K5K96J14j99j71P8J48J8
3617H7n8j03k2N3J32L0j38j77J02K65K1l13j82K67L52j57m21m8M28K50l46m01
3639c79J79M62K6m39j99L30L34j73l49J1K76J30j85j69P5J35J6n7l7k0j1P6J12
3662A44q4k06J0K75J13k64k78J93L85m6m37j39L95L20k66m60Q8M88J00m22k77
3683c68L06L52j06l98l4L28J38k05k04R2J66k2o8k2J7l2N1Q6pj91n2K30J74j92
3707C9l02J00L94M6m11k07L38L75k07m84L6M79J67m14k99K64L90j02l96o6L39
$$ y = [-159, 98, 241, 20, -258, -147, 214, 259, -102, -315, -38, 299, 187, -216, -280, 56, 284, 43, -252, -178, 124, 184, -29, -193, -93, 89, 107, -17, -113, -83, 7, 114, 65, -90, -154, -22, 189, 120, -152, -233, 63, 301, 85, -277, -221, 202, 336, -38, -352, -96, 314, 239, -173, -301, 40, 313, 124, -222, -197, 99, 213, 14, -157, -79, 69, 87, 29, -74, -96, -43, 89, 119, -19, -196, -94, 171, 192, -121, -303, -36, 316, 159, -262, -310, 118, 368, 22, -379, -200, 262, 288, -151, -350, -20, 314, 141, -208, -197, 79, 209, 24, -145, -70, 65, 81, 24, -13, -33, -44, 32, 144, 60, -146, -136, 139, 252, -12, -290, -97, 288, 242, -195, -334, 61, 381, 115, -345, -257, 231, 331, -91, -368, -62, 290, 184, -214, -248, 80, 218, 13, -191, -99, 67, 45, -23, -45, -28, -60, -9, 77, 70, -121, -173, 57, 231, 39, -263, -163, 231, 277, -134, -341, -3, 372, 165, -319, -283, 196, 363, -51, -350, -86, 304, 202, -194, -260, 79]
3728G9J62k19k05R6J79j8j19j7O6k7j2N7L3j31p8J60J83j32k80M9L39P9l46k39
3752c41K83L71j34m65k7M62J93l62l43K33M13m6m31q2L38K14k27k48J01K24jj52
3774b7n9R8L2m3K8K3p9o1J11J42q8k49J2L09J07l11k49K48L45j12m24o2M41K24
3798C56l66l41J95M17j9m11j39L27K42k00k85P5K61K8j98o3J10N2l0l2L1m5l7
3821g2P9J39r7k11K0K74J00k86k33K24L48r1m02r6M03K50l17l56J57M24J0m01
3843a34j72L06K65j69k98M0K53P1j86j05Q3Q8k1m2Qj5m5O1J11m7j99j4K37J42
3867B18k49k41J67L41k5m01j32L78K73k52l88J10M09O5l65j93K65K66j10l05k
3888a71K55R2j72j23Q6R8k0m7%%l8L4R0j1j60m3J88J49j78k32P6L16J4l20j57
$$ y = [79, 241, 22, -183, -87, 92, 74, -45, -62, 4, -23, -35, 22, 55, -76, -154, 6, 189, 57, -223, -174, 165, 244, -102, -341, -58, 313, 179, -286, -313, 149, 342, -20, -363, -130, 283, 237, -194, -276, 62, 276, 49, -199, -98, 126, 125, -27, -86, 12, 44, 1, 29, 52, -27, -88, 23, 165, 77, -172, -160, 149, 256, -55, -304, -56, 289, 177, -247, -309, 132, 356, -10, -351, -156, 261, 242, -169, -308, 19, 261, 61, -224, -149, 112, 140, -58, -121, -11, 41, 11, -21, 10, -35, -72, 7, 146, 49, -162, -142, 132, 232, -54, -287, -63, 285, 194, -208, -304, 99, 349, 32, -324, -167, 257, 267, -134, -306, 0, 265, 96, -202, -162, 91, 162, -24, -129, -46, 42, 21, -21, -13, -28, -73, -12, 99, 52, -147, -161, 76, 218, -31, -272, -105, 236, 211, -190, -322, 56, 329, 77, -311, -201, 208, 273, -92, -285, -20, 246, 136, -169, -171, 84, 176, 4, -119, -33, 65, 45, -2, -2, -2, -40, -6, 84, 73, -87, -130, 58, 207, 29, -203, -127, 189, 203, -117, -274]
3913b74K69K95j82l51K9L49J26k98k30J82K85n7k97k0J98J25j25j47N1J24no9
3935b2nJ1k1J9O6Pj15m3J26J30r8k09M5K41M8k29j59J83K49j05k85KK61J29k31
3960ek03J34K29k9k13o1J69R6j09j17L3R8J0m9k7J3OJ5L3Mp7m3R4R7q5j49K4J89
3988G7N6j83j31J28K08o3k27rK01J06j58j74R8J92k0j82l6J41R0r4r1L9P2j2k7
4013AoK7k7jL4Pn6m2N3R7m2j16lJ28O0j37j18R0J72m7j92k9J72J06j41j41P5J58
4041H2mj50l8J15Q0p8r8L7R0nn9j3M3Qj4oM2k6l2J1O1kq6k4R6O8p0j11M4J29M
4072I4j48m5J21J00p4j55M9J16K2j16o6R1Q6m2j05J4P5K4n6m1L4K4rl0J6J4l3
4099d0J3K0K0l1m0L4O2k1p5MP5K7p8l7L5Q9j5q9k6Q5O9p5o5K8Q0qn6k6N6L1l0
$$ y = [-274, -5, 290, 108, -243, -214, 135, 261, -37, -267, -85, 200, 143, -154, -174, 24, 149, 24, -123, -72, 52, 47, -22, -27, -16, -37, -18, 48, 55, -60, -103, 23, 153, 55, -154, -109, 132, 180, -49, -208, -25, 224, 119, -166, -164, 97, 226, -5, -208, -74, 155, 126, -87, -148, 21, 117, 8, -109, -76, 22, 32, -17, -44, -31, -25, -10, 23, 27, -50, -93, 1, 98, 13, -136, -112, 77, 133, -50, -181, -53, 155, 92, -135, -144, 57, 163, 5, -169, -71, 121, 101, -81, -117, 24, 114, 20, -71, -32, 40, 28, 1, -5, 22, -5, -6, 28, 35, -21, -63, -10, 87, 45, -71, -74, 54, 114, -23, -141, -51, 121, 74, -118, -147, 25, 131, -10, -151, -76, 82, 78, -72, -110, 5, 85, 7, -91, -54, 36, 31, -28, -41, 2, 10, -4, -10, 32, 6, -26, -15, 46, 44, -42, -66, 30, 98, 28, -83, -39, 90, 94, -54, -99, 22, 122, 48, -107, -58, 58, 80, -36, -102, -11, 75, 33, -72, -58, 17, 41, -15, -56, -22, 2, -7, -37, -21, -7, -40, -27, -7, 13, -18, -58, -24, 38, 17, -58, -54, 21, 48, -30, -67, -32, 57, 42, -47, -73, 12, 81, 6, -59, -31, 49, 41, -15, -41, 15, 46, 16]
4130A6m6J4K1J2k8PJ5k0KPJj7rJ6K0Pm8j6M1K3l7k3J5K6J9m9rK3L5k4pl0M4Rj6
4165fk1J3K6J2k5k5K8J8j6omrJ4K6j7lkJ1J5j2k7QK8lk3j5M5kj8l3J0L0Kk1j6
4200a8K0Ljl1K6lLj6j0QmOrK1lk1RK5j2j5j1L2K0j7m0J7L7kl8j4L8J5j6l3kO0
4236B4Kk5k8K1L0k1l2K6K1J7l8j9K6K9k6qJ0joj9K1Pk0l1K3L2j8l7RM0J2m3m6
4269f8M6M4j6m1j3N2L6n2l4L2L7J1n0l3M4L9j8m0MK6J8nk2jRJ5Lrj2k7M1L0l7
4302Il2J3N5J8o6m1L1O2mp6k0O0N8m2q2OQ2L3p0o1L1O5on9j4K2L9J7n0j8PM7P
4335B1l2k5k3P5K3m0m7oQ8K7p3o6N0Q9nq8l2N9Q1k3j05qP2P0n8p3RP5L1m5q0L4
4367b5N6M4n7m7oM9L3k8o7JO0N3m8q6%Q6M6o9q4K2J02K4q8q3P4J10rj23l0Q0Q5
$$ y = [16, -30, -16, 5, 17, -11, -4, 11, -9, -7, 0, 1, -16, -25, -9, 11, 18, -30, -46, -5, 18, -19, -42, -27, -1, 18, -31, -40, -17, 18, -6, -13, -43, 1, 10, -6, -27, -14, 12, 24, -1, -26, 2, 20, 4, -2, -6, -15, -1, 25, 8, 5, 3, 14, 29, 17, -10, -2, 26, 23, 0, -15, 30, 28, 10, -23, -13, 17, 19, -2, -18, 2, 5, 4, -27, -1, -4, -1, -17, -27, -19, -23, -17, -26, -5, -8, -29, -20, 5, -7, -22, -33, -1, 19, 2, -38, -21, 16, 14, -24, -38, 0, 15, -1, -34, -36, 24, 26, 1, -27, -6, 24, 3, -29, -3, 18, 35, -3, -22, 4, 33, 7, -1, 9, 8, 2, -17, 4, 11, -9, -40, -17, 15, -3, -40, -31, 9, 21, -22, -68, -22, 22, 6, -35, -48, 4, 40, -12, -46, -14, 23, 34, -16, -49, -5, 34, 16, -24, -20, 6, 24, 19, -3, -4, 5, 20, 23, 14, 2, -25, 16, 46, 9, -23, -10, 45, 63, -3, -44, -13, 49, 45, -31, -51, 9, 67, 25, -57, -51, 31, 64, -6, -67, -36, 29, 23, -36, -50, -28, 11, 28, -22, -40, -33, 14, 21, -11, -36, -59, 16, 39, -1, -48, -54, 34, 61, -12, -78, -28, 61, 56, -32, -64, -5, 76, 53, -52, -60, 12, 82, 24, -49, -40, 35, 66, 21, -59, -25, 31, 75, 18, -29, -35, 14, 47, 19, -48, -47, 13, 66, 18, -68, -68, 18, 64, -5, -89, -67, 35, 59, -29, -112, -38, 72, 63, -60, -90, -10, 75]
4398G5l2r8j6Q9M6k8p7qO2M5k3o3l0O7O8k2r5rN6Q6m5r6j6R8Q1p4j14jJ36M4r6
4429A0r9L6J37pj04o4O0J03k0r0m5O5O9j3o4k4K9O6mp5m3L7Q9Np9p0O3J04%j28
4459e6o1J03J20m9j38j7J33P7q7j05lJ43M2j15q4O4J07kq3n6M8Q3pp5m2L3N8J3
4487D4l9n8J2P1L5n5j00K5J24K7j04r8O8J34j5j46m5J15J16o4j55lJ37O8j04r8
4513a08N3J03J9j00m7O4O2j8m7l0K5M8J7l2k9j9N7N4n3o5KQ1M9o0j13L1J28L8
4541A10j31q3Q4J37m1j43l1J25Q2q0j22K4J16L0p7q1N9O0jn2m4N1L3j6k6k9K3
4568b3J8M7l2o6oP2P0n5q8LJ25J4q0r8N3J38lj32m2R8Q7n1j09J1R4M6p1q0K6Q0
4598D6J1p1l4M1L4J6l5m1ML9J9k2l9k5P1L8n2p6J8P2L4o5p5L8J02J3j10n0P9Q3
$$ y = [75, 43, -55, -71, 18, 64, 36, -41, -49, 13, 58, 35, -28, -58, 9, 77, 55, -40, -49, 7, 93, 48, -48, -64, 34, 115, 41, -73, -74, 62, 106, 10, -89, -53, 84, 77, -27, -91, -31, 72, 52, -38, -83, -18, 51, 38, -26, -50, -21, 45, 41, -34, -77, -40, 49, 54, -25, -95, -32, 72, 72, -56, -117, -14, 106, 57, -81, -98, 35, 112, 25, -80, -83, 60, 102, -13, -97, -33, 74, 72, -11, -67, -19, 64, 57, -18, -60, -27, 31, 44, 5, -53, -41, 30, 65, 10, -90, -65, 59, 86, -18, -116, -48, 86, 71, -75, -120, -5, 111, 47, -108, -111, 26, 94, -10, -108, -55, 48, 67, -33, -80, -16, 46, 28, -19, -49, -24, 24, 41, 9, -20, -39, 18, 72, 19, -46, -44, 37, 86, 26, -87, -56, 72, 110, -21, -104, -20, 117, 76, -67, -98, 27, 109, 29, -93, -69, 47, 77, 0, -81, -22, 38, 37, -15, -59, -8, 25, 9, -17, -46, -23, -5, 42, 10, -56, -62, 10, 80, 25, -63, -60, 65, 79, -1, -99, -46, 92, 89, -43, -85, 13, 100, 49, -60, -49, 45, 91, 20, -60, -34, 46, 57, -14, -48, -7, 27, 43, 8, -33, -29, 10, 29, 7, -32, -57, 14, 52, 0, -76, -58, 14, 48, -17, -92, -54, 48, 61, -49, -99, -20, 63]
4628F3l4r1j1Q0N7n4o9K5N7K3m8m2L4M2mk0k0mL1L1j0m9k8O0M9k3q6mP0N8o1q7
4660f5M6Q3J2r5n1O9O4k9r0mP8M0o3n7J8O7Rm1k9MM9nk0rj0K0K4nk2k9K9N5j8
4693B5o9JN7O1n8q6K6R5K2q5p7Q5Q4l6r4jP3N8o6n2J8P0%n6l0L0M1j9j8k3J8J0
4725DJ0qk0k2J5M2no2k0N5N0l4p7qR1L9p3p3O7Q2j5p7m2Q1O8m8r6J1Q5K9o2m2
4757e5L5N0Lm3mK1NRj6kj7LM7pm0k7N0M2j9q5%R0J3n1o2K1R4j4q8k2O7O7m2p9
4791e6MO8K0n9l1J8M5Nk4j9PK7Pj5k0kJ3L2%l8j6M2M7l2n9rP6L8o7n3K7R1Lr4
4825b4l2O6O4n4o7K2O6Nm8l5K6M5Jl7j1J8Lj8lOj9QL3pl1k1K0N6nr1ON4O3o6p2
4860g9L2O9J9p8m6O7P7m1p7PQ2K1o2m0M2M7j5m1J0K2Poj0jmkJ1J4j1m6J6O0lo8
$$ y = [63, 29, -62, -73, 7, 64, 10, -59, -34, 23, 46, -2, -44, -10, 32, 28, 8, -12, -16, 15, 46, 36, -13, -41, 19, 68, 45, -41, -45, 25, 83, 22, -65, -19, 64, 76, -19, -70, -1, 63, 34, -56, -60, 18, 58, -5, -62, -44, 23, 32, -9, -38, -34, 15, 10, -10, -19, -29, -9, 15, 10, -12, -41, -12, 43, 25, -44, -43, 14, 75, 17, -69, -43, 52, 74, -11, -88, -3, 81, 45, -49, -50, 23, 81, 15, -37, -19, 51, 51, -5, -35, -5, 36, 17, -1, -24, -6, 4, 14, 6, -14, -36, -21, 21, 16, -46, -66, -11, 39, 5, -72, -80, 11, 50, -23, -96, -29, 53, 38, -39, -81, 0, 68, 20, -76, -65, 20, 49, -13, -55, -20, 30, 33, -10, -14, 7, 12, 21, 5, 3, -14, -11, 36, 29, -11, -38, 12, 54, 35, -50, -50, 40, 53, 2, -60, -39, 55, 41, -47, -69, -2, 65, 23, -56, -52, 16, 36, -23, -54, -36, 9, 14, -10, -29, -22, 5, 12, -3, -23, -25, -12, 20, 20, -18, -34, 8, 55, 23, -36, -45, 31, 69, 2, -51, -24, 67, 70, -24, -56, 10, 74, 20, -47, -25, 41, 46, -2, -37, -11, 34, 35, -2, -13, 5, 8, -10, -13, -7, -26, -18, 15, 8, -23, -44, -24, 32, 27, -64, -58, -4, 59, -7, -79, -47, 22, 41, -37, -83, -16, 61, 20, -57, -50, 32, 53, -9, -49, -7, 40, 25, -16, -6, 16, 23, 17, 7, 6, 2, 0, 11, 25, 14, -32, -16, 44, 41, -27]
4894b7k1O8M4n0q7L4Q2J9r6m2N8P2k3p9j0O1L8o4m2L5M1Nm0j5K9J5nk4J3j0NJ
4926a5K3Ll7oN9jm5l4M7O8l1o3oQ0L5o6o9M2Q5mq6k5O3M0m1o1K6M8J1m4j2J8%
4959BJ7k5J0k7j3K9J6j6m5K5M1Qm9k6K7P0j8o7k2P0M4o3l7PP3Nn9l1N0M4rn2J
4992b0L9J7l2olJ6jrK0k1JML3k6k8oL7K8m7l8K8M9ro5j3O3K9m1o0K2O9ln0k7L9
5027a1K7k1k9LL5kj0jpmJ0J6Mj6j6PL8j4l1jL6L1m8l5K7M4Po3%N0J9k6m3pP1J2
5063E2m8k3K4L0ol5KK3nj6Pkj2QkQj3j3J2K7nl9k0N3K4m1l7K3M4lm9j2M6L4m3
5098gm7K5M7Jk9k0M6J4k6k1K1J2j0j0lL0j7j7J3K0Ml2jL2J0k8l2K9L3l3l7ON8
5131C1Ln7k6M6M4l5m1J0N5pl9l2M0K3l1j5MM5j3m0J7K3Qm0OK9Qk1k2K5K6j4l4
$$ y = [-27, -48, 20, 64, 14, -73, -39, 43, 62, -34, -76, -18, 54, 31, -48, -58, 3, 41, -23, -65, -30, 11, 16, -24, -39, -10, 5, 0, -24, -11, -21, -16, -15, 8, 11, -26, -32, 27, 26, -19, -53, -6, 62, 31, -32, -38, 42, 77, 11, -58, -16, 69, 65, -21, -46, 17, 57, 16, -45, -19, 29, 40, -4, -16, 2, 2, 19, -6, 4, -23, -36, -7, 9, -7, -52, -27, 14, 22, -27, -53, -26, 44, 26, -41, -63, 7, 51, -12, -49, -42, 31, 36, -23, -54, -4, 40, 31, -21, -20, 19, 36, 4, -2, -5, 11, 10, 1, 21, 0, 1, 5, 38, 12, -16, -22, 15, 43, -4, -42, -14, 35, 26, -39, -52, 11, 40, -1, -61, -39, 30, 27, -23, -50, -11, 16, -5, -34, -31, 4, 2, -8, -9, -16, -20, -10, 6, 10, -6, -22, -15, 23, 9, -22, -23, 13, 44, -4, -39, -12, 32, 39, -24, -24, 26, 45, 19, -24, -31, 40, 52, 4, -19, 5, 35, 29, -6, -4, 19, 14, -2, 5, 3, -9, -1, -3, 5, -8, -21, -9, 18, 13, -26, -46, 7, 31, -10, -47, -24, 20, 17, -32, -44, 2, 36, -7, -54, -29, 18, 19, -10, -30, 16, 30, 4, -17, 4, 16, 6, -4, -7, 23, 6, -11, 2, 22, 26, -6, -7, 25, 35, 7, -25, 4, 37, 4, -33, -27, 31, 34, -23, -49, -3, 41, 6, -35, -25, 30, 23, -16, -48, -8, 15, -16, -31, -27, 18, 5, -35, -18, 5, 13, -27, -21, 8, 16, -5, -27, -2, 24, 10, -24]
5164b4K1L3ln5JO0K3n5m0L5O1k5m7qN1K2n1j7K7L4k2m7MN1j0l2%J9jj8j0K2J5
$$ y = [-24, -3, 30, 27, -28, -27, 33, 56, 1, -39, -4, 57, 32, -15, -23, 28, 50, -1, -18, 9, 43, 21, -26, -22, 29, 19, -13, -13, 6, 5, -13, -23, -1, 14]
$$ [...]
8191A0
##END NTUPLES=NMR FID
##END=
