##TITLE=1H_Pr 5-MeS
 D2O
 8 sc, 
 13.3.2024
##JCAMPDX= 6.0         $$ Bruker NMR JCAMP-DX V2.0
##DATA TYPE= NMR FID
##DATA CLASS= NTUPLES
##ORIGIN= UXNMR, Bruker Analytische Messtechnik GmbH
##OWNER= root
$$ XWIN-NMR		Version 3.5
$$ Wed Mar 13 16:02:12 2024 Russian Standard Time (UT+4h)  she@DPX200
##.OBSERVE FREQUENCY= 200.1313
##.OBSERVE NUCLEUS= ^1H
##.DELAY= (6, 6)
##.ACQUISITION MODE= SIMULTANEOUS
##.ACQUISITION SCHEME= undefined
##.AVERAGES= 8
##.DIGITISER RES= 18
##SPECTROMETER/DATA SYSTEM= spect
##.PULSE SEQUENCE= zg30
##.SOLVENT NAME= D2O
##.SHIFT REFERENCE= (INTERNAL, D2O, 0, 15.7039)
##AUDIT TRAIL= $$ (NUMBER, WHEN, WHO, WHERE, WHAT)
$$ ##TITLE= Audit trail, XWIN-NMR		Version 3.5
$$ ##JCAMPDX= 5.01
$$ ##ORIGIN= Bruker BioSpin GmbH
$$ ##OWNER= she
$$ F:/spectra/data/she/nmr/H-F/1/audita.txt
$$ ##AUDIT TRAIL=  $$ (NUMBER, WHEN, WHO, WHERE, WHAT)
(   1,<2024-03-13 16:00:57.28 +0400>,<she>,<DPX200>,
      <created by zg, POWCHK disabled, PULCHK disabled
       configuration hash MD5:
       00 E9 B6 7A A2 85 ED C7 34 08 36 98 17 FE 4E 26
       data hash MD5: 16K
       4F 58 1A 66 A7 46 CF 07 8F 6E 3D 3F 7A 7C 48 8B>)
$$ ##END=
$$ 
$$ hash MD5
$$ 98 3F E4 C9 BC 24 C2 7D 1C B5 AE 7D 17 B3 AD 02
##$RELAX= 
##$RELAX= 
##$RELAX= 
##$RELAX= 
##$RELAX= 
##$RELAX= 
$$ Bruker specific parameters
$$ --------------------------
##$DU= <F:/spectra>
##$EXPNO= 1
##$NAME= <H-F>
##$PROCNO= 1
##$TYPE= <nmr>
##$USER= <she>
##$AMP= (0..31)
100 100 100 100 100 100 100 100 100 100 100 100 100 100 100 100 100 100 
100 100 100 100 100 100 100 100 100 100 100 100 100 100 
##$AQSEQ= 0
##$AQ_mod= 1
##$AUNM= <au_zg>
##$AUTOPOS= <>
##$BF1= 200.13
##$BF2= 200.13
##$BF3= 200.13
##$BF4= 200.13
##$BF5= 200.13
##$BF6= 200.13
##$BF7= 200.13
##$BF8= 200.13
##$BYTORDA= 1
##$CFDGTYP= 0
##$CFRGTYP= 5
##$CHEMSTR= <none>
##$CNST= (0..31)
1 1 145 1 1 1 1 1 1 1 1 1 1 1 1 1 1 1 1 1 1 1 1 1 1 1 1 1 1 1 1 1 
##$CPDPRG= <>
##$CPDPRG1= <>
##$CPDPRG2= <>
##$CPDPRG3= <>
##$CPDPRG4= <mlev>
##$CPDPRG5= <mlev>
##$CPDPRG6= <mlev>
##$CPDPRG7= <mlev>
##$CPDPRG8= <mlev>
##$CPDPRGB= <>
##$CPDPRGT= <>
##$D= (0..31)
0 1.2 0 0 0 0 0 0 0 0.06 0 0.03 0 0 0 0 0.0002 0 0 0 0 0 0 0 0 0 0 0 0 
0 0 0 
##$DATE= 1710331256
##$DBL= (0..7)
120 120 120 120 120 120 120 120 
##$DBP= (0..7)
150 150 150 150 150 150 150 150 
##$DBP07= 0
##$DBPNAM0= <>
##$DBPNAM1= <>
##$DBPNAM2= <>
##$DBPNAM3= <>
##$DBPNAM4= <>
##$DBPNAM5= <>
##$DBPNAM6= <>
##$DBPNAM7= <>
##$DBPOAL= (0..7)
0.5 0.5 0.5 0.5 0.5 0.5 0.5 0.5 
##$DBPOFFS= (0..7)
0 0 0 0 0 0 0 0 
##$DE= 6
##$DECBNUC= <off>
##$DECIM= 32
##$DECNUC= <off>
##$DECSTAT= 4
##$DIGMOD= 1
##$DIGTYP= 9
##$DL= (0..7)
0 120 120 120 120 120 120 120 
##$DP= (0..7)
150 150 150 150 150 150 150 150 
##$DP07= 0
##$DPNAME0= <>
##$DPNAME1= <>
##$DPNAME2= <>
##$DPNAME3= <>
##$DPNAME4= <>
##$DPNAME5= <>
##$DPNAME6= <>
##$DPNAME7= <>
##$DPOAL= (0..7)
0.5 0.5 0.5 0.5 0.5 0.5 0.5 0.5 
##$DPOFFS= (0..7)
0 0 0 0 0 0 0 0 
##$DQDMODE= 0
##$DR= 18
##$DS= 0
##$DSLIST= <SSSSSSSSSSSSSSS>
##$DSPFIRM= 0
$$ [...]
##$SUBNAM2= <"">
##$SUBNAM3= <"">
##$SUBNAM4= <"">
##$SUBNAM5= <"">
##$SUBNAM6= <"">
##$SUBNAM7= <"">
##$SUBNAM8= <"">
##$SUBNAM9= <"">
##$SW= 18.0517328524113
##$SWIBOX= (0..15)
0 0 2 0 0 0 0 0 0 0 0 0 0 0 0 0 
##$SW_h= 3612.71676300578
##$TD= 16384
##$TD0= 1
##$TE= 0
##$TE2= 300
##$TE3= 300
##$TEG= 300
##$TL= (0..7)
0 120 120 120 120 120 120 120 
##$TP= (0..7)
150 150 150 150 150 150 150 150 
##$TP07= 0
##$TPNAME0= <>
##$TPNAME1= <>
##$TPNAME2= <>
##$TPNAME3= <>
##$TPNAME4= <>
##$TPNAME5= <>
##$TPNAME6= <>
##$TPNAME7= <>
##$TPOAL= (0..7)
0.5 0.5 0.5 0.5 0.5 0.5 0.5 0.5 
##$TPOFFS= (0..7)
0 0 0 0 0 0 0 0 
##$TUNHIN= 0
##$TUNHOUT= 0
##$TUNXOUT= 0
##$USERA1= <user>
##$USERA2= <user>
##$USERA3= <user>
##$USERA4= <user>
##$USERA5= <user>
##$V9= 5
##$VALIST= <valist>
##$VCLIST= <CCCCCCCCCCCCCCC>
##$VD= 0
##$VDLIST= <DDDDDDDDDDDDDDD>
##$VPLIST= <PPPPPPPPPPPPPPP>
##$VTLIST= <TTTTTTTTTTTTTTT>
##$WBST= 1024
##$WBSW= 4
##$XGAIN= (0..3)
0 0 0 0 
##$XL= 0
##$YL= 0
##$YMAX_a= 453187
##$YMIN_a= -534214
##$ZGOPTNS= <>
##$ZL1= 120
##$ZL2= 120
##$ZL3= 120
##$ZL4= 120
##$ABSF1= 10
##$ABSF2= 0
##$ABSG= 5
##$ABSL= 3
##$ALPHA= 0
##$AQORDER= 0
##$ASSFAC= 0
##$ASSFACI= 0
##$ASSFACX= 0
##$ASSWID= 0
##$AUNMP= <proc_1d>
##$AZFE= 0.1
##$AZFW= 0.1
##$BCFW= 1
##$BC_mod= 2
##$BYTORDP= 1
##$COROFFS= 0
##$CY= 11.3945322036743
##$DATMOD= 1
##$DC= 2
##$DFILT= <>
##$DTYPP= 0
##$F1P= 15.7292609196834
##$F2P= 12.9074282941183
##$FCOR= 0.5
##$FTSIZE= 0
##$FT_mod= 4
##$GAMMA= 1
##$GB= 0.15
##$INTBC= 1
##$INTSCL= 1
##$ISEN= 128
##$LB= 0.24
##$LEV0= 0
##$LPBIN= 0
##$MAXI= 10000
##$MC2= 0
##$MEAN= 0
##$ME_mod= 0
##$MI= 1.114404
##$NCOEF= 0
##$NC_proc= 0
##$NLEV= 6
##$NOISF1= 3.799351
##$NOISF2= 2.8
##$NSP= 1
##$NTH_PI= 0
##$NZP= 0
##$OFFSET= 15.70392
##$PC= 1
##$PHC0= -25311.84
##$PHC1= 13.98731
##$PH_mod= 1
##$PKNL= yes
##$PPARMOD= 0
##$PSCAL= 0
##$PSIGN= 0
##$REVERSE= no
##$SF= 200.130013532006
##$SI= 16384
##$SIGF1= 3
##$SIGF2= 2
##$SINO= 400
##$SIOLD= 16384
##$SREGLST= <1H.CDCl3>
##$SSB= 0
##$STSI= 0
##$STSR= 0
##$SW_p= 3612.71676300578
##$SYMM= 0
##$S_DEV= 0
##$TDeff= 0
##$TDoff= 0
##$TI= <>
##$TILT= no
##$TM1= 0
##$TM2= 0
##$TOPLEV= 0
##$USERP1= <user>
##$USERP2= <user>
##$USERP3= <user>
##$USERP4= <user>
##$USERP5= <user>
##$WDW= 1
##$XDIM= 8192
##$YMAX_p= 0
##$YMIN_p= 0
$$ End of Bruker specific parameters
$$ ---------------------------------
##NTUPLES= NMR FID
##VAR_NAME=  TIME,          FID/REAL,        FID/IMAG
##SYMBOL=    X,             R,               I
##VAR_TYPE=  INDEPENDENT,   DEPENDENT,       DEPENDENT
##VAR_FORM=  AFFN,          ASDF,            ASDF
##VAR_DIM=   8192,          8192,            8192
##UNITS=     SECONDS,       ARBITRARY UNITS, ARBITRARY UNITS
##FACTOR=    0.0002768,     1,               1
##FIRST=     0,             0,               0
##LAST=      2.2672688,     0,               0
##MIN=       0,             -534214,         0
##MAX=       2.2672688,     453187,          0
$$ Real data points
##PAGE= N=1
##DATA TABLE= (X++(R..R)), XYDATA
0@%%%%%%%%%%%%%nNqJ6j6J7j7K4l2L4m2N0n7O7p7Q9j01J15j32J48j70J92k14K41
37A27k69L03l36L71m14M59n09N62o21O86p55Q33r17J010j113J226j355J499j660
56h73J843k054K303k597K953l393L950m685N703p214R685j4435K6867j22802l84653
71d89402l3011K08665L04608K54780J44529M713n7046j31242k38345k65378j34673
82d31802N885J11473K16133K71887J92517N5384r0542k28015k69231j46479O041
93c06749R0597J52291J94150J38621L4945m9946j46807k39304k19232q9650P2375
104c68709K40987L40933K39976k264j77902k20864j99203j29005l6877L2160J11641
115a69127K12656K12532P1101o8203j22662j49051j55149j03436k2934P5946J97280
$$ y = [0, 0, 0, 0, 0, 0, 0, 0, 0, 0, 0, 0, 0, 0, -5, 0, -8, 8, -8, 9, -8, 16, -16, 18, -24, 26, -31, 36, -41, 48, -53, 62, -70, 78, -92, 100, -114, 127, -142, 161, -175, 196, -218, 241, -268, 294, -327, 359, -396, 437, -480, 530, -583, 643, -712, 787, -873, 970, -1084, 1219, -1378, 1575, -1818, 2132, -2553, 3150, -4064, 5621, -8814, 18053, -104749, -489402, -522413, -313748, -9140, 245640, 390169, 394882, 337836, 206594, -31751, -297129, -431802, -425917, -314444, -98311, 173576, 366093, 421477, 330935, 102920, -166311, -312790, -306749, -216152, -63861, 130289, 268910, 303855, 253909, 107102, -132202, -351434, -441084, -368709, -127722, 213211, 453187, 450923, 273021, 52157, -147046, -276051, -312928, -280768, -169127, 43529, 256061, 327162, 258959, 136297, -12754, -167903, -271339, -294273, -218327, -21047]
126b1047K39274J20069m7761j37702j71555j73508j06234J823R7102J87208K29200
137B16869J41969k3278j39169j93712k05247j29998O634J08964J61852J85768
147A30652J39625K6464p4402j36432j76070j37178j4114Q4639J08967J13119J04712
158A69982N2291k2157j00463j82004j90256o5368R4076J72593J79956J50392O7514
169C26556m0258j28480j93546j99707r0899O5640J45496J43559J16863O3649j2103
180A96770p2527j20904j48969r6592K9619J25964J46743J26091O3896l3237j03811
191A13043j26738j34753j09127k0138Q1429J44927J72255J39157K6794r1506j43588
202E1755j45288j15000l5715O2888J28995J53380J22968J7292j00989j42165j13673
$$ y = [-21047, 218227, 338296, 290535, 152833, -18722, -192230, -298464, -296641, -199539, -12331, 216869, 358838, 335560, 196391, 2679, -202568, -332566, -325932, -216968, -55116, 130652, 270277, 296741, 222339, 85907, -90163, -227341, -241455, -156816, -47849, 65270, 169982, 222273, 200116, 99653, -82351, -272607, -337975, -243899, -71306, 108650, 259042, 326556, 286298, 157818, -35728, -235435, -326334, -260694, -115198, 28361, 145224, 208873, 196770, 124243, 3339, -145630, -242222, -212603, -86639, 60104, 186195, 250091, 216854, 113043, -13695, -148448, -257575, -277713, -196284, -51357, 120898, 260055, 286849, 195343, 51755, -93533, -208533, -244248, -181360, -52365, 101015, 223983, 241275, 140286, -1879, -115552]
213a15552p2058j9292M6551R9599J32138J33540O0603o3744j43746j41909j00405
224a84275m1834L1441R1618J23974J34807R1871j5312j17256j49713j26514o6318
235b27511K2696R7260J23698J16504P9892k840r6183j38200j23493o7938K1125
246a94990J03307J25532J02177O4616L848p3113j26319j33328r6928j2852Q7170
257a50880J35091J18612P8289K7487l9111r7513j26298j15502n1033N3107J28824
268c8927J28648P8546J4682n2022j00777j12445r3133m0302M7662J26294J40837
279I9063R6219K5733m6630j01564j16391j01520o3544M793Q7111J33234J18335
290A34839N9260k0358q8262j10151q7746m8008K520O4915J11012J11182O7147
$$ y = [-115552, -187610, -206902, -160351, -60752, 71386, 204926, 265529, 201785, 58039, -83870, -184275, -226109, -194668, -103050, 20924, 155731, 247602, 232290, 115034, -34679, -161193, -227511, -204815, -107555, 16143, 132647, 212539, 209699, 113516, -24684, -148177, -216115, -194990, -91683, 33849, 136026, 200642, 204490, 131377, 5058, -128270, -225198, -238050, -150880, -15789, 102823, 181112, 208599, 169488, 71975, -54323, -169825, -220858, -167751, -38927, 89721, 168267, 182949, 130927, 30150, -82295, -175428, -215730, -168068, -41774, 99063, 195282, 221015, 174385, 72821, -43570, -145090, -208634, -203841, -116730, 16504, 134839, 194099, 173741, 85479, -24672, -112418, -160426, -157906, -92991, 18021, 129203, 196350]
301A96350j0129r0231j28086j07657n5164M061O5369J13001J22556Q7474J5063
312B12607p1796j27336j18582o3334j051N0479Q4980R5577Q0210L6820l3887j02021
324D2666j24167q6284j5573N4517R8208J04788P7436K9220l2153r2583j20776
335f4701r5902l1416M1794R4985J07415Q4165M0663j4205p2855j13854j11582
346a35493n7987K1922R1355J14966Q9172L6189j7993o1077q8699r1777o0987O97
358a59712O9164J09818J01220N0581j4292o8007r6913r8260o8372r693O1559J12799
370a0108J16503P0303l93o1669r1688r0390o7269k4611L2061Q3399J05062Q2440
382A43640J9918n1221r4274r5293o4060j5639L8561Q3130J02247Q6276L2398m1361
$$ y = [196350, 186221, 95990, -32096, -139753, -194917, -190856, -125487, -12486, 110070, 197544, 212607, 140811, 13475, -105107, -168441, -169492, -119013, -34033, 61544, 141754, 178574, 144687, 42666, -81501, -167785, -183358, -128841, -30633, 74155, 151591, 180811, 148658, 56075, -64701, -160603, -192019, -150225, -55240, 52175, 136340, 177003, 162798, 89943, -23911, -135493, -193480, -171558, -80203, 34763, 123935, 160124, 142131, 81054, -7645, -99422, -160409, -159712, -90548, 19270, 120490, 171071, 156779, 88772, -8141, -106401, -174773, -184466, -122907, -10108, 106395, 176698, 176305, 114636, 22948, -67442, -134711, -159322, -127261, -43862, 61200, 143640, 163558, 112337, 18063, -77230, -141290, -156929, -118368, -35238, 67009, 153285, 185683, 144322]
394A44322r7003j07793p9396k9668K5215O9996R2692R1095N6792q687p7060j08079
406b7574r0047l7754K4725P1646Q6480P5363M6367m608o4465j01003r5114n1040
418a67024J3156O9963R4043Q5098N6782J0603m9513r6913j04547o9872p103O1087
430a04240R6522Q8040N3309R794l8382p7584q8641p0442k5092L7965Q9769R8261
442F9279O6932J6912l8367q0641r1215p0995l0023K8156Q4839J02562P5617K3038
454A56094l1646p4231q6485p0415m1462M205O2960J01937R1580M4571j8584p2713
466F5811r1246p1621l5435M813N3110Q7938Q3596M6148p515o1200r0993q0225
478i6819m4140j303M7367Q8160R3884O1211Q414n0008r3048r2641n3508n593L9577
$$ y = [144322, 47319, -60474, -139870, -169538, -144323, -74327, 18365, 109460, 166252, 157565, 80505, -27574, -117621, -155375, -130650, -59004, 27476, 102839, 149206, 144598, 80133, -20870, -115984, -167024, -153868, -83905, 10138, 95236, 152018, 162621, 113108, 16195, -88352, -158224, -165327, -104240, -7718, 80322, 133631, 143425, 105043, 27459, -61182, -131624, -156716, -118751, -28982, 69279, 136211, 153123, 114756, 34115, -57100, -128095, -158118, -129962, -45123, 57439, 133056, 156094, 124448, 50217, -36268, -106683, -148145, -143940, -80980, 20957, 112537, 157108, 138524, 65811, -25435, -97056, -132491, -127678, -74568, 13370, 96966, 143114, 135599, 74399, -16594, -96819, -140959, -142262, -94895, -6735, 87149, 148360, 156774, 106766, 13718, -78923, -132431, -138024, -98447]
491i8447P4109P9714N6162K0230k5733p3448r2394o5830j4574L8235P8597Q6312
503F2933N9048J9116k3864o9915r7206p7586k4610L0468P2956Q6069O5146K7570
515A30125q376n0326q5934q3830m1033J5095O3021Q7816P1916K9036j2817m9487
527F5206p9442p8663m1321P614N1550Q3012Q0674M3705l413m5006p6966q3342
539g6392n1422n668L9571P7715Q9136N7040K137m4719p4393p7205m8107p790K6344
552i3753N9945Q2753O7749J8110l5323p2117q2737n6900j1937K6740N7535Q0319
564D0384P1113K4772k8856o5729q0707o4608k2912J7574M9857P5893P7269L9057
576A33107j4946n7207p9190p2260l2287J5633M9710O9435O8827L7278r002m5353
$$ y = [-98447, -24338, 55376, 111538, 131768, 106035, 32587, -59807, -125637, -140211, -101976, -23379, 62933, 121981, 141097, 117233, 47318, -49888, -127474, -152084, -121616, -48660, 37409, 102555, 130125, 121749, 71423, -14511, -98341, -139374, -124279, -61258, 26558, 98474, 127510, 114693, 65206, -14236, -92899, -134220, -126606, -75056, 7956, 88630, 132335, 128922, 83916, 6950, -76392, -127814, -133482, -93911, -16196, 72940, 129980, 132117, 87398, 13005, -64200, -112307, -120097, -93753, -33808, 48945, 116694, 134804, 99481, 27364, -55373, -112273, -124210, -97470, -39935, 40384, 111497, 136269, 107413, 41684, -39023, -103631, -126543, -108969, -59112, 16781, 94050, 133107, 118161, 60954, -18236, -90496, -122783, -107150, -57440, 11995, 80822, 118100, 109098, 63745]
588F3745o8981p4594m6185N304M9038P3994P5243M5079k260l9887o4271p6124
600e9899n8770q720M1222P0165P3242M9146N826l1771n4473o9638o0791j8334
612a22795L4280O7600P3852N4061J1108l0576n5749o8781o3621k6889K5366O1470
624d0674P3809O2010K5049k0518n2282o6439o4394l4148J3708N2065O8981O5339
636H2506L5226j4021n3642o8318o1340l2331J0941M4925O0488O3440M5110J369
648A14353m5692p0625o8679m2343K870M2356O1909O3697M8895Q284l9708o6530
660H787o6142m3941n685L2736N4911O1162N3711J9868k9006o5162p0189n0799
672i9749j1351L2170N8081O1034M8676J9574k1387n3412o3922n5277k7904J6321
$$ y = [63745, -5236, -79830, -126015, -120711, -71673, 2321, 77564, 122643, 120383, 80496, 16225, -59899, -118669, -127389, -86167, -16002, 57240, 106386, 112212, 80441, 25968, -43670, -104461, -122795, -88515, -20915, 52937, 106998, 118106, 87530, 31781, -37000, -100621, -127510, -102144, -40674, 33135, 95145, 120194, 99676, 47394, -19045, -83439, -117587, -103879, -51814, 17167, 82506, 117732, 103711, 50069, -18249, -79589, -111920, -100979, -56054, 4434, 67874, 112984, 114353, 68661, -1964, -70643, -112986, -110116, -67760, -5851, 57846, 106741, 115025, 75317, 8787, -57355, -101296, -106981, -74245, -19334, 41828, 95539, 115407, 86401, 21239, -48950, -99749, -111100, -78930, -20849, 40185, 88861, 108435, 87048, 33636, -30286, -85563, -113467, -97146]
684i7146N4389O8804N8734K8495j6360n3702o4797n4663k9342J0779M8703O3658
696A7552N3923K9129p936m2468n9058n6357l8692j447M4092O9730O3931L4950
708A07349n667m3143o0164n5251l8058p617L1789N9696O2060M3032Q830l1250
720G1606n8206o0662m3814j2190K8963N9834O3177M3094J0065k7937n5407n9893
732d1370m3790j6021J9990N1304O1976M9964K2142j6374n2044o5410n0788k0147
744a00568J6527M7765N8849M8541K4838q267m3146o2367n4666k5948R761M3134
756d5547N9752N2323K8965l452l8699o1109n7043l1782M044L7835N8223N4422
768E7932L3062K334l1980n6814n8033l7057l567L1368N4718N6171L6632P251k5437
$$ y = [-97146, -42757, 26047, 84781, 113276, 96916, 43214, -21583, -76246, -105588, -94809, -46106, 17552, 71475, 100604, 92668, 50200, -8858, -65215, -103907, -105354, -61262, 8468, 72399, 107349, 101682, 58539, -1625, -56876, -94934, -102551, -70762, -11066, 50994, 94026, 102856, 71606, 13400, -47262, -91076, -103266, -74303, -14469, 48708, 91802, 101867, 73930, 18523, -41370, -85160, -101181, -81191, -29887, 32089, 82053, 104195, 87821, 35777, -29633, -80421, -100568, -84041, -36276, 22573, 71114, 95952, 87685, 44539, -17828, -72494, -98442, -88681, -45547, 14205, 66528, 95493, 92041, 53342, -7767, -64810, -96592, -92548, -54713, 3510, 57932, 90994, 93328, 61348, 4534, -53499, -90556, -94123, -62755, -8037, 48134, 84766, 92017, 66580]
781F6580n0883n7646m1619j2024K4167N2762O0448M2875R815k4023m9904n6661
793c6113m2250j4390J7154M5340N8406M7899J9074j5687m5498n7709m8003k0480
805i2257J2910M2175N6641M9261K1358j2031l9875n3693m7551k4594N591L5268
817d6797N4574N3912L0185m185l7514n6451n3435k9243L837L2750N1766N1290
829E0689L2745J966k8819m9880n3267l5632m434K7761M9416N3692L6666O489k5580
842F1812m8495n4126l8216q510K3323M6012N2465M0203J2877j8197m3678n4436
854b8966m3871j5957J7358M3989N3619M2952J6968j4704m0023n1657m4857k0789
866h5938J1618L8860N2101M5574K2406q889l6148n0678m6873k5696N397L4266
$$ y = [66580, 15697, -41949, -83568, -95592, -71425, -18663, 41785, 84660, 94475, 70452, 20548, -36113, -78363, -92753, -75599, -30259, 28147, 76046, 95120, 79433, 33935, -23774, -71777, -92257, -79347, -37172, 19469, 68730, 90088, 78057, 38182, -15511, -63062, -87656, -82065, -46797, 7777, 61689, 91874, 87689, 50175, -6276, -59711, -88954, -85117, -52367, -601, 50689, 83434, 85400, 56581, 6701, -46566, -82198, -86632, -58871, -9455, 44237, 80903, 87392, 61812, 13317, -40809, -79025, -87535, -64212, -18200, 34265, 74468, 87345, 69148, 25470, -28966, -72837, -88794, -71436, -27447, 26172, 69124, 86092, 71388, 31365, -20292, -65149, -85938, -74320, -35460, 16641, 62215, 84621, 75732, 39584, -11094, -57967, -83663, -78266, -44000]
878d4000N1001M8129K7542l563l2622m8951m8002k9778k1K9205M7763M9632L2373
891G8708K468k7683m6872m8754l3544m924K4243M5056M9570L5713P772k2855m4067
904A4831m9777l6505j0013J9777M2071M9004L9241J3277j6784m0930m9878l9883
916f5569j5552J4547L8954M8411M1086J8094j1806l6518m9187m2057j9812R570
928f9839L5611M7404M2678K2073o361l2725m7248m4325k4499M102L1146M6119
940D136M4739K6272j647k8308m5092m5279k8308j196K6723M4525M5160K9731L401
953G4857k4198m2627m5817l1796o300K1788M2076M6421L3250Q058j9921l9906
965A5885m5768l4843j0985J7354L8429M5930L6462J2715j4908l6852m5976l7360
$$ y = [-44000, 7001, 55130, 82672, 79109, 46487, -2464, -50466, -80244, -80265, -51060, -3297, 46335, 78708, 81176, 53493, 6621, -42133, -75677, -80601, -56358, -11302, 38268, 73981, 81753, 58898, 14831, -34946, -71451, -81464, -61687, -19616, 29388, 68629, 81906, 65122, 24192, -25686, -65569, -81121, -66574, -27620, 20791, 61877, 79971, 68165, 31647, -17540, -59597, -79409, -69839, -34228, 13176, 55854, 77927, 71566, 38841, -8407, -52732, -77231, -73129, -41983, 4136, 48875, 75147, 73500, 45192, 100, -45179, -73487, -74683, -47960, -3435, 41725, 71456, 74857, 50659, 8032, -37785, -69581, -75881, -54093, -12017, 34404, 67654, 75712, 55791, 15885, -29883, -64726, -75711, -58357, -19928, 26002, 62464, 75179, 60271, 23419, -22557, -59917]
977e9917j4950J2453L5709M5521L8381J6987j0188l4065m4812l9203j8771P330
989f5525L2263M4036M0250K1549n670l0272m3956m0773k3267L549K8108M3184
1001C476M1345K4984j070k6166m2125m2240k6223j900K4553M0772M2777K8427
1013F6610L521k2001l9838m2921k9744o195K0203L8596M2863L1456Q085j7992
1025E2643l7304m2879l2832j0275J5780L6011M2906L3934J2453j3318l4706m2912
1037b0499l4994j4813J1223L3171M2273L6292J6890q909l1367m2029l7265j8351
1049f8378O507K9470M1845L7874K0041m357k7466m1361l8786k1987K272K6013
1061c8313M0313L9323K3874r1k3762l9115m0214k5682k254K2294L8076M0526K6877
$$ y = [-59917, -74867, -62414, -26705, 18816, 57197, 74184, 63996, 29931, -14881, -54084, -72855, -65525, -33262, 10774, 51024, 72573, 66903, 36631, -7325, -48098, -71365, -67816, -39708, 3476, 44821, 69805, 68735, 42569, 444, -41796, -68019, -69919, -45366, -4594, 38183, 66610, 70131, 48130, 8292, -34629, -64373, -70568, -50365, -11769, 31094, 62550, 70635, 52643, 15339, -27540, -60372, -70647, -54867, -18856, 24050, 57984, 70437, 57119, 22413, -20499, -55493, -70306, -59083, -25912, 16361, 52653, 69543, 60634, 29267, -12762, -50027, -68378, -61871, -32401, 9444, 47318, 67359, 63002, 35536, -5825, -44611, -66598, -64326, -38313, 2000, 41323, 65197, 65106, 41344, 2229, -37985, -63667, -65921, -43627, -5551, 34975, 61852]
1074F1852M020j9941l7167m0232k8444o370J8147L6116M0450K9976Q276j6435
1086E0248l5068m0305l1119j0356J4152L3751M0370L2600J2368j2658l2222m0188
1098a8427l3001j3941R726L0086L9893L4735J6274q206k9244l9186l4998j7629
1110f3918O045K6898L8598L6178J9686m064k6070l8122l6226k1247J743K3937
1122c6562L7064L7559K3127K83k1952l6585l7743k4694k160K0590L5148L7789
1134C1864K5574M109j8541l4025l7707k7069o315J6947L3515L7928K7819Q168
1146F2267j4538l2120l8172l0242j0165J3331L1188L7610L0637J1620j0873k8832
1158B1711l6988l1953j3980Q841K8351L6708L2660J5305p107k6588l6989l3348
$$ y = [61852, 65872, 45931, 8764, -31468, -59912, -66282, -48135, -12019, 28431, 58407, 66683, 50248, 15180, -25125, -56244, -66600, -52448, -18697, 21673, 54273, 66641, 53983, 21761, -18427, -51428, -65369, -55643, -25557, 14336, 49071, 65345, 57139, 27895, -11291, -46289, -63918, -57873, -30975, 7623, 43801, 63487, 59423, 33353, -4769, -40995, -62242, -60499, -36562, 502, 38061, 61188, 61471, 39519, 2934, -34809, -59503, -61663, -41073, -5925, 31864, 57438, 61547, 43006, 8981, -28726, -55795, -62110, -45163, -11648, 26280, 54099, 62267, 47729, 15609, -22563, -52805, -62970, -49639, -18451, 19159, 49796, 61416, 50543, 21711, -15277, -47230, -61210, -52369, -24018, 12690, 45350, 60655, 53548, 26960, -10029, -43377]
1170d3377j7336N786K5571L6073L3936J8611l135k3691l5535l4259k0841J419
1182e6778K1995L4211L5043K2376Q71k0690l4089l4993k2921k738J9151L2464
1194f098L4700K5007M893j7463l2090l5143k5944o289J5307L0814L5245K7830
1206E0769Q658j3903l0571l5395k7913j0086J2039K8590L4106K9180J2573r830
1218D8217k7116l4724k9735j4262Q180K6261L4436L0255J5381o263k5028l3666
1230h064l1174j7097M153K3523L3821L1748J8330k140k1907l2793l1943k0631
1242e4174M2K0547L2953L2002K1115J042j8819l1145l2088k2192l652J7075L1141
1255f153L3000K2996M938j5712k9981l2732k4568p121J3789K9330L3303K5496
$$ y = [-43377, -60713, -54927, -29356, 6717, 40653, 59264, 56129, 32438, -3097, -37356, -58197, -56778, -34783, -572, 34471, 56847, 57718, 37028, 2939, -32054, -54975, -57713, -38562, -6098, 28602, 53609, 58502, 41039, 8949, -26194, -52138, -58427, -43120, -12306, 22939, 50769, 59427, 45524, 14953, -20442, -48355, -58441, -46402, -17812, 16294, 45474, 58047, 48217, 21101, -13623, -43358, -57620, -49440, -23179, 11257, 41512, 56893, 50630, 25602, -8064, -39238, -56335, -52182, -28659, 5162, 36910, 55240, 53100, 31193, -1600, -33543, -54174, -54132, -33585, -632, 31370, 52485, 53527, 34708, 3563, -28525, -50717, -54369, -37294, -6153, 26847, 49843, 54781, 39069, 9088, -23644, -48212, -55333, -41544, -12214, 21089, 46585]
1267D6585Q236j2056k7747l2817k6020j0242R925K6628L2685K6932J1609q259
1279D5459k5683l2961k7419j2991P070K4513L2343K8186J4731n068k3147l2513
1291g480k9164j5370L402K1367L1562K9143J7725j241k0520l1241l0092j7920
1303d9829J93J8876K9638L0199J9666J692j7199k9494l0745k0729l297J5598K8976
1316f455L1099K1832N162j4357k7902l1479k2913o628J2440K7080L1231K3979
1328D3089P929j0715k5758l1138k4502r709R122K5159L1319K5294R983p992k3578
1341A8503l0565k5619j2131N517K2575L0735K7334J3651m672k1480l0142k7215
1353c3509j5008K740J9295K9925K7931J6148r67j8670k9187k8141j7264k94J7446
$$ y = [46585, 54821, 42765, 15018, -17799, -43819, -54061, -44136, -17508, 15177, 42109, 53718, 45459, 19776, -13185, -40604, -53595, -46525, -22012, 10331, 38517, 53248, 48180, 25033, -7480, -36644, -52014, -48612, -27245, 4317, 33460, 51185, 49944, 29424, -1817, -31909, -49829, -49636, -30760, -1122, 29077, 48743, 50435, 33236, 3742, -27003, -47732, -51029, -35431, -6455, 24644, 46476, 51638, 37281, 9379, -22100, -45013, -51641, -39201, -12121, 19110, 43089, 51018, 40303, 14545, -16593, -41095, -50804, -41682, -16523, 14796, 40090, 50073, 42081, 18503, -12062, -37681, -49812, -44295, -21720, 9015, 36349, 50000, 45328, 23848, -6294, -33509, -48517, -45777, -26482, 3443, 31374, 47522, 46555, 27885, -1302, -29443, -46707, -47001, -29555]
1366b9555K8212K9082J8348J298j6023k7537k9238j9340k765J4283K6674K8876
1378B2315K1082M570j2661k6036k9768k1622n679J1462K5255K9008K2196P372
1390D7494j0179k3470k9551k3235q795Q597K3341K9531K3912R838p519k1904k9075
1403a1015k4947j1274O213K0706K8734K4872J2900m085j9621k7820k6189j4466
1415d5992L107J8730K7416K6241J5370j592j7220k6742k6522j6777j61J6045K6385
1428a712K7158J8255J261j5458k5971k7282j8381k872J3868K5028K7034J9890
1440D0818M190j2020k4650k7188k0061n766J0650K3059K7606K1268P260r873k2652
1453A2641k7129k1927q097P918K1608K6885K3024J0044o711k1199k6966k3704
$$ y = [-29555, -1343, 27739, 46087, 47385, 31362, 3825, -25413, -44753, -47518, -33235, -6561, 22315, 43397, 47967, 35306, 9270, -20498, -42120, -47799, -36337, -11082, 17926, 40122, 47494, 37315, 13845, -15706, -38941, -47736, -39139, -15798, 13733, 37645, 47483, 39964, 18060, -11015, -35962, -47236, -41023, -20317, 8417, 33289, 46189, 42104, 22483, -5337, -31526, -45992, -42885, -24155, 3261, 29502, 44872, 43280, 26060, -682, -27204, -43981, -44142, -28097, -1712, 25446, 43701, 44962, 29504, 3533, -23749, -42130, -45002, -31134, -6106, 20928, 40818, 45008, 32988, 8338, -18850, -38911, -44677, -34027, -10968, 16638, 37906, 45166, 35293, 12641, -14488, -36415, -44512, -36594, -14986, 11899, 34923, 44967, 38256, 17057, -9909, -33613]
1465c3613j0684N422K0037K6475K3654J2032l904j8917k6010k3986j2986K595
1477c9885J7604K5157K4831J4457j321j6301k5149k5447j5520l12J5437K4842
1489a607K5706J6159J690j3886k3928k5597j7615l217J2581K3633K5755J8225
1501C7899M309j1382k2808k5721j9035n504J0030K2212K5520J9653P060q437k1281
1514A2515k5576k0808q381P315K0161K5800K1380R667o116j9494k5250k1870j0540
1527d1197M550J8345K4890K2709J1749l780j7456k4393k3047j2352K188J5967
1539b1827K4343K3148J3517n84j5146k3754k3983j4516l72J3860K3450K3875J5602
1552C7613J901j2902k2516k4117j6698k722J1903K1585K3893J7475M329j0663
$$ y = [-33613, -44297, -38875, -18838, 7637, 31291, 43323, 39419, 20502, -5508, -29494, -42480, -39885, -22281, 2876, 27707, 42164, 40843, 24542, -607, -26054, -41574, -41886, -26449, -1607, 24099, 40258, 41948, 28062, 4134, -21463, -39078, -42295, -29714, -6081, 19674, 37899, 42208, 30826, 8018, -17703, -36738, -42242, -32212, -10000, 15520, 35173, 42233, 33796, 12515, -13061, -33869, -42250, -34935, -14774, 11026, 32406, 42073, 35957, 16463, -8787, -30657, -41197, -36647, -18302, 6588, 29297, 41046, 37266, 19810, -4583, -27630, -39982, -37794, -21827, 2516, 25664, 39181, 38597, 23451, -303, -24286, -38802, -39174, -25314, -1864, 22011, 37613, 39514, 26612, 4096, -20021, -36719, -39441, -27538, -5953, 17940, 35415, 39744, 29081]
1564B9081k1573k3920j8223n075R712K0385K3999J8850O242q034j9818k4066j8930
1577c1370q332P141J8883K3891J9990R002n700j8050k3389k0817r874M305J7429
1590a6891K3156K1209J1023l614j6019k2959k1847j2259K417J5324K2642K2102
1602B4284J3039p98j4524k2151k2315j3681p80J3417K1355K2875J4596J720j2260
1615B4777k1009k2605j5818k608J1016K0650K2755J6528L890j0048k0060k2781
1627a5313j7380m869Q852J9630K2439J8034O218p872j8606k2693j8611p318O955
1640c0534J7732K2385J9274Q122n515j7228k1855j9699r316M270J6164K2221J9788
1653B5809J0439l158j5267k2147k0210j1504K226J4626K1577K0404J2167n15j3663
$$ y = [29081, 7508, -16412, -34635, -39710, -29998, -9613, 14386, 33236, 39478, 31444, 11626, -12440, -31370, -39702, -32561, -13678, 10213, 30203, 39205, 33505, 15455, -7934, -28751, -38625, -34320, -16891, 6265, 27474, 38497, 34883, 18864, -4095, -25942, -38201, -35784, -20460, 2182, 24284, 37323, 36525, 22001, -150, -22465, -36146, -36926, -23509, -2154, 20721, 35317, 37037, 24777, 3768, -18837, -34655, -37263, -26247, -5597, 17158, 33686, 37576, 27528, 7468, -15313, -32693, -37562, -28710, -9080, 13359, 31393, 37611, 29739, 11133, -11560, -30171, -37489, -30534, -12802, 9583, 28857, 36979, 31464, 14236, -7619, -27318, -36634, -32364, -16200, 6021, 25809, 36248, 33090, 17823, -4324, -24534, -36038, -33812, -19186, 2391, 22795, 34962, 34447, 20784]
1666B0784k1142k0650j3329o00J2620K0479K1334J4292J386j1763j9899k1323
1678a7811j4750k646J0127J9905K1294J5489M019r411j9126k1558j6141m748P812
1691b7545J8688K1672J6651O012p412j7607k1199j7428p167O132J7017K1205J7928
1704B6947Q161n063j6280k1081j8746q666L812J5732K0771J8832R704k835j4440
1717A6848k0646j9177j0931K256J3339K0269J9456J1745j020j2579j9782j9823
1729b0045j2646q1J1723J9804J9917J3008J661j1069j9353j9886j3984k440R921
1742b3470J8816K0165J4646L396r131j7881k0364j5500m253P797J7460K0640J5650
1755B7971N638o821j6853k0421j6420o551O050J5848K0526J7057P311m825j5744
$$ y = [20784, -358, -21008, -34337, -34937, -22317, -1838, 19496, 33788, 35174, 23411, 3512, -17811, -32561, -35207, -25080, -5175, 16119, 31608, 35627, 26216, 7090, -14468, -30609, -35357, -27545, -8857, 12815, 29466, 35478, 28066, 10459, -10740, -28168, -35335, -29203, -12186, 9019, 26947, 35108, 30045, 13765, -7316, -26062, -34728, -30916, -15184, 5587, 24419, 34123, 31288, 16848, -3798, -22975, -33906, -31650, -18311, 1958, 21414, 33159, 32139, 19560, -222, -20045, -32691, -32772, -21049, -1245, 18672, 31680, 33341, 22272, 2919, -16967, -30951, -33391, -23470, -4654, 15511, 30157, 33553, 24422, 6541, -13823, -29323, -33576, -25779, -8319, 12321, 27971, 33609, 26788, 9935, -10486, -26906, -33457, -27407, -11559, 8967, 26024, 33335, 28510, 12766]
1768A2766k0140j7222q191L702J4614J9932J7760R291k789j3949j9810j7887j0156
1781c2079J892J3011J9170J8888J0809j078j2305j8750j8889j1548j25J1418J8459
1794a127J8851J2647J014j0432j8025j9062j3222k636R903J7773J9407J3455L330
1807C1876q986j6813j9389j4350m088P489J6676J9502J4867N106o819j5950j9410
1820a0289j5305o063N813J5326J9288J6102O616m917j4731j8893j6549p601L814
1833b7389J4108J8802J6986Q154k631j3092j8888j7233r198J563J2752J8322J7312
1846A9568J0501r85j1692j8070j7566j1072O9J0582J7657J7807J1999J023j0003
1859A9818j7234j8007j2638j800R090J6561J8588J2863K922q178j6186j8592j3315
$$ y = [12766, -7374, -24596, -32787, -29085, -14471, 5461, 23221, 32512, 29723, 15774, -4036, -21923, -32079, -30187, -17176, 1994, 20882, 31691, 30613, 18308, -442, -19331, -30879, -31004, -19586, -1127, 17724, 30371, 31385, 20953, 2928, -16134, -29356, -31992, -22089, -4316, 15091, 28546, 31876, 22890, 6077, -13312, -27662, -31750, -24261, -7585, 11917, 26784, 31890, 25071, 9121, -10289, -25594, -31657, -25844, -10518, 8770, 24872, 31488, 26571, 11840, -7053, -23602, -31203, -27389, -13281, 5521, 22507, 30661, 28030, 14938, -3950, -21183, -30381, -28818, -16066, 2256, 19568, 30069, 29084, 17392, -678, -18244, -29316, -29247, -18665, -1008, 16799, 28798, 29821, 19818, 2584, -15423, -28061, -29861, -20771, -4210, 14378, 27241, 30163, 21985, 5799, -12793, -26108]
1872b6108m230P033J5945J8493J4373M672o452j5038j8317j4737n532N437J4212
1885a0249J8240J4995O850m347j4231j7813j5697p455L551J3194J8183J5572Q567
1898B9360k563j2671j7623j6443r110K002J1956J7070J6722R924q97j1501j6784
1911e58j7039j0232k24J0363J6730J7072J1394P58r384j6296j7372j1662j810
1924b8260Q421J6058J7273J2427K678p770j5600j7497j2672l625O942J4761J7788
1937A0924J3200M428n747j4677j7021j4368n447N132J4020J7398J4357O364m267
1950B4296j3162j7570j4808p163L711J2443J6969J5456P821k660j1915j6796j5848
1963a9226q643K097J1288J6509J5882R222p71j0500j6299j6357r609k68R775J5795
$$ y = [-26108, -30338, -23305, -7360, 11133, 25506, 30178, 23726, 8688, -9629, -24366, -29898, -24461, -10249, 7991, 22986, 29836, 25489, 11258, -6555, -22252, -29707, -26156, -12962, 5221, 20793, 29360, 26797, 14126, -3497, -19940, -29050, -27048, -15092, 1978, 18700, 28624, 27727, 16226, -558, -17597, -27829, -28053, -17690, -960, 16112, 27506, 28264, 18880, 2584, -14788, -26450, -28260, -19839, -3781, 13492, 25919, 28597, 20827, 5227, -12270, -24942, -28567, -21625, -6864, 10924, 24124, 28552, 22805, 8128, -8893, -23261, -28708, -23576, -9556, 7842, 22199, 28563, 24296, 11134, -6436, -21244, -28407, -24696, -12253, 4716, 20172, 27993, 25333, 13418, -3378, -19226, -27869, -25772, -14484, 2025, 17907, 27129, 26358, 15858, -441, -16798, -26407, -26675, -16900, -1105]
1977a105J6450J0684J108q981j5872j6450j1153k028Q247J5280J6512J1981K621
1990B7294p457j4641j6708j2585l443O812J4197J6915J2494M706o033j3556j6673
2003h678j3673n130N015J3227J6823J3672N916l973j3058j6304j4352o783L289
2016b4009J2443J6243J4865P426k677j1531j6102j5156p917J588J0903J5977J5040
2029A7093R093q29j0136j5728j5325r614rR394J5151J5379J0629Q35q602j5113
2043B218j5635j0760j777P984J4414J5794J1438K635p259j4025j6165j1776l265
2056b6179O250J3659J5873J2581M060n710j2879j6070j2719n195M947J2604J5928
2069G150J3210N547l625j2387j5589j3907o199L059J1715J5608J4112O833k356
$$ y = [-1105, 15345, 26029, 27137, 18156, 2284, -14166, -25319, -27347, -19100, -3820, 12692, 24673, 27294, 19837, 5196, -11512, -24097, -27540, -20728, -6531, 10384, 22878, 27584, 21551, 7995, -8678, -22351, -27481, -22466, -9239, 7584, 21256, 27172, 23199, 10141, -6163, -20515, -27298, -24009, -11566, 4677, 19542, 26968, 24291, 12760, -3342, -18498, -26415, -24827, -13924, 2053, 17093, 26186, 25357, 15221, -507, -15832, -25446, -25455, -16061, -910, 14469, 25098, 25933, 17331, 2218, -13417, -24177, -25954, -17970, -3556, 12238, 23676, 26311, 19052, 5027, -11138, -22914, -26179, -19929, -6270, 9603, 22184, 26244, 20534, 7655, -8415, -21134, -26329, -21382, -8778, 7150, 20360, 25907, 22282, 9895, -5694, -19601, -25800, -22741, -11026, 4582, 18694, 25527, 23171]
2082B3171j0970j5466j3961q061J656J0448J5187J4431Q324o64r793j4735j4866
2095a5299q796m35R091J4790J4881R722P40q348j4218j5068j0210j514P440J3874
2109c350J5160J0752K371o745j3694j5084j1300l336O110J3235J5304J1809L929
2122B5161n550j2602j5276j2110m450M329J2181J5214J2668N313l816j1543j5233
2135e714j2958n859K858J1096J4971J3119P187k518j0392j4767j3567p665J516
2148b2693R955J4379J3733Q270n79r290j4246j3951q780j21Q498J3991J4414R286
2162B2866O70p738j3901j4022j0006j550P314J2984J4554J0633K165o716j3011
2175D242j4166j0798l231N808J2594J4568J1235L541m914j2190j4229j1845m535
$$ y = [23171, 12201, -3265, -17226, -25287, -23631, -13183, 2004, 16435, 24759, 24095, 14302, -433, -15299, -24095, -24530, -15439, -649, 14232, 23954, 24694, 16346, 2128, -12940, -23150, -24664, -17224, -3350, 11810, 22562, 24933, 18188, 4494, -10590, -21890, -25226, -19116, -5881, 9423, 21232, 25161, 19611, 7009, -8267, -20377, -24827, -20498, -8317, 6897, 19565, 24878, 21062, 9519, -5714, -18672, -24531, -21673, -10577, 4394, 17513, 24700, 22182, 11790, -2977, -16544, -24209, -22693, -12738, 1641, 15374, 23644, 23065, 13775, -471, -14422, -23202, -23323, -14825, -834, 13580, 22866, 23536, 15798, 1897, -12125, -22131, -23681, -16367, -3383, 11171, 21804, 23969, 17253, 4242, -9924, -20722, -23953, -18145, -5551, 9017, 20252, 23793, 18879, 6689, -7540, -19385, -23920]
2188b3920M692J1353J4497J2009N209l840j1276j4381j2072n958L085J0674J3823
2201C895J3115O473k386r872j4249j2960p329J887R475J3838J3084P578m99q908
2215A3142j3527j3638p992l43Q246J3560J3233R148Q11p718j3176j3676r412j373
2229b2715O789J2931J3760R653K506o195j2330j3842j0473k950N413J1763J3929
2242H239J1015L773m949j1556j3736j1258m299M025J1146J3571J1489N255l554
2255A9161j0285j3790j1856n402K367R901J3747J2247O383k256r270j3473j2537
2268a5063o855J462Q950J2868J2767P380o02q248j3043j2949q065J18Q001J2438
2282h41J3107Q492Q87p159j2684j3005r075j220O371J2393J3143R148K317o024
$$ y = [-23920, -19228, -7875, 6622, 18631, 23840, 20000, 8724, -5657, -17729, -23687, -20602, -9928, 3895, 17010, 23483, 21097, 11225, -3024, -15984, -23313, -21426, -11951, 1887, 14971, 22549, 22050, 13142, -385, -14023, -22015, -22358, -14112, -552, 12681, 21829, 22640, 14922, 1746, -11930, -21342, -22715, -15926, -2995, 10765, 20418, 22924, 16729, 4399, -9443, -19916, -22866, -17453, -5690, 8239, 19254, 23027, 18078, 6522, -7214, -18472, -22771, -18746, -7600, 5971, 17460, 22715, 19161, 8876, -4914, -16770, -22172, -19805, -9904, 3843, 16090, 22473, 20217, 10947, -2526, -15063, -21918, -20456, -11506, 1362, 14129, 21509, 20907, 12659, -384, -13333, -21398, -21280, -13279, -841, 12266, 20758, 21645, 14486, 1802, -11203, -20278, -21498, -15127, -2734, 10409, 19557, 21874, 15850]
2296A5850j1885j3259r737k960N347J1681J2752J0591L343m828j0827j3075j0528
2309a7535m227L893J0789J3123J0904M926l288j0548j2698j1495n117K232R554
2322i487J3132J1571O213k305q686j2833j1841o621J080Q554J2810J1960O958
2335B0505m98p908j2448j2259q003L50P400J2117J2456Q350N01o799j1949j2341
2349a0526q720j669O396J1631J2522R043J971n276j1163j2929r632k600N127J0977
2363d848J2376J0146L336m337j0882j2494j0198l768L745R943J2500J0525M449
2376B0493k977r664j2614j0726n174K682R058J2495J1192N514j840q669j2427
2389b657j1373n905J268P934J2322J1386P106j051p580j2078j1514p219K10P018
$$ y = [15850, 3965, -9294, -19031, -21991, -16644, -4963, 7789, 18380, 21723, 16895, 6068, -7007, -17535, -21762, -17869, -7080, 6043, 16947, 21873, 18585, 8037, -4661, -16156, -21273, -19041, -9487, 3645, 15216, 21429, 19124, 10438, -2395, -14236, -20857, -19777, -11223, 1587, 13547, 20505, 20007, 12099, -349, -12608, -20611, -20261, -12861, -744, 11712, 20062, 20563, 13764, 1815, -10526, -19246, -20915, -14519, -2888, 9634, 18677, 20648, 15372, 4209, -8720, -18352, -20952, -15825, -4848, 7528, 17674, 21010, 16673, 5791, -6703, -16901, -20669, -16924, -6981, 5519, 16044, 20493, 17516, 7852, -4762, -15488, -20662, -17980, -8922, 3573, 14765, 20279, 18439, 9770, -2657, -14030, -19935, -18667, -10733, 1589, 12975, 20081, 19030, 11450, -628, -12142, -19361, -19151, -12133]
2403a2133J1531J2180P539N15o356j1704j2009q106j261N959J1161J1994Q720
2416A8030K083n694j0750j2166r076k443M721J0484J2250R593K845m066j0176
2429E635j2270r427l966L528R883J1791J0172M454l067r052j2190j0388m694K378
2443a7213Q818J2024J0416N500k281q084j1710j0700n933J079Q042J1578J0848
2456A2384O597p72p498j1166j0927p180P3O752J1322J1243P294N03o234j0863
2470A528j1532q020r13N983J0284J1764Q191J756n252j0534j1385q690k279M756
2484a4343R948J1512R179K729m056r780j1477r357l402L605R200J1624R519M228
2498A9129l317q701j1611r753m534K407Q570J1466R896N183k114p789j1158j0493
$$ y = [-12133, -602, 11578, 19117, 19632, 13276, 1572, -10437, -18543, -19804, -13845, -2684, 9310, 18030, 20113, 14419, 3669, -8497, -17573, -20016, -15295, -4811, 7439, 17032, 19877, 15811, 5635, -6635, -16062, -20028, -16500, -6617, 5174, 15346, 19800, 16733, 7681, -4509, -14897, -19591, -17213, -8395, 3629, 14045, 19545, 17264, 9180, -2530, -13230, -19163, -18084, -10042, 1536, 12384, 18981, 18209, 10711, -455, -11382, -18562, -18489, -11737, -415, 10828, 18122, 18625, 12391, 1528, -10004, -18024, -18937, -12954, -2670, 9094, 17285, 19041, 13789, 3255, -8130, -16820, -19099, -14343, -4395, 7117, 16296, 19025, 14969, 5189, -6288, -15645, -19047, -15442, -6242, 5382, 14901, 19129, 15812, 7111, -4500, -14253, -18787, -16380, -7810, 3656, 13552, 18735, 16621, 8832, -2326, -12819]
2512a2819n537J023P952J0887J0651N920p29p073j0833j0482o627J04O723J0268
2526e72J0938O543Q17n772j0405j1052p488j065N643R963J0899P971J853n042
2540A3231r835j1181q017k364M372R914J0792Q456L015l937r439j0769q895l490
2554a8147L602Q671J1065R018L743k821q660j0721r388m262K286Q215J0781R555
2568A2937M740j719p808j0518r999n213J413P083J0377R919O170q81o561j0468
2582e28j0150o276J6O577J0032J0139O774L17n802r917j0153p543o40N387R522
2597b245J0462P511J653m842r252j0837p554k296M460R036J0501Q158K570l554
2611A3771q812j0649q285l521L410Q205J0781Q688L532k459q455j0177r073m147
$$ y = [-12819, -18356, -17333, -9381, 1506, 12157, 18077, 17348, 10275, -558, -11040, -17667, -17563, -10840, -572, 10366, 16909, 17726, 11954, 1549, -9503, -16991, -18056, -12413, -2450, 8449, 16420, 18273, 13231, 3396, -7785, -15802, -18166, -13794, -3880, 6912, 15368, 18383, 14446, 5007, -5762, -14657, -18147, -14545, -5874, 5191, 14209, 17952, 15131, 6471, -4250, -13638, -17900, -15614, -7399, 3382, 12937, 17677, 15958, 8150, -2368, -12367, -17580, -16167, -9084, 1293, 11212, 17382, 16501, 9940, -528, -10678, -16954, -16938, -10361, -329, 9810, 16584, 16901, 11099, 1182, -8971, -16514, -17154, -11767, -2245, 8217, 15728, 17381, 12539, 3287, -7550, -15104, -17400, -12940, -3904, 6597, 14755, 17325, 13771, 4959, -5690, -13975, -17496, -14086, -5881, 4900, 13588, 17120, 14661, 6206, -3971, -13044, -17191]
2625a7191K459P572J0245R175M672j639p209j0119r585m998P92O744J0359R539
2639A0816N566m64o311r956r842n915o3N998R728R756O570M70n481r590r979o568
2655a5265j400N404R128R820P090J677m267r231j0141p092k250M015Q846J0063
2669F397P672K360l405q405j0168p959l017L028Q541R613Q036L631k621p688r795
2684c780q566m018K166P324R859Q494M567j749o778r832q853m702J039O560R611
2699A342Q726N415m10o454r101r522n325jN725R185R315O290J47n312q953r244
2715h177o377r98M603Q644R836O688J398m091q971r104p379j777L778Q419R606
2730F098P302K438l533q003r552p520k876K982P803R254P703L467k281p404r746
$$ y = [-17191, -14732, -7160, 3085, 12260, 16932, 15293, 8084, -2035, -11620, -16618, -15826, -9082, 1277, 10816, 16382, 15918, 9607, -349, -10191, -16106, -16169, -10171, -443, 9313, 15883, 16353, 10872, 1282, -8697, -15265, -16665, -11261, -2133, 7687, 14777, 16454, 12187, 2956, -7185, -14277, -16527, -12512, -3666, 6397, 14069, 16429, 13024, 4619, -5549, -13508, -16525, -13497, -4956, 4657, 12693, 16324, 13703, 6015, -3780, -12346, -16364, -14198, -6874, 2985, 11479, 16046, 14297, 7519, -2313, -11166, -15868, -14829, -8269, 1342, 10068, 15483, 15073, 8619, -482, -10004, -15329, -15330, -9605, -420, 8895, 15185, 15332, 10020, 1067, -8177, -14554, -15552, -10949, -2305, 7531, 14219, 15617, 11526, 2555, -6549, -13928, -15705, -11927, -3508, 6098, 13400, 15838, 12305, 4302, -5250, -12770, -15646, -12664, -4861, 4393, 12096, 15563, 13282, 5878, -3868]
2745c868p785l853J903P004R055Q689L906j017o852q958q529m914R07O691R103
2760A482Q358N124q00n515q946q806n820L68N354Q895R011N520L84m954q496q956
2776g797o185q34M622Q105R300O412J606m247q148r450o808j556L772P863Q912
2791E567P091K299k998p886q887p481k664K796P458R120P322L036k151p195q868
2806c441p755l407J822O522R058P933L932j416o393q826q030m514J180N703R041
2821A409P972M681m29n569q547q137n511M01N149Q316Q546N326M17m823q099q609
2837g507n701j042M471P944Q648O185J220l932p733q463o948j241L625P121Q691
2852E338O701K140l042p346q509o658k765K920O834Q410P218K905k345o708q360
$$ y = [-3868, -11653, -15506, -13603, -6599, 2456, 11145, 15051, 14034, 7182, -1776, -10305, -15219, -14312, -7621, 1482, 9840, 14964, 14164, 8649, -297, -9103, -14923, -14555, -9201, -306, 8705, 14225, 14609, 9655, 1159, -7797, -13982, -14816, -10194, -2089, 7211, 13623, 15229, 10982, 2834, -6616, -13424, -14980, -11208, -3345, 5567, 12658, 14957, 11959, 4073, -4814, -12295, -14959, -12163, -4705, 4415, 11737, 14773, 12622, 5427, -3441, -11196, -14603, -12781, -6259, 2799, 10732, 14664, 13248, 6855, -1971, -10001, -14515, -13335, -7632, 1409, 9381, 14062, 13633, 8064, -483, -8620, -14131, -13730, -8581, -265, 8281, 13607, 14024, 9201, 1102, -7507, -13208, -14250, -9779, -1835, 6813, 12998, 14218, 10286, 2553, -5910, -12858, -14099, -10474, -3353, 5338, 12039, 14179, 11137, 3791, -4718, -11376, -14141, -11221, -4387, 4023, 11241, 14146, 11801, 5093, -3267]
2867c267p550l244K000N924Q520P676L790j296o003q634p534m030R45N486Q503
2882A286P867M336m83n477p959p895m815J43M930P945Q101N100J60m382p949p903
2898f995n715o85M168P558Q113N669J505l857p579q234n804j633L492P275Q010
2913E288O255K087l074o829q222o449k662K579O575Q317O690L099k359o420q232
2928c357p027k843J727N984P890P462L266j280n621q073p282l712P60N362P746
2943A002P735L978q3n458p715p479m595M5N080P547P471M723K42m193p233p832
2959f765n279n66L742P444P795N551Q55l601p273p699n687j373L226P205P442
2974E017N872J863k650o703p801o493j921K439O284P872O529K660k098o190q104
$$ y = [-3267, -10817, -14061, -12061, -6137, 2383, 10059, 13849, 12553, 6550, -2084, -9618, -13648, -12703, -7217, 1286, 9153, 13489, 13006, 7529, -430, -8325, -13140, -12997, -8067, -122, 7979, 13079, 13239, 8857, 908, -6995, -12710, -13395, -9227, -1669, 6444, 12113, 13618, 9761, 2182, -6052, -11856, -13489, -9997, -2722, 5288, 11543, 13630, 10556, 3727, -4495, -10944, -13606, -11027, -4452, 3865, 10555, 13654, 11295, 4875, -3357, -10384, -13227, -11500, -5516, 2374, 9836, 13102, 11822, 6201, -1872, -9154, -12866, -12106, -6744, 1002, 8737, 12715, 12632, 7174, -541, -8020, -12615, -12570, -7490, 57, 7528, 12251, 12493, 8300, 1067, -6765, -12044, -12610, -8868, -1424, 6371, 11922, 12777, 9176, 1903, -5796, -11483, -12856, -9630, -2425, 5017, 10889, 12752, 10102, 3399, -4402, -10895, -12816, -10377, -4093, 3779, 10308, 12968, 10870, 4680, -3424]
2989c424o452k849J759N787P821O347L927j567n457p642p080l782R68N362P652
3004A370O632M289m43m691p738p384m280L22M595P190P292M624M57m560o800p359
3020f484n039p46M108O728P516N234J008l590o503p714n452j340L198O483P285
3035D692N997J458k586o385p322o066k218K553O102P380O191K603k083o147p452
3050c283o046l054J728N718P144O679L168j332n375p167o537l555Q54M876P386
3065A204O925L832q23m493p157p054m347O92M191O993O894M386Q2m238o303p327
3081f543m504n98L784O348P348N363N16l314o301p349n209j415K983O485P213
3096D807N348J553k660o156o915n890j951K504N791P275N588K583k524n001p260
$$ y = [-3424, -9876, -12725, -10966, -5179, 2642, 8989, 12916, 11349, 5892, -1750, -8830, -12612, -11644, -6282, 1370, 8002, 12291, 11848, 7157, -581, -7965, -12245, -11923, -7328, -138, 7154, 11778, 12235, 7675, 875, -6484, -11523, -12269, -8161, -1433, 6083, 11317, 12325, 8735, 2232, -5482, -10934, -12274, -9076, -2593, 4692, 10689, 12147, 9561, 3176, -4146, -10212, -12430, -9877, -3775, 3605, 9796, 12399, 10316, 4169, -3283, -9329, -12383, -10655, -4937, 2207, 8886, 12054, 10722, 5347, -1820, -8357, -11912, -11058, -6182, 1204, 8129, 11961, 11138, 6645, -512, -7566, -11913, -11221, -7030, -37, 6857, 11243, 11325, 7087, 784, -6543, -11047, -11645, -7861, -1513, 5835, 11198, 11714, 8400, 2099, -5250, -10459, -11874, -8891, -2406, 4807, 10155, 11708, 9048, 2892, -4023, -9913, -11864, -9360, -3569, 3706, 9294, 11877, 9353, 4352, -2908]
3111b908o328k358J652N493O742O386K656q85n277o710o436l578J157M744O715
3126A065O571L708p92m266o931o560l828K45M236O566O737M111J63m063o454o573
3142f065m530n43L859O216O651M709P24l454o035o600m998j167K763O322O843
3157D695N129J632l099n453o922n576j480K138N609O900N585K185k188n318o802
3172b965n706k534J621N316O877N847K355j245m724o696o003l135R21M694O597
3187A220O312L270p76m053o678o071l911Q2M254O676O194L824L9l671o407o485
3203f181l964n94L499O443O283M564K92k899o019o545m533q43K535N647O814M887
3219I386J350k381n583o826m958j816K381N528O532N078J955j747n163p030m932
$$ y = [-2908, -9236, -11594, -9942, -4449, 2293, 8679, 11335, 10450, 5173, -1537, -7973, -11551, -10394, -5650, 1065, 7636, 11344, 10552, 6286, -645, -7205, -11033, -10788, -6552, 14, 6751, 10862, 11025, 6962, 508, -6065, -10595, -11138, -7279, -1063, 5588, 10297, 11021, 7567, 1532, -5068, -10066, -11233, -8470, -2148, 4695, 9824, 11456, 8357, 2904, -4018, -9594, -11074, -8936, -3327, 3573, 9158, 11343, 9155, 3837, -2965, -8671, -11205, -9584, -4268, 2609, 8456, 10811, 9566, 4842, -1854, -7857, -10992, -10071, -5377, 1220, 7532, 10802, 10026, 5973, -705, -6776, -10687, -10605, -6351, 325, 6519, 10343, 10382, 6711, 304, -6181, -10145, -10739, -7240, -797, 5486, 10050, 10342, 7443, 1424, -5121, -9654, -10497, -7962, -2315, 4499, 9386, 10736, 8355, 2772, -4054, -9012, -10828, -8447, -2919, 3613, 8691, 10646, 8899, 3736, -3294, -8226]
3234h226k570K016M665O518N528K514j306m645o305n664k863Q84M443O351N829
3249G169L264o86m504o094o113l253O88L859N790O090L752L87m334n684o058m064
3265i791j81L175O028O019M176O92l045n694o184m477q53K744N697O067M429J350
3281A0152k519n128o263n125j215K185M934O007N120J878j604n053o371m703k462
3296a0167J604M790N915N512K079r93m634n935n400k504Q28M491N584N545K978
3311I693p71l989n923n320l289K72L951N593N934L409j14l689n777n780l272k98
3327i370K924N913N543L805M73k744n505n866m044o77K768N044O045M380J163
3342I852k814n048n745m624j216J956N243N825M621J687j957m784n926m749j957
$$ y = [-8226, -10796, -8780, -4115, 2403, 7931, 10445, 9139, 4494, -1811, -7475, -10338, -9454, -5011, 1340, 7169, 10433, 9747, 5243, -851, -6964, -10217, -9529, -5670, 120, 6210, 9962, 10349, 6015, 331, -5727, -9791, -9972, -6797, -769, 5250, 9426, 10118, 7073, 1379, -4805, -9282, -10135, -7391, -1694, 4373, 8802, 10152, 7633, 2505, -3758, -8883, -10098, -7913, -2979, 3028, 8148, 10026, 8422, 3369, -3002, -7705, -10167, -8563, -3773, 2142, 7654, 9733, 8740, 4106, -1829, -7229, -9733, -8905, -4414, 1170, 6715, 9693, 8922, 4933, -990, -6310, -9599, -9327, -5376, 217, 6151, 9560, 9446, 5757, -20, -5800, -9072, -9370, -6446, -533, 5010, 8815, 9288, 6544, 1039, -4827, -8871, -9548, -6780, -1736, 4309, 8689, 9852, 7038, 1990, -3755, -8379, -9595, -7639, -2396, 3429, 8050, 9737, 7780, 2996, -2930, -7679, -9636]
3357i636J426M568O055M864K158j037m450n759m932k671R04M014N649N493K913
3372I559p12m046n743n592k694L45L515N729N452L079l53k858n400n659l600k1
3388h999L072N237N525L742L74k645n103n653m029o74K585N114N417M262R34k471
3404F688m614n610m582j209K270M514N718M344J794j615m576n724m626j947J641
3419g534M143N727M700K058j198m277n240m948k502R33L866N606N092K495q06
3434H115l613n221n210k846N10L193N650M742L309K98l504n455m908l458j13L149
3450e362M989N106L820K13l176m420n520l825o87K323M964N341M210Q86k418m588
3466A856n315m258j100K124M384N436M123J420j910l998n266m536j685J558M028
$$ y = [-9636, -8210, -3642, 2413, 7277, 9435, 8398, 3948, -1811, -6743, -9414, -8510, -4496, 1153, 6646, 9559, 8847, 4801, -942, -6534, -9228, -8883, -5368, 361, 5813, 8892, 8539, 5681, 281, -5378, -8978, -8999, -5927, -690, 4835, 8577, 8951, 6306, 1203, -4450, -8479, -9153, -6568, -1454, 3963, 8225, 9159, 6688, 2074, -3536, -8118, -9327, -7057, -2543, 3175, 7519, 9313, 7698, 3122, -2602, -7228, -9175, -7534, -3391, 2336, 7036, 9094, 7896, 3619, -1621, -6569, -9071, -8138, -4272, 1334, 6426, 8921, 8115, 4502, -719, -5929, -8775, -8265, -5072, 578, 5320, 8629, 8927, 5423, -32, -4940, -8398, -8511, -5362, -373, 4733, 8553, 8766, 5590, 1170, -4350, -8175, -8862, -6539, -1575, 3766, 7976, 8862, 6444, 1856, -3459, -7717, -8817, -6693, -2309, 3127, 7250, 8670, 6760, 2762, -2504, -7040, -8725, -7167, -3139]
3481c139N470M343K145j371m195m998m744k268J063M012N158M482K653p30l433
3496D448n501m687k475O10K982N154M607L337k75l225n252m897k793n64L339N079
3512a13M734L512K73l126m755m744l434n20K498M408N508L201R58k164m573n305
3528c642l637j286K227M403N123M167J204j805m352n123m390j408J647M155M641
3543A924M566K001j449l849n109m418j817J082L388N086M708K130q67l409m829
3558h62m922k187L27L466M650M729K826j70l326m445n068k812lK713N151M713
3574D780K926R5k517m892m688l042o15K409M404M964L635M88k049m615m990l314
3590g021j063J975M084M956L700J420j733m113m743m099j557J735L875M972M134
$$ y = [-3139, 2331, 6674, 8819, 7448, 3253, -1745, -6489, -8757, -7694, -3682, 1476, 5958, 8611, 7881, 4448, -1053, -5740, -8215, -7605, -4623, 531, 5138, 8475, 8200, 4975, -277, -5174, -7967, -8531, -5192, -113, 4621, 8133, 8406, 5280, 525, -4219, -7653, -8173, -5675, -1267, 4241, 7442, 8400, 6236, 1663, -3642, -7279, -8565, -6338, -1935, 3188, 7355, 8559, 6754, 2402, -2721, -7111, -8519, -6872, -2717, 1924, 6490, 8491, 7042, 3193, -1916, -6334, -8151, -7069, -3681, 1405, 6113, 8243, 7376, 3967, -862, -5784, -7971, -7644, -4178, 472, 5201, 8027, 7857, 4531, 86, -4982, -7794, -7797, -5084, 67, 4780, 7706, 7801, 5284, 392, -4296, -7338, -7953, -5544, -1140, 3824, 7459, 7947, 5898, 1283, -3707, -7021, -8084, -6109, -2025, 2931, 6631, 8051, 6318, 2205, -2538, -6637, -8194, -6459, -2584, 2388, 6522]
3605F522J441j073l890n146l914j796O06L886N031M117K294j340l220m573m492
3620e547j894L41K806M948M459K622m46k844m724m533k940M59K747M506M444K849
3636G253L56k570m527m776k913m16K319M239M761L103R61k441m352m342l355r95
3652g695J867M412M440L732N57j377l925m845l341j517J537L712M596L833J696
3667G682j346l543m781l763j899J077L364M580M095K273r51l356m598l911k497
3682g574N65L067M749M065K433m70k798m381m538k298PK959M348M376K738l64
3698F884k073m424m492k856k93K247M195M596K718P32k023l892m738l386n24J788
3714e541M150M500L181Q89j661l534m747l304j284J517L705M377L743J346j144
$$ y = [6522, 7963, 6890, 3000, -2146, -6060, -7856, -7250, -3364, 1667, 5784, 8078, 6738, 3518, -1055, -5547, -7441, -7100, -4294, 654, 5113, 7735, 7289, 4445, -279, -4812, -7752, -7293, -4546, -40, 4404, 7253, 7609, 5039, 512, -4264, -7177, -7593, -5274, -1035, 3726, 6829, 7790, 5349, 997, -3345, -6700, -7695, -5828, -1416, 3024, 6756, 7313, 5936, 2011, -2834, -6175, -7692, -6155, -2443, 2153, 5986, 7682, 6336, 2793, -1988, -5751, -7650, -6573, -3209, 1371, 5466, 7739, 6788, 3432, -1166, -5077, -7574, -7009, -3942, 807, 4872, 7305, 6835, 4037, -344, -4882, -7180, -7173, -4214, 134, 4510, 7248, 6884, 4811, 387, -4105, -6961, -7254, -5007, -812, 3784, 6502, 7234, 5211, 1319, -3419, -6805, -7329, -5541, -1391, 3109, 6290, 7179, 5518, 1984, -2763, -6067, -7351, -5834, -2129, 2248, 5991, 7337, 6193]
3729F193l639m558l565k119J307L428M517L910J768j070k950m552m057j809O42
3744f554L169M234L931K297l07k768m625m003k495J86L023M003M063K519J17k484
3760D306l888m336k876j1J949L877M619L081L46k208l751m502k738j020K302L616
3776a234M011L526O63j693l681m341l261j127J633L553M024L454J686j412l645
3791B156m115l639j400J073L319M309L596J514p65l156m209l613k142P70L122
3806c180M119L773K034l41k928l967m015k055J86K642L803M183K531j49k397m314
3822g5l993k515k17K326L936M185K508L03j902l499m487k878l14J780L731L938
3838B827L158N17j180l998l867l324j072J728L292M470K903J528j498l430m006
$$ y = [6193, 2554, -2004, -5569, -7688, -6381, -2953, 1564, 5474, 7242, 6172, 3222, -1330, -5387, -7196, -6554, -3385, 849, 4780, 7077, 6770, 4002, -623, -4626, -7121, -6935, -3912, 91, 4154, 6673, 6790, 4306, 418, -3918, -6794, -6805, -4856, -979, 3640, 6721, 7067, 4859, 1108, -3394, -6132, -7152, -4850, -1234, 2777, 6303, 6966, 5273, 1592, -2749, -6010, -7137, -5504, -1951, 2073, 5527, 7213, 5801, 2156, -1959, -5598, -6998, -5925, -2606, 1703, 5299, 6813, 6048, 2892, -1317, -4930, -7072, -6302, -3180, 939, 4712, 6746, 6405, 3477, -490, -4505, -6560, -6374, -3732, 71, 4254, 6785, 6636, 4239, -75, -4068, -6583, -6800, -4474, -538, 3647, 6155, 6458, 4556, 1057, -3430, -6308, -6622, -4842, -1111, 2827, 5985, 6502, 5322, 1324, -2543, -5867, -6939, -5211, -1919, 2551, 5454, 6982, 5484, 2054, -1952]
3853a952l193j694J123L360M153L116J801r89k752m507l653j506P85K731M213
3868A036L686J674l75k722l745m051k078M04K493L974L710K318K8k549l820l838
3884c855k506J98K319L542L958K515j41j710l564m064k734l91J663L613M414K461
3900E718M97j315l683l838k729j393J690L534M316K657Q17j253l217m037k989
3915e225j112Q31L377L736L334J754j165k834l981l704j273M73K878M073L242
3930D404J954m36k699l888l621k055K62K641L931L489K073k92k124l589l653k408
3946f011m2K290L760L733K137K33k120l367m151k101m39J518L754L741K637N79
3962F151j683l362l907k707n98J294L441L766K877J197j702l228l734k610j572
$$ y = [-1952, -5145, -6839, -5716, -2356, 1797, 4913, 6714, 5725, 2973, -1534, -5187, -6693, -5908, -3177, 1036, 4722, 6396, 6021, 3299, -446, -4497, -6575, -6171, -3678, 296, 4006, 6324, 6352, 3803, -17, -3855, -6361, -6163, -3844, -302, 3656, 6171, 6030, 4320, 756, -3308, -6042, -6433, -4770, -1157, 3257, 5718, 6215, 4900, 1217, -2621, -5350, -6743, -5053, -1519, 2797, 5454, 6271, 5018, 1801, -2236, -5225, -6337, -5506, -2129, 1607, 4941, 6695, 5530, 2696, -1285, -4989, -6262, -5789, -2911, 1162, 4404, 6358, 5922, 3223, -665, -4286, -6341, -6079, -3438, 493, 3982, 6055, 5763, 3639, 50, -3603, -6011, -6053, -3763, -3, 3730, 5867, 6100, 3980, 613, -3538, -5639, -6078, -4560, -806, 2935, 5572, 6151, 4468, 1106, -2801, -5508, -6106, -4812, -1371, 2395, 5272, 6469, 4767, 1539, -2195, -4805, -6377]
3977f377J234L159L842K935J410j010k594l787l510j302P49K600L783L308J804
3992F244r51k207l734l790j662K63K525L807L444K031n7k557l497l598k218J3
4008e944K151L544L775K055L87k051l338l770k453l51J806L386L805K497L93j428
4024D464l466l560k804p75J464L358L750K791R16j242l351l580l046r17J263K859
4040a876L623K758J706j084l052l879k713j406Q71K580L164L667J686p12k289
4055C044l817l089j939M92K342L713L123K118n76k159l398l451j687l87K166L521
4071A6L273K405k01j738l542l380k393l00J996L084L815K189M77j738l043l518
4087b598k482r20J725K966L473K988N34j097l209l501k643j462J679K911L380
$$ y = [-6377, -5143, -1984, 1858, 4793, 6203, 5193, 2599, -1188, -4698, -6000, -5251, -2651, 1132, 4440, 6244, 5293, 3086, -648, -4438, -6100, -5837, -3312, 495, 3939, 5970, 5913, 3356, -141, -3739, -5957, -5944, -3793, -249, 3526, 5581, 5968, 3917, 579, -3191, -5644, -5995, -4189, -803, 3002, 5499, 5892, 4464, 998, -2562, -5366, -6141, -4677, -1319, 2431, 5222, 6138, 4896, 1545, -2035, -5081, -5998, -4735, -1876, 1747, 4505, 6211, 5127, 2075, -1804, -4517, -5923, -5052, -2472, 692, 4359, 6045, 5333, 3044, -773, -3862, -5801, -5309, -2967, 746, 3869, 5987, 5411, 3252, -146, -3597, -5284, -5671, -3505, 16, 3289, 5694, 5493, 3755, 213, -3167, -5560, -5860, -3864, -780, 3035, 5224, 5701, 3963, 920, -2598, -5080, -6000, -4275, -1309, 2164, 5152, 5686, 4589, 1380, -2121, -4764, -6226, -4547, -1636, 1744]
4102A744K742J276j037k644l480l019j331P20K593L551L089J476o78k202l802
4117a002l208j389O34K087L371L172J887l35k445k928l483j967J02K146L394L173
4133C209K170L0j990l481l075k366j58K157L177L002K606L78j663l120l549k447
4149e120m26J614K598L862K511M94j228l035l325k706p51J420K513L384K902R27
4165E634j063k908l126k932r84P40K453L378K991J375n65k800l311l004j313K73
4181e162K361L812K666J836m44k187l369k881k188L18K072L124L226K082k0j789
4197C457l229l159k414J57J553K967L549K083M37j609k963l363k344k63J216K983
4213i42L261K416O63j287k772l586k156j201J265K955L238K693R33r03k870l259
$$ y = [1744, 4486, 5762, 4725, 2081, -1399, -4418, -5749, -5029, -2436, 1115, 4204, 5680, 5002, 2800, -1002, -4210, -5599, -4965, -2878, 493, 3665, 5552, 5217, 2772, -156, -3639, -5606, -5504, -3358, 36, 3209, 5379, 5409, 3419, -62, -3137, -5503, -5661, -3504, -327, 2675, 5281, 5659, 3996, 876, -2673, -5120, -5546, -3932, -1334, 2528, 5039, 5533, 4305, 1270, -2055, -4761, -5512, -4092, -1579, 1805, 4707, 5634, 4571, 1663, -1463, -4395, -5379, -4639, -2186, 1192, 4183, 5558, 4993, 2193, -1118, -4122, -5435, -5162, -2801, 1011, 3677, 5513, 5069, 2882, -487, -3368, -5556, -5238, -3166, -42, 3184, 5266, 5246, 3457, 228, -2931, -5345, -5188, -3635, -668, 2881, 4964, 5401, 3792, 829, -2534, -4878, -5141, -3925, -942, 2319, 4735, 5398, 4111, 1339, -2247, -4403, -5604, -4339, -1384, 1854, 4547, 5480, 4577, 1707, -1552]
4229a552k687j355J070K608L395K633J331l52l016l138k894j529P19K036L527
4244G96K722J873n76k165l334k918j780N29J999K837L301J905o1j811l405l068
4260c156j687l62J856K815L136K021M97j538k838l351j978o43J615K828L029K420
4276D664N91j258k774l350k548p95J314K545L483K308J169j303k592l024k649
4291d219q59O52K474L556K196J535q34k518l117k827j215L46K523L055L059J161
4307D968j49k133l048l278j260j22K070L065L159J766j37j926k828k972k057J03
4323d779J365L048K972K164L27j761k777l066k408k14J615K875L135J774Q31j266
4339C835k737k973k510n55P60L013K858K670R03j230k513l046k386j015O67K319
$$ y = [-1552, -4239, -5594, -4524, -1916, 1479, 4112, 5443, 5091, 2075, -1063, -3957, -5486, -4767, -2731, 796, 3518, 5391, 4815, 2650, -684, -3602, -5382, -4853, -2854, -17, 3284, 5189, 5128, 3317, -88, -3156, -4843, -5205, -3349, -534, 2602, 4623, 5120, 3582, 744, -2607, -4585, -5228, -3613, -785, 2244, 4664, 5255, 3997, 1223, -2127, -4675, -5470, -4156, -1611, 1872, 4180, 5349, 4046, 1454, -1570, -4219, -5078, -4426, -1952, 1604, 3800, 5335, 4501, 1983, -1134, -3961, -5176, -4830, -2307, 748, 3807, 4968, 4819, 2686, -362, -3640, -4900, -5022, -2952, 113, 3272, 5038, 4901, 2975, 147, -2825, -4882, -4779, -3414, -366, 2606, 4770, 5097, 3336, 559, -2507, -4915, -5129, -3514, -639, 2496, 4270, 5101, 3835, 1098, -1875, -4385, -4940, -4180, -1167, 1691, 4361, 5264, 4034, 1521, -1525, -3911, -4926, -4259, -1940]
4355a940L311K545J062o11k488k839k885j145O13K321K899K604J287k00k213k790
4371d69l022j333K25K046K715K888J751j7j807l262k476k007J91J419K828L313
4387B983J957n3j685k637k876k138n55J601K658L008K090N20j228k681k983k248
4403d267n21J213K421K844K340J041j380k184l151k404j128J163K251K871K477
4418C586J207n56k435k870k561j234Q08K198K807K605J281n25k109k884k696j267
4434d645L3J848L237K718J490o6j894k766k670j866J63J489K862K798J863N5j551
4451C098k803l031j789j85J538K660K912J923N82j536k548k650k288n06J005K468
4467a150K850K489N56j298k264k798k305j013R40K507K779K354J166r87j857l052
$$ y = [-1940, 1371, 3916, 4978, 4367, 1879, -960, -3845, -4990, -4377, -2056, 843, 3447, 4734, 4534, 2321, -469, -3491, -4824, -4599, -2553, 162, 3050, 4801, 4784, 2977, -285, -2761, -4768, -4577, -3158, -330, 2983, 4940, 4887, 3202, 565, -2311, -4449, -5004, -3403, -745, 2263, 4353, 4873, 3645, 964, -2019, -4267, -4788, -3575, -1154, 1690, 4030, 5071, 3691, 1507, -1644, -4048, -5176, -4013, -1762, 1109, 3586, 4793, 4237, 1802, -1068, -3629, -4863, -4055, -1857, 950, 3555, 4836, 4311, 2202, -682, -3378, -4645, -4612, -2764, 473, 3191, 4681, 4615, 2721, -45, -2715, -4581, -4418, -2929, -67, 2731, 4594, 4649, 3098, 295, -2736, -4525, -4710, -3172, -512, 2400, 4323, 4905, 3369, 821, -1829, -4117, -4623, -3618, -1150, 1700, 4189, 4745, 3447, 1183, -1615, -3920, -4933, -3993, -1486, 1293, 3647, 4813, 3826, 1969, -1083]
4483a083k356j229O02J979L168K216J353m02k046k711k766j414M44J791K930K820
4499C296J520n79j689k615k730j634j67J826K845K700J463M39j731k808k644j984
4515d492J39J274K708K484K149L58j447k520l204j577l96J332K122K973K002P17
4531D622j006k760k460k248o94R63K333K626K272J227j075k405k526k396j093
4546d620N72K316K761K403R55l64k397k527k464j241L54K137K607K676J100k07
4562D061j561k700k660j588K31J713K395K614J647J2j139k809k667j714l16J456
4578c025K492K909J758K73j273k373k908j576q91J139K427K907J989N43r65k461
4594I65k723j985p18J141K149K721K030J020r65k154k819k368p96J009J729K844
$$ y = [-1083, -3439, -4668, -4066, -2087, 1081, 3297, 4650, 4248, 2202, -509, -3275, -4689, -4245, -2454, 476, 3296, 4816, 4237, 2548, -67, -2797, -4431, -4598, -2772, 73, 2773, 4236, 4675, 2944, 136, -2508, -4492, -4353, -3079, -371, 2113, 4262, 4620, 3173, 653, -2551, -4128, -4524, -3192, -1070, 1903, 3905, 4622, 3616, 856, -1604, -3852, -4546, -3583, -1250, 1376, 3648, 4875, 3800, 1395, -1131, -3527, -4620, -4048, -1732, 1029, 3432, 4387, 4023, 1626, -901, -3365, -4606, -4252, -2115, 492, 3168, 4268, 4061, 2500, -200, -2860, -4448, -4217, -2504, -109, 2505, 4152, 4164, 3025, 216, -2451, -4165, -4481, -3025, -533, 2376, 4134, 4407, 3134, 761, -2147, -3723, -4614, -3475, -1048, 1859, 3848, 4391, 3426, 965, -1758, -3743, -4461, -3320, -1171, 1550, 3580, 4600, 3635, 1481, -1338, -3706, -4502, -3493, -1764, 1080]
4610A080K299J071o46k218k499k385j062O20J744K531K481J387j79j979k708k425
4626b888j608L54J678K590K436J597J7j475k601k536j636j11J533K116K716J749
4642C931J61j303k556k272j948l38J331J935L007J736P49j149k401k617j952o06
4658d292P81K489K656K004O39j103j877k593k231q45Q94K072K615K087J150o30
4674C816k065k653k372j069M60J704K742K487J386o15j876k411k473j495O65J476
4690b293K522K749J040J67j761k270k488j577l79J639K343K721J545K97j238k576
4706D41k643j592m20J266K354K643J970j2q73k277k618j987m71R28K307K438K121
4723C575Q63j009k197k443k198q82N40K341K422K335P79p46j954k258k218j012
$$ y = [1080, 3379, 4450, 3804, 1586, -913, -3298, -4360, -3740, -1996, 535, 3016, 4403, 4224, 2245, -463, -2888, -4496, -4142, -2464, 126, 2562, 4159, 4176, 2701, 100, -2436, -4072, -4183, -2650, -534, 2182, 3931, 4092, 2789, 233, -2039, -3987, -4325, -2994, -1059, 1948, 3684, 4433, 3284, 883, -1734, -3686, -4292, -3511, -1022, 1634, 3638, 4277, 3174, 1297, -1296, -3527, -4372, -3478, -1406, 1209, 3296, 4446, 3816, 1751, -902, -3274, -4343, -3883, -2179, 563, 3050, 4436, 3821, 1945, -466, -2939, -4434, -3769, -2293, 229, 2978, 4018, 4185, 2424, 154, -2334, -3911, -4290, -2651, -308, 2413, 3958, 4255, 3017, 441, -2202, -3794, -4214, -2948, -594, 2049, 4019, 4007, 3134, 857, -1761, -3748, -4219, -3291, -984, 1454, 3575, 4438, 3429, 1232, -1211, -3409, -4291, -3751, -1410, 1012, 3347, 4126, 3380, 1426, -832, -3050, -4062]
4739d062L38J877K513K249J102k74j714k402k402j271N9J612K706K413J337N2
4755D133j610k707k296j366j80J429K368K423J554N68j713k327k425k081J34J414
4771b682K271K203K004L09r02k277k687k216k32J023K034K560K209M79r56j744
4787A396k744j833q68P12J936K501K187O85m54j865k628k056j328Q20K124K101
4803F86K003J433m04j961k338k352j218K78J811K423K131J370N7j383k948k043
4819b455j410o3J514K100K697J565O0j187k525k400j773j58J230K227K370J640
4835C432N36j268k092k373j772p05J182K070K553J821Q25j088k003k452k205o73
4851d212Q54K378K404J816P48m34k004k433k324j110O74J963K574K168R85l21
$$ y = [-4062, -3724, -1847, 666, 2915, 4017, 3743, 2029, -373, -2775, -4046, -3987, -2375, 331, 2744, 4081, 4133, 2523, -184, -2480, -3846, -4026, -2597, -229, 2194, 3748, 4316, 2603, 276, -2149, -4230, -4096, -2682, -411, 1792, 3796, 4105, 3203, 926, -1761, -3977, -4209, -3186, -1152, 1408, 3617, 4096, 3140, 1396, -1348, -3181, -4049, -3337, -1401, 1100, 3287, 3972, 3518, 1653, -975, -3031, -4359, -3539, -1415, 686, 2689, 4122, 3718, 1757, -581, -2933, -4151, -3873, -2062, 361, 2492, 3862, 3919, 2536, -412, -2455, -3865, -3928, -2414, -314, 2383, 3948, 4008, 2821, 296, -2104, -3877, -4035, -2805, -578, 1792, 3432, 3968, 2700, 608, -1765, -3537, -4242, -3060, -990, 1563, 3384, 4209, 3121, 1118, -1334, -3539, -4212, -3358, -980, 1424, 3240, 3988, 3554, 1550, -883, -3207, -4317, -3643, -1680, 894, 3062, 4047, 3726]
4867C726j749k549k202r70M45J353K362K161J127R4j428k572k425j408m1J702
4883b374K343K282J290L74j397k059k683j468k41J310K246K400J694J86j242k002
4899F59k413j758l65R27K170K600J720N28r60k047k292k088p29J086J562K580
4915A180J910P13l44k404k191k011p17N83J711K095K497O75j44j609k320k489
4931b865j128L96J768K354K224J061j65j383k607k041j764L90J459K599K123J214
4947C635Q8j115k549k056j488l22J128K055K767J260M99j092k298k255j831k17
4963c791R22K280K029J634J002j003k110k425j682q67O49K247K137K227P73q05
4979C217j705k728j840o57N30J808K111K283M59m17j346k417k018j108L91J542
$$ y = [3726, 1977, -572, -2774, -3744, -3299, -1946, 416, 2577, 3704, 3798, 2370, -202, -2627, -4035, -4076, -2374, -31, 2251, 3541, 3915, 2518, 459, -2224, -3692, -3933, -2623, -377, 2023, 3717, 3903, 2661, 659, -1754, -3512, -3877, -2950, -780, 1820, 3540, 4068, 3108, 1061, -1231, -3319, -4048, -2962, -1400, 1180, 3090, 3803, 3459, 1055, -1136, -3147, -3864, -3281, -1570, 525, 3022, 3697, 3553, 1944, -376, -2865, -3993, -3597, -1829, 525, 2749, 3810, 3645, 2262, -345, -2386, -4150, -3760, -2301, 298, 2421, 3635, 3723, 2608, 59, -1997, -3485, -3807, -2679, -624, 2143, 3403, 3902, 2810, 512, -1743, -3574, -3791, -2869, -589, 1440, 3074, 4076, 3073, 963, -1462, -3144, -4011, -3362, -1115, 1022, 3249, 4022, 3217, 1512, -1216, -3056, -3713, -3183, -1375, 736, 3019, 3478, 3061, 1715, -702, -2720, -3828, -3437, -1895]
4995a895K428K332J070n15j349k534j922j285M5J521K326K164J262J1j240k472
5011e3k201j478J89J280K069K193J484K39j103j968k501j770j06J108K139K193
5027A714J535N01p76k131k554j341o00O40J819K424J551R82q12j853k081k059
5043c041p84P50J675K469J632J083o30j404k270k164j251L84J717K215K144J227
5059C752j86j609k187k446p25p6J515J792K214J693k72j412j981k228j496k0J390
5076b282J771K580J092N13q58k110k545j557l36Q50K109K305J646O60r94j991
5092H53k366j731o27J090J685K224J773Q15o81j709k569j655o69L94J789K316
5108I32J844Q32m86j537k473j749r94L48J806K025J986J093k28j455k307k222
$$ y = [-1895, 533, 2865, 3935, 3420, 2071, -463, -2385, -3670, -3625, -2104, 222, 2386, 3648, 3659, 2419, -53, -2254, -3732, -3543, -2263, -194, 1999, 3483, 3722, 2619, 651, -1850, -3620, -3726, -2618, -479, 1714, 3249, 3750, 2974, 843, -1711, -3052, -3652, -3012, -1193, 1231, 2782, 3764, 2952, 1099, -982, -3041, -3825, -3075, -1400, 1069, 2701, 3784, 3154, 1750, -520, -2684, -3935, -3551, -1834, 381, 2525, 3752, 3566, 1957, -230, -2676, -3401, -3477, -1962, -170, 2044, 3737, 3465, 2053, 72, -2156, -3652, -3672, -2282, -511, 2069, 3161, 3674, 2816, 706, -1839, -3396, -3732, -2882, -773, 1532, 3178, 3838, 2844, 853, -1513, -3244, -3871, -2781, -1096, 1128, 2901, 3716, 3035, 1326, -1243, -2898, -3567, -3173, -1384, 932, 2776, 3608, 3122, 1585, -888, -2637, -3631, -3283, -1477, 548, 2534, 3627, 3399, 1944, -363, -2585]
5124b585j144L82J369K079K117J105M1j203k107k130j435KR46K390K398J216J17
5141C558j126j876k402j511l87J243J978K006J659M67q36j985k086j688n93J005
5157b574J794K076J770N47o27j996k262j441q95M63K003K007J920Q38o24j407
5173A592k551j737j049M55J556K328K011P45j00j506k526j702r79L20J182K018
5189E7K107J130m5j114k074j987j390j44J124K061K198J242M55j384j875k191
5205a830j349l61Q71J941K513J549J23q89j894j961j917m89J099J752K260J447
5221B865O56r61j355k396j484r77O87J591K046K011R08l96j959j791k195p75M64
5238c061J593J901K015R57k03j480k069k022j019M11J163J966K062J219p8j142
$$ y = [-2585, -3729, -3347, -1978, 101, 2218, 3323, 3364, 2161, 54, -2076, -3511, -3509, -2563, -173, 2225, 3441, 3558, 2432, 556, -1846, -3357, -3744, -2501, -523, 1483, 3142, 3609, 2773, 788, -1298, -2986, -3579, -2574, -780, 1296, 3066, 3613, 2986, 990, -1272, -2713, -3608, -3145, -1142, 865, 2785, 3623, 2999, 1592, -959, -2696, -3745, -3290, -1734, 594, 2605, 3350, 3250, 1744, -782, -2484, -3463, -3143, -1961, 57, 2164, 3294, 3249, 2135, 61, -1926, -3316, -3460, -2336, -275, 1923, 3165, 3620, 2236, 361, -1830, -3179, -3540, -2669, -728, 1785, 3334, 3457, 2568, 674, -1287, -3204, -3693, -2594, -842, 1418, 2865, 3521, 2560, 1205, -1191, -2675, -3652, -2965, -1374, 672, 2683, 3591, 3195, 1236, -555, -2750, -3525, -3061, -1468, 433, 2448, 3405, 3202, 1722, -347, -2369, -3388, -2977, -1814, 152, 2214, 3433, 3355, 2213]
5254B213k115k124j275j35J400J744K079J348L36j217k004j979j657OJ113J809
5270d58J886J695J88o41k072k175j517l74Q65J685K083K005M18q86j771k262j436
5287b767p20P47J390K168J844Q43o40j356k152j841r28O40J258J980J917R92m20
5304B955j322k000k049j083M26J402J927J861J136p3j261j955j867j336l4J348
5320a925J757J909J342L36j019k444j756r91n38J054J914J819J619M69j245j610
5336F91j973j658m03J101J534J918J678M04m70j958k026j567q68P78J750J965
5352H96J715P93m13j693k179j620o49J70J359J944K005P70l2j587j892j834j169
5369c416K37J406J884K173J136k62j389j711k039j008m12J298J913J890J332J05
$$ y = [2213, 98, -2026, -3301, -3436, -2036, -292, 1787, 3135, 3471, 2254, 250, -1729, -3386, -3380, -2267, -458, 1428, 3123, 3311, 2670, 598, -1577, -3094, -3468, -2603, -918, 1165, 3170, 3588, 2702, 931, -1331, -2767, -3487, -2740, -1350, 818, 2662, 3505, 2865, 1509, -643, -2484, -3412, -2772, -1514, 466, 2383, 3375, 2955, 1633, -367, -2416, -3499, -3073, -1671, 256, 2117, 3253, 3180, 1919, -36, -1903, -3239, -3273, -1925, -168, 1741, 3083, 3419, 2400, -44, -1800, -2791, -3329, -2275, -361, 1458, 3077, 3546, 2301, 691, -1282, -2940, -3343, -2242, -708, 1210, 2888, 3292, 2822, 864, -1162, -2729, -3597, -2819, -1069, 896, 2611, 3404, 2991, 1298, -881, -2501, -3150, -2980, -1621, 323, 2328, 3098, 3066, 1479, -413, -2247, -3416, -3179, -1773, 111, 2284, 3420, 3158, 1769, 58, -1981, -2989, -3401, -2103, -190, 1700, 3032, 3137]
5385C137r29k007j863j233l19J018J823J647J654N42j117j899j896j151o05M29
5401b769J784K316J436N16n26j682k058j749m50N55J522K099J618M72m5j495k302
5418g58j814q93N49J572J782J917R78k41j461k015j810j194K93J434J783J778
5434A900J015L83j658j789j771j044k33J047K039J925J271n8r34j606k283j077
5450b873m72J037J851K016J371K31q61j630j836j581l13O81J659J876J334N83
5466C073k80j929k051j533k91K60K014J415J661N47m01j099k016j884m57K28J243
5483a500J930K053P98k13j596j834j769q32KJ231J970J898Q74P7j130k261j644
5500a946j116J20Q47K107K047R39K04j034j826j802j452n34J043J943J762J489
$$ y = [3137, 2208, 201, -1662, -2895, -3214, -2196, -373, 1274, 2928, 3470, 2353, 454, -1442, -2593, -3198, -2769, -985, 1331, 2767, 3283, 2757, 1075, -983, -2732, -3182, -2627, -1105, 994, 2612, 3084, 3039, 1544, -758, -2572, -3465, -2916, -1344, 438, 2355, 3333, 3092, 1631, -384, -2194, -3388, -3095, -1661, 122, 1900, 2915, 3298, 1640, -149, -1920, -2964, -3197, -2150, -111, 1814, 3085, 3027, 2093, 487, -1796, -2873, -3345, -2308, -457, 1559, 2930, 3161, 2300, 670, -1166, -2747, -3060, -2379, -720, 1156, 2490, 3073, 2793, 864, -1187, -2720, -3011, -2751, -737, 678, 2339, 2886, 2485, 1386, -630, -2514, -2971, -2743, -1500, 430, 2483, 3281, 3068, 1472, -362, -2131, -2963, -2961, -1730, 240, 2138, 3012, 3089, 1959, -302, -1946, -3062, -2942, -2095, 12, 2059, 2998, 3202, 2168, 342, -1460, -2912, -3446, -2403, -460, 1302, 2791]
5516B791J80n72j547k100j447o82R13J574K041J337P33n59j700j967j468l53R2
5533b734J506K065J506O00j08j589j805j679q60L11J375J876J875Q29l89j239
5549A540j921j700j116O2J650J679J785J034m9j254j624j828j168p4J105J733
5565a46J710J324K11r41k100j523j388j78R16J684J995J138M71q69j486k072j674
5582b928m10J041J415K194J101N32l09j615j735k094k92M05J637K008J380O53
5598B983l67j536j656j847n10K54J327J727K165L74k52j137j865j858o26K16R88
5615a620J518K076J044j27r88k119j549j227J1J115J659J892J172J52j014j468
5631E27j994j385r6Q08J543K053J026O06o90j710j801j575k66P13J312K017J486
$$ y = [2791, 2971, 2399, 852, -1248, -2695, -3377, -2464, -890, 1151, 2488, 3221, 2662, 962, -1005, -2473, -2826, -2734, -1228, 837, 2343, 2943, 2835, 1246, -559, -2238, -3098, -2787, -1412, 464, 2339, 3168, 2779, 1540, -381, -2081, -3197, -3135, -1485, 194, 1979, 3013, 2964, 1710, 86, -1742, -2910, -2984, -1879, -146, 1564, 2888, 3099, 2158, 58, -1465, -2853, -3031, -2115, -431, 1564, 2702, 3173, 2304, 818, -1254, -2928, -3338, -2297, -882, 1312, 2413, 2945, 2636, 1021, -714, -2808, -3100, -2695, -1058, 950, 2330, 2983, 2616, 1080, -576, -2423, -2933, -2679, -1352, 375, 2540, 2914, 2662, 1525, -340, -2198, -2824, -2608, -1620, -102, 1974, 3018, 2891, 1903, -216, -1765, -2992, -2981, -1866, -207, 1685, 2857, 3009, 1995, 527, -1467, -2852, -2948, -2140, -597, 1456, 2482, 3088, 2398, 688, -1113, -2688, -2954, -2241, -929, 1088, 2574]
5648B574N03o96j380j899j471q95Q36J115K148J440N40r1j398k108j606m11J7
5665b782J465J821J682N68j83j121j596j903j145M99J230J600J512R79J8j041
5681A603j257k135j134R6Q87J839J742J135K0j033j194k156r35n48R32J713J598
5698A173J257N96q99j571k024j284k84J110J163J668J349P68n59j737j483j480
5714b237o45N23J221K146J342L97k53j030j913j922o85M61J131J946J550J070
5730C102l00j436j702j712o28NJ100J856J279J216J17j086j806j667q87n3N86
5747b016J917J863Q62K25j060j425j716j104m36O58J801J747J184N01p15j766
5763E20j984j097l69P16J315K035J274P46j098j176j891j173n80K86J624J606
$$ y = [2574, 3077, 2381, 1001, -898, -2369, -3264, -2428, -1313, 835, 2275, 2815, 2724, 1326, -782, -2388, -2799, -2782, -1317, 504, 2186, 2754, 2571, 1450, -146, -2049, -3194, -2695, -1465, 135, 1647, 2626, 2644, 1603, 346, -1789, -2923, -2827, -1940, -101, 1641, 2776, 2796, 1763, 569, -1587, -2522, -3070, -2138, -425, 1173, 2430, 3026, 2127, 556, -1468, -2752, -3036, -1926, -763, 905, 2254, 3022, 2463, 726, -757, -2237, -2882, -2359, -1138, 1008, 2350, 2747, 2494, 1464, -449, -2371, -3056, -2595, -1464, 482, 2032, 3102, 2802, 1366, -336, -2048, -2676, -2671, -1571, 285, 1564, 2780, 2897, 1811, 5, -1662, -2549, -2602, -2016, -99, 1764, 2626, 2851, 1791, 366, -1350, -2454, -2890, -2232, -431, 1316, 2500, 3001, 2286, 520, -1464, -2561, -2930, -2214, -899, 1136, 2410, 3156, 2058, 882, -1009, -2182, -2762, -2476, -852, 754]
5779G54J370P20m47j277j666j500n75l5J408J606J437J104m45j086j509k093o17
5796b851J81J097J879J454J321o55r96j317j763j131K46O04J729J806R74J26p65
5813A939j410k011r45n40R81J474J578J376L43p59j477j695j363l69P50J267J989
5830A128J474J79o42r70k024j597m47L62J752J519J379L98Q7j175k169j245n54
5847b545M2J406J508J392J195l48j206k092j214r64J46R26J728J817O84o2r17
5864A496j337j673j214R1R86J557J737J103j10n86j959j182j224o08P90J719J624
5881A210J372P0q05j360j549j264m67O22J286K144J110M49o53j209j702j188p45
5898b679K88J272J928J229N51k67j339j417j651n16J21J538J252J395Q06L2r91
$$ y = [754, 2124, 2844, 2397, 1120, -546, -2046, -2621, -2656, -1248, 358, 1795, 2899, 2454, 1368, -141, -2234, -2851, -2670, -1573, 306, 1760, 3081, 2426, 1430, 113, -1650, -2781, -2535, -1931, -202, 1604, 2578, 2704, 1939, 529, -1482, -2427, -2967, -1986, -512, 1066, 2442, 2785, 2026, 549, -1146, -2509, -2878, -2128, -861, 1128, 2602, 2781, 2139, 1169, -855, -2452, -2899, -2537, -785, 734, 2113, 2511, 2598, 1423, -746, -1991, -2545, -2503, -1097, 411, 1803, 2998, 2650, 1444, -648, -1862, -2826, -2680, -1754, -26, 1791, 2475, 2413, 1496, 159, -1514, -2728, -2637, -1651, -94, 1643, 2746, 2636, 2050, 91, -1091, -2315, -2923, -2133, -414, 1210, 2582, 2652, 1847, 487, -1062, -2326, -2793, -2171, -885, 1259, 2369, 2818, 2165, 956, -746, -1934, -2679, -2391, -1119, 809, 2038, 2589, 2322, 983, -434, -2085, -2601, -2480, -942, 310, 1705, 2511, 2543, 1552]
5915A552j850j372q39p2J058J904J211Q84K08q02j732k023o81K4J002J080J859
5932A411J250j12r18j437j420j281j61N80J885J396R32M98p57j475j498j054o53
5949b814P59J422J603J106P17m75j563j550j399m77L85J285J633J472P17n48j138
5966A135j800j284p46M54J225J571J356Q30l34r87j612j291j098J93Q18J446J741
5983A617Q76p0p55j826j441r50k22J249J295J577J065J34q01j468j664r74k34
6000b592P51J392J649J134P3m43j357j290j492l28N78J291J694J102L91p06j069
6017G78j504j426l27M99J137J680J078P08m76j362j316j544n74L53J104J511J338
6034A657P96j40j050j535j539n71j1J110J309J515P80K38r01j616j510r21Q6P07
$$ y = [1552, -298, -1670, -2509, -2581, -1523, 381, 1592, 2476, 2684, 1882, 150, -1873, -2554, -2530, -1528, -448, 1411, 2661, 2549, 1631, 194, -1226, -2507, -2668, -2088, -203, 1193, 2125, 2623, 1866, 391, -1107, -2161, -2814, -2055, -633, 970, 2076, 2793, 2318, 755, -795, -2194, -2671, -2286, -1001, 632, 2104, 2821, 2273, 1135, -665, -1949, -2695, -2241, -1016, 555, 1911, 2741, 2407, 1420, -192, -1483, -2581, -2388, -1570, -124, 1617, 2493, 2423, 1668, -158, -1599, -2549, -2771, -1522, -227, 1350, 2415, 2549, 1748, 280, -1384, -2358, -2592, -1841, -449, 1200, 2334, 2407, 1964, 607, -683, -2175, -2503, -1925, -634, 1060, 2162, 2553, 1847, 778, -726, -2152, -2479, -1980, -843, 837, 1915, 2623, 2147, 785, -531, -2075, -2649, -2296, -1192, 319, 1657, 2453, 2313, 1263, -272, -1811, -2382, -2393, -1283, 26, 1541, 2321, 2559, 1658, 42, -1468, -2389, -2303, -1596]
6052a596J372J581J140mp78j304j623j188j15P42J443J573P83N59n07j465j626
6069a013j118n93N39J495J737J091L86m10j344j518j386l20N02J151J538R69P96
6086B502l32j235j285j447n81K98J211J223J229P46Mj149j315j419j085K51O56
6103a728J881J158J099J26j041j353j460j008j56P09J503J633J055K18r01j189
6119E46j739j176n6O20J307J543J062K21m58j427j517j065m41Q07R90J786J079
6136B082O64q42j312j236j274o74N69J084J623J260N64m66j179j410j254p36M43
6153b094J266J004J443R04k08r26j524j358q58m4R41J717J362P68m9p64j540j555
6171a515o03j81Q52J219J583J248o5q47j369j495r57k81N53J560J183J163M81
$$ y = [-1596, -224, 1357, 2497, 2493, 1715, 411, -1212, -2400, -2515, -1773, -330, 1243, 2026, 2585, 2078, 613, -1013, -2131, -2724, -2185, -690, 1047, 2138, 2524, 2114, 770, -748, -2134, -2454, -1952, -801, 737, 1706, 2502, 2170, 935, -350, -1797, -2378, -2080, -869, 354, 1583, 2329, 2333, 1184, -131, -1550, -2635, -2384, -1728, 153, 1311, 2410, 2536, 1495, 142, -1318, -2326, -2482, -1773, -270, 1363, 2418, 2636, 1735, 546, -1193, -2369, -2425, -1805, -498, 1045, 2107, 2328, 1870, 443, -1074, -2139, -2580, -1773, -783, 1003, 2082, 2746, 1904, 592, -644, -1918, -2592, -2023, -939, 684, 1944, 2508, 2042, 863, -547, -1801, -2537, -2094, -828, 176, 1619, 2523, 2315, 1389, -135, -1493, -2351, -2395, -1454, 263, 1625, 2393, 2344, 1580, 40, -1515, -2118, -2299, -1447, -228, 1355, 2603, 2538, 1691, 322, -1173, -2130, -2411, -1858, -298, 885, 2048, 2529]
6188B529o98j128j924o33n20O06R31J653J493N2p13r80j555j157o4K05P81J832
6206G10Q74O26K6j165j378j570m55L36Q49J520J011R46R7j232j454j367o94K58
6224b062L90J615J502Q81r7q07j238j670o51k79Q10J373J593R47p2n27j412j502
6242a206j131j8O47J312J246J195L03n06j297j287j347l42O01J010J785R10N42
6259B417m17j196j614j001n89M24Q96J557J236P11k36j344q99j591o51K22J059
6276a016J274J278Q59k98j194j013j503q73P1J109J565J404O95k81o87j301j403
6293a314r78J5Q86R56J673J008j46n14j046j397j135k72O08J033J808P45J86n67
6311A549j007j454r57m14N43R33J519J159K40l2j235j537r36p24N65J315J263
$$ y = [2529, 1831, 703, -1221, -1854, -2374, -1768, -837, 816, 2309, 2361, 1648, 668, -887, -2044, -2108, -1903, -1122, 710, 1584, 2210, 2236, 1071, -307, -1877, -2332, -1996, -1147, 373, 1384, 2330, 2427, 1195, -259, -1626, -2320, -2062, -1672, -57, 1445, 2326, 2229, 1422, 184, -1486, -2137, -2416, -1606, -233, 1360, 2307, 2235, 1708, 296, -1206, -2337, -2355, -1708, -396, 850, 2045, 2348, 1842, 545, -742, -2089, -2431, -1830, -820, 965, 1875, 2417, 2000, 804, -810, -1811, -2400, -1976, -1080, 477, 1713, 2424, 2188, 844, -55, -1646, -2297, -2075, -1016, 258, 1536, 2395, 2097, 903, -110, -1613, -2486, -2415, -1306, 259, 1663, 2358, 2077, 1390, 89, -1314, -2292, -2277, -1391, -435, 1238, 2246, 2100, 1586, 540, -857, -1992, -2264, -1656, -623, 1185, 1930, 2116, 1549, 542, -912, -1869, -2283, -1740, -807, 712, 1871, 2111, 2079, 844, -693, -1629, -2353, -1788, -473, 790]
6328G90R20N92j50j269j129r72j181M66J248R46J262O89j44q01j287j332q45J39
6346b058O63J385J283Q92j03p65j132j379r23O8O32J138J493Q43L09o12j485j362
6364a113o69m85P09J332J185J039M03o46j245j518j053k11M54J160J635R52R6
6381B025j67q86j599j292j09O6J134J366J106M61m37q37j062j123j020M61R45
6398i68J076J457N72q3j044j310j112q38J63R56J337J060N37K04o45j335j083
6415a056j055L6M69J419J265Q41L53n86j650q88r32m54P22J261J218J186m8m47
6433A654j087j600o97l52L07J247J073J085O27n15j031j090j130n18K01J042J389
6450F05J050L67q7j048j283j099p14M17Q40J205J278N46L3j078j257j195p35K75
$$ y = [790, 1710, 2302, 2152, 883, -246, -1218, -2399, -1933, -685, 261, 1523, 2212, 2068, 1267, -20, -1352, -2197, -2058, -1395, -10, 1273, 2165, 2062, 1297, 165, -1214, -2137, -2069, -1437, -299, 1194, 2037, 2346, 1734, 249, -1113, -1782, -2267, -1558, -226, 959, 1998, 2401, 1755, 510, -1008, -2061, -2272, -1818, -658, 977, 1929, 2025, 1858, 972, -627, -1919, -2028, -1962, -828, 538, 1644, 2105, 1668, 831, -231, -1354, -2374, -1913, -968, 108, 1565, 2137, 2054, 1010, -300, -1412, -2250, -2087, -1131, 206, 1266, 1803, 2007, 1362, 27, -1056, -2111, -2075, -1606, -187, 1078, 1919, 2272, 1686, 36, -852, -1784, -2238, -1516, -255, 963, 2149, 2101, 1654, 567, -1033, -1730, -2082, -1775, -528, 545, 1630, 2257, 1742, 711, -379, -1509, -2027, -1826, -784, 605, 1655, 2022, 1935, 887, -396, -1495, -2209, -1792, -952, 253, 1531, 2077, 2110, 1032, -225, -1420, -2155, -1880]
6468a880P11J065J304R67j1q54j318j308q68J38Q35R30J379Q65n3k57j297j203
6486h55j078M1L87R79J260J006N29o14j113j372j134q8N20P89J441Q94O40n12
6504A720j091j295j264l05N07P81J569J077K07k94n34j437r07r38M01P01J391
6521B89R99N46J03o42j398j000r00kQ43J184J489N27Nr21q23j504o15J5K33J298
6541b74J252J279k02p16r52j330r30n4K60J150J518O51K68m79o92j331j008o19
6559b209N15J037J366J040M84m11j166j365j002m39L34J085J348Q77O66r1j297
6576G72j099r57q48K55Q57J380J242N03o1r54j205j111o75j47R29Q89J568Q21
6594B159k66m70j232j208q96j86P57J130J274P42J88n40j147j388q26j80O74J234
$$ y = [-1880, -1169, -104, 1200, 2167, 2156, 1302, -16, -1324, -2192, -2054, -1219, -289, 1090, 1955, 1902, 1645, 348, -855, -1933, -1892, -1505, -526, 734, 1740, 2269, 1655, 542, -830, -1964, -2052, -1532, -743, 698, 1592, 2232, 1720, 629, -666, -1930, -2235, -1728, -947, 622, 1699, 1906, 1612, 1078, -359, -1266, -2204, -1803, -1102, 289, 1288, 1834, 1937, 1295, -103, -1103, -2003, -2005, -1162, 22, 1511, 2038, 2043, 1122, 299, -1205, -1820, -1805, -1572, -274, 978, 2257, 2055, 1339, 387, -943, -1873, -1927, -1667, -517, 1001, 1652, 1920, 1441, 749, -582, -1590, -2209, -1694, -657, 709, 1749, 2233, 1822, 656, -709, -1711, -2150, -1816, -731, 617, 1494, 2160, 2069, 772, -327, -1284, -2132, -1877, -1020, 360, 1602, 2105, 2044, 1090, -115, -1226, -1901, -2048, -1119, -230, 1338, 2159, 1893, 1423, 191, -1017, -1913, -2099, -1342, -212, 1062, 1804, 1992, 1452, 305, -1083, -1909, -2089, -1415, -181]
6612a81R55J034J96o66q53j184p71n18N57Q29J365P93L41l40j094r78p12o24J57
6631a694Q26J265R83N17k36r19q98j052p06kQ28J278R92O12R3n91j561q97j008
6650b170M27O12J222J111N29M31r72q93j331j042P0P57J074J243M96L44q25r50
6668A33j185n21j93K7J272J499O53J89l33j159p70j118m48M64P05J406R84M53
6686B058m84q68j358o55m67R7Q51J425Q97L02q3q56j073j226m70KR16J229J266
6705A503M40k22p80r96j401l96LN78J178J138O46M19j094j024j068p75p2O24J272
6724b7O94J043P6q75o42j067o66m75L71J081J288R52K9p08r22q58j068J4J30J195
6744d35J079P75L69k15q57j038j174p10P04N34J382J274J61r6p11j170j027n58
$$ y = [-181, 774, 1808, 2004, 1338, 485, -699, -1470, -1988, -1431, -602, 763, 1556, 1897, 1557, 463, -515, -1227, -1851, -1694, -868, 397, 1380, 1897, 1661, 742, -156, -1208, -1914, -1916, -1088, 190, 1182, 1794, 1887, 1296, -265, -1162, -2170, -1743, -1131, 91, 1202, 1731, 2162, 1190, 297, -1034, -2076, -2006, -1249, -175, 1068, 1564, 1908, 1083, 133, -1052, -1573, -1766, -1739, -467, 1032, 1685, 1874, 1541, 382, -388, -1506, -1954, -1490, -785, 621, 1605, 2058, 1574, 706, -652, -1307, -1774, -1677, -826, 599, 1496, 1798, 1715, 859, -214, -1440, -1910, -1908, -992, 237, 1503, 1943, 1721, 941, -55, -1456, -1852, -1849, -1271, -93, 1045, 1691, 2110, 1016, -8, -1076, -1851, -1923, -1299, -27, 667, 1710, 1786, 911, 269, -798, -1464, -1939, -1568, -487, 801, 1753, 1782, 1074, 152, -706, -1774, -1760, -1630, -435, 644, 1419, 1788, 1573, 716, -322, -1496, -2206, -1502, -968, 414, 1688, 1849, 1753, 1042, -128, -1155, -1713]
6762a713n2R05R71R88O20N7o45j218j085m57j9M36J380J011N90L3l96j158j391
6781a143o32q0O29J262Q84N94L76m67j350q35q24k68N14J020J176Q46ql67j162
6800A65q31q10o60O83Q82J090P71M69j33r82j176j100k19J82J023R07J132O01
6818A994o83o83q34j078l73o5Q94J037J101N44k41q25p87j066o17J22O98Q95J317
6837A350N03j69o58q49j164o69k15P82R44R01P82K41m77q01j329r37J27L65R31
6856c42Q76J079n8j43j075r80o58m91L96R76P28J463K18m62q95r15j045l86L86
6875a328M70J161J013O40n04o61q81j082m61k7R44R09P21N98O5n44j308j085m65
6894a825L5R12R04R44O71q3n13p81r89j027j65R42Q12J034P47K5l12j260q04q61
$$ y = [-1713, -1765, -860, 111, 1099, 1719, 1776, 1131, -87, -1172, -1629, -1648, -1212, 168, 1179, 1769, 1802, 1406, 248, -1143, -1775, -1855, -1226, 36, 920, 1514, 1890, 1423, 73, -762, -1586, -1854, -1340, -320, 856, 1702, 1694, 1327, 165, -666, -1476, -2136, -1453, -571, 519, 1290, 1759, 1626, 644, -532, -1632, -1851, -1669, -646, 261, 1393, 1994, 1311, 628, -206, -1284, -1657, -1722, -828, 209, 1310, 1854, 1613, 788, 1, -1065, -1682, -1560, -862, 33, 1350, 1853, 1684, 1026, 177, -987, -1656, -1871, -1089, -145, 756, 1538, 1779, 1302, 501, -828, -1765, -1638, -1273, -342, 534, 1613, 1555, 1412, 337, -643, -1301, -1792, -1396, -420, 308, 1771, 1989, 1527, 632, -283, -1328, -1714, -1328, -858, 303, 1316, 1956, 1452, 791, -90, -1172, -1633, -1660, -716, 193, 914, 1512, 1577, 1033, -275, -1360, -1825, -1790, -878, 26, 970, 1641, 1558, 1045, 264, -725, -1752, -1917, -975, -163, 871, 1618, 1643, 1331, 71, -733, -1594]
6914a594JK65Q74J151N68M03q9j110j163o88k72J80R83Q72J304K28m63o43j480
6933f73m70m86m7Q66J224Q99L33R6r12j145o00r11K67P24Q04J154L70K58j028
6952G23q13j081p23J34P54J036Q06O76L15n40j309p87q93j44M54J345R38N13L66
6971A770o94r00j045o45k29O95R26O70Q37M78n95r36r92r07j56L58R66R23Q25
6990A349N42m72q83q91r32n48M43R97P92R78M07m29p21q52r41l93K10O00R05P57
7010I18Q15Np75j132q89m95O8M53R75J062N43R7n69r24j173n32L5K96J008J203
7030I89N70K4k00j261j027m90j59L74J068O61J063m3l32q49j270n09n29N72P21
7049f27J150O90N54m69m21j611o20l95L94O97J056P81L81r9q04r56p16m66JO15
$$ y = [-1594, -1593, -1328, -454, 697, 1265, 1668, 1579, 469, -694, -1382, -1654, -1474, -491, 381, 1685, 1913, 1450, 807, -673, -1143, -1629, -1676, -810, 414, 1313, 1646, 1742, 830, -315, -915, -1826, -1559, -835, -31, 1123, 1493, 1751, 723, -90, -1171, -1894, -1760, -1006, 30, 836, 1512, 1827, 1287, -22, -809, -1702, -1846, -1392, -47, 891, 1404, 1770, 1076, 176, -869, -1514, -1743, -1048, -122, 548, 1385, 1863, 1268, 332, -660, -1567, -1723, -1365, -399, 524, 1349, 1891, 1419, 536, -355, -1287, -1835, -1392, -395, 397, 1375, 1782, 1353, 632, -220, -1161, -1554, -1344, -744, 161, 918, 1733, 1738, 963, -169, -1058, -1553, -1485, -1032, -57, 1005, 1548, 1645, 1076, 152, -1021, -1553, -1518, -1222, -214, 989, 1559, 1583, 1383, 122, -905, -1395, -1554, -1180, -112, 549, 1612, 1569, 1237, 388, -882, -1391, -1920, -1348, -627, 523, 1213, 1767, 1298, 877, -734, -1354, -1749, -1355, -658, 398, 1179, 1560, 1461, 657, -299, -1015, -1481, -1480, -865]
7069h65J137Q90L09j6o49q12j269j60l2O33N08J691L36m36l82o17j308n19K49
7088a312M13P45J197L80J01l74p62j210p16j47P75N54J180O55r2j06r08j101o07
7107a335k72K28Q11R62R25Q5j36p27q19r62m40M97M86R42R83M15m04n96q99r14
7127a170n58L08O44J072O68O99k23n27j088n23j099M02P30J024N56Q80j40j009
7145F46n83j118o36N9P09O35R91Q84k0m45n93j008j279M1Q07O47R79M25L88m94
7165A035o16j012q73j58O44N93R87R26r3L3r88j083q26j18L76O30R16R45M54m40
7185A332o78j087n52o31J48P47J025J033K60K16q86j005p75o29n2M95J076R49
7203I86P30j29o20o89j079m86k15M68P51J204N69K59o64j060r88o10O6M93Q52
$$ y = [-865, 272, 1162, 1471, 1455, 806, -6, -1275, -1435, -1467, -834, -326, 1365, 1701, 1265, 883, 266, -1042, -1561, -1312, -899, -154, 1043, 1423, 1524, 1150, 388, -822, -1538, -1685, -910, -356, 824, 1479, 1387, 1281, 373, -728, -1335, -1607, -1379, -568, 394, 1319, 1404, 1268, 541, -278, -1240, -1680, -1183, -697, 245, 1228, 1643, 1239, 643, -256, -1170, -1728, -1420, -776, 296, 964, 1663, 1440, 913, -175, -698, -1797, -1395, -665, 359, 915, 1795, 1655, 646, 63, -1055, -1691, -1632, -923, -288, 703, 1587, 1567, 1122, 529, -479, -1758, -1717, -910, -263, 716, 1141, 1529, 1035, 419, -593, -1466, -1624, -980, -387, 600, 1526, 1433, 1466, 478, -605, -1431, -1549, -1173, -543, 373, 1318, 1772, 1332, 654, -433, -985, -1616, -1468, -721, 304, 1337, 1597, 1813, 927, -78, -853, -1482, -1534, -1039, 37, 986, 1716, 1587, 967, 278, -801, -1287, -1502, -1034, -283, 921, 1490, 1749, 1085, 25, -963, -1573, -1507, -1014, -162]
7222a62Q09O84K73n40p92r87m83m30L06R90Q83P98L58m84p16r86p50l57J80Q82
7242e24R06O63M72l4q03q17p27p59R2J038R79M76P08k12m58j306o78m46j30O61
7262h99J197P52J62L06n37j052o85q50L55R8J092J150L50J47o70q49r65k76l56
7281a530K14Q54J292M54L40n48q07r34o20m27N15Q91O78N65N66l30m28j172p78
7300a205r9j48P69J129M82O51n5q75r95p28k26k72Q22J050O73M49J27p90o88j045
7320i74l52j71O86J085M18Q04o2n11q97r20m39p8K35J093R57O94k34l31j036q42
7340h75k89l30L69P94J014O37K20n73p49o47p37m39K74R03R49N70N18o74m46j139
7360f50k74o84K54Q45O99J173J37R7j300o26r35j10j38Q01R11R40K27j43m59q62
$$ y = [-162, 647, 1331, 1604, 1064, 272, -715, -1198, -1628, -1322, -332, 551, 1349, 1707, 1223, 507, -479, -1229, -1586, -1406, -524, 382, 1045, 1517, 1483, 680, -137, -864, -1623, -1531, -493, 486, 962, 1670, 1458, 1000, -306, -984, -1430, -1560, -899, 298, 1050, 1212, 1518, 981, -71, -756, -1606, -1251, -1153, -61, 1089, 1439, 1586, 916, 67, -898, -1174, -1530, -1316, -462, 830, 1284, 1624, 1076, 269, -665, -1285, -1712, -1197, -306, 372, 937, 1503, 1173, 745, -427, -1205, -1304, -1452, -683, 446, 928, 1579, 1524, 649, -346, -1074, -1300, -1572, -750, 300, 973, 1422, 1549, 759, 71, -974, -1326, -1497, -811, 274, 692, 1496, 1434, 923, 26, -894, -1333, -1411, -1176, -83, 874, 1568, 1334, 1003, -33, -875, -1164, -1494, -1125, -331, 683, 1320, 1540, 967, 218, -429, -1166, -1605, -1331, -428, 521, 1091, 1609, 935, 489, -650, -924, -1608, -1354, -509, 190, 1363, 1500, 1597, 297, -329, -1264, -1374, -1512, -711, 200, 1140, 1367, 1224, 765, -97]
7380i7r85m74j37P40R50Q99N64p3k76j088r23o32%N03P78J233K46L89o83q17p65
7401f48q43k0O15N41Q57P13M13m38o42j123p66l65K19J034Q90J005L6m24l10j159
7421d15n58o15M65M27J015Q33K17L00j085j181m64k92%N22J133Q43K69k7o67r48
7441b28q50m53o2N40J152J001K05L89p44q47q14q37M9M09J150O83P16m6l30q91
7461A92r75n32l23N48P45J036N10K07l87r48p68m59n17L78J031O55O88N20m38
7480A163p73r57n69l52K7P68J161P67Q5op36r24q87l19M36K11J073O59P66l12
7500A281n94q63r02k4j70L94P97J301K71k55p5j021j233k59J93k8R68J094N72
7519A447Mn23o91j080o59L48J41P79P58R97j74k96o35q39p41l49L93P40R68P11
$$ y = [-97, -1082, -1556, -1693, -953, -3, 896, 1460, 1387, 1111, 23, -900, -1532, -1532, -1029, -251, 982, 1228, 1617, 934, 117, -648, -1491, -1511, -896, -355, 502, 1215, 1628, 1190, 548, -575, -1341, -1706, -1487, -453, 437, 1442, 1478, 1054, 744, -415, -973, -1588, -1123, -696, 319, 1152, 1369, 1669, 584, -597, -1061, -1353, -1353, -831, 302, 1145, 1414, 1387, 720, -228, -1078, -1531, -1593, -1053, 99, 1100, 1305, 1694, 950, 103, -711, -1548, -1499, -1090, 60, 743, 1459, 1413, 1083, 192, -783, -1315, -1638, -1090, -345, 691, 1201, 1408, 1021, 73, -695, -1154, -1671, -1293, -262, 393, 1081, 1601, 1163, 390, -567, -1136, -1488, -1461, -693, 468, 1235, 1320, 1314, 578, -346, -1233, -1552, -1116, -905, 168, 827, 1593, 1281, 687, -176, -1078, -1102, -1272, -878, -81, 1220, 1491, 1236, 1161, 140, -1093, -1352, -1159, -1187, -219, 875, 1447, 1451, 928, 237, -843, -1502, -1154, -1013, -234, 524, 1521, 1347, 1051, 416, -423, -1164, -1513, -1120, -380, 588, 1299]
7539A299J40k98l07j209q74m06O41L94J024P38L68m28m63q14o45m41k9O19R09
7558B18R00L23o2p62n18j084q8l13P49P69O12O48K7o02p05p30q96K01M28Q72J96
7579A83J184N4n61p82n81q83k00O50N06J085O51J49o14m93q98q42k45M32R81P43
7599E19M21N04j47q42q70m84m72R6Q33R16N41N63k97o01q16n61q90K83P81O69
7619A46O96O29l34j69j244o00n52j7O39M12J209M13L4o80o26n79o47q3O26P21
7639fP98L15N44m18j164p73k31o08L93R09Q59M87L65j29j265m85p07p0j17O66
7659f37J298O99J05P1j014q83o37k91j03R64P64O82N22l42m92j082p20l95L09
7678a182M07J092O93L78q7o39p52q49k65j22O31M34J233K75m6k54j091p36k70
$$ y = [1299, 1439, 1141, 834, -375, -1249, -1655, -1014, -620, 404, 1142, 1510, 1082, 619, -195, -840, -1281, -1310, -691, 218, 1118, 1441, 1379, 617, 99, -985, -1073, -1386, -637, 132, 744, 1392, 1419, 817, 112, -618, -1514, -1313, -885, -13, 183, 1367, 1421, 860, 78, -503, -1386, -1586, -936, -430, 655, 1306, 1455, 841, 348, -550, -1392, -1637, -1205, -224, 519, 940, 1444, 1297, 455, -415, -899, -1371, -1275, -442, 474, 1015, 1578, 1281, 680, -136, -697, -1587, -1304, -523, 146, 842, 1471, 1137, 968, -276, -876, -1428, -1445, -806, -394, 815, 1228, 1262, 582, -44, -623, -1270, -1353, -727, -6, 792, 1107, 1651, 1233, 69, -704, -935, -1543, -1150, -241, 618, 1105, 1470, 1341, 76, -409, -1116, -1186, -1303, -637, 661, 1360, 1465, 1536, 522, -361, -998, -1289, -1392, -428, 336, 1018, 1540, 1198, 706, -376, -1096, -1491, -1182, -775, 317, 1010, 1388, 1301, 662, -90, -939, -1204, -1326, -695, -261, 972, 1247, 1201, 947, -144, -880, -1150]
7697a150l45M35J079O14M65K62j49q06j213l51k63N58O21O02P84L10k23r56r98
7716g24l36PJ67L09J045P57l4j24p41n58p76O3l96M56J106Q17J36j71n26q47r02
7737a272J53j03M48Q33R60Q5L5m43o91q27m35j40J82J328P45P30m90k30p29j052
7757i13n38K20M61O03R52N31M0o13o32p65n65n6K31P83R71M16K67l55o20p90q10
7778a182j69K00Q94N19P22K54j65n54p01p50o01K20O44Q56P26M63l15l58o86j057
7798a040l26J89N44Q12M80M36N0n21p18p82o01L18M85N16R26L45L19p84l91q72
7818f15p82MO38P07N62P60K98o15p17p36m47l77K20P21R30Q82r0o51k01n60j156
7839a225l2P7N99J064P02K16k90o13r39n00k97J47N57O27Q01K84P9m35r26o08
$$ y = [-1150, -1495, -1060, 19, 633, 1098, 1360, 1211, 405, -808, -1159, -1422, -864, -243, 359, 1143, 1453, 1230, 274, -724, -1060, -1053, -886, -577, 468, 1225, 1191, 1067, 326, -232, -1008, -945, -1341, -885, 221, 1038, 1174, 1003, 477, -370, -1272, -1119, -1222, -774, 59, 1019, 1104, 1139, 696, 5, -822, -1257, -1397, -1215, 113, 858, 1588, 1098, 868, 139, -913, -1451, -1231, -770, -167, 785, 1316, 1356, 743, 111, -654, -1219, -1275, -1044, -261, 710, 1126, 1393, 1038, 418, -372, -1182, -1351, -1151, -257, 262, 984, 1238, 1073, 519, -182, -932, -1533, -1313, -669, 187, 913, 1376, 1061, 703, 17, -1040, -1366, -1177, -633, 179, 659, 1095, 1145, 624, -94, -876, -1477, -1159, -674, -158, 768, 1113, 1432, 648, 257, -615, -1397, -1393, -755, -48, 514, 1274, 1572, 957, 240, -496, -943, -1320, -1100, -379, 551, 1433, 1343, 692, 491, -69, -1225, -1257, -1180, -581, 483, 1185, 1401, 1111, 498, -441, -941, -1238, -1091, -534, 93, 894, 1178, 1257, 822, -104, -712]
7859g12p32N9Q80N90Q18K33j32r8j034p26l64k14O00P85Q04N95k84k25q29o36
7879f22n45k05O76O44M65P75Q7k94p21p17o26j22L29M35R85M83L78l54q34m28
7899b11p95j26l1Q62P23L97N92j89p05q74o61l25J63N97Q25N41K81n3m10q64o60
7920i23j20k09N71P24P61N43j22m99o91q26k34k25L15Q70R67J21L67n69j037m72
7940f88l20l29M73M39R40R23n7n51m29q42m01m18J55Q66O77N70K14k66m52o02
7960i8r15j58J10P92P73M32K20J3m53q42p71l17kN56P65M71O60j5o58p31o03n85
7982a356L98K57Q17M75P96j84o09n39p67l27L2L33N42O56Q13j3o56n90p21n56
8002a199L7L73N76Q21M21M10m72q35m87r37j27O71K71N70J007L71o81j01r83l72
$$ y = [-712, -1444, -1385, -505, 85, 903, 1136, 1004, 906, -128, -854, -1218, -1432, -832, -47, 757, 1352, 1068, 843, 14, -622, -1167, -1372, -696, -52, 413, 1188, 1275, 981, 260, -457, -1083, -1205, -876, -441, 544, 1027, 1405, 1051, 217, -211, -1006, -1132, -1163, -301, 422, 819, 1411, 1222, 517, -357, -1018, -1343, -1180, -583, 242, 783, 1064, 1011, 601, -263, -923, -1043, -1252, -681, 43, 804, 1347, 1225, 726, 35, -791, -1025, -1250, -935, -65, 902, 1023, 1390, 821, -216, -688, -1008, -1337, -864, -425, 515, 1438, 1381, 830, 401, -441, -842, -1260, -1105, -239, 438, 1008, 1222, 956, 504, -98, -1013, -1171, -1061, -269, 504, 936, 1156, 1169, 716, -126, -897, -1214, -1216, -660, 105, 576, 1236, 1221, 563, -168, -771, -1356, -958, -701, 116, 591, 1387, 1203, 594, 55, -712, -1039, -1007, -674, -132, 524, 1337, 1324, 668, 78, -643, -1199, -1162, -789, -213, 608, 1029, 1439, 967, 132, -355, -1292, -1419, -748, -477, 93, 1100, 1471, 790, 689, -294, -666]
8022f66n03K39M09Q21Q64Jq9n06r07k67m29k15P02O36Q56J93j95l72o58p88l41
8043a215K14K23Q95M30M08L49m68r56m96m36l46N29Q17O66M97L2n52m58p35m51
8063a053k65N39O25N86L53M08n24m15q51l68k32K83M83J102L18L68l32p78p22
8082d75j77o10J10O23J072M28L5J89o77q02l44o28J18N74O65O10O37j75o82m48
8102D3o65n78j8N40N12Q63L47m7l95p95m48o95Q4N01P00Q70J86K27l45p18p91
8123f22m32L6K33N17P39M07L82l21o30j019j57k07K24N24Q16N25J15j84m69r66
8143d89l35m42J92O01N43P40L7K5k70p95p18k01J00M53O85M64N73j36n88o69m22
8164f52o66J90O98N51P07K99P8n40n84p38l16k36M24P98M51N55M2l4q09p63m73
$$ y = [-666, -1169, -930, -521, 300, 1164, 1165, 1076, 570, -337, -604, -1033, -1248, -546, 90, 946, 1139, 944, 572, -86, -874, -1215, -1001, -778, 117, 547, 955, 1304, 836, -120, -616, -1052, -1398, -869, -52, 614, 1111, 1143, 591, 133, -602, -1053, -1318, -779, -154, 432, 785, 1193, 669, 254, -597, -965, -1197, -914, -431, 671, 989, 1357, 1025, 247, -475, -652, -1262, -1152, -529, 543, 971, 1006, 1195, 518, -284, -628, -1256, -1138, -564, 101, 711, 1348, 1173, 491, 43, -622, -1200, -1218, -678, -166, 697, 1044, 997, 602, -193, -641, -1336, -1252, -751, -51, 819, 1005, 1232, 887, 169, -622, -1054, -1018, -785, -268, 471, 878, 1260, 939, 309, -710, -867, -1074, -850, -326, 490, 1015, 1130, 946, 477, -489, -824, -1266, -1074, -473, 70, 810, 847, 872, 602, -193, -911, -1112, -1012, -559, 126, 590, 1163, 1027, 439, -230, -652, -1318, -1128, -430, 121, 828, 1127, 1205, 665, 81, -657, -973, -1209, -785, 13, 464, 1019, 1061, 1027, 218, -545, -1018]
8185a018q2L89M63Q24M00q6
$$ y = [-1018, -1100, -711, -248, 576, 976, 890]
8191H90
$$ Imaginary data points
##PAGE= N=2
##DATA TABLE= (X++(I..I)), XYDATA
0@%%%%%%%%%qJ6j6J8k6L5m3N6o8Q1j01J21j44J72k04K41k81L28l79M36n04N76
31C06o57P48q48R59j080J217j363J525j705J897k112K345k597K875l178L510l872
48b030M266m700N178n705O288o937P661q472R395j0451J1673j3107J4812j6889
62i018J9479k2819K7312l3711M3651o1350J02553l83677k16634N37248K64026
73B67060J78736o9633j19650j86912j24960j72450q5367M8951J92752J72404J60682
84B61613P9748m7007j98739k30761k17691r8973Q9926K48864K39149J79385R9921
95D05435j9416j57389k04523k09312j78960o4571J20093K39375K73242K07960
105D11934J2318k24964k91936j84314m4853N9537J35889J52649J39190J25396
$$ y = [0, 0, 0, 0, 0, 0, 0, 0, 0, 0, -8, 8, -8, 10, -16, 19, -24, 32, -36, 45, -56, 65, -79, 93, -111, 130, -151, 177, -202, 234, -270, 306, -351, 397, -451, 508, -572, 645, -718, 807, -898, 999, -1113, 1232, -1365, 1510, -1668, 1842, -2030, 2236, -2464, 2714, -2991, 3297, -3640, 4021, -4451, 4944, -5507, 6166, -6941, 7871, -9018, 10461, -12358, 14954, -18757, 24894, -36456, 66097, -317580, -534214, 3034, 267060, 445796, 376163, 256513, 69601, -55359, -227809, -313176, -264225, -71473, 100931, 261613, 341361, 294354, 95615, -135146, -352837, -451810, -361884, -113020, 126129, 305514, 405435, 386019, 228630, 24107, -185205, -364165, -428736, -308643, -69268, 203974, 411934, 424252, 199288, -92648, -276962, -321815, -262278, -126389, 26260, 165450, 290846]
115B90846M2457j24307k21518j75230q9975k0324O7014J46282J81598J82128J08075
126C87046p2329k26242k28386j42326n3975N2622J54316J90369J72231J10204
136C43530l0239j80653k16522j50113o2499M7388J57826J83654J26011N1476l9635
147B30224j42587j81003j38817o9051K9481J52039J99448J38958N7066l592p7490
158A94676j42526j64343j49831p2982Q0588K03555J91503R7912P375p7368j43091
169B5468j49100j07018l0486R4270J98224J77354O6430k9893r4581j42860j45923
180a38115j07725n0703M6889J61806J97188J28271L2895n2365j26104j45783j01828
191a55574m7891R143Q7406J42015J25399O4947j7604j17593j72939j30214m0514
$$ y = [290846, 333303, 208996, -12522, -187752, -277727, -298051, -231037, -84755, 96843, 278971, 387046, 314717, 88475, -139911, -282237, -336212, -283590, -129274, 61095, 233326, 343530, 313291, 132638, -83884, -233997, -296496, -249108, -91282, 92372, 218383, 269859, 230224, 87637, -93366, -232183, -301234, -271753, -119714, 79734, 218692, 275758, 272166, 194676, 52150, -112193, -262024, -335006, -254418, -50863, 140640, 238552, 245927, 168559, 25468, -123632, -230650, -261136, -166866, 31358, 208712, 275142, 245249, 150668, 7808, -138115, -245840, -296543, -249654, -87848, 109340, 237611, 270506, 218141, 92037, -53746, -155574, -203465, -194322, -106916, 35099, 160498, 225445, 207841, 90248, -82691, -212905, -253419]
202b53419M0628J14123J62113J43557P1944k1716j25671j88401j47037m1907L9195
213b06591Q5992J18376J19045Q3491K5619o2189j49467j56662p4043J8125P6774
224a21530J12828J14909P8487K4913m4150j26219j60344j04173p053P5625J32623
235b4084J42834R1945J6481n2032j17828j54526j18079l0428N7205J25527J48445
246H5460J03209K2332m1482q6677j19236j10412n3823K1809R3372J37181J10951
257A62684K9131m4221q4293j06845j02579n9718Q017Q5325J47814J47387O6737
268B49439l5614j02099j29186j18832p0299k752O3131J19872J37300Q3731o135
279A88556p7587j08875j02394n8661N88N0929R3505J16810Q8643J0547p2249j23816
$$ y = [-253419, -212791, -98668, 63445, 207002, 278946, 257230, 131559, -56842, -203879, -245786, -206591, -120599, -2223, 116822, 200313, 225932, 163743, 14276, -142386, -216429, -198304, -121530, -8702, 106207, 184694, 209607, 165457, 39238, -121106, -225279, -232332, -156707, -24084, 118750, 210695, 227176, 175144, 57316, -97210, -215289, -245717, -188512, -62985, 85460, 188669, 211001, 169519, 82842, -36394, -146806, -200629, -178820, -85448, 51733, 162684, 191815, 147594, 63301, -43544, -146123, -205841, -197824, -112499, 35315, 182702, 249439, 213825, 111726, -17460, -136292, -206591, -209343, -146212, -26340, 110960, 194691, 188556, 110969, 2094, -100300, -158961, -158373, -107444, -13939, 102871, 191514, 202061, 129812, 5996]
291E996j28281p9932l101O0348R7950J16940J02073M3627l6082j03041j32849
302e6352j05944l0821M4355Q8289J03219R1036M4440k3706q8423j23355j06043
313a63305l3353N0917R9685J04721Q1081L8040j5170o7605j08910j17708p2098
324b03705J2778Q8694J21702J05834N4431r885o4506r8948j06404p4194n058O8199
336a11062J10430J04148N9502k826n6174q7994r7180p6935k1773N2922J10127
347a6815J19674P5204M7o6653r8379r5610o9499k4372L3380Q8278J15516R5844
359A56615L3134m1854r3098j04221p9776l3414K1119P3087J04268R3898M0583
370A70341l3289r0995j05802p5725k3054K8151O9440R5069R2979N5206j0995p9606
$$ y = [5996, -122285, -202217, -205318, -144970, -47020, 69920, 171993, 215620, 179538, 76497, -56352, -162296, -193117, -148762, -60473, 42746, 133782, 178222, 154516, 66093, -57262, -163305, -196658, -145741, -46056, 58665, 139746, 177786, 162616, 95011, -13899, -131607, -203705, -190927, -102233, 19469, 125303, 179734, 169849, 105343, 6395, -100009, -174203, -179261, -111062, -632, 103516, 163018, 160192, 104018, 16024, -81156, -158091, -179864, -126942, -16815, 102859, 178063, 178110, 111457, 13078, -82532, -152031, -176403, -143023, -54745, 60771, 156615, 189749, 147895, 54797, -49424, -129200, -162614, -141495, -68408, 35860, 129758, 170341, 137052, 46057, -59745, -135470, -158524, -130373, -60933, 34136, 127115, 182321, 171326, 91720]
382I1720j17591j04381m9120J6319O6964R4425R3270O1360P159n4262r9243j01302
$$ y = [91720, -25871, -130252, -179372, -163053, -96089, -1664, 91606, 152966, 160125, 105863, 6620, -94682]
$$ [...]
8191b87
##END NTUPLES=NMR FID
##END=
