##TITLE=1H_Pr 5-Me
 DMSO+CDCl3
 8 sc, 
 12.3.2024
##JCAMPDX= 6.0         $$ Bruker NMR JCAMP-DX V2.0
##DATA TYPE= NMR FID
##DATA CLASS= NTUPLES
##ORIGIN= UXNMR, Bruker Analytische Messtechnik GmbH
##OWNER= root
$$ XWIN-NMR		Version 3.5
$$ Tue Mar 12 15:44:00 2024 Russian Standard Time (UT+4h)  she@DPX200
##.OBSERVE FREQUENCY= 200.1313
##.OBSERVE NUCLEUS= ^1H
##.DELAY= (6, 6)
##.ACQUISITION MODE= SIMULTANEOUS
##.ACQUISITION SCHEME= undefined
##.AVERAGES= 8
##.DIGITISER RES= 18
##SPECTROMETER/DATA SYSTEM= spect
##.PULSE SEQUENCE= zg30
##.SOLVENT NAME= CDCl3
##.SHIFT REFERENCE= (INTERNAL, CDCl3, 0, 15.7039)
##AUDIT TRAIL= $$ (NUMBER, WHEN, WHO, WHERE, WHAT)
$$ ##TITLE= Audit trail, XWIN-NMR		Version 3.5
$$ ##JCAMPDX= 5.01
$$ ##ORIGIN= Bruker BioSpin GmbH
$$ ##OWNER= she
$$ F:/spectra/data/she/nmr/H-F/1/audita.txt
$$ ##AUDIT TRAIL=  $$ (NUMBER, WHEN, WHO, WHERE, WHAT)
(   1,<2024-03-12 15:42:43.34 +0400>,<she>,<DPX200>,
      <created by zg, POWCHK disabled, PULCHK disabled
       configuration hash MD5:
       00 E9 B6 7A A2 85 ED C7 34 08 36 98 17 FE 4E 26
       data hash MD5: 16K
       99 15 60 3A 9E 71 9E C9 DA 6D 48 DA 26 1E 83 C7>)
$$ ##END=
$$ 
$$ hash MD5
$$ 83 6F 66 86 74 75 0C 34 68 9B AD 3C 74 4D A6 C5
##$RELAX= 
##$RELAX= 
##$RELAX= 
##$RELAX= 
##$RELAX= 
##$RELAX= 
$$ Bruker specific parameters
$$ --------------------------
##$DU= <F:/spectra>
##$EXPNO= 1
##$NAME= <H-F>
##$PROCNO= 1
##$TYPE= <nmr>
##$USER= <she>
##$AMP= (0..31)
100 100 100 100 100 100 100 100 100 100 100 100 100 100 100 100 100 100 
100 100 100 100 100 100 100 100 100 100 100 100 100 100 
##$AQSEQ= 0
##$AQ_mod= 1
##$AUNM= <au_zg>
##$AUTOPOS= <>
##$BF1= 200.13
##$BF2= 200.13
##$BF3= 200.13
##$BF4= 200.13
##$BF5= 200.13
##$BF6= 200.13
##$BF7= 200.13
##$BF8= 200.13
##$BYTORDA= 1
##$CFDGTYP= 0
##$CFRGTYP= 5
##$CHEMSTR= <none>
##$CNST= (0..31)
1 1 145 1 1 1 1 1 1 1 1 1 1 1 1 1 1 1 1 1 1 1 1 1 1 1 1 1 1 1 1 1 
##$CPDPRG= <>
##$CPDPRG1= <>
##$CPDPRG2= <>
##$CPDPRG3= <>
##$CPDPRG4= <mlev>
##$CPDPRG5= <mlev>
##$CPDPRG6= <mlev>
##$CPDPRG7= <mlev>
##$CPDPRG8= <mlev>
##$CPDPRGB= <>
##$CPDPRGT= <>
##$D= (0..31)
0 1.2 0 0 0 0 0 0 0 0.06 0 0.03 0 0 0 0 0.0002 0 0 0 0 0 0 0 0 0 0 0 0 
0 0 0 
##$DATE= 1710243762
##$DBL= (0..7)
120 120 120 120 120 120 120 120 
##$DBP= (0..7)
150 150 150 150 150 150 150 150 
##$DBP07= 0
##$DBPNAM0= <>
##$DBPNAM1= <>
##$DBPNAM2= <>
##$DBPNAM3= <>
##$DBPNAM4= <>
##$DBPNAM5= <>
##$DBPNAM6= <>
##$DBPNAM7= <>
##$DBPOAL= (0..7)
0.5 0.5 0.5 0.5 0.5 0.5 0.5 0.5 
##$DBPOFFS= (0..7)
0 0 0 0 0 0 0 0 
##$DE= 6
##$DECBNUC= <off>
##$DECIM= 32
##$DECNUC= <off>
##$DECSTAT= 4
##$DIGMOD= 1
##$DIGTYP= 9
##$DL= (0..7)
0 120 120 120 120 120 120 120 
##$DP= (0..7)
150 150 150 150 150 150 150 150 
##$DP07= 0
##$DPNAME0= <>
##$DPNAME1= <>
##$DPNAME2= <>
##$DPNAME3= <>
##$DPNAME4= <>
##$DPNAME5= <>
##$DPNAME6= <>
##$DPNAME7= <>
##$DPOAL= (0..7)
0.5 0.5 0.5 0.5 0.5 0.5 0.5 0.5 
##$DPOFFS= (0..7)
0 0 0 0 0 0 0 0 
##$DQDMODE= 0
##$DR= 18
##$DS= 0
##$DSLIST= <SSSSSSSSSSSSSSS>
$$ [...]
##$SUBNAM2= <"">
##$SUBNAM3= <"">
##$SUBNAM4= <"">
##$SUBNAM5= <"">
##$SUBNAM6= <"">
##$SUBNAM7= <"">
##$SUBNAM8= <"">
##$SUBNAM9= <"">
##$SW= 18.0517328524113
##$SWIBOX= (0..15)
0 0 2 0 0 0 0 0 0 0 0 0 0 0 0 0 
##$SW_h= 3612.71676300578
##$TD= 16384
##$TD0= 1
##$TE= 0
##$TE2= 300
##$TE3= 300
##$TEG= 300
##$TL= (0..7)
0 120 120 120 120 120 120 120 
##$TP= (0..7)
150 150 150 150 150 150 150 150 
##$TP07= 0
##$TPNAME0= <>
##$TPNAME1= <>
##$TPNAME2= <>
##$TPNAME3= <>
##$TPNAME4= <>
##$TPNAME5= <>
##$TPNAME6= <>
##$TPNAME7= <>
##$TPOAL= (0..7)
0.5 0.5 0.5 0.5 0.5 0.5 0.5 0.5 
##$TPOFFS= (0..7)
0 0 0 0 0 0 0 0 
##$TUNHIN= 0
##$TUNHOUT= 0
##$TUNXOUT= 0
##$USERA1= <user>
##$USERA2= <user>
##$USERA3= <user>
##$USERA4= <user>
##$USERA5= <user>
##$V9= 5
##$VALIST= <valist>
##$VCLIST= <CCCCCCCCCCCCCCC>
##$VD= 0
##$VDLIST= <DDDDDDDDDDDDDDD>
##$VPLIST= <PPPPPPPPPPPPPPP>
##$VTLIST= <TTTTTTTTTTTTTTT>
##$WBST= 1024
##$WBSW= 4
##$XGAIN= (0..3)
0 0 0 0 
##$XL= 0
##$YL= 0
##$YMAX_a= 525524
##$YMIN_a= -743919
##$ZGOPTNS= <>
##$ZL1= 120
##$ZL2= 120
##$ZL3= 120
##$ZL4= 120
##$ABSF1= 10
##$ABSF2= 0
##$ABSG= 5
##$ABSL= 3
##$ALPHA= 0
##$AQORDER= 0
##$ASSFAC= 0
##$ASSFACI= 0
##$ASSFACX= 0
##$ASSWID= 0
##$AUNMP= <proc_1d>
##$AZFE= 0.1
##$AZFW= 0.1
##$BCFW= 1
##$BC_mod= 2
##$BYTORDP= 1
##$COROFFS= 0
##$CY= 11.3945322036743
##$DATMOD= 1
##$DC= 2
##$DFILT= <>
##$DTYPP= 0
##$F1P= 15.7292609196834
##$F2P= 12.9074282941183
##$FCOR= 0.5
##$FTSIZE= 0
##$FT_mod= 4
##$GAMMA= 1
##$GB= 0.15
##$INTBC= 1
##$INTSCL= 1
##$ISEN= 128
##$LB= 0.24
##$LEV0= 0
##$LPBIN= 0
##$MAXI= 10000
##$MC2= 0
##$MEAN= 0
##$ME_mod= 0
##$MI= 1.114404
##$NCOEF= 0
##$NC_proc= 0
##$NLEV= 6
##$NOISF1= 3.799351
##$NOISF2= 2.8
##$NSP= 1
##$NTH_PI= 0
##$NZP= 0
##$OFFSET= 15.70392
##$PC= 1
##$PHC0= -25303.49
##$PHC1= 11.18731
##$PH_mod= 1
##$PKNL= yes
##$PPARMOD= 0
##$PSCAL= 0
##$PSIGN= 0
##$REVERSE= no
##$SF= 200.130013532006
##$SI= 16384
##$SIGF1= 3
##$SIGF2= 2
##$SINO= 400
##$SIOLD= 16384
##$SREGLST= <1H.CDCl3>
##$SSB= 0
##$STSI= 0
##$STSR= 0
##$SW_p= 3612.71676300578
##$SYMM= 0
##$S_DEV= 0
##$TDeff= 0
##$TDoff= 0
##$TI= <>
##$TILT= no
##$TM1= 0
##$TM2= 0
##$TOPLEV= 0
##$USERP1= <user>
##$USERP2= <user>
##$USERP3= <user>
##$USERP4= <user>
##$USERP5= <user>
##$WDW= 1
##$XDIM= 8192
##$YMAX_p= 0
##$YMIN_p= 0
$$ End of Bruker specific parameters
$$ ---------------------------------
##NTUPLES= NMR FID
##VAR_NAME=  TIME,          FID/REAL,        FID/IMAG
##SYMBOL=    X,             R,               I
##VAR_TYPE=  INDEPENDENT,   DEPENDENT,       DEPENDENT
##VAR_FORM=  AFFN,          ASDF,            ASDF
##VAR_DIM=   8192,          8192,            8192
##UNITS=     SECONDS,       ARBITRARY UNITS, ARBITRARY UNITS
##FACTOR=    0.0002768,     1,               1
##FIRST=     0,             0,               0
##LAST=      2.2672688,     0,               0
##MIN=       0,             -743919,         0
##MAX=       2.2672688,     525524,          0
$$ Real data points
##PAGE= N=1
##DATA TABLE= (X++(R..R)), XYDATA
$$ plain form
0 0 0 0 0 0 0 0 0 0 0 0 0 0 0 0 0 -8 8 -8 8 -8 8 -12 16 -16 19 -20 24 -28 32 -35 43 -44 52 -56 64 -71 79 -89
38 -89 99 -108 122 -132 146 -163 178 -196 217 -239 261 -288 316 -351 387 -430 475 -530 595 -670
58 -670 764 -879 1018 -1206 1456 -1809 2345 -3216 4823 -8408 19722 -127337 -743919 -523271
72 -523271 116212 503107 525524 149008 -177813 12100 269344 205849 110191 -1832 -149541
83 -149541 81037 441517 262878 -196190 -395263 -314774 36219 359932 154059 -231220
93 -231220 -205996 -51167 -43920 -4321 -62593 -241759 -124626 172106 213931 64203 -196119
104 -196119 -448813 -210324 347311 412834 9609 -257346 -264723 -67979 209025 179967 -52525
115 -52525 -20887 109875 85482 108403 80450 -133662 -137617 131017 253586 182178 21851
$$ packed form
0@%%%%%%%%%%%%%%%qJ6j6J6j6J6k0K8l2L5l9M4n2O0o7P8q7R6j08J20j35J50j68
38h9J88k07K30k54K78l09L41l74M13m56N00n49O04o67P38q17R05j005J125j265
58f70J434j643J897k224K662l265M154n561Q039j3231K8130j47059o16582K20648
72e23271O39483L86895K2417l76516l26821J89913K57244o3495r5658j12023j47709
83a49541K30578L60480j78639m59068j99073Q0489L50993L23713k05873l85279
93b31220K5224J54829P247L9599n8272j79166J17133K96732M1825j49728k60322
104a96119k52694K38489N57635O5523m03225k66955p377J96744K77004k9058k32492
115e2525L1638J30762k4393K2921k7953k14112l955K68634J22569p1408j60327
$$ plain form
126 21851 -211728 -208846 78494 152171 -6973 -17512 7065 -50969 -15084 -22411 -157503 -142254
138 -142254 -8825 62273 163149 149626 -155005 -328370 -109438 111544 143243 91303 -53721
149 -53721 -117246 19447 41700 -83861 -45287 59537 60469 109172 134498 -15539 -107993 -38106
161 -38106 21848 102013 164506 32926 -73242 24866 41474 -68843 -69244 -25958 -13699 52530
173 52530 41380 -95007 -128000 -87395 -99231 520 146120 62922 -89718 -88527 -39525 29621
185 29621 105320 42338 -28614 67353 111604 4184 -34862 -13464 -21143 52036 121001 36109
197 36109 -45433 -58745 -92755 -45610 61289 22951 -52964 4462 37311 -25104 -55601 -76555
209 -76555 -70927 49271 118776 37961 -10705 -25770 -94334 -70502 51857 83040 45337 18640
$$ packed form
126B1851k33579K882K87340P3677j59144j0539K4577n8034L5885p327j35092J5249
138a42254J33429P1098J00876j3523l04631j73365K18932K20982L1699n1940j45024
149e3721o3525J36693K2253j25561L8574J04824R32M8703K5326j50037r2454O9887
161c8106N9954Q0165O2493j31580j06168R8108J6608j10317m01M3286J2259O6229
173E2530j1150j36387l2993M0605j1836R9751J45600q3198j52640J191M9002O9146
185B9621P5699o2982p0952R5967M4251j07420l9046K1398p679P3179O8965q4892
197C6109q1542j3312l4010M7145J06899l8338p5915N7426L2849o2415l0497k0954
209g6555N628J20198O9505q0815m8666j5065o8564K3832J22359L1183l7703k6697
$$ plain form
221 18640 -35276 -39709 29921 2784 -71501 -8476 77578 69980 49835 -6593 -92313 -60874
233 -60874 33068 48908 47187 39464 -33755 -52829 16597 7302 -50401 -25184 13446 30275 51639
246 51639 -4939 -92326 -60707 10391 17199 35743 47232 -19167 -59355 -25045 -4007 19655
258 19655 44619 -4986 -38512 19370 36614 -14302 -28225 -17011 2892 61637 74810 -186
270 -186 -43442 -27617 -13846 30156 70705 23691 -24393 -5472 -1584 -20244 -19631 -29007 -22722
283 -22722 29649 38482 -20689 -48935 -47451 -54467 -17043 38912 38343 16532 -5509 -40318 -27659
296 -27659 27336 31602 3129 13520 32446 32652 30441 -3777 -47548 -23539 30156 43494 35510
309 35510 6335 -41805 -43139 -3151 8424 -1280 184 -3565 -5272 5181 -8358 -31044 -15023
$$ packed form
221A8640n3916m433O9630k7137p4285O3025Q6054p598k0145n6428q5720L1439
233f0874R3942J5840j721p723p3219j9074O9426r295n7703K5217L8630J6829K1364
246E1639n6578q7387L1619P1098O808J8544J1489o6399m0188L4310K1038K3662
258A9655K4964m9605l3526N7882J7244n0916j3923J1214J9903N8745J3173p4996
270a86m3256J5825J3771M4002M0549m7014m8084J8921L888j8660O13r376O285
283b2722N2371Q833n9171k8246J484p016L7424N5955n69k1811k2041l4809J2659
296b7659N4995M266k8473J0391J8926K06k211l4218m3771K4009N3695J3338p984
309C5510k9175m8140j334L9988J1575r704J464l749j707J0453j3539k2686J6021
$$ plain form
322 -15023 6047 6926 15025 13886 -11453 -25621 -18451 -2636 22832 33246 1258 -29775 -17656
335 -17656 5560 13785 11684 -3182 -7056 15301 23591 785 -20324 -20493 -592 28640 38351
348 38351 12723 -17767 -23938 -15038 -1320 11796 13125 10316 7298 -5283 -18442 -19920 -11756
361 -11756 -3109 3894 11687 14848 4512 -16432 -32379 -25447 1801 24225 23092 3450 -9054
374 -9054 -5420 -2157 -2313 -2628 469 15855 28073 15800 -5424 -13663 -9690 139 11589 11729 3429
389 3429 2697 -1584 -17506 -17522 -3834 2269 5488 1298 -14921 -14613 1590 2130 -6327 -876 4150
404 4150 4543 10741 2058 -13911 -504 17224 12719 11248 8370 -7745 -7803 2530 -2685 327 17511
419 17511 9315 -10084 -8832 -11740 -14530 2905 2983 -10793 4008 15806 -4248 -17095 -17898 -18671
$$ packed form
322a5023K1070Q79Q099j139k5339j4168P170J5815K5468J0414l1988l1033J2119
335a7656K3216Q225k101j4866l874K2357Q290k2806k1109j69J9901K9232R711
348C8351k5628l0490o171Q900J3718J3116J329k809l018j2581j3159j478Q164
361a1756Q647P003P793L161j0336k0944j5947O932K7248K2424j133j9642j2504
374i054L634L263j56l15L097J5386J2218j2273k1224q239L973R829J1450J40q300
389C429p32m281j5922j6J3688O103L219m190j6219L08J6203N40q457N451N026
404D150L93O198q683j5969J3407J7728m505j471k878j6115n8J0333n215L012J7184
419A7511q196j9399J252k908k790J7435P8j3776J4801J1798k0054j2847q03p73
$$ plain form
433 -18671 5558 32022 12118 -11140 -2966 -4648 -7176 8840 3489 -6153 15921 21467 -441
446 -441 -1223 -612 -15757 -3169 18855 8070 5043 12717 -11494 -21704 3770 4785 -3254 7968
460 7968 -3776 -18536 6428 13009 -16257 -16980 -3456 -6706 9382 15831 -21495 -25649 8226
473 8226 6505 -1322 9476 -7296 -17923 9886 12594 -3881 13438 15222 -9540 5668 21904
486 21904 -753 863 15316 -1751 5917 30140 5195 -17712 -4802 -11243 -11528 22569 13705
499 13705 -27500 -19548 -5443 -16071 -3369 -5668 -34689 -10725 26089 1076 -18600 -7023
511 -7023 -17731 -12465 24557 18608 -1363 15343 5640 -14749 17626 28003 -5224 2153 20012
524 20012 5458 15370 24125 -14000 -20153 13285 6366 723 20882 -7721 -36987 -674 14574
$$ packed form
433a8671K4229K6464j9904k3258Q174j682k528J6016n351r642K2074N546k1908
446d41p82O11j5145J2588K2024j0785l027P674k4211j0210K5474J015q039J1222
460G968j1744j4760K4964O581k9266p23J3524l250J6088O449l7326m154L3875
473H226j721p827J0798j6772j0627K7809K708j6475J7319J784k4762J5208J6236
486B1904k2657J616J4453j7067P668K4223k4945k2907J2910o441k85L4097q864
499A3705m1205P952J4105j0628J2702k299k9021K3964L6814k5013j9676J1577
511g023j0708N266L7022n949j9971J6706r703k0389L2375J0377l3227P377J7859
524B0012j4554R912Q755l8125o153L3438o919n643K0159k8603k9266L6313J5248
$$ plain form
537 14574 -7751 -5038 -14562 -31037 5825 22822 -22732 -28349 4147 -4465 -5524 12404 -12024
550 -12024 -21239 11072 4904 -6117 23303 11169 -25217 87 23180 3472 9829 16548 -8091
563 -8091 6883 30073 -3890 -12338 15168 -1589 -6548 30047 16601 -20899 -10416 -6318 -11215
576 -11215 17455 8986 -33297 -8160 23131 -12633 -24362 -5404 -16762 -7074 18024 -7812
588 -7812 -18648 11598 -5030 -27681 9832 17893 -10857 6176 17126 -5358 8324 16155 -12188
601 -12188 5879 33186 -309 -8616 24067 7919 -12593 9557 3787 -10620 10663 -1038
613 -1038 -24480 8298 11883 -31517 -16614 16694 -4433 -14150 -6065 -20661 -2682 28509 -5502
626 -5502 -26241 11743 8802 -13906 10432 11705 -11649 8837 17562 -4347 8877 10542 -25827
$$ packed form
537A4574k2325K713r524j6475L6862J6997m5554n617L2496q612j059J7928k4428
550a2024r215L2311o168j1021K9420j2134l6386K5304K3093j9708O357O719k4639
563h091J4974K3190l3963q448K7506j6757m959L6595j3446l7500J0483M098m897
576a1215K8670q469m2283K5137L1291l5764j1729J8958j1358R688K5098k5836
588g812j0836L0246j6628k2651L7513Q061k8750J7033J0950k2484J3682P831k8343
601a2188J8067K7307l3495q307L2683j6148k0512K2150n770j4407K1283j1701
613a038k3442L2778L585m3400J4903L3308k1127r717Q085j4596J7979L1191l4011
626e502k0739L7984k941k2708K4338J273k3354K0486Q725k1909J3224J665l6369
$$ plain form
639 -25827 -6108 35553 6949 -15255 6096 -1800 -7448 12845 -6637 -20101 16009 12491 -17269
652 -17269 7011 15168 -25320 -20024 10622 5375 10590 8644 -30235 -17884 28730 5202 -25422
665 -25422 -1525 2314 -5789 17813 10642 -19587 -5080 3489 -9976 19289 29711 -19359 -21246
678 -21246 19479 13896 1579 6038 -12859 -8546 25772 7827 -18973 7634 8035 -20974 1144
691 1144 19175 -7432 -10382 -5260 -16242 9650 25974 -19837 -31921 9256 7876 -9827 4138
704 4138 -4629 -14585 12761 10210 -13135 4816 4930 -20320 7459 35881 3577 -12837 3152
717 3152 -573 7009 20277 -8059 -14285 22456 11873 -17754 998 5246 -16829 -5218 5785
730 5785 -4574 6116 4019 -27904 -12932 21090 -1265 -17224 6049 4011 -3244 10215 -2935
$$ packed form
639b5827J9719M1661k8604k2204K1351p896n648K0293j9482j3464L6110l518k9760
652a7269K4280Q157m0488N296L0646n247N215j946l8879J2351M6614k3528l0624
665b5422K3897L839q103K3602p171l0229J4507Q569j3465K9265J0422m9070j887
678b1246M0725n583j2317M459j8897M313L4318j7945k6800K6607M01k9009K2118
691A144J8031k6607k950N122j0982K5892J6324m5811j2084M1177j380j7703J3965
704D138q767r956K7346k551k3345J7951J14k5250K7779K8422l2304j6414J5989
717C152l725P582J3268k8336o226L6741j0583k9627J8752M248k2075J1611J1003
730E785j0359J0690k097l1923J4972L4022k2355j5959K3273k038p255J3459j3150
$$ plain form
743 -2935 -13703 11049 8112 -12867 8005 16828 -12974 -8140 12525 -1574 -3844 4775 -9237
756 -9237 -697 19274 -6767 -20090 13161 15137 -9060 -2407 1958 -4839 10856 9050 -13607
769 -13607 1771 15271 -11267 -10320 12510 -1413 -11763 3356 369 -1918 8857 -9228 -22597
782 -22597 6990 14404 -8383 -127 7793 -8873 -2499 8672 -3587 -1330 6565 -7752 359
795 359 23951 2237 -23821 -4986 9550 6303 10593 -2825 -16787 5707 13596 -8358 -4936
808 -4936 5931 -8082 -4614 13847 3342 -7827 -4103 -11318 -4792 18687 5127 -18688 -4237
821 -4237 6848 -995 5294 5424 -9697 -2883 8793 1830 6252 10853 -11022 -12141 15397 14661
835 14661 -4308 -7521 -9471 -2878 15509 6716 -15983 -8398 2739 -5612 -966 6142 -6616 -7726
$$ packed form
743b935j0768K4752k937k0979K0872Q823k9802M834K0665j4099k270Q619j4012
756i237Q540J9971k6041j3323L3251J976k4197O653M365o797J5695j806k2657
769a3607J5378J3500k6538R47K2830j3923j0350J5119k987k287J0775j8085j3369
782b2597K9587P414k2787Q256P920j6666O374J1171j2259K257P895j4317Q111
795C59K3592k1714k6058J8835J4536l247M290j3418j3962K2494P889k1954L422
808d936J0867j4013L468J8461j0505j1169L724p215O526K3479j3560k3815J4451
821d237J1085p843O289J30j5121O814J1676o963M422M601k1875j119K7538p36
835A4661j8969l213j950O593J8387q793k2699P585J1137q351M646P108j2758j110
$$ plain form
849 -7726 4429 1784 2077 5557 -9241 -11637 10554 13615 -978 -550 -663 -6549 2193 6411 -2994
864 -2994 561 3867 -5620 213 10979 -2151 -12237 -1381 5692 6944 7955 -3567 -10419 4050
878 4050 7612 -4170 -1425 3635 -2444 -181 3227 -3817 -3949 -342 -5422 -3490 5734 101 -7757
893 -7757 -356 996 -3218 863 1782 -1871 1623 1461 -3640 2312 7344 -1089 -4212 2447 2598 254
909 254 1672 -1048 -307 5584 1535 -3840 835 2725 -1731 -708 2663 2529 2662 965 -5125 -4078
925 -4078 2065 871 -988 593 -2030 -3404 270 -343 -3743 -4276 -2344 1115 5259 2969 -4381 -5296
941 -5296 266 2739 2027 1134 -396 920 2080 907 -522 -776 -1102 -1331 753 3736 2937 -1263 -3904
958 -3904 -2341 1853 3788 1791 -1163 -2017 1131 3996 2316 -412 -2575 -2690 1938 4409 464 -3539
$$ packed form
849g726J2155k645K93L480j4798k396K2191L061j4593M28j13n886Q742M218r405
864b994L555L306r487N833J0766j3130j0086J0856P073J252J011j1522o852J4469
878D050L562j1782K745N060o079K263L408p044j32L607n080J932R224n633p858
893g757P401J352m214M081R19l653L494j62n101N952N032q433l123O659J51k344
909B54J418k720P41N891m049n375M675J890m456J023L371j34J33j697o090J047
925d078O143j194j859J581k623j374L674o13l400n33J932L459M144k290p350r15
941e296N562K473p12q93j530J316J160j173j429k54l26k29K084K983p99m200k641
958c904J563M194J935j997k954q54L148K865j680k728k163j15M628K471l945m003
$$ plain form
974 -3539 -3181 -939 1678 2178 -2051 -5602 -1564 1313 650 2167 639 -3355 -1482 944 -43 1101
990 1101 1830 -2091 -1597 3729 2373 -1618 -1598 -3835 -2861 5511 5324 -1716 -2451 -1510 -1869 2825 3996
1007 3996 -2420 -1511 4269 2339 1009 2492 -3384 -4712 3450 3723 62 2363 -806 -5932 -561
1022 -561 2431 -2199 -445 1300 -4275 -1086 5220 -1276 -4817 -478 -2363 -449 7154 1315 -6977
1037 -6977 -1101 2152 -610 3497 1856 -6415 -609 6240 -337 -96 3174 -3753 -2083 6467 1229
1052 1229 -3205 2639 -296 -3588 5314 4107 -5514 -1015 1128 -4879 2470 6520 -4472 -4648 2236
1067 2236 -2487 -1452 4800 -3368 -6594 5309 4122 -3274 1467 -1098 -7369 3326 7043 -3013
1081 -3013 -20 3913 -4375 -1291 6021 -2337 -3841 5546 270 -2830 6578 929 -7658 1457 2231
$$ packed form
974c539L58K242K617N00m229l551M038K877o63J517j528l994J873K426r87J144
990A101P29l921M94N326j356l991K0k237R74Q372j87p040p35R41l59M694J171
1007C996o416R09N780j930j330J483n876j328Q162K73l661K301l169n126N371
1022e61K992m630J754J745n575L189O306o496l541M339j885J914P603n839q292
1037f977N876L253k762M107j641q271N806O849o577K41L270o927J670Q550n238
1052A229m434N844k935l292Q902j207r621M499K143o007P349M050j0992j76O884
1067B236m723J035O252q168l226J1903j187p396M741k565o271J0695L717j0056
1081c013K993L933q288L084P312q358j504R387n276l100R408n649q587R115P74
$$ plain form
1096 2231 -3661 4837 4782 -7524 -2366 4887 -3574 -1867 4285 -5257 -4532 7291 -140 -5899 2676
1111 2676 -1294 -5967 6119 4799 -6187 954 4434 -4466 1769 7326 -4215 -1968 6591 -2438
1125 -2438 -2023 8530 -368 -6771 4116 1978 -4172 4282 919 -8847 2046 7197 -5091 -1714
1139 -1714 3033 -7520 -2941 7519 -2694 -5059 4360 -2841 -5727 5954 366 -8834 2993 5034
1153 5034 -4231 3607 4822 -7278 -419 6956 -3046 1168 9757 -2857 -5294 7343 1917 -4210
1167 -4210 4531 -377 -5677 7801 5071 -9233 -812 3759 -6313 353 6567 -5800 -4045 5003
1181 5003 -4381 -4449 6326 -3499 -8641 5873 2632 -6981 2396 1672 -7135 2630 5293 -6160 1018
1196 1018 7283 -5923 -2893 9805 446 -3825 6010 -490 -2772 8691 1489 -7209 6105 5572
$$ packed form
1096B231n892Q498n5j2306N158P253q461J707O152r542P25J1823p431n759Q575
1111B676l970m673J2086j320j0986P141L480q900O235N557j1541K247Q559r029
1125b438M15J0553q898o403J0887k138o150Q454l363r766J0893N151j2288L377
1139a714M747j0553M579J0460j0213k365R419p201k886J1681n588r200J1827K041
1153E034r265P838J215j2100O859P375j0002M214Q589j2614k437J2637n426o127
1167d210Q741m908n300J3478k730j4304Q421M571j0072O666O214j2367J755R048
1181E003r384o8J0775r825n142J4514l241r613R377p24q807R765K663j1453P178
1196A018O265j3206L030J2698r359m271R835o500k282J1463p202q698J3314n33
$$ plain form
1210 5572 -6762 768 4993 -6149 -859 5387 -5381 -1653 6381 -6165 -7045 6239 -1506 -7308
1224 -7308 5231 2016 -6693 2106 1259 -6889 3638 4785 -8767 57 9729 -3702 -4729 4009
1238 4009 -3483 -2068 8086 -781 -4840 7159 1395 -7713 5127 6229 -5866 1294 5703 -2826
1252 -2826 3181 5391 -8283 -3117 8864 -1379 -4575 5316 -1889 -7707 3777 1409 -5637 2551
1266 2551 -942 -8759 4615 7672 -8165 -5249 4644 -1254 689 5603 -5441 -4708 7510 -16
1280 -16 -4473 7206 1246 -8618 2871 5965 -2451 1846 1431 -6411 3610 9514 -5334 -5306 5517
1295 5517 -1148 -2005 7391 -455 -6429 1952 -962 -4058 6308 1598 -10705 -92 7768 -2583
1309 -2583 -2876 265 -5389 1428 9125 -2746 -4480 5381 -1085 -5170 6396 3851 -5065 1128 2071
$$ packed form
1210E572j2334P530M225j1142N290O246j0768L728Q034j2546q80J3284p745n802
1224g308J2539l215q709Q799q47q148J0527J147j3552Q824R672j3431j027Q738
1238D009p492J415J0154q867m059J1999n764r108J2840J102j2095P160M409q529
1252b826O007K210j3674N166J1981j0243l196R891p205n818J1484k368p046Q188
1266B551l493p817J3374L057j5837K916R893n898J943M914j1044P33J2218p526
1280a6m457J1679n960r864J1489L094q416M297m15p842J0021N904j4848K8J0823
1295E517o665q57R396p846n974Q381k914l096J0366m710j2303J0613P860j0351
1309b583k93L141n654O817P697j1871j734R861o466m085J1566k545q916O193R43
$$ plain form
1324 2071 -2838 4428 2081 -9799 -1013 8436 -1613 -2899 3499 -3153 -3137 5015 -101 -2805 4972
1339 4972 -796 -6094 6014 5751 -6776 -2017 3290 -1204 2018 1996 -7302 -1751 6713 -2635 -4996
1354 -4996 4245 -305 -5005 3167 1835 -2595 3664 1164 -4384 4809 5620 -5745 -1450 6108 -222
1369 -222 -1160 2526 -3071 -2515 3846 -2995 -5030 4626 583 -6439 935 2422 -4256 -1189 909 -2263
1385 -2263 3315 4611 -5522 -2409 6741 141 -3450 2766 889 -510 4634 -244 -4151 2897 1699
1400 1699 -3953 3164 5272 -3624 -2462 3109 -416 296 1429 -4609 -1526 5877 -661 -5687 597
1415 597 -53 -3877 839 1233 -3296 -116 -110 -4005 2394 5203 -3966 -3666 4228 2585 644 1848 -1843
1432 -1843 -930 5369 2009 -2830 1574 788 -3854 1352 4316 -1451 -2217 -721 -1808 1947 3643 -3598
$$ packed form
1324B071m909P266k347j1880Q786R449j0049j286O398o652J6Q152n116k704P777
1339D972n768n298J2108k63j2527M759N307m494L222k2r298N551Q464r348k361
1354d996R241m550m700Q172j332m430O259k500n548R193Q11j1365M295P558o330
1369b22r38L686n597N56O361o841k035R656m043p022P374J487o678L067K098l172
1385b263N578J296j0133L113R150o600l591O216j877j399N144m878l907P048j198
1400A699n652P117K108q896J162N571l525P12J133o038L083P403o538n026O284
1415E97o50l824M716L94m529L180Ol895O399K809r169L00P894j643j941J204l691
1432a843R13O299l360m839M404p86m642N206K964n767p66J496j087L755J696p241
$$ plain form
1448 -3598 -3484 4037 2358 -1826 648 -693 -2386 1456 1100 -1142 1602 -416 -5580 -1378 3231
1463 3231 -1254 -3634 -841 -860 846 2344 -2522 -3089 2260 2154 -46 3200 2659 -1231 355 2538
1479 2538 1473 2131 1012 -2305 525 3857 -770 -3378 -360 -212 -775 335 -1049 -1731 373 -857
1495 -857 -2349 1116 2144 -2054 -2008 920 450 333 140 -1571 -215 1622 -571 -1729 591 561 -1016
1512 -1016 290 1206 272 123 -391 -857 1306 2143 -105 -120 1268 445 -1038 -581 346 679 380 -861
1530 -861 -647 1113 509 -1641 -821 852 1325 688 -35 -100 67 5 -42 56 722 40 -1145 -663 -69 -411
1550 -411 -1748 -2047 -670 82 -278 -542 -937 -722 90 55 825 1877 1001 -245 930 2416 1762 585
1568 585 322 108 1146 1626 -675 -1404 35 -355 -611 281 -367 -1841 -928 -351 -475 1180 878 -1581
$$ packed form
1448c598J14P521j679m184K474j341j693L842l56k242K744k018n164M202M609
1463C231m485k380K793j9J706J498m866n67N349j06k200L246n41l890J586K183
1479B538j065O58j119l317K830L332m627k608L018J48n63J110j384o82K104j230
1495h57j492L465J028m198M6K928m70j17j93j711J356J837k193j158K320l0j577
1512a016J306R16r34j49n14m66K163Q37k248j5J388q23j483M57R27L33k99j241
1530h61K14J760o04k150Q20J673M73o37p23o5J67o2m7R8O66o82j185M82N94l42
1550d11j337k99J377P52l60k64l95K15Q12l5P70J052q76j246J175J486o54j177
1568E85k63k14J038M80k301p29J439l90k56Q92o48j474R13N77j24J655l02k459
$$ plain form
1586 -1581 -285 1389 -276 -295 714 -541 -199 1270 -176 -1386 -190 -1078 -1764 1207 1620 -1524
1602 -1524 -959 75 -1092 660 1559 -1159 -148 2483 549 -186 1511 -312 -1149 1991 1514 -504
1618 -504 1295 354 -2319 592 1558 -1333 -200 1138 -1321 -634 1614 -1177 -1736 1266 -515 -1491
1634 -1491 1755 -291 -3123 11 665 -1696 612 737 -2628 -292 2002 -1095 -585 2321 -491 -529
1650 -529 2913 674 -1270 2357 864 -1256 2608 1915 -2145 -51 1041 -2197 121 2499 -1874
1665 -1874 -1502 1420 -1642 -1748 2231 -735 -2306 2410 1275 -2011 1266 568 -2766 1051 2605 -1899
1681 -1899 -314 1679 -2776 -1568 1979 -1629 -1914 1993 -760 -2352 2380 563 -3048 1491 2105
1696 2105 -1450 2297 2842 -2437 229 3270 -827 347 3170 -1382 -1777 3003 -79 -2562 1726
$$ packed form
1586a581J296J674j665j9J009j255L42J469j446j210J196q88o86K971M13l144
1602a524N65J034j167J752Q99k718J011K631j934p35J697j823q37L140m77k018
1618e04J799r41k673K911R66k891J133J338k459O87K248k791n59L002j781r76
1634a491L246k046k832L134O54k361K308J25l365K336K294l097N10K906k812l8
1650e29L442k239j944L627j493k120L864o93m060K094J092l238K318K378m373
1665a874L72K922l062j06L979k966j571M716j135l286L277o98l334L817J554m504
1681a899J585J993m455J208L547l608k85L907k753j592M732j817l611M539O14
1696B105l555L747N45n279K666L041m097J174K823m552l95M780l082k483M288
$$ plain form
1711 1726 24 -2975 1804 1151 -3805 -191 1476 -2976 57 2673 -2490 -1913 2060 -1631 -1653 3066
1727 3066 -664 -2997 2024 578 -2886 1960 1129 -2926 1640 3524 -1631 348 2353 -2347 -493
1742 -493 4322 -533 -1682 3175 -440 -2499 2732 335 -3406 1486 1539 -3000 996 1713 -3966 -1086
1758 -1086 2894 -1836 -727 3035 -2270 -2645 2881 -363 -2781 2277 131 -3266 2020 1800 -3460
1773 -3460 44 1792 -2696 778 3383 -2624 -1505 3476 -712 -1149 3823 -175 -2227 2909 1156
1788 1156 -2602 2303 1453 -3566 966 2653 -3320 -1026 1733 -3128 -1046 3428 -1756 -2696 2450
1803 2450 -1151 -2633 3121 1158 -3057 2210 1842 -2686 1439 2063 -3108 598 3743 -1534 -1126 2575
1819 2575 -2042 -2278 2964 -680 -2293 2716 1 -3661 1763 1367 -3235 570 2187 -2431 170
$$ packed form
1711A726j702k999M779o53m956L614J667m452L033K616n163N77L973l691k2M719
1727C066l730k333N021j446l464M846q31m055M566J884n155J979K005m700J854
1742d93M815m855j149M857l615k059N231k397l741M892N3m539L996P17n679K880
1758a086L980m730J109L762n305l75N526l244k418N058k146l397N286k20n260
1773c460L504J748m488L474K605o007J119M981m188m37M972l998k052N136j753
1788A156l758M905q50n019M532J687n973K294K759m861K082M474n184r40N146
1803B450l601j482N754j963m215N267l68m528M125O24n171L706L145n277M08L701
1819B575m617k36N242l644j613N009k715l662N424l96m602L805J617m618K601
$$ plain form
1834 170 2707 -2779 -1327 2994 -1536 -1761 3361 -299 -2907 2271 513 -2303 2367 1691 -2656 1341
1850 1341 2696 -2647 63 3225 -1843 -762 3028 -1519 -1684 2521 -1678 -2923 2700 663 -3338
1865 -3338 771 731 -3221 874 1909 -2735 211 2685 -2506 -991 3184 -1766 -2453 2635 163 -1714
1881 -1714 2193 -415 -3131 2246 1918 -2632 1432 2596 -2326 76 3034 -1289 -92 2888 -1071
1896 -1071 -456 3610 -670 -3397 1664 719 -2247 1527 166 -3663 176 1032 -3250 -418 1791 -2891
1912 -2891 -1300 2789 -999 -2126 1637 -785 -1167 3426 629 -2556 1776 1639 -1939 1479 2298 -1846
1928 -1846 58 2078 -1462 100 2439 -2001 -1579 3369 435 -2494 982 -215 -1797 1909 739
1943 739 -2614 558 1178 -2969 -509 1986 -2005 -1459 1740 -1040 -893 1479 -1434 -1846 2851 991
$$ packed form
1834A70K537n486J452M321m530k25N122l660k608N178j758k816M670o76m347L997
1850A341J355n343K710L162n068J081L790m547j65M205m199j245N623k037m001
1865c338M109m0l952M095J035m644K946K474n191J515M175m950o87N088k472j877
1881a714L907k608k716N377l28m550M064J164m922K402K958m323J197K980l959
1896a071O15M066m280k727N061r45k966L774j361l829L839Q56m282K832K209m682
1912b891J591M089l788j127L763k422l82M593k797l185M332j37l578L418Q19m144
1928a846J904K020l540J562K339m440M22M948k934k929L476j197j582L706j170
1943G39l353L172O20m147K460K495l991N46L199k780J47K372k913m12M697j860
$$ plain form
1959 991 -1998 1521 1492 -1643 689 1435 -1168 899 2219 -1662 -166 2649 -1123 -1683 1986 387
1975 387 -1102 1394 -341 -1728 1379 578 -2470 853 1926 -1921 -693 889 -1491 -790 986 -1134
1991 -1134 -1057 1460 -1204 -2521 1526 635 -1975 562 945 -720 1187 1013 -1784 992 2743 -492
2007 -492 -250 2252 -288 -857 1561 229 -577 1412 -438 -1736 1112 634 -2393 -597 1065 -707
2023 -707 -308 440 -1883 -855 1084 -953 -588 1941 -378 -1663 1051 597 -878 245 -106 -680 1483
2040 1483 1262 -1918 -611 1319 -392 4 1329 -127 -582 662 -188 -342 1450 47 -1375 872
2056 872 1410 -762 -439 -66 -761 420 840 -924 -406 572 -712 -816 1132 188 -1013 -34 203 -83
2074 -83 595 -326 -1378 722 1418 -509 -291 220 -562 -173 460 58 91 528 -431 -497 1109 327 -795
$$ packed form
1959I91k989L519k9l135K332P46k603K067J320l881J496K815l772n60L669j599
1975C87j489K496j735j387L107q01l048L323J073l847J228J582k380P01J776k120
1991a134P7K517k664j317M047q91k610K537L83j665J907j74k797K776J751l235
2007d92K42K502k540n69K418j332q06J989j850j298K848m78l027J796J662j772
2023g07L99P48k323J028J939k037L65K529k319j285K714m54j475J123l51n74K163
2040A483k21l180J307J930j711L96J325j456m55J244q50j54J792j403j422K247
2056H72N38k172L23L73o95J181M20j764N18R78j284j04J948r44j201R79K37k86
2074h3O78r21j052K100O96j927K18N11p82L89O33m02L3M37r59o6J606p82j122
$$ plain form
2093 -795 222 707 229 56 -188 -767 103 522 -273 -15 458 -568 -977 -28 -49 -244 55 -272 -127 597
2113 597 11 -778 -79 677 496 210 368 -1 36 38 -203 39 522 -242 -471 -176 -194 -378 -665 -495 2
2134 2 89 -175 -481 -161 127 -3 -86 348 583 275 -40 -27 426 321 298 364 394 286 47 -474 -138 417 112
2157 112 -508 -215 237 -395 -298 -326 -579 -46 48 -270 -257 43 -659 -664 238 149 -296 189 -190 -299 494 21
2179 21 -646 474 686 90 325 562 -250 -52 549 30 379 796 -112 -536 792 127 -532 433 114 -395
2199 -395 374 69 -1001 -248 249 -609 68 817 -675 -824 230 -383 -496 494 -384 -717 593 203 -912
2218 -912 160 329 -566 549 983 -434 59 821 -418 98 1449 -12 -321 1107 252 -480 772
2235 772 215 -888 627 547 -928 -116 132 -1568 -432 733 -810 -631 599 -941 -1191 721 -90
$$ packed form
2093g95J017M85m78j73k44n79Q70M19p95K58M73j026m09R49k1j95K99l27J45P24
2113E97n86p89O99P56j81k86J58l69L7Kk41K42M83p64k29K95j8j84k87J70M97
2134BQ7k64l06L20K88j30q3M34K35l08l15J3M53j05k3O6L0j08k39n21L36N55l05
2157A12o20K93M52o32R7k8k53N33R4l18J3L00p02nR02q9m45M85l79j09P93m73
2179B1o67J120K12n96K35K37q12J98O01n19L49M17r08m24J328o65o59R65l19n09
2199c95P69l05j070P53M97q58O77P49j492j49J054o13j13R90q78l33J310l90j115
2218i12J072J69q95J115M34j417M93P62j239N16J351j461l09J428q55p32J252
2235G72n57j103J515q0j475Q12K48j700J136J165j543J79J230j540k50J912q11
$$ plain form
2252 -90 -987 759 420 -890 611 622 -1022 412 1173 -497 398 1240 -553 -489 1122 -282 -320 1369
2270 1369 49 -986 1086 422 -1134 595 406 -1298 441 941 -1379 -387 877 -1034 -634 1297
2286 1297 -507 -1078 882 -345 -1453 1058 191 -1292 808 775 -1188 477 1025 -1051 -49 1516
2302 1516 -531 -469 1351 -642 -761 1494 236 -954 854 368 -1201 630 710 -1553 435 1277 -1184
2319 -1184 -169 1241 -1408 -814 1155 -506 -887 1130 -406 -1428 828 208 -1524 665 899 -1349
2335 -1349 529 1190 -1268 -193 1607 -798 -200 1897 -303 -855 1293 307 -1045 1161 357 -1384
2351 -1384 734 712 -1888 18 993 -1328 -291 1199 -972 -813 1256 -793 -1110 1524 47 -1385
2367 -1385 1098 431 -1348 785 1054 -1090 528 1176 -1361 -99 1587 -900 -535 1533 -369 -978
$$ packed form
2252i0q97J746l39j310J501J1j644J434P61j670Q95Q42j793O4J611j404l8J689
2270A369j320j035K072o64j556J729j89j704J739N00k320R92J264j911M00J931
2286A297j804n71J960j227j108K511q67j483K100l3j963J665N48k076J002J565
2302A516k047O2J820j993j19K255j258j190J808m86j569J831Q0k263J988Q42k461
2319a184J015J410k649N94J969j661l81K017j536j022K256o20j732K189K34k248
2335a349J878O61k458J075J800k405N98K097k200n52K148r86j352K206q04j741
2351a384K118k2k600J906R75k321J037J490k171J59K069k049l17K634j477j432
2367a385K483o67j779K133K69k144J618O48k537J262J686k487L65K068j902o09
$$ plain form
2383 -978 1481 -109 -1425 1391 527 -1346 892 740 -1439 183 1095 -1454 -19 1398 -1158 -902
2399 -902 1501 -723 -1307 1269 -130 -1213 1184 693 -1437 787 1085 -1516 400 1588 -1215 22
2415 22 1541 -834 -418 1501 -669 -881 1671 58 -1304 1127 352 -1484 828 1057 -1240 350
2431 350 843 -1489 -223 1256 -1185 -993 1175 -721 -1263 1010 -379 -1443 1094 521 -1246 753
2447 753 840 -1484 394 1324 -982 228 1638 -719 -447 1719 -408 -923 1442 54 -1215 1097
2463 1097 321 -1670 467 630 -1465 256 1013 -1303 -456 1080 -965 -730 1377 -560 -842 1162
2479 1162 -212 -1297 1153 382 -1332 785 909 -1211 229 986 -1469 -158 1386 -805 -526 1353
2495 1353 -468 -756 1336 73 -1052 1093 315 -1118 735 671 -1523 255 1293 -1129 -69 1055
$$ packed form
2383i78K459j590j316K816q64j873K238j52k179J622R12k549J435J417k556K56
2399i02K403k224n84K576j399j083K397m91k130K224K98k601J916J188k803J237
2415B2J519k375M16J919k170k12K552j613j362K431p75j836K312K29k297J590
2431C50M93k332J266J479k441J92K168j896n42K273j389j064K537n73j767J999
2447G53Q7k324J878R30k306J210J410k357K72K166k127n15K365j388j269K312
2463A097p76j991K137J63k095J721P57k316Q47J536k045K35K107j937k82K004
2479A162j374j085K450p71j714K117J24k120J440P57k455J311J544k191K79J879
2495A353j821k88K092j263j125K145p78j433J853o4k194J778J038k422J060J124
$$ plain form
2511 1055 -982 -640 1042 -379 -905 1136 -52 -1029 839 426 -1196 484 625 -1088 563 897
2527 897 -946 -136 1246 -623 -485 1102 -328 -1005 919 41 -927 800 257 -936 784 721 -1046
2544 -1046 -53 669 -816 38 929 -892 -623 895 -588 -825 809 -11 -941 707 313 -1013 715
2561 715 626 -914 765 1166 -836 3 979 -658 -314 850 -251 -625 779 -209 -1009 587 276 -973
2579 -973 283 642 -825 -58 613 -808 -105 892 -560 -331 1012 -144 -566 596 10 -585 691
2596 691 143 -832 343 392 -890 54 872 -541 -157 763 -276 -176 813 -212 -419 849 209 -640
2614 -640 445 130 -636 127 398 -534 131 387 -757 7 731 -520 -352 513 195 -417 361 -129 -506
2633 -506 506 284 -565 351 282 -524 -200 446 -302 -50 236 -287 -11 712 -230 -582 375 308 -237 248
$$ packed form
2511A055k037L42J682j421n26K041j188r77J868m13j622J680J41j713J651L34
2527H97j843Q10J382j869J38J587j430o77J924q78r68J727n43j193J720o3j767
2544a046R93P22j485Q54Q91j821K69J518j483k37J634q20r30J648l94j326J728
2561G15q9j540J679M01k002Q39R76j637L44J164j101l74J404r88q00J596l11j249
2579i73J256L59j467P67O71j421P03R97j452K29J343j156m22J162n86n95J276
2596F91n48r75J175M9j282R44Q18j413L84R20j039J00R89j025k07J268o40q49
2614f40J085l15p66P63K71r32O65K56j144P64P24j251J68Q65l18o12P78m90l77
2633e06J012k22q49R16o9q06L24O46p48K52K86n23K76P23r42l52R57o7n45M85
$$ plain form
2653 248 167 -506 324 173 -523 158 311 -360 -507 388 -242 -506 37 -308 -274 333 117 -376 267 113 -158
2674 -158 372 385 -221 173 404 -96 123 198 -420 -167 538 109 -441 -90 -101 -71 129 -4 -263 101 101 -189
2696 -189 145 313 36 -170 335 -30 20 -36 -178 16 247 -76 -218 -51 -58 -225 -2 125 -122 -73 107 -18
2718 -18 178 420 -99 -56 348 270 98 -38 -81 59 81 -62 -142 223 -55 17 -127 -225 68 -137 -7 85 206
2741 206 21 -84 -43 120 259 110 24 -34 225 50 -241 -10 92 -136 54 66 -116 193 -43 -158 245
2762 245 271 -40 -51 252 -154 39 222 -214 -171 138 -8 -327 84 -2 -521 78 82 -183 -80 126 -178 105
2784 105 426 -110 -73 397 65 -23 334 -46 -147 439 185 -388 331 137 -494 36 246 -366 -177 297 -373
2805 -373 17 351 -329 -370 508 -49 -297 362 80 -479 57 64 -445 213 381 -441 -89 451 -293 -280 522
$$ packed form
2653B48q1o73Q30j51o96O81J53o71j47Q95o30k64N43l45L4O07k16m93O43j54k71
2674a58N30J3o06L94K31n00K19P5o18K53P05m29n50L51j1L0K00j33k59L64%k90
2696a89L34J68k77k06N05l65N0n6j42J94K31l23j42J67pj67K23J27k47M9J80j25
2718a8J96K42n19M3M04p8j72j36m3J40K2j43q0L65k78P2j44r8K93k05J30R2J21
2741B06j85j05M1J63J39j49q6n8K59j75k91K31J02k28J90J2j82L09k36j15M03
2762B45K6l11j1L03m06J93J83m36M3L09j46l19M11q6n19N99Mk65J03K06l04K83
2784A05L21n36L7M70l32q8L57l80j01N86k54n73P19j94o31N30K10o12J89M74o70
2805c73L90L34o80m1Q78n57k48O59k82n59N36Pn09O58J68q22L52N40p44J3Q02
$$ plain form
2826 522 19 -65 530 6 -483 563 208 -410 488 405 -429 22 320 -505 -19 400 -475 -473 472 -300 -411
2847 -411 515 -320 -492 470 120 -734 338 322 -626 157 646 -495 -80 706 -412 -254 733 -322 -234
2866 -234 797 -31 -502 561 173 -686 546 482 -558 378 697 -578 64 618 -544 -205 700 -304
2884 -304 -468 543 -127 -746 405 207 -810 362 333 -767 129 451 -666 39 735 -442 -337 965
2902 965 -190 -420 645 -112 -620 674 378 -768 408 485 -631 282 799 -551 -58 767 -584 -252
2920 -252 797 -178 -564 709 101 -752 575 98 -1125 264 366 -778 161 597 -696 -163 916
2937 916 -489 -562 768 -155 -545 795 -62 -922 562 403 -725 611 381 -824 134 693 -631 -92
2955 -92 867 -661 -343 958 -121 -770 858 107 -900 524 425 -763 440 489 -825 176 878 -866
$$ packed form
2826E22n03q4N95n24m89J046l55o18Q98q3q34M51K98q25M86M19q75KR45p72j11
2847d11R26q35j72R62l50q54J072j6r48P83M89j141M15P86j118J58R87j055Q8
2866b34J031q28m71J063l88q59J232o4j040R36L19j275O42N54j162L39R05j004
2884c04j64J011o70o19J151j98j017J172k9j100Q96L22j117P05O96j177J05J302
2902I65j155k30J065p57n08J294k96j146J176P7j116R13N17j350M93Q25j351L32
2920b52J049r75l86J273o08q53J327m77j223J389J02j144R39M36j293N33J079
2937I16j405p3J330r23l90J340q57q60J484j59j128J336k30j205R58N59j324N39
2955i2R59j528L18J301j079o49J628p51j007J424r9j188J203M9j314J001P02j744
$$ plain form
2973 -866 -320 676 -477 -458 753 -253 -652 690 104 -844 721 335 -821 432 615 -557 303 758
2991 758 -611 -212 936 -482 -598 671 -296 -752 604 90 -798 518 150 -915 421 560 -934
3008 -934 82 767 -792 -167 927 -507 -513 838 -322 -772 691 -119 -702 615 241 -817 313
3025 313 552 -677 283 764 -625 -105 815 -416 -288 810 -200 -745 630 11 -779 408 467 -892
3043 -892 110 457 -880 151 705 -819 -364 838 -395 -415 828 -216 -688 837 51 -613 551
3060 551 332 -799 391 425 -693 79 794 -540 -195 816 -454 -398 823 -223 -558 830 -70 -672
3078 -672 228 258 -921 124 325 -796 152 476 -662 -210 795 -462 -593 569 -101 -645 469 -46
3096 -46 -517 487 302 -664 371 655 -818 147 754 -577 -205 767 -196 -415 707 -308 -731 549
$$ packed form
2973h66N46R96j153J9J211j006l99J342n86r48J565l86j156J253J83j172Q60M55
2991G58j369L99J148j418j16J269r67m56J356n14q88J316l68j065J336J39j494
3008i34J016O85j559O25J094j434oJ351j160m50J463q10n83J317l74j058J130
3025C13K39j229R60M81j389N20R20j231J28J098j010n45J375o19p90J187N9j359
3043h92J002L47j337J031N54j524M55J202j233k0J243j044m72J525p86o64J164
3060E51k19j131J190L4j118P72P15j334L45J011j270N6J221j046l35J388r00o02
3078f72R00L0j179J045K01j121R48L24j138M52J005j257j31J162o70n44J114n15
3096d6m71J004j85r66J035K84j473R65O07j331L72R72r63k19J122j015m23J280
$$ plain form
3114 549 25 -683 441 292 -621 285 521 -722 -17 574 -342 -178 628 -544 -613 433 -209 -635 487
3133 487 121 -706 540 417 -563 427 603 -477 139 811 -280 -46 837 -130 -241 698 -138 -571 483
3152 483 85 -679 426 270 -869 76 492 -494 -114 588 -409 -316 545 -170 -301 476 -93 -565 524
3171 524 157 -547 343 315 -459 297 228 -722 24 396 -290 -3 581 -155 -227 440 -93 -363 401 21 -471
3192 -471 432 23 -532 83 343 -553 -157 172 -304 -89 487 -156 -228 393 -176 -307 488 117 -476 366
3212 366 89 -360 116 373 -253 155 494 -364 -302 285 -78 -159 441 -46 -32 354 38 -285 36 295 -296
3233 -296 -108 280 -280 -93 414 -256 -152 340 -232 -369 221 -8 -293 44 105 -131 163 235 -264 249 362
3254 362 -241 17 385 -42 -40 80 -147 -130 124 146 -85 11 -48 -266 128 25 -279 -158 9 36 -5 220 -74
$$ packed form
3114E49n24p08J124j49r13R06K36j243P05N91r16J64Q06j172o9J046o42m26J122
3133D87l66q27J246j23r80R90J76j080O16O72j091K34Q83r67j11R39q36m33J054
3152D83l98p64J105j56j139R45M16r86L80P02r97R3Q61p15j31P77n69m72J089
3171E24l67p04Q90k8p74P56o9r50P46L72o86K87N84p36p2O67n33k70P64l80m92
3192d71R03m09n55O15K60q96L96L29m76K15N76o43p2O21n69j31P95l71n93Q42
3212C66k77m49M76K57o26M08L39q58O2N87l63q1O00m87J4L86l16l23L21K59n91
3233b96J88L88n60J87N07o70J04M92n72j37N90k29k85L37O1k36K94P2m99N13J13
3254C62o03K58L68m27KJ20k27J7K54K2k31R6n9k18L94j03l04J21J67K7m1K25k94
$$ plain form
3277 -74 -148 88 -43 49 80 -126 -7 162 -64 -174 211 74 -34 51 244 56 -146 55 52 177 197 -62 -33
3300 -33 139 3 -82 45 -36 -104 18 -99 -93 -49 32 -129 -30 61 -23 -180 95 -38 280 -4 -32 197 41 -99
3324 -99 -102 23 -57 191 107 -181 151 -116 -103 -17 51 -115 -21 -61 -49 102 55 -77 80 221 64 -247 95 -92
3348 -92 -115 111 -158 -165 14 -124 -128 86 109 -260 -126 125 94 59 233 -63 -64 154 -12 -183 220 -25 -258 198
3372 198 359 -38 89 52 -148 -1 -18 -155 -39 275 -67 -151 121 -42 -151 226 44 -234 362 117 -331
3393 -331 -30 145 -193 -120 213 64 11 309 -70 -174 341 -2 -203 280 100 -220 138 168 -417 -38 184
3414 184 -317 34 314 -256 -213 305 -71 -177 309 38 -272 242 121 -219 327 384 -292 -27 245 -250 76
3435 76 387 -256 -264 452 -235 -306 331 -174 -481 176 159 -395 -26 224 -579 -40 402 -141 -123 445 -179 -247
$$ packed form
3277g4p4K36j31R2L1k06J19J69k26j10L85j37j08Q5J93j88k02K01lJ25K0k59K9
3300c3J72j36q5J27q1o8J22j17OM4Q1j61R9R1q4j57K75j33L18k84k8K29j56j40
3324i9lJ25q0K48q4k88L32k67J3Q6O8j66R4m0J2J51m7j32J57J41j57l11L42j87
3348i2k3K26k69pJ79j38mK14K3l69J34K51l1l5J74k96jK18j66j71M03k45k33M56
3372A98J61l97J27l7k00J47j7j37J16L14l42q4K72j63j09L77j82k78N96k45m48
3393c31L01J75l38P3L33j49n3K98l79j04N15l43k01M83j80l20L58L0n85L79K22
3414A84n01L51K80n70M3N18l76j06M86k71l10N14j21l40N46N7o76K65K72m95L26
3435G6L11o43qP16o87p1O37n05l07O57j7n54L69K50q03N39M42n43J8N68o24o8
$$ plain form
3457 -247 350 -73 -275 347 123 -292 341 363 -384 273 444 -203 151 416 -426 -110 480 -291 -191 616
3477 616 -71 -514 334 -21 -604 201 106 -666 54 267 -515 -16 396 -474 -148 546 -388 -313 554 -128 -421
3498 -421 521 41 -476 277 470 -313 281 587 -510 -27 633 -388 -128 523 -277 -270 692 -50 -474 430
3518 430 -2 -606 355 279 -599 126 381 -703 -159 537 -493 -497 533 -226 -428 408 -112 -482 505 295
3538 295 -431 390 318 -638 434 474 -587 78 567 -316 -211 560 -475 -450 611 -144 -536 455 27 -720
3558 -720 154 366 -740 72 386 -561 -2 456 -459 -344 402 -179 -523 400 -47 -545 421 106 -425 367
3578 367 497 -390 295 513 -275 16 840 -208 -235 778 -19 -363 531 -4 -529 494 104 -657 187
3597 187 309 -767 -2 443 -514 -205 283 -706 -441 694 -177 -643 558 -1 -551 467 285 -595 290
$$ packed form
3457b47N97m23k02O22k24m15O33K2p47O57J71o47L54K65q42L16N90p71J00Q07
3477F16o87m43Q48l55n83Q05r5p72P20K13p82M99M12q70L26O94r34P5Q67o82k93
3498d21R42m80n17P53J93p83N94L06j097M83O60j021K60O51q00PR62p42m24R04
3518D30m32o04R61p6q78P25K55j084N44O96j030mJ030p59k02Q36n20l70R87k10
3538B95p26Q21p2r56J072M0j061O65M89q83J05P71j035K5J061p55l92R91m28p47
3558g20Q74K12j106Q12L14r47N59M58r15J15P46n81l44R23m47m98R66l15n31P92
3578C67J30q87O85K18p88K91Q24j048k7J013p97l44Q94n35n25J023l90p61Q44
3597A87J22j076P65M45r57L09M88r89K65J135q71m66J201n59n50J018j82q80Q85
$$ plain form
3616 290 516 -513 116 356 -426 -172 514 -238 -125 624 -53 -250 377 156 -325 404 123 -450 226 387
3636 387 -612 26 561 -450 -184 470 -491 -402 416 -18 -549 674 35 -551 352 230 -562 305 453 -677
3656 -677 2 572 -194 84 608 -154 -108 613 -46 -394 398 -100 -589 520 189 -749 164 264 -636 148
3676 148 472 -450 -38 392 -243 -350 547 -128 -548 555 183 -566 489 239 -489 144 367 -468 61
3695 61 445 -369 -32 571 -229 -325 490 -241 -381 429 -13 -591 294 84 -555 292 338 -556 -33 392 -328
3716 -328 -159 508 -387 -170 501 -129 -531 378 -16 -440 307 59 -326 127 305 -400 146 491 -361 -132
3736 -132 416 -170 -281 551 -180 -332 415 130 -414 226 268 -398 295 281 -423 -127 199 -339 -8 279 -97
3757 -97 -224 333 8 -288 189 174 -247 223 146 -346 206 310 -463 34 153 -302 22 446 -99 -69 367
$$ packed form
3616B90K26j029O29K40p82K54O86p52J13P49o77j97O27k21m81P29k81n73O76J61
3636C87r99O38N35j011K66O54r61Q9Q18m34n31J223o39n86R03j22p92Q67J48j130
3656f77O79N70p66K78N24p62M6P21o59l48P92m98m89J109l31r38R13J00r00P84
3676A48L24r22M12M30o35j07Q97o75m20J103l72p49J055k50p28O33K23q35N29
3695F1L84q14L37O03q00r6Q15p31j40Q10m42n78Q85k10o39Q47M6q94N23M25p20
3716c28J69O67q95K17O71o30m02R09l94m24P47k48l85M53J78p05N46L45q52K29
3736a32N48n86j11Q32p31j52P47k85n44O40M2o66O93j4p04K96L26n38L31K87l76
3757i7j27N57l25k96M77j5m21M70p7m92N52J04p73M97J19m55L24M24n45L0M36
$$ plain form
3778 367 -46 -376 203 164 -451 214 312 -123 82 46 -374 79 226 -129 -182 357 -152 -224 249 -20 -358 198
3800 198 -24 -227 167 147 -255 203 341 -192 66 373 -176 44 241 -138 -264 274 -84 -262 -44 82
3820 82 -270 153 210 -208 243 182 -201 33 220 -178 -218 119 -13 -30 247 -122 -197 136 11 -243 -13 167
3842 167 -135 58 148 -71 303 348 4 16 291 -134 -53 296 -83 -203 158 43 -104 42 173 -235 89
3863 89 105 -17 -18 98 47 56 118 -7 -88 92 -75 -265 46 -104 -145 -124 270 -87 235 95 -150 -122 -23 -126
3887 -126 -43 76 -39 -73 2 161 9 15 93 20 21 131 110 58 -13 -145 -39 -41 10 -103 -40 76 27 20 -44 67 52
3914 52 -212 14 -50 193 -69 -152 150 47 -19 -64 23 187 -41 -12 60 -118 40 -162 -88 -203 51 -60 62
3937 62 263 81 -131 23 56 15 65 141 -69 8 -13 -198 253 124 -141 -131 194 43 64 -19 68 -110 37 13
$$ packed form
3778C67m13l30N79l9o15O65R8m35K05l6m20M53J47l55n3N39n09p2M73k69l38N56
3800A98k22k03L94k0m02M58J38n33K58L07n49K20J97l79j26N38l58j78K18J26
3820H2l52M23N7m18M51o1l83K34J87l98m0L37j32j7K77l69p5L33j25k54K30J80
3842A67l02J93R0k19L74M5l44J2K75m25Q1L49l79j20L61j15j47J46J31m08L24
3863H9J6j22jJ16n1RO2j25q1J80j67j90L11j50m1K1L94l57L22j40k45K8R9j03
3887a26Q3J19j15l4P5J59j52OP8p3JJ10k1n2p1j32J06kN1j13O3J16m9po4J11j5
3914E2k64K26o4K43k62q3L02j03o6m5Q7J64k28K9P2j78J58k02P4j15K54j11J22
3937F2K01j82k12J54L3m1N0P6k10P7k1j85M51j29k65J0L25j51K1q3Q7j78J47k4
$$ plain form
3961 13 -154 -6 65 -182 77 -149 -215 24 105 -198 -165 -41 -290 -214 69 18 -129 154 36 -10 235 162 -240
3984 -240 103 20 -68 -7 225 -93 42 135 -4 -37 220 -8 -295 85 -120 -350 200 11 -366 -46 192 -235
4006 -235 37 209 -219 -83 354 -143 -261 226 -138 -297 79 16 -99 185 140 -304 134 207 -22 120 350
4027 350 -255 83 312 -5 -170 196 -81 -311 355 -2 -308 122 43 -464 -21 204 -556 -117 205 -457
4047 -457 -167 422 -289 -152 254 -161 -293 283 81 -464 356 275 -414 207 200 -258 -6 292 -192 32 506
4068 506 -220 -102 500 63 -124 544 71 -438 204 104 -558 80 253 -424 1 211 -428 -106 343 -326
4088 -326 -371 221 -170 -446 326 144 -470 290 326 -396 205 492 -293 -16 419 -270 -138 385 -385 -415 422
4109 422 -68 -273 465 74 -354 307 262 -403 175 352 -374 -18 423 -298 -324 399 -213 -201 328 -134 -337
$$ packed form
3961A3j67J48P1k47K59k26o6K39Q1l03L3J24k49P6K83n1j47K83j18m6K45p3m02
3984b40L43q3q8O1K32l18J35R3j39l3K57k28k87L80k05k30N50j89l77L20K38m27
4006b35K72J72m28J36M37m97j18M87l64j59L76o3j15K84m5m44M38P3k29J42K30
4027C50o05L38K29l17j65L66k77k30O66l57l06M30p9n07M43K25p60M39L22o62
4047d57K90N89p11J37M06m15j32N76k02n45Q20q1o89O21pm58K52K98m84K24M74
4068E06p26J18O02m37j87O68m73n09O42j00o62O38J73o77M25K10o39L22M49o69
4088c26m5N92l91k76P72j82o14P60L6p22O01K87p85K77M35o89J32N23p70l0Q37
4109D22m90k05P38l91m28O61m5o65N78J77p26L56M41p21k6P23o12J2N29m62k03
$$ plain form
4130 -337 444 160 -530 215 138 -493 178 442 -322 -3 530 -168 -290 515 -205 -315 446 53 -491 431
4150 431 137 -528 387 368 -443 19 453 -488 9 522 -435 -15 409 -238 -352 439 -240 -471 366 -55
4170 -55 -570 212 321 -543 130 433 -517 -36 460 -518 -138 556 -115 -288 582 -90 -355 423 119 -449
4190 -449 441 217 -612 6 294 -461 -179 599 -465 -300 472 -193 -394 648 -11 -446 268 163 -537
4209 -537 312 151 -560 119 296 -454 -9 536 -370 -75 546 -364 -349 472 -66 -329 473 49 -434 346
4229 346 318 -544 251 411 -497 20 453 -169 -153 555 -186 -569 439 20 -501 372 97 -387 323 372 -556
4250 -556 102 307 -417 25 481 -208 -200 585 -198 -374 373 -102 -333 330 194 -589 189 182 -611 -3 352
4271 352 -501 131 545 -412 -180 409 -194 -343 527 -201 -601 321 54 -392 247 247 -378 -37 548 -414 -23
$$ packed form
4130c37P81k84o90P45p7o31O71K64p64L19N33o98j22Q05p20j10P61l93n44R22
4150D31k94o65R15j9q11M62M34r41M97N13r57M20M24o47j14P91o79k31Q37m21
4170e5n15P82J09q64O73L03r50M81M96r78L80O94o71j73Q70o72k65P78l04n68
4190d49Q90k24q29O18K88p55K82P78j064J65P72o65k01J042o59m35P14j05p00
4209e37Q49j61p11O79J77p50M45N45r06K95O21r10J5Q21n38k63Q02m24m83P80
4229C46k8q62P95J60r08N17M33o22J6P08p41l83J008m19n21Q73k75m84P10M9r28
4250e56O58K05p24M42M56o89QP85p83j76P47m75k31O63j36p83P78pp93O08L55
4271C52q53O32M14r57K32N89o03j49Q70p28m00R22k67m46O39%o25L41N85r62L91
$$ plain form
4292 -23 620 -257 -226 505 18 -347 511 23 -186 535 -97 -315 198 56 -378 -82 480 -421 13 434 -172
4313 -172 -61 464 -134 -360 285 20 -358 286 43 -573 181 141 -388 162 294 -474 -96 337 -273 -162
4333 -162 280 -49 -254 244 -40 -377 263 189 -337 244 163 -447 -63 283 -351 56 443 -287 -218 516 -314
4354 -314 -466 310 -121 -323 188 170 -408 66 179 -230 -31 197 -319 -73 445 -233 -174 236 -233 -108 222
4375 222 62 -220 166 84 -160 195 75 -281 90 445 -313 -41 378 -49 -139 9 -130 -101 111 -59 -267
4396 -267 48 166 -347 68 130 -265 211 219 -277 16 263 -189 42 335 26 -424 286 94 -329 233 57
4417 57 -259 -69 -30 -423 -59 199 -305 -115 333 -23 46 140 30 -3 205 98 -229 4 66 -157 155 100
4439 100 -128 -6 6 -20 -160 -87 -119 -98 107 -45 -79 233 18 31 59 72 -234 147 278 -59 -101 104 9 -81
$$ packed form
4292b3O43q77L1P31m87l65Q58m88k09P21o32k18N13j42m34K96N62r01M34M21o06
4313a72J11N25n98k26O45k65l78O44k43o16P54m0n29N50J32p68L78M33o10J11
4333a62M42l29k05M98k84l37O40p4n26N81q1o10L84L46o34M07L87p30O9P34q30
4354c14j52P76m31k02N11j8n78M74J13m09J99K28n16K46N18o78N9M10m69J25L30
4375B22j60k82L86q2k44L55j20l56L71L55p58K72M19m27r0J48j39K9K12j70k08
4396b67L15J18n13M15O2l95M76Qm96K93K47m52K31K93l09m50P10j92m23N62j76
4417E7l16J90L9l93L64K58n04J90M48l56O9R4j10l3K08j07l27K33O2k23L12n5
4439A00k28J22J2k6j40P3l2K1K05j52l4L12k15J3K8J3l06L81J31l37m2K05r5r0
$$ plain form
4463 -81 62 -63 44 87 -47 -57 140 17 -12 176 -21 -103 130 -32 -125 49 132 6 -3 -59 139 -6 7 3
4487 3 -181 101 146 -75 73 26 35 151 -152 -5 67 -91 174 49 -145 -99 -168 -39 38 -92 -88 -11 8 -82 -75 40
4513 40 29 145 88 -135 -195 36 -24 -32 96 -93 -181 121 111 -80 -89 -197 -202 -141 29 26 -18 -68 -21 34 132 81 48 120
4541 120 -95 -10 81 124 -189 12 9 -141 -118 107 -45 -67 215 -60 -92 94 -68 -110 100 69 -139 38 214
4564 214 -24 130 151 -216 -1 216 -108 -26 5 34 -192 83 -87 -272 242 45 -130 -24 76 -231 160
4585 160 231 -253 -46 175 -130 101 164 -153 -214 254 6 -291 121 214 -221 9 241 -207 89 267 -147
4606 -147 -2 281 -235 69 253 -34 -284 270 107 -295 65 138 -239 153 247 -305 36 311 -104 -100 240
4627 240 -246 -71 328 15 -345 167 94 -322 159 207 -303 115 254 -161 106 168 -290 -73 188 -198 -192 259
$$ packed form
4463h1J43j25J07M3j34j0J97j23k9J88j97q2K33j62r3J74Q3j26rn6J98j45J3m
4487Cj84K82M5k21J48m7RJ16l03J47P2j58K65j25j94M6o9J29P7j30MP7J9r0PJ15
4513D0j1J16n7k23o0K31o0qJ28j89q8L02j0j91rj08nO1J70lm4n0M7N5R8n1l3P2
4541A20k15Q5R1M3l13K01lj50K3K25j52k2K82k75l2J86j62m2K10l1k08J77J76
4564B14k38J54K1l67K15K17l24Q2L1K9k26K75j70j85N14j97j75J06J00l07L91
4585A60P1m84K07K21l05K31O3l17o1M68k48k97M12R3m35K30K32m48K96J78m14
4606a47J45K83n16L04J84k87k50N54j63m02L60P3l77L92R4n52L41K75m15ML40
4627B40m86J75L99l13l60N12p3m16M81M8n10M18J39m15K67O2m58K17K61l86OM51
$$ plain form
4649 259 -228 -135 370 174 -193 271 137 -160 134 172 -199 -107 326 -319 -251 415 -152 -275 196 -27 -233
4670 -233 162 -76 -319 272 215 -381 126 380 -325 36 278 -326 -230 434 -281 -297 336 -102 -285 335 13
4691 13 -253 273 93 -112 124 264 -161 -58 411 -200 -69 595 -413 -344 384 -97 -203 374 176 -474
4711 -474 249 151 -215 304 337 -292 -15 369 -344 -73 452 -270 -323 430 -8 -402 337 37 -314 157 331
4732 331 -460 107 454 -513 67 468 -219 -271 503 -39 -79 472 -23 -331 430 5 -380 326 28 -407 60
4753 60 348 -316 17 488 -279 -215 542 -239 -435 371 -144 -240 242 -5 -555 223 136 -457 222 367 -623
4774 -623 -81 278 -328 -239 518 -9 -216 421 -135 -492 490 147 -347 288 245 -446 142 221 -411 -140 382
4795 382 -312 -240 382 -248 -415 429 -92 -361 440 75 -346 270 228 -401 50 284 -320 -150 326 -397 -298
$$ packed form
4649B59m87R3N05j96l67M64j34k97K94L8l71R2M33o45O8O66n67j23M71k23k06
4670b33L95k38k43N91n7n96N07K54p05L61K42o04R6O64p15j6O33m38j83O20l22
4691A3k66N26j80k05K36J40m25J03M69o11J31O64j008O9P28m81j06N77j98o50
4711d74P23r8l66N19L3o29K77L84p13K71N25p22n3P53m38l94P39l00l51M71J74
4732C31p91N67L47r67N80M01o87n2P74n42m0N51m95l08P61m25l85P06k98m35M67
4753F0K88o64L33M71p67O4P57p81j96Q06n15r6M82k47n50P78q7n93O79J45r90
4774f23N42L59o06Q9P57n27k07O37n56l57R82l43m94O35m3o91N88P9o32K71N22
4795C82o94P2O22o30j67Q44n21k69Q01l65m21O16m2o29M51K34o04J70M76p23R9
$$ plain form
4816 -298 446 -247 -281 571 19 -273 418 117 -257 243 59 -311 241 330 -256 -31 555 -222 -207 350 -262
4837 -262 -252 409 -168 -489 166 219 -440 162 124 -548 72 272 -296 46 420 -307 -222 213 -182 -108 611 -192
4859 -192 -254 500 172 -330 243 246 -411 165 249 -467 114 211 -187 121 439 -4 -247 288 66 -273 279 114
4881 114 -304 222 -79 -345 -17 447 -406 -151 498 -218 -40 292 -24 -183 555 -23 -301 199 133 -310
4901 -310 157 95 -258 61 244 -372 -58 155 -270 -207 484 -124 -116 376 4 -321 350 72 -371 339 73
4922 73 -367 35 60 -364 80 176 -312 -222 395 -195 -3 382 -163 -122 290 44 -126 36 99 -201 78 340
4944 340 -299 188 171 -291 -99 280 -75 -102 60 16 -238 410 55 -363 130 103 -155 377 217 -241 89
4965 89 203 -408 -76 335 -163 -239 161 -98 -128 186 -15 -305 3 13 -173 140 183 -257 114 147 10 -100
$$ packed form
4816b98P44o93l4Q52n52k92O91l01l74N00j84l70N52Q9n86K25N86p77J5N57o12
4837b62J0O61n77l21O55N3o59O02l8o72O20K00n68L42L74p27Q5M35l95P4P19q03
4859a92o2P54l28n02N73Lo57N76Q4p16N81R7l98L08L18m43k43N35k22l39N52j65
4881A14m18N26l01k66L28M64q53K55O49p16J78L32l16j59P38n78k78N00o6m43
4901c10M67o2l53L19J83o16L14K13m25O3O91o08QM92l72l25O71k78m43P10k66
4922G3m40M02K5m24M44R6m88R0O17n90J92L85n45M1M12k46j70J62O3l00K79K62
4944C40o39M87j7m62J92L79l55k7J62m4k54O48l55m18M93k7k58N32j60m58L30
4965H9J14o11L32M11m98p6M00k59l0L14k01k90L08J0j86L13M3m40L71L3j37j10
$$ plain form
4987 -100 178 -77 -74 89 -5 -132 203 122 -183 120 -6 -199 -45 230 -245 10 156 -78 -63 235 -61 -172
5009 -172 324 -20 -218 259 -78 -145 140 7 -253 -44 38 -112 -67 41 -208 50 22 -81 -156 305 -159 -300
5031 -300 19 9 -50 66 89 -34 85 114 -51 -98 54 -130 101 297 11 -148 86 -127 -138 37 34 0 107
5054 107 -38 -52 138 63 -48 45 75 -83 99 -10 181 36 133 75 -24 -42 -66 -115 -47 57 -239 267 52 -28
5078 -28 113 208 145 -27 20 1 34 152 -58 -189 -129 -126 35 -44 -148 51 53 -77 145 218 -51 82 176 -49 -3
5103 -3 -69 -3 85 29 -99 -107 -130 -79 68 -85 -137 108 159 -11 -104 115 -155 -174 138 42 80 105 27 -65 -135 10 -13
5130 -13 -76 -14 -194 65 -3 162 -137 155 -11 -114 78 23 -184 24 14 -91 153 40 -101 -139 128 -140
5152 -140 -2 34 137 -77 -17 -111 -11 -25 -40 -151 109 120 -58 -92 72 -127 -127 209 -120 -80 171 -44 -157
$$ packed form
4987a00K78k55LJ63r4j27L35q1l05L03j26j93J54K75m75K55J46k34J5K98k96j11
5009a72M96l44j98M77l37o7K85j33k60K09Q2j50M5J08k49K58k8j03p5M61m64j41
5031c00L19j0n9J16K3j23J19K9j65m7J52j84K31J96k86j59K34k13j1J75ll4J07
5054A07j45j4J90p5j11R3L0j58J82j09J91j45R7n8r9j8k4m9O8J04k96N06k15q0
5078b8J41R5o3j72M7j9L3J18k10j31O0LJ61p9j04J99Kj30K22P3k69J33R4k25M6
5103co6O6Q8n6j28qk3N1J47j53n2K45N1j70r3K19k70j9L12r6L8K5p8r2p0J45k3
5130a3o3O2j80K59o8J65k99K92j66j03J92n5k07K08j0j05K44j13j41l8K67k68
5152a40J38L6J03k14O0r4J00j4j5j11K60J1j78l4J64j99%L36l29M0K51k15j13
$$ plain form
5175 -157 204 -42 -239 275 41 -193 79 156 6 138 66 -120 -52 92 -80 8 68 -56 -191 163 -14 -313
5197 -313 -20 87 -134 -115 117 -133 -33 202 -194 -211 86 -83 -16 159 -84 -159 -36 -79 -255 47 115 -195
5219 -195 -15 226 -87 90 122 -242 -28 139 7 48 438 -112 -249 225 -20 -144 172 116 -293 46 137
5240 137 -136 -239 299 -126 -126 185 -21 -187 296 -47 -288 225 227 -22 122 213 -361 -37 209 -384 56 333
5262 333 -175 -91 237 -103 -233 176 -4 -310 292 167 -417 350 7 -490 41 284 -80 -76 353 -298 62
5283 62 324 -125 -228 347 -136 -338 226 135 -199 219 92 -289 121 210 -281 74 275 -292 89 303 -207
5304 -207 -218 329 -118 -283 291 0 -343 107 216 -279 223 238 -190 -31 227 -169 -219 372 -216 -206 394
5325 394 -112 -132 365 34 -252 166 126 -332 33 151 -312 -42 271 -248 62 235 -142 -173 183 -28 -199
$$ packed form
5175a57L61k46j97N14k34k34K72P7j50J32p2j86O8J44j72Q8O0j24j35L54j77k99
5197c13K93J07k21J9K32k50J00K35l96j7K97j69O7J75k43p5J23m3j76L02O8l10
5219a95J80K41l13J77L2l64K14J67j32M1L90n50j37M74k45j24L16n6m09L39R1
5240A37k73j03N38m25%L11k06j66M83l43k41N13Kk49J44R1n74L24K46n93M40K77
5262C33n08Q4L28l40j30M09j80l06O02j25n84P67l43m97N31K43l64MM29o51L60
5283F2K62m49j03N75m83k02N64r1l34M18j27l81M10Q9m91L55K01n67L81K14n10
5304b07j1N47m47j65N74k91l43M50J09m95N02J5m28J59K58l96n0N91n88J0O00
5325C94n06k0M97l31k86M18m0m58L65J18m63K70L13n19L10J73l77l1L56k11j71
$$ plain form
5346 -199 335 128 -418 53 72 -210 139 321 -330 65 206 -86 -39 226 -132 33 377 -46 -298 269 -154
5367 -154 -242 213 201 -453 100 260 -168 -53 397 -307 -281 309 -304 -388 185 116 -217 145 -78 -361 240 130
5389 130 -341 156 75 -279 -73 182 -270 -115 281 -144 -331 317 -96 -339 425 64 -157 212 37 -280
5409 -280 -2 91 -381 -28 349 -365 26 323 -349 -122 202 -165 -179 271 -48 -208 152 120 -324 166 320
5430 320 -241 63 327 -322 -103 466 22 -129 257 86 -196 220 -48 -146 202 48 -291 198 47 -278
5450 -278 -61 402 -356 -49 202 -5 -323 286 -121 -205 252 75 -305 273 -105 -371 301 239 -217 113 287
5471 287 -246 -35 317 -47 -244 255 -161 -226 326 73 -105 -2 159 -239 -4 158 -182 -5 198 -106
5491 -106 -32 232 -226 -126 448 -141 -206 285 -40 -233 145 38 -210 33 46 -249 -149 67 -211 158 234
$$ packed form
5346a99N34k07n46M71J9k82L49J82o51L95J41k92M7K65l58J65L44m23k52N67m23
5367a54q8M55j2o54N53J60m28J15M50p04K6N90o13q4N73o9l33L62k23k83O01j10
5389A30m71M97q1l54K06K55m52J55L96m25j87O48m13k43P64l61k21L69j75l17
5409b80K78R3m72L53L77p14L91K97o72K27L24l67j4M50l19j60L60l2m44M90J54
5430C20n61L04K64o49K19N69m44j51L86j71k82M16k68r8L48j54l39M89j51l25
5450b78K17M63p58L07K51k07l18O09m07q4M57j77l80N78l78k66O72o2m56L30J74
5471B87n33K11L52l64j97M99m16o5N52k53j78J03J61l98K35J62l40J77K03l04
5491a06P4K64m58J00N74n89o5M91l25j93L78j07k48K43J3k95J00K16k78L69P6
$$ plain form
5512 234 -58 -163 256 -80 -109 211 -89 -134 188 180 -205 2 73 -239 -65 142 -186 -19 44 -82 -218 50
5534 50 -11 -156 158 -96 -83 125 297 -253 163 -8 -240 13 50 -167 -34 273 -60 -209 58 -50 -20 30
5556 30 -152 -62 0 57 -49 -57 80 -178 44 76 -116 -182 23 -117 -116 155 -109 -251 123 67 5 -145 127 -134
5580 -134 52 145 -165 50 78 -77 -73 276 -44 -46 212 -28 -290 198 56 -271 70 115 -200 118 90 -261 53
5603 53 160 -54 8 130 -155 -136 250 96 19 200 6 -145 11 53 -140 28 -63 -147 112 -2 -142 -40
5625 -40 123 17 43 117 11 -119 65 -74 77 -7 88 -29 -89 43 51 -54 53 -122 2 81 109 35 78 19
5649 19 -91 26 77 41 111 175 -26 43 81 -41 35 249 -23 134 75 -133 -16 3 2 -42 42 -5 -60 61 117 5
5675 5 -24 53 38 9 -107 -153 87 53 -89 31 -176 -67 20 -26 78 -26 57 42 45 27 22 0 41 -93 132 -171
$$ packed form
5512B34k92j05M19l36k9L20l00m5L22ql85K07P1l12J74K07l28J67O3j26j36K68
5534E0o1j45L14k54J3K08J72n50M16j71k32K53L7k17J33L07l33j49K67j08L0N0
5556C0j82R0O2N7j06qJ37k58K22L2j92o6K05j40JK71k64j42L74n6o2j50K72k61
5580a34J86R3l10K15K8j55ML49l20kK58k40k62M88j42l27L41M5l15L18k8l51L14
5603E3J07k14O2J22k85J9L86j54p7J81j94j51J56M2j93J68r1q4K59j14j40J02
5625d0J63j06K6P4j06j30J84j39J51q4R5j17o0J32Qj05J07j75J24P9K8p4M3n9
5649A9j10J17N1l6P0O4k01O9L8j22P6K14k72J57n9k08J17J9jm4Q4m7n5J21N6j12
5675Ek9P7j5k9j16m6K40l4j42J20k07J09Q7m6J04j04Q3j5Lj8nk2M1j34K25l03
$$ plain form
5701 -171 -133 33 34 -79 66 -49 -30 -52 72 -137 13 -47 65 -99 237 -184 -135 93 79 -46 27 63 -59
5724 -59 71 -39 -23 45 135 -95 -2 199 63 108 196 -66 67 -16 156 -53 64 24 18 -60 55 2 -29 60 69 27
5750 27 54 13 -52 135 -110 -236 29 -36 -158 -67 134 -37 8 206 -117 6 128 -59 -70 134 -136 25 40
5773 40 -115 -195 136 101 -292 123 57 -172 120 -66 -206 -7 46 -169 -91 116 -190 -4 118 7 -101 100
5795 100 97 -74 60 -121 -249 5 158 -36 -64 189 -28 -108 324 -17 -99 360 110 -132 151 103 -157 155
5817 155 -46 -175 90 -98 -86 17 99 -135 -79 178 -157 -203 36 -202 -262 257 -34 -235 -21 144 -271 -104
5839 -104 165 -327 74 127 -94 -93 341 4 -44 135 95 -170 348 -85 -167 265 173 -250 177 205 -48 87 253
5862 253 -93 36 172 -76 -140 326 -169 -278 243 -28 -194 177 134 -232 201 62 -250 82 363 -223 -46
$$ packed form
5701a71L8J66Jj13J45j15J9k2J24k09J50o0J12j64L36m21M9K28j4j25P3L6j22
5724e9J30j10J6O8R0k30R3K01j36M5Q8k62J33q3J72k09J17m0op8J15n3l1Q9Rm2
5750B7K7m1o5J87k45j26K65o5j22R1K01j71M5J98l23J23J22j87j1K04k70J61J5
5773D0j55q0L31l5l93M15o6k29K92j86j40J99N3k15P8K07l06J86J22j11j08K01
5795A00lj71J34j81j28K54J53j94k8K53k17q0M32l41q2M59k50k42K83m8k60L12
5817A55k01j29K65j88J2J03Q2k34N6K57l35m6K39k38o0N19k91k01K14J65m15J67
5839a04K69m92M01N3k21JM34l37m8J79m0k65N18m33q2M32r2m23M27K8k53J35J66
5862B53l46J29J36k48o4M66m95j09N21k71j66L71m3l66M33j39l12L32K81n86J77
$$ plain form
5883 -46 191 -138 -119 373 -23 -201 267 42 -133 203 102 -176 123 148 -73 -49 74 -388 -90 300 -170
5904 -170 -282 263 -127 -287 90 24 -126 163 142 -241 -82 29 -168 134 366 -151 -145 267 -226 -159 328 -25
5926 -25 -82 240 -61 -149 116 212 -116 116 311 -158 52 291 -164 -156 405 -76 -87 303 -84 -221 226 79
5948 79 -116 105 177 -270 -68 40 -178 -81 328 -203 -213 211 -56 -122 329 91 -244 401 60 -222 152 211
5970 211 -177 79 49 -271 72 222 -16 -4 333 -54 -174 299 65 -305 259 135 -189 270 148 -310 112
5991 112 169 -407 -38 266 -52 -195 241 -116 -108 243 92 -13 240 -23 -62 258 76 -180 61 99 -263 -15
6013 -15 96 -208 72 242 -192 -138 204 -137 -263 186 152 -354 64 34 -329 73 176 -165 -150 190 -173 -145
6035 -145 179 -255 -268 152 -56 -140 5 107 -230 173 124 -315 112 49 -175 -163 257 48 -183 319 -199 -266
$$ packed form
5883d6K37l29J9M92l96j78M68k25j75L36j01k78K99K5k21K4J23m62K98L90m70
5904a70j12N45l90j60L77o6j50K89k1l83J59J11j97L02K32n17OM12m93O7M87l53
5926b5n7L22l01q8K65R6l28K32J95m69K10K39m55QN61m81j1L90l87j37M47j47
5948G9j95K21P2m47K02J08k18R7M09n31j0M24k67o6M51k38l35O45l41k82L74N9
5970B11l88K56l0l20L43J50k38J2L37l87j20M73k34l70N64j24l24M59j22m58M22
5991A12N7n76L69L04l18j43M36l57QL51j51j05K53k63l9L20j82k56K41L8l62K48
6013a5J11l04K80J70m34N4L42l41j26M49l4n06M18l0l63M02J03l41J5L40l63K8
6035a45L24m34j3M20k08q4J45J02l37M03m9m39M27o3k24J2M20k09k31N02n18o7
$$ plain form
6057 -266 98 -31 -100 81 56 -350 124 134 -196 45 167 -174 80 141 -143 -38 94 -25 -133 236 78
6078 78 -169 10 30 -194 139 27 -229 -78 142 -259 -48 296 -281 -70 140 61 -204 212 -9 -189 174
6099 174 65 -195 125 105 -265 138 179 -329 -145 244 -93 -8 102 -54 -31 233 5 -106 151 76 -113 120
6121 120 142 -25 6 139 -67 4 235 -99 -12 208 -21 -126 8 -181 -221 91 37 -140 221 27 -143 -44
6143 -44 3 -34 172 212 55 -89 130 -79 -156 213 -158 -44 53 221 -194 139 -33 -52 28 24 -73 54 138 -92
6167 -92 -104 -163 76 -94 286 -164 -96 166 -50 -182 58 158 41 7 144 68 46 91 -75 -30 82 -105 -51
6190 -51 145 -46 -54 93 62 -22 92 -86 -179 92 64 -62 54 129 -172 -9 -46 -109 -78 34 -84 -15 67 -43
6214 -43 -8 18 38 -101 -172 80 95 104 -51 -119 47 17 35 -39 78 -71 100 -112 45 -73 -99 13 78 -31 -55
$$ packed form
6057b66L64j29o9J81k5m06M74J0l30K41J22l41K54O1k84J05J32j19j08L69j58
6078G8k47J79K0k24L33j12k56J51K20m01K11L44n77K11K10p9k65M16k21j80L63
6099A74j09k60L20k0l70M03M1n08J84L89l37Q5J10j56K3K64k28j11K57p5j89K33
6121A20K2j67L1J33k06P1K31l34Q7K20k29j05J34j89m0L12n4j77L61j94j70R9
6143d4M7l7K06M0j57j44K19k09p7L69l71J14R7J68m15L33j72j9Q0mr7J27Q4k30
6167i2j2n9K39j70L80m50O8K62k16j32K40J00j17l4J37p6k2M5j66M5J12j87N4
6190e1J96j91qJ47l1q4J14j78r3K71k8j26J16P5l01J63l7o3L1J12j18O9Q2j10
6214d3L5K6K0j39p1K52J5Rj55o8J66l0J8p4J17j49J71k12J57j18k6J12O5j09k4
$$ plain form
6239 -55 40 -73 110 42 -78 7 -34 -131 8 135 -115 91 -66 -102 155 -60 42 44 54 -81 -18 -149 11 100
6263 100 80 -52 -84 -27 54 -130 140 -53 39 -92 226 127 -77 23 165 74 -41 171 -43 34 36 120 -154 96
6287 96 -142 -114 2 27 78 93 33 -141 166 29 -68 117 5 -131 92 3 39 -59 -109 34 -161 -4 -27 168
6311 168 -102 82 -108 -84 -1 -103 -22 -19 -86 -10 38 -47 77 96 67 -81 119 -23 -76 119 28 57 81 -66 101
6336 101 -96 128 36 -96 161 133 -162 -107 -39 56 10 -75 -56 -11 2 -202 -156 121 156 -94 108 -24 -112 -30 166
6361 166 -21 -27 116 -78 -98 152 -199 -66 48 70 -15 153 14 -3 364 56 -2 196 103 -64 -23 188 -22
6384 -22 -159 207 -34 -65 -22 13 -150 194 -36 -75 -56 37 -370 -14 84 -265 -52 163 -155 86 63 -50 16
6407 16 123 113 40 274 50 -263 148 17 -66 6 82 -166 65 270 -32 -28 158 -106 -37 158 -97 -50 35 154
$$ packed form
6239e5R5j13J83o8j20Q5m1r7J39J27k50K06j57l6K57k15J02KJ0j35O3j31J60Q9
6263A00k0j32l2N7Q1j84K70j93R2j31L18r9k04J00J42r1j15K12k14P7KQ4k74K50
6287I6k38K8J16K5N1J5o0j74L07j37r7J85j12j36K23q9L6r8n0J43j95J57k3J95
6311A68k70J84j90K4Q3j02Q1Lo7P6M8q5J24J9k9j48K00j42n3J95r1K9K4j47J67
6336A01j97K24r2j32K57k8k95N5O8R5m6q5J9M5J3k04M6K77L5k50K02j32q8Q2J96
6361A66j87oJ43j94k0K50l51J33J14K2q5J68j39j7L67l08n8J98r3j67M1K11k10
6384b2j37L66k41l1M3L5j63L44k30l9J9R3m07L56R8l49K13K15l18K41k3j13O6
6407A6J07j0p3K34k24l13M11j31q3P2P6k48K31K05l02MJ86k64O9J95k55M7Q5J19
$$ plain form
6431 154 -214 80 267 -289 35 52 -157 4 189 -204 -82 200 -109 -129 246 78 -43 171 107 -52 -24
6452 -24 243 -148 16 105 -219 -103 152 -5 -5 144 -141 -37 227 -18 -265 221 -87 -179 58 118 -246 30
6474 30 145 -212 137 152 -148 -89 93 -14 -143 133 -142 -309 -102 125 -185 98 73 -182 61 118 -190 196
6496 196 303 -192 -201 85 -93 -51 164 -163 -94 299 51 -256 3 73 -245 62 42 -143 2 103 -224 26
6518 26 92 -138 -167 214 -148 -120 155 24 -284 36 114 -263 68 143 -211 -5 282 -83 27 88 -59 -67 9
6541 9 -88 -193 261 -31 -257 190 72 -305 25 31 -255 -57 -3 -217 4 251 -48 -22 185 -179 -115 56 69
6564 69 -151 -4 -32 -255 23 87 -171 99 34 -254 -105 72 -121 -121 159 81 -280 164 121 -163 197 10 -252
6587 -252 27 -7 -227 51 158 -63 -78 159 -185 -180 165 -146 -216 41 -102 -82 188 146 -95 33 -6 21 -28
$$ packed form
6431A54l68K94J87n56L24J7k09J61J85l93J22K82l09k0L75j68j21K14o4j59K8
6452b4K67l91J64Q9l24J16K55j57%J49k85J04K64k45k47M86l08r2K37O0l64K76
6474C0J15l57L49J5l00N9J82j07j29K76k75j67K07K27l10K83k5k55K43N7l08L86
6496A96J07m95rK86j78M2K15l27O9L93k48l07K59P0l18L07k0j85J45J01l27K50
6518B6O6k30k9L81l62K8K75j31l08L20P8l77L31P5l54K06K87l65J10O1j47qP6
6541Ir7j05M54k92k26M47j18l77L30Ok86J98N4k14K21K47k99K6K07l64O4J71J3
6564F9k20J47k8k23K78O4k58K70o5k88J49J77j93%K80p8l61M44m3k84L60j87k62
6587b52K79l4k20K78J07k21j5K37l44NL45l11p0K57j43K0K70m2k41J28l9K7m9
$$ plain form
6610 -28 25 -109 6 203 -129 -17 120 16 -157 199 -158 -227 36 -75 -116 109 172 -93 -45 -50 0 70 81 -16
6634 -16 -61 172 -83 -134 55 -7 -152 15 -34 -212 59 116 -81 -88 113 -81 -45 182 54 -91 216 111 -69
6657 -69 228 18 -191 -156 64 -154 122 5 -73 -100 183 -210 117 391 -176 -132 122 -76 -114 71 79 5 104
6680 104 -82 -195 127 42 -87 -3 70 -131 -96 47 -162 -166 124 -72 -156 -2 148 -104 74 -14 -60 103 259
6703 259 -121 64 70 67 50 54 -194 -36 -49 19 -82 97 98 -121 -82 92 -92 76 94 -79 -120 175 -59 -13 104
6728 104 -54 -117 124 -154 -137 15 55 -31 141 11 -99 69 73 31 26 4 46 76 -41 -107 -1 19 16 -90 83
6753 83 -138 -80 70 23 -92 -31 161 49 170 -38 -55 -22 76 263 62 3 36 -74 -56 -43 -89 65 44 6 121
6778 121 64 -113 -133 2 -84 -118 198 54 -24 68 -137 -154 123 -46 -82 -104 33 -60 -9 207 86 14 21 -108 105
$$ packed form
6610b8N3j34J15J97l32J12J37j04j73L56l57o9K63j11m1K25O3k65M8nN0P0J1r7
6634a6m5K33k55n1J89o2j45J67m9j78K71N7j97pK01j94L6K27j28j45L07j05j80
6657f9K97k10k09L5K20k18K76j17p8k7K83l93L27K74n67M4K54j98l8J85Qp4R9
6680A04j86j13L22q5j29Q4P3k01L5J43k09mK90j96q4J54J50k52J78q8m6J63J56
6703B59l80J85Olj7Mk48J58j3O8j01J79Jk19L9J74j84J68J8j73m1K95k34M6J17
6728A04j58o3K41k78J7J52M0q6J72j30j10J68Mm2nk2M2L0j17o6J06K0lj06J73
6753H3k21N8J50m7j15O1J92j12J21k08j7L3R8J87k01n9L3j10J8J3m6J54k1l8J15
6778A21n7j77k0J35q6l4L16j44p8R2k05j7K77j69l6k2J37r3N1K16j21p2Pj29K13
$$ plain form
6803 105 -47 52 92 28 -2 -41 31 -106 59 66 109 86 99 -77 103 -22 -94 -34 -79 -56 -63 -123 -9 146 -119 73
6829 73 183 -23 -56 274 -22 110 -14 12 -54 -68 74 56 28 -66 77 108 109 38 -5 -35 20 59 -105 -74 -26 227
6855 227 0 14 16 -61 -48 181 23 36 -46 26 -43 -277 -23 -32 -57 2 43 -79 141 -82 120 28 105 16 104 -50
6881 -50 193 8 -16 14 -91 -84 -92 -73 -25 -102 56 -48 -51 112 2 28 145 -5 -104 95 -6 -4 -65 39 -130 -93
6907 -93 -55 -44 97 -49 51 67 -77 -103 -1 -42 -24 44 164 -52 -81 78 -26 -19 85 30 20 45 4 -71 56
6932 56 149 126 30 112 32 -98 166 0 84 166 105 42 144 57 24 -69 -7 -27 -50 -107 -29 67 -16 -16 55 3 -104 -117
6960 -117 85 15 -72 154 -185 50 61 -43 -18 -81 -100 -32 136 -57 105 172 87 -147 -42 51 -127 170 142 -3
6984 -3 -94 85 -41 -9 -77 88 -79 145 -16 39 117 -133 46 43 31 17 101 161 36 -133 49 -247 -76 289
$$ packed form
6803A05j52R9M0o4l0l9P2j37J65PM3k3J3j76J80j25p2O0m5K3po0J14J55k65J92
6829G3J10k06l3L30k96J32j24K6o6j4J42j8k8r4J43L1Jp1m3l0N5L9j64L1M8K53
6855B27k27J4Kp7J3K29j58J3q2P2o9k34K54rk5N9M1j22K20k23K02r2P7q9Q8j54
6881e0K43j85k4L0j05PqJ9M8p7J58j04lJ63j10K6J17j50r9J99j01Ko1J04j69L7
6907i3L8J1J41j46J00J6j44k6J02m1J8O8J20k16k9J59j04PJ04n5j0K5m1p5J27
6932E6R3k3r6Q2q0j30K64j66Q4Q2o1o3J02q7l3r3O2k0k3n7P8R6q3%P1n2j07j3
6960a17K02p0q7K26l39K35J1j04K5o3j9O8J68j93J62O7q5k34J05R3j78K97k8j45
6984cr1J79j26L2o8J65j67K24j61N5P8k50J79lj2j4Q4O0j25j69J82k96J71L65
$$ plain form
7008 289 45 -82 7 -109 -38 104 95 -67 -114 101 -66 -20 64 -75 147 35 -68 -10 163 108 -5 95 38
7031 38 -156 67 177 -142 134 72 -197 26 96 -4 83 84 24 -162 40 -47 -101 164 4 40 97 109 -279 24
7055 24 126 -95 -42 89 76 -42 78 -66 -157 -87 -33 -88 197 87 -98 105 59 -169 16 96 44 51 65 115 2
7080 2 9 27 -80 103 129 -123 -46 24 -25 160 76 -161 -12 104 -3 86 18 19 -68 157 22 -47 153 16 -168
7105 -168 78 108 -162 -84 21 -111 -32 137 -10 49 84 -107 -67 136 -5 -75 -14 -97 -200 11 69 -240 42
7128 42 187 -127 -10 291 -36 -187 44 -30 -83 73 -108 -26 162 180 -92 48 103 -51 38 83 -33 32 182
7151 182 49 -48 82 -69 -137 -85 -127 -39 -216 -85 -121 100 3 -87 33 -104 -69 47 16 -87 84 250 4
7174 4 40 81 -11 -35 219 -14 -20 170 156 -71 86 -23 -68 67 -57 -193 -163 -91 -230 15 39 -83 -43 -42 37 -34
$$ packed form
7008B89k44j27Q9j16P1J42rj62m7K15j67M6Q4j39K22j12j03N8J73n5j13J00n7
7031C8j94K23J10l19K76o2k69K23P0j00Q7Jo0j86K02q7n4K65j60L6N7J2l88L03
7055B4J02k21N3J31j3j18J20j44r1P0N4n5K85j10j85K03m6k28J85Q0n2PJ4N0j13
7080BPJ8j07J83K6k52P7P0m9J85q4k37J49J16j07Q9o8Jq7K25j35o9K00j37j84
7105a68K46L0k70P8J05j32P9J69j47N9L5j91M0K03j41p0O1q3j03K11N8l09K82
7128D2J45l14J17L01l27j51K31p4n3J56j81Q2J88J8k72J40N5j54Q9M5j16O5J50
7151A82j33r7J30j51o8N2m2Q8j77J31l6K21r7r0J20j37L5J16l1j03J71J66k46
7174DL6M1r2k4K54k33oJ90j4k27J57j09m5J35j24j36L0P2j39K45K4j22M0JP9p1
$$ plain form
7200 -34 -13 70 93 -27 20 20 32 144 106 43 218 42 -97 238 75 36 179 178 -52 -12 -59 -68 93 -98 -67 -8
7226 -8 -189 -158 55 109 -37 -174 83 124 28 27 -91 2 256 -122 -18 21 119 -85 66 -102 -1 53 79 -91
7250 -91 -93 81 109 -199 16 -9 21 -117 -35 -14 -177 -60 -92 -121 -50 -131 -10 -4 54 29 27 349 21 145 -27 -23 -175
7277 -175 72 -76 -18 23 -54 -3 131 -87 79 -14 -58 -42 118 -39 127 188 -173 87 -148 9 38 81 63 -23
7301 -23 44 127 -74 -62 0 -21 -34 119 -3 23 86 37 -52 92 29 -64 -56 87 78 -152 144 -124 34 39 -5 63 -114
7328 -114 90 169 -25 115 -165 -118 124 -246 15 -205 -57 -69 39 114 111 2 85 -7 86 21 -138 -23 10 -11
7352 -11 50 16 34 33 -91 29 19 -15 -95 -46 72 -35 -93 235 15 106 -70 -57 76 23 -101 -153 44 63 -8 -54
7378 -54 -4 -41 -158 70 -138 -95 45 -12 22 41 34 -36 -115 -164 66 -106 -14 -59 -11 76 -33 -17 81 78 -5 -83 -23 -10
$$ packed form
7200c4K1Q3K3j20M7%J2J12l8o3J75j76j39L35j63l9J43jk30M0m7rJ61j91L1N9
7226hj81L1K13N4j46j37K57M1r6jj18R3K54l78J04L9R8k04J51j68J01N4K6j70
7250i1kJ74K8l08K15k5L0j38Q2K1j63J17l2k9P1q1J21ON8k5kL22l28J24j72Mj52
7277a75K47j48N8M1p7N1J34k18J66r3m4J6J60j57J66O1l61K60k35J57K9M3j8q6
7301b3O7Q3k01J2O2k1j3J53j22K6O3m9q9J44o3r3QJ43rk30K96k68J58Nm4O8j77
7328a14K04P9j94J40k80M7K42l70K61k20J48j2J08P5lj09Q3r2R3o5j59J15L3k1
7352a1O1l4J8jj24J20j0l4q0M9J18j07n8L28k20R1j76J3J33n3j24n2J97J9p1m6
7378e4N0l7j17K28k08M3J40n7L4J9pp0p9m9K30j72R2m5M8Q7j09J6R8lq3p8O0J3
$$ plain form
7406 -10 51 128 -27 -67 10 54 -27 43 -147 51 38 -36 -109 -134 -85 -131 -72 74 26 53 97 -37 -3 13 -61 2 -78 46
7434 46 193 68 -105 27 66 -73 8 -8 -37 180 158 82 15 -82 82 98 99 6 120 -137 40 -70 -46 72 19
7459 19 233 -6 18 -1 152 -18 58 -57 -9 12 -115 -20 182 47 97 -23 -147 -71 9 242 -121 28 13 108
7483 108 -94 -7 -20 -7 -103 41 -48 31 135 61 60 86 -134 45 151 -102 74 -13 161 97 150 -78 101 50 16
7508 16 14 200 -115 -197 -91 140 -94 -2 -52 153 60 114 -44 1 69 80 38 -57 -40 -209 62 -27 -73 -61 -95 -76
7534 -76 46 123 17 49 17 -57 22 79 -44 26 146 -74 -32 170 145 -67 71 49 0 -68 -105 27 99 78 -34
7559 -34 69 105 -13 -109 56 -105 -13 23 -13 13 7 42 -14 -6 -72 -1 -37 -35 43 86 126 49 26 -128 -10 -12 -93 -19 -11 -67
7589 -67 -151 -1 -10 50 -4 -73 -38 -25 -146 5 -60 59 37 -166 77 6 204 138 -30 54 -137 -97 134 132 -13 -13
$$ packed form
7406a0O1P7j55m0P7M4q1P0j90J98j3p4p3k5M9m6N9J46m8K7M4j34L4J6p4O3q0J24
7434D6J47j25j73J32L9j39Q1j6k9K17k2p6o7r7J64J6Jr3J14k57J77j10K4J18n3
7459A9K14k39K4j9J53j70P6j15M8K1j27R5K02j35N0j20j24P6Q0K33l63J49j5R5
7483A08k02Q7j3J3r6J44q9P9J04p4jK6k20J79J06k53J76q7J74o4N3k28J79n1l4
7508A6kJ86l15q2J06K31k34R2n0K05r3N4j58M5O8J1m2r5J7j69K71q9m6J2l4J9
7534g6J22P7j06L2l2p4P9N7j23P0J20k20M2K02k5k12J38k2m9o8l7J32P2k1j12
7559c4J03L6j18r6J65j61R2L6l6K6oL5n6Qo6P1l6KP8M3M0p7k3j54J18kq1P4Qn6
7589f7q4J50rO0n4o9L5J3j21J51o5J19k2k03K43p1J98o6j68Q4j91M0K31kj45%
$$ plain form
7615 -13 -7 117 -158 96 -85 -13 -62 -22 105 87 -91 -29 85 20 -102 -2 136 -72 -28 -147 41 67 42 -111
7639 -111 -7 95 93 205 -212 -113 95 41 63 24 70 -93 -161 -43 -7 37 106 -1 149 138 -124 75 -35 107
7663 107 -19 155 92 -9 95 2 -56 -52 -97 117 -198 -180 -130 -28 87 -42 77 17 -3 112 -8 81 -71 -4
7687 -4 107 -109 20 -6 -138 -122 20 66 -135 20 -55 -60 -40 78 92 114 -67 -109 131 80 -59 -114 104 -21 -77
7712 -77 18 23 -112 30 43 -15 -47 39 15 136 -4 -21 79 147 -21 165 10 -91 -36 60 16 -47 194 52 4
7737 4 63 -1 247 195 -37 12 1 10 -52 -7 64 -52 -225 55 63 -7 -61 -22 34 -9 27 -42 -33 -28 7 35 32 3 -118 -25
7767 -25 -5 -40 -19 -107 38 3 55 -84 18 -40 -12 -34 -30 -132 -139 -34 -102 -109 25 196 -48 -35 -20 98 131 109 45
7794 45 166 226 22 -29 -80 -8 -36 -15 -8 -113 -49 -59 17 19 -93 -149 -30 35 41 151 77 100 110 40 -52 -47 37 -55 97
$$ packed form
7615a3OJ24k75K54j81P2m9M0J27j8j78O2J14o5j22J00J38k08M4j19J88K6k5j53
7639a11J04J02kJ12m17R9K08n4K2l9M6j63o8J18L6M4O9j07J50j1k62J99j10J42
7663A07j26J74o3j01J04r3n8Mm5K14l15J8N0J02J15j29J19o0k0J15j20Q9j52O7
7687dJ11k16J29k6j32J6J42M6k01J55p5nK0J18J4K2j81m2K40n1j39n5K18j25n6
7712g7R5Nj35J42J3n8l2Q6k4J21j40j7J00O8j68J86j55j01N5R6m4o3K41j42m8
7737DN9o4K48n2k32M9j1Ro2M5P1j16j73K80Qp0n4L9N6m3L6o9RNL5K8lk9j21R3
7767b5K0l5K1q8J45l5N2j39J02n8K8k2Mj02pJ05o8pJ34J71k44J3J5J18L3k2o4
7794D5J21O0k04n1n1P2k8K1Pj05O4j0P6Kj12n6J19O5OJ10p4K3J0p0r2NQ4r2J52
$$ plain form
7823 97 -120 115 74 -22 -10 -78 43 -84 -12 -14 -125 -66 -15 -31 -76 113 -109 13 127 13 -81 -107 -155 81 -62
7848 -62 45 -43 -44 -18 -44 36 174 151 55 72 27 89 -174 -94 -111 -133 -25 -159 -71 47 0 -43 63 -108 -25 69 -14
7875 -14 -18 -72 141 -23 147 -38 -37 -87 186 -37 -114 -143 110 -92 -55 32 180 163 24 -70 114 83 -19 56 -60
7900 -60 27 103 0 46 47 -55 91 -25 -73 -34 49 28 -160 -4 -149 92 -83 -1 58 -22 106 17 32 61 -99
7925 -99 46 -74 42 -6 65 -76 62 -26 -125 20 -17 -68 -61 79 -97 -35 -2 8 102 28 14 106 -92 66 119 -146
7951 -146 85 34 -13 11 66 60 97 -3 39 -8 -81 8 88 -57 28 109 -111 -18 -42 -18 -73 -2 15 16 -18 33 -90 -55
7979 -55 -175 -32 9 -5 27 -69 -54 11 21 36 -23 -28 91 -14 87 -40 118 27 -88 27 -59 -15 -49 -48 -17 12 19
8006 19 -18 -110 45 76 -50 63 58 -163 -70 -33 -22 -87 12 -78 -3 67 74 -140 -64 -79 -120 -169 -9 223 -36 -120 10
$$ packed form
7823I7k17K35m1r6J2o8J21j27P2kj11N9N1j6m5J89k22J22J14j14r4k6m8K36j43
7848f2J07q8jK6k6Q0J38k3r6J7m5O2k63Q0j7k2J08j34Q8J18m7m3J06j71Q3R4q3
7875a4mn4K13j64J70j85Jn0K73k23p7k9K53k02L7Q7J48j7j39r4J84l1j02P5j16
7900f0Q7P6j03M6Jj02J46j16m8L9Q3k1j88J56j45K41j75Q2N9q0J28q9J5K9j60
7925i9J45j20J16m8P1j41J38q8r9J45l7n1PJ40j76O2L3J0R4p4j4R2j98J58N3k65
7951a46K31n1m7K4N5oL7j00M2m7p3Q9Q0j45Q5Q1k20R3k4K4n5P1J7Jl4N1j23L5
7979e5j20J43M1j4L2r6J5O5J0J5n9nJ19j05J01j27J58r1j15J15q6M4l4JL1K9P
8006A9l7r2J55L1j26J13nk21R3L7J1o5R9r0P5P0Pk14P6j5m1m9J60K32k59q4J30
$$ plain form
8033 10 -13 -34 60 40 67 -97 27 8 77 -64 164 -64 136 124 -152 -95 -80 204 -8 188 46 -69 -179 -16
8057 -16 -105 177 -70 162 91 3 -24 -45 -65 -37 -151 -95 -45 14 -14 -6 25 -60 234 55 42 75 -98 -148 112 -55
8083 -55 11 -5 94 106 -33 -149 42 -51 -15 33 -13 18 -137 -81 -13 -202 -34 39 65 92 -11 -40 -41 -41 57 -71 54
8110 54 171 127 167 5 -54 -139 68 -53 -88 -75 47 -108 -21 19 -20 93 -172 52 18 -53 112 -186 -42 -54
8134 -54 123 137 137 53 13 -54 -34 131 -216 -62 28 10 -74 42 -27 -93 -53 -19 -41 140 22 63 32 77 -6 76 -47
8161 -47 -82 46 -88 -53 13 47 -11 -22 99 -62 -24 -52 12 42 -151 -46 -42 -8 76 7 -67 25 -36 -44 20 28 -111 -6
$$ packed form
8033A0k3k1R4k0K7j64J24j9O9j41K28k28K00j2k76N7J5K84k12J96j42j15j10J63
8057a6q9K82k47K32p1q8k7k1k0K8j14N6N0N9k8QL1q5K94j79j3L3j73n0K60j67
8083e5O6j6R9J2j39j16J91r3L6M8m6L1j55N6O8j89J68P3K6K7j03k9j%R8j28J25
8110E4J17m4M0j62n9q5K07j21l5J3J22j55Q7M0l9J13k65K24l4p1J65k98J44j2
8134e4J77J4%q4m0o7K0J65l47J54R0j8q4J16o9o6M0L4k2J81j18M1l1M5q3Q2j23
8161d7l5J28j34L5O6L4n8j1J21j61L8k8O4L0j93J05ML4Q4o9p4R2o1qO4Qj39J05
8189flL
8191f
$$ Imaginary data points
##PAGE= N=2
##DATA TABLE= (X++(I..I)), XYDATA
$$ plain form
0 0 0 0 0 0 0 0 8 -8 8 -8 8 -16 16 -24 32 -40 48 -56 72 -88 104 -120 144 -169 200 -233 270 -313 361 -415
30 -415 473 -539 614 -695 784 -882 992 -1110 1242 -1384 1542 -1714 1898 -2103 2328 -2569
46 -2569 2837 -3128 3447 -3796 4184 -4609 5079 -5605 6195 -6860 7618 -8485 9495 -10689
60 -10689 12120 -13878 16101 -19005 22979 -28786 38105 -55514 99359 -452903 -593220 347001
72 347001 404149 180077 -287089 -450526 -170931 216186 103365 -22435 -32249 -11510 171951
83 171951 452963 195159 -250561 -267522 45898 345888 487745 158825 -259906 -185039
93 -185039 87630 71623 21112 -12867 -123336 -27157 226222 155749 -110808 -279820 -316270
104 -316270 -27680 418725 311531 -229846 -434977 -233416 26476 209521 109815 -166012
$$ packed form
0@%%%%%%Qj6J6j6J6k4L2m0N6p2Q8j04J28j60J92k24K64l13L69m33N03n83O74p76
30d15Q88j012J153j309J479j666J874k102K352k626K926l256L612m001M431m897
46b569N406n965O575p243P980q793R688j0684J1800j3055J4478j6103J7980k0184
60a0689K2809k5998K9979l5106M1984n1765O6891r3619J54873n52262j40317R40221
72C47001N7148k24072m67166j63437K79595L87117j12821j25800r814K0739J83461
83A71951K81012k57804m45720j6961L13420K99990J41857l28920m18731P4867
93a85039K72669j6007n0511l3979j10469R6179K53379p0473k66557j69012l6450
104c16270K88590M46405j07194n41377k05131K01561K59892J83045r9706k75827
$$ plain form
114 -166012 -146468 43217 13636 -38368 -29381 -137610 -95678 188077 259931 68783 -90489
125 -90489 -179133 -84115 212894 267811 28948 -32539 40672 -6920 -8727 17104 -73079 -49804
137 -49804 106880 132233 91579 18702 -213507 -294462 3964 232497 139231 -12232 -127121
148 -127121 -156910 -12472 42974 -85068 -66346 61151 39080 3065 6143 -107223 -162227
159 -162227 -21786 83200 104085 115109 2433 -93595 27132 96905 -4510 -2133 83016
170 83016 82879 83374 53608 -75930 -101898 -7439 8153 36902 108078 -9632 -184408 -142255
182 -142255 -30553 16403 46605 -13453 -89600 -4561 60477 -40621 -72762 10688 40082
193 40082 76608 118605 23265 -68282 -32402 -4752 31582 110040 61221 -45784 -8456 34763
$$ packed form
114a66012J9544J89685k9581n2004Q987j08229M1932K83755P1854j91148j59272
125i0489q8644R5018K97009N4917k38863o1487P3211m7592j807K5831r0183K3275
137d9804J56684K5353m0654p2877k32209q0955K98426K28533r3266j51463j14889
148a27121k9789J44438N5446j28042J8722J27497k2071l6015L078j13366n5004
159a62227J40441J04986K0885J1024j12676r6028J20727O9773j01415K377Q5149
170H3016j37M95k9766j29538k5968R4459J5592K8749P1176j17710j74776M2153
182a42255J11702M6956L0202o0058p6147Q5039O5038j01098l2141Q3450K9394
193D0082L6526M1997r5340r1547L5880K7650L6334P8458m8819j07005L7328M3219
$$ plain form
205 34763 -38018 -70065 -39964 -13786 67217 101894 -15651 -90905 -60257 -64750 -29084 85724
217 85724 91463 212 -38423 -55383 -48891 19877 16844 -51250 2713 87823 43479 -20206 -50910
230 -50910 -85844 -29128 79793 78353 26040 7663 -36858 -46803 30045 39220 -24078 -1476
242 -1476 48435 36150 19732 -25380 -87142 -36774 54434 46139 16681 11905 -41280 -70760 -12449
255 -12449 24895 21495 24534 -16694 -51812 2452 27644 -29695 -42022 -4926 15398 41116
267 41116 34690 -41000 -71897 -17374 22205 45097 63153 13023 -37868 -4666 22736 5494
279 5494 8868 17003 19036 47531 40990 -28485 -55814 -25862 -12213 11077 44885 17975 -32424
292 -32424 -49333 -57657 -35589 18998 21466 -17848 -11883 13426 6961 -3954 -19118 -36311 2008
$$ packed form
205C4763p2781l2047L0101K6178Q1003L4677j17545p5254L0648m493L5666J14808
217H5724N739r1251l8635j6960O492O8768l033o8094N3963Q5110m4344o3685l0704
230e0910l4934N6716J08921j440n2313j8377m4521r945P6848R175o3298K2602
242a476M9911j2285j6418m5112o1762N0368R1208q295k9458m776n3185k9480N8311
255a2449L7344l400L039m1228l5118N4264K5192n7339j2327L7096K0324K5718
267D1116o426p5690l0897N4523L9579K2892J8056n0130n0891L3202K7402j7242
279E494L374Q135K033K8495o541o9475k7329K9952J3649K3290L3808k6910n0399
292c2424j6909q324K2068N4587K468l9314N965K5309o465j0915j5164j7193L8319
$$ plain form
305 2008 60422 55762 19188 -9522 -35629 -21104 28472 37601 11446 3620 2191 -4253 498
318 498 -6303 -23646 -6075 19051 11252 3203 -832 -21540 -27771 -6891 12033 22258 17368 -15937
332 -15937 -39741 -15957 14874 14351 2419 -9707 -12070 6691 11962 -11795 -25602 -10438 14617
345 14617 32280 25698 -6805 -31187 -20413 3585 18339 23946 17050 5330 -887 -8934 -14662
358 -14662 -7137 6398 14326 14556 11737 5300 -8902 -24344 -26261 -8296 17790 26733 9658 -16059
372 -16059 -25653 -14591 -4955 -3994 -2005 2260 10897 15020 -892 -19392 -16538 -43 13323 20142
386 20142 15974 3837 593 1027 -7642 -4460 12380 14937 7440 -426 -13314 -12716 3761 3419 -9439
401 -9439 -7037 -472 -4092 -3558 -7566 -18047 -3749 16411 7395 -2317 -1543 -9381 -6352 10272 10123
$$ packed form
305B008N8414m660l6574k8710k6107J4525M9576R129k6155p826j429o444M751
318D98o801j7343J7571K5126p799q049m035k0708o231K0880J8924J0225m890l3305
332a5937k3804K3784L0831n23j1932j2126k363J8761N271k3757j3807J5164K5055
345A4617J7663o582l2503k4382J0774K3998J4754N607o896j1720o217q047n728
358a4662P525J3535P928K30k819o437j4202j5442j917J7965K6086Q943j7075k5717
372a6059r594J1062R636R61J989M265Q637M123j5912j8500K854J6495J3366O819
386B0142m168j2137l244M34q669L182J6840K557p497p866j2888N98J6477l42j2858
401i439K402O565l620N34m008j0481J4298K0160r016r712P74p838L029J6624j49
$$ plain form
416 10123 6902 17981 10365 -11463 -7592 1458 -469 11472 13479 -4383 1111 11641 -9773
429 -9773 -23583 -11896 -3493 11091 25847 668 -28625 -15133 -3434 -7859 4894 5573 -7529
442 -7529 7089 14406 -10430 -14197 -1061 -6600 2348 24601 11898 -3476 4922 -7098 -16343
455 -16343 12060 18968 695 6195 3701 -11329 7285 17863 -11695 -15282 8318 6050 6131 10572
469 10572 -19482 -26364 11958 13005 -10141 -4322 -10456 -22416 2144 10439 -13097 -5553 4263
482 4263 -17739 -9428 14763 -4328 -10011 12833 4628 1884 25020 7209 -17595 4628 15725
495 15725 10059 31251 24941 -18290 -11357 16496 4549 2441 6528 -17681 -6141 26263 -3313
508 -3313 -36394 -18249 -13314 -15023 12430 6839 -25249 -13333 -6652 -24867 486 19651 -13327
$$ packed form
416A0123l221J1079p616k1828L871R050j927J1941K007j7862N494J0530k1414
429i773j3810J1687Q403J4584J4756k5179k9293J3492J1699m425J2753O79j3102
442g529J4618P317k4836l767J3136n539Q948K2253j2703j5374Q398j2020r245
455a6343K8403O908j8273N500k494j5030J8614J0578k9558l587K3600k268Q1M441
469A0572l0054o882L8322J047k3146N819o134j1960K4560Q295k3536P544R816
482D263k2002Q311K4191j9091n683K2844q205k744K3136j7811k4804K2223J1097
495A5725n666K1192o310m3231O933K7853j1947k108M087k4209J1540L2404k9576
508c313l3081J8145M935j709K7453n591l2088J1916O681j8215K5353J9165l2978
$$ plain form
521 -13327 -12196 17345 6026 2282 15613 -9113 -15739 25119 26159 4552 18143 4520 -23029
534 -23029 12498 35695 2545 -4852 1229 -11072 12015 29219 -16544 -30531 10138 7178 -11386
547 -11386 2599 -11673 -27583 4241 6505 -17562 1095 -116 -34647 -12994 20630 -2172
559 -2172 -9526 5935 -10711 -5978 21295 -3501 -19423 15642 13290 -2965 25685 19625 -21272
572 -21272 -7582 15815 7942 21320 19825 -20005 -4138 33411 -503 -24226 4796 3782 -2032
585 -2032 17228 -4107 -26278 1661 -1830 -29874 -387 16126 -19460 -14381 6750 -15211 -12324
598 -12324 6406 -14524 -7469 24813 -974 -18929 17565 14378 -12838 9586 18336 -1884 12951
611 12951 15207 -10349 11786 25450 -16302 -11270 27457 5640 -18305 -3113 -7219 -3434 21095
$$ packed form
521a3327J131K9541j1319l744J3331k4726o626M0858J040k1607J3591j3623k7549
534b3029L5527K3197l3150p397O081j2301K3087J7204m5763j3987M0669k960j8564
547a1386J3985j4272j5910L1824K264k4067J8657j211l4531K1653L3624k2802
559b172p354J5461j6646M733K7273k4796j5922L5065k352j6255K8650o060m0897
572b1272J3690K3397p873J3378j495l9830J5867L7549l3914k3723K9022j014n814
585b032J9260k1335k2171K7939l491k8044K9487J6513l5586N079K1131k1961K887
598a2324J8730k0930P055L2282k5787j7955L6494l187k7216K2424Q750k0220J4835
611A2951K256k5556K2135J3664m1752N032L8727k1817k3945J5192m106L785K4529
$$ plain form
624 21095 -7244 -36626 1396 11453 -19914 -3670 9841 -15501 -3802 14498 -8838 -6315
636 -6315 8204 -16554 -5842 36556 10563 -23969 2405 8776 -6281 10664 3893 -15125 14835
649 14835 20464 -15894 -2287 17170 -17506 -17265 22155 15383 606 2626 -22238 -16032 29812
662 29812 11009 -30168 -4731 12943 -4915 5900 5322 -25371 -13035 9853 -4509 6326
674 6326 19194 -22775 -28916 20040 18136 -9196 -2110 -5668 -5891 23862 13101 -20493 2522
687 2522 17575 -11533 874 25438 -2322 -13124 4701 -500 9391 23701 -15555 -31741 14138
700 14138 19389 -12044 -3930 -261 -14710 4910 8809 -19600 -8899 4644 -17136 -1261 27442
713 27442 -5220 -28740 -1531 5906 2716 14559 -3221 -13921 20961 19114 -16317 -1089 16620
$$ packed form
624B1095k8339k9382L8022J0057l1367J6244J3511k5342J1699J8300k3336K523
636f315J4519k4758J0712M2398k5993l4532K6374O371j5057J6945o771j9018K9960
649A4835N629l6358J3607J9457l4676K41L9420o772j4777K020k4864O206M5844
662B9812j8803m1177K5437J7674j7858J0815n78l0693J2336K2888j4362J0835
674F326J2868m1969o141M8956j904k7332P086l558k23K9753j0761l3594K3015
687B522J5053k9108J2407K4564k7760j0802J7825n201R891J4310l9256j6186M5879
700A4138N251l1433Q114L669j4449J9620L899k8409J0701J3543k1780J5875K8703
713B7442l2662k3520K7209P437l190J1843j7780j0700L4882j847l5431J5228J7709
$$ plain form
726 16620 -5468 -101 17782 3139 1193 4714 -19303 -11243 23943 4062 -22757 1542 7728
739 7728 -8963 204 -2873 -16127 5601 11340 -12646 -27 15907 -10947 -12684 14591 3791
752 3791 -8524 4601 -2407 -3851 14645 -3711 -21956 9713 17488 -12962 -9658 5834 -1488
765 -1488 5447 9475 -11542 -2725 17217 -4903 -11214 15136 6624 -10576 5327 7683 -3195
778 -3195 3892 -4671 -17923 7631 18732 -9263 -9405 6302 -7853 -7818 7966 -2110 -6691 5541
792 5541 -2843 -3220 16068 -33 -25997 -3163 19047 7099 2259 -3470 -14331 4505 17044
805 17044 -6503 -8832 8742 -276 -3687 13150 4980 -11908 -3918 -1243 -368 16141 4870 -21392
819 -21392 -6921 11339 -677 -3012 1050 -10756 -6613 8967 1880 -2370 4404 -8708 -11106
$$ packed form
726A6620k2088N367J7883j4643j946L521k4017Q060L5186j9881k6819K4299O186
739G728j6691R167l077j3254K1728N739k3986J2619J5934k6854j737K7275j0800
752C791j2315J3125p008j444J8496j8356j8245L1669P775l0450L304J5492p322
765a488O935M028k1017Q817J9942k2120o311K6350q512j7200J5903K356j0878
778c195P087q563j3252K5554J1101k7995j42J5707j4155L5J5784j0076m581J2232
792E541q384l77J9288j6101k5964K2834K2210j1948m840n729j0861J8836J2539
805A7044k3547k329J7574r018l411J6837q170j6888P990K675Q75J6509j1271k6262
819b1392J4471J8260j2016k335M062j1806M143J5580p087m250O774j3112k398
$$ plain form
832 -11106 16468 16500 -8345 -8693 666 5675 16290 8089 -14976 -7399 10135 1691 -2046 5767
846 5767 -4670 -9619 3839 2368 -4376 -706 -8408 -10788 9890 12937 -6369 -7814 -709 -3763
860 -3763 2035 8314 -1743 -2653 4565 -2923 -2446 8098 -2257 -12887 478 9643 4448 1418
874 1418 -5565 -10266 4291 10792 -2536 -2684 6306 1157 37 5093 -466 -2697 3090 257 -1289
889 -1289 6141 1227 -8354 -1735 3045 -3555 -1727 1054 -3655 -1856 514 -3937 -669 4535 -2737
904 -2737 -6668 1412 3381 -1321 -223 -257 -874 3694 1085 -5091 -312 3831 -911 -818 3619 2801 987
921 987 89 -3080 -1388 5501 4666 296 1548 430 -1641 1283 1159 -2658 -2772 225 2089 2719 -688
938 -688 -7106 -6573 832 3181 458 -1218 -1830 -524 1066 -233 -1447 -722 -76 438 1567 2891 962
$$ packed form
832a1106K7574L2k4845l48R359N009J0615q201k3065P577J7534q444l737P813
846E767j0437m949J3458j471o744L670p702k380K0678L047j9306j445P105l054
860c763N798O279j0057r10P218p488M77J0544j0355j0630J3365R165n195l030
874A418o983m701J4557O501j3328j48Q990n149j120N056n559k231N787k833j546
889a289P430m914r581O619M780o600J828K781m709J799K370m451L268N204p272
904b737l931Q080J969m702J098l4o17M568k609o176M779M143m742R3M437q18j814
921I87q98l169J692O889q35m370J252j118k071K924j24l817j14K997J864O30l407
938f88o418N33P405K349k723j676o12J306J590j299j214P25O46N14J129J324j929
$$ plain form
955 962 -3214 -4081 -980 2708 3114 -287 -2787 -2357 1337 3578 878 -1727 -1702 -315 3764 5280 606
972 606 -3289 -1069 2290 3055 2102 -1673 -4657 -155 3383 909 -104 -885 -4227 -1929 1626 299
988 299 -153 804 -1653 -1761 3106 1832 -3183 -2162 -1206 -593 5142 4369 -4511 -4967 -961 -966 1758 2792
1006 2792 -2852 -3216 3516 2115 -1903 212 -1948 -3071 5190 6143 -228 453 54 -3919 964 5390
1022 5390 161 -844 2579 -1845 -1601 4767 -752 -6179 129 1126 -492 4611 215 -8412 -2219
1037 -2219 4110 -528 71 898 -5937 -1919 6490 -380 -3930 1533 -2468 -3085 5534 1960 -4897 1128
1053 1128 2034 -2518 3882 4808 -5130 -2303 4496 -878 1723 7011 -3321 -5824 3464 900 -2357
1068 -2357 3625 -1157 -6245 4363 5321 -5563 -2458 338 -5400 2358 7763 -3466 -4025 3119 -3065
$$ packed form
955I62m176q67L101L688M06l401k500M30L694K241k700k605K5J387M079J516m674
972F06l895K220L359P65r53l775k984M502L538k474j013p81l342K298L555j327
988B99m52R57k457j08M867j274n015J021R56O13N735p73q880m56M006nK724J034
1006B792n644l64O732j401m018K115k160j123Q261R53o371O81l99l973M883M426
1022E390n229j005L423m424K44O368n519n427O308R97j618N103m396q627O193
1037b219O329m638N99Q27o835M018Q409o870l550N463m001o17Q619l574o857O025
1053A128R06m552O400R26r938K827O799n374K601N288j0332k503R288k564l257
1068b357N982m782n088J0608R58j0884L105K796n738P758N405j1229n59P144o184
$$ plain form
1083 -3065 -3047 5655 -593 -5227 4530 2584 -4513 3488 2095 -7777 755 6104 -1825 2221 5059
1098 5059 -6125 -3626 7122 -240 -3350 4672 -1377 -4826 6534 1903 -8014 482 1456 -5535
1112 -5535 3361 4873 -7711 -3147 4662 -3814 -2029 5936 -3450 -5223 5993 187 -4225 6791
1126 6791 1616 -7564 3503 5768 -3486 2240 3811 -6076 1692 9848 -3320 -4398 4875 -2707
1140 -2707 -2772 8658 247 -6761 3342 616 -6501 3708 2262 -9245 254 6418 -5159 -2304
1154 -2304 3378 -7438 -4193 7119 -1662 -3406 6574 -2308 -7732 5850 4256 -5448 2856 3693
1168 3693 -4082 5777 7241 -8129 -2181 8153 -1800 -421 8194 -2490 -5310 5946 -60 -5103
1182 -5103 5627 469 -8458 4826 5407 -7984 -1294 3617 -6202 -744 5434 -6150 -3651 5619
$$ packed form
1083c065J8Q702o248m634R757j946p097Q001j393r872Q532N349p929M046K838
1098E059j1184K499J0748p362l110Q022o049l449J1360m631r917Q496R74o991
1112e535Q896J512j2584M564P809q476J785P965r386j773J1216n806m412J1016
1126F791n175r180J1067K265r254N726J571r887P768Q156j3168j078R273p582
1140b707o5J1430q411p008J0103k726p117J0209j446j1507R499O164j1577K855
1154b304N682j0816L245J1312q781j744R980q882n424J3582j594r704Q304Q37
1168C693p775R859J464j5370N948J0334r953J379Q615j0684k820J1256o006n043
1182e103J0730n158q927J3284N81j3391O690M911r819N458O178j1584K499R270
$$ plain form
1196 5619 -5105 -6702 7199 486 -8218 2747 1635 -4920 5569 3223 -7569 3685 8153
1209 8153 -5456 -866 8126 -2310 -1358 8016 -988 -2891 7396 -1850 -7081 6863 2913 -7203
1223 -7203 3547 4408 -7403 -695 3694 -5772 440 5998 -6999 -3174 9210 -2997 -8607 3221
1237 3221 -134 -3852 5701 212 -7829 3367 2550 -8638 1458 7266 -6026 -2287 6885 -1596
1251 -1596 -776 5186 -4959 -3209 10789 2575 -5550 4879 2264 -6310 4031 5707 -4751 697
1265 697 2612 -6364 2730 8294 -7972 -7808 6165 1208 -3013 3087 -4322 -6497 6230 2130 -7021
1280 -7021 3389 2562 -9095 819 7737 -3170 -2402 2252 -4559 985 8916 -4446 -7633 6543
1294 6543 3051 -3100 5671 1704 -7046 2137 4007 -2510 4604 3614 -8831 -898 9715 -1962
$$ packed form
1196E619j0724j597J3901o713q704J0965j112o555J0489k346j0792J1254M468
1209H153j3609M590Q992j0436R52R374r004j903J0287r246n231J3944l950j0116
1223g203J0750Q61j1811O708M389r466O212N558j2997L825J2384j2207n610J1828
1237C221l355l718R553n489q041J1196q17j1188J0096N808j3292L739R172q481
1251a596Q20N962j0145J750J3998q214q125J0429k615q574J0341J676j0458N448
1265F97J915q976R094N564j6266J64J3973m957m221O100p409k175J2727m100r151
1280g021J0410q27j1657R914O918j0907P68M654o811N544P931j3362l187J4176
1294F543l492o151Q771l967q750R183J870o517P114r90j2445P933J0613j1677
$$ plain form
1308 -1962 -6458 1046 -2126 -228 7251 -2983 -8344 3421 1208 -5786 4253 5092 -5788 -1073
1322 -1073 4406 -1788 1514 3073 -7029 -1531 10052 -222 -6125 2573 -751 -4295 4022 1344
1336 1344 -4706 2365 941 -5973 3712 6495 -6628 -3495 6120 1101 62 2680 -4735 -1775 7686
1351 7686 -511 -6463 3048 1750 -5901 1103 2839 -4159 141 1500 -4910 1513 5257 -5342 -3045
1366 -3045 7235 1738 -2639 2967 266 -1834 4818 719 -3874 4625 3249 -6137 -314 4080 -3783
1381 -3783 -2688 1874 -1688 112 2447 -5834 -4633 5905 620 -5891 1480 2094 -1943 2028 231
1396 231 -4494 1718 3322 -3101 1483 5474 -3248 -3545 4350 1562 -693 2213 -1494 -624 6734 1399
1412 1399 -5384 1168 3381 -2132 582 2566 -3035 -1745 841 -3324 161 3361 -4906 -5807 3057
$$ packed form
1308a962m496P504l172J898P479j0234n361J1765k213o994J0039Q39j0880M715
1322a073N479o194L302J559j0102N498J1583j0274n903Q698l324l544Q317k678
1336A344o050P071j424o914R685K783j3123L133R615n019j039K618p415K960R461
1351G686q197n952R511j298p651P004J736o998M300J359o410O423L744j0599K297
1366c045J0280n497m377N606k701k100O652m099m593Q499j376r386N823M394p863
1381c783J095M562l562J800K335q281J201J0538n285o511P371O14m037L971j797
1396B31m725O212J604o423M584L991q722k97P895k788k255K906l707Q70P358n335
1412A399o783O552K213n513K714J984n601J290K586m165L485L200q267r01Q864
$$ plain form
1427 3057 2192 -2936 -1018 -1393 -1705 3870 2174 -3872 234 2992 -1958 1524 5197 -1150 -3089 695
1443 695 179 1321 2803 -2946 -3787 3858 3026 -3111 -893 763 -1194 2253 3193 -632 841 1118
1459 1118 -3237 11 5032 145 -3870 -260 471 -531 150 -3500 -4662 963 1546 -2532 -689 383
1475 383 -3071 -1454 2340 1139 676 871 -1115 1034 4714 607 -2422 1553 2499 538 1087 346
1491 346 -1245 505 198 -1513 718 1881 -2100 -2384 1110 996 -289 -316 -1170 -383 1595 -311 -2119
1508 -2119 519 856 -1410 -517 570 -633 -967 -733 -847 666 1450 -857 -1234 1106 399 -810 -39
1525 -39 1081 897 364 -419 -346 895 433 -1536 -827 1333 1204 -7 -786 -519 204 450 428 842 1242
1544 1242 720 -218 359 1144 708 -362 -493 487 689 -492 -1184 -1317 -1533 -979 -924 -981 -369 -1219 -1909 -592
$$ packed form
1427C057q65n128J918l75l12N575j696o046M106K758m950L482L673o347j939L784
1443F95n16J142J482n749q41P645q32o137K218J656j957L447R40l825J473K77
1459A118m355L248N021m887m015L610P31j002O81l650j162N625N83m078J843J072
1475C83l454J617L794j201m63J95j986K149L680m107l029L975R46j961N49p41
1491C46j591J750l07j711K231J163l981k84L494j14j285k7q54P87J978j906j808
1508b119K638L37k266Q93J087j203l34K34j14J513P84k307l77K340p07j209P71
1525c9J120j84n33p83P3J241m62j969P09K160j29j211p79K67P23K46k2M14M00
1544A242n22r38N77P85m36j070j31R80K02j181o92j33k16N54N5n7O12q50o90J317
$$ plain form
1564 -592 1047 572 -442 -18 428 1316 2152 342 -521 1475 1423 411 952 293 -968 -170 651 -100
1582 -100 58 -1 -1829 -1065 1134 6 -882 586 31 -287 1389 346 -1371 163 384 -740 1252
1599 1252 1562 -1783 -1846 132 -834 -375 636 -1637 -1449 1323 -119 -1895 264 -133 -1172 1312 2020
1616 2020 -773 240 787 -1464 622 2684 -391 -593 1872 -206 -754 1941 100 -1628 1426 1162
1632 1162 -1247 1392 859 -2552 259 1998 -1045 -419 690 -2297 -1413 1607 -1191 -2460 1114 -864
1648 -864 -2296 1128 284 -2526 1008 1533 -1392 1280 2364 -1743 -188 2561 -423 463 3099 -514
1664 -514 -1914 1965 -92 -1972 1869 336 -2730 1333 1526 -2572 -227 1331 -2007 564 3372
1679 3372 -1074 -1218 2683 -1107 -1657 2956 -2 -2324 1718 117 -3208 861 462 -3705 -314 1864
$$ packed form
1564e92J639m75j014M24M46Q88Q36j810q63J996n2j012N41o59j261P98Q21p51
1582a00J58n9j828P64K199j128q88J468n55l18J676j043j717J534K21j124J992
1599A252L10l345o3J978r66M59J011k273J88K772j442j776K159l97j039K484P08
1616B020k793J013N47k251K086K062l075k02K465k078n48K695j841j728L054k64
1632A162k409K639n33l411K811J739l043O26J109k987Q84L020k798j269L574j978
1648h64j432L424q44k810L534N25k925K672J084m107J555K749k984Q86K636l613
1664e14j400L879k057j880L841j533l066M063J93m098K345J558l338K571K808
1679C372m446j44L901l790n50M613k958k322M042j601l325M069l99m167L391K178
$$ plain form
1695 1864 -2222 -456 1996 -2869 -1546 3134 -108 -1173 3018 115 -1889 3146 1680 -2118 1825
1710 1825 2188 -2051 1423 2641 -2570 -497 2855 -1520 -732 2955 -1622 -2774 2177 -214 -2339
1725 -2339 2354 320 -3726 1169 1387 -3447 299 1653 -3230 -248 3004 -2295 -2221 1923 -1352 -1433
1741 -1433 3873 101 -2850 2376 1040 -2520 2353 2149 -2650 1501 3069 -2088 -69 2507 -2681
1756 -2681 -1315 3842 -543 -1946 2463 -899 -3265 2631 1116 -2809 1443 1440 -3099 805 2364 -3385
1772 -3385 -1176 2603 -2091 -933 2876 -2393 -3287 2721 -20 -2692 2256 650 -3381 1750 2276
1787 2276 -2603 1292 3036 -2445 462 3988 -1834 -1458 3087 -914 -1531 3393 -556 -3601 1765
1802 1765 372 -3368 1675 1567 -3886 168 2323 -2783 -374 2589 -2323 -628 4144 -824 -2313
$$ packed form
1695A864m086J766K452m865J323M680l242j065M191k903k004N035j466l798L943
1710A825L63m239L474J218n211K073L352m375P88L687m577j152M951k391k125
1725b339M693k034m046M895K18m834L746J354m883K982L252n299P4M144l275q1
1741a433N306l772k951N226j336l560M873k04m799M151J568n157K019K576n188
1756b681J366N157m385j403M409l362k366N896j515l925M252lm539L904J559n749
1772c385K209L779m694J158L809n269q94O008k741k672M948j606m031N131N26
1787B276m879L895J744n481K907L526n822L76M545m001o17M924l949l045N366
1802A765j393l740N043j08n453M054K155n106K409K963m912J695M772m968j489
$$ plain form
1817 -2313 2804 24 -2488 2979 1360 -2754 1869 1367 -3515 907 2654 -2780 -427 2970 -1861
1832 -1861 -1318 2632 -1731 -2392 2993 -318 -2815 2504 558 -3927 1120 1603 -2729 788 2033 -2794
1848 -2794 -149 2922 -2256 -1309 3787 -582 -1841 3308 49 -2001 2549 627 -2549 2733 2142
1863 2142 -3200 20 2218 -2345 -25 2764 -2150 -1381 2609 -1697 -2106 2633 -683 -3055 2249
1878 2249 1114 -2710 794 414 -3425 990 2624 -2909 -629 2388 -2444 -1560 2792 -913 -1765 2467
1894 2467 17 -1380 3066 741 -3219 2122 3177 -1248 1163 2014 -2292 251 2925 -1774 -893
1909 -893 2258 -1707 -2296 2425 -574 -3547 568 -170 -2295 1695 319 -3953 382 2108 -2107 -2
1925 -2 2372 -1505 -941 2279 -646 -1029 2555 -630 -1857 3078 1225 -2606 535 1385 -1161 1572
$$ packed form
1817b313N117k780k512N467j619m114M623n02m882M422J747n434K353L397m831
1832a861N43L950m363o61N385l311k497N319j946m485N047M83m332L517J245m827
1848b794K645L071n178R47N096m369j259N149l259k050M550j922l176N282n91
1863B142n342L220K198m563K320K789m914P69L990m306m09M739l316k372N304
1878B249j135l824L504l80l839M415J634n533K280L017m832Q84M352l705q52M232
1894B467k450j397M446k325l960N341J055m425K411Q51m306K543K674m699Q81
1909h93L151l965n89M721k999k973M115p38k125L990j376m272M335J726m215K105
1925bK374l877N64L220k925l83L584l185j227M935j853l831L141Q50k546K733
$$ plain form
1941 1572 2062 -2009 108 2056 -1784 -746 2956 -840 -1772 1835 -158 -1833 761 -822 -2403
1956 -2403 1789 1120 -2989 -481 1214 -2145 -674 1704 -1020 -84 2120 -1289 -1209 2449 -225 -1908
1972 -1908 2035 1454 -1341 650 570 -1549 1178 1472 -1982 292 2490 -1226 -1077 1807 -339 -757
1988 -757 1535 -116 -1224 1506 -332 -2399 1022 1023 -2456 -633 863 -1428 -652 121 -2084 -433
2004 -433 1907 -892 -1570 1538 200 -1357 1464 1385 -488 1373 600 -1170 1297 1739 -1691 -363
2020 -363 1990 104 -628 621 -1066 -1089 1124 -275 -1131 1091 -355 -2259 423 942 -1189 -479 267
2037 267 -780 763 838 -1855 -1190 1532 96 -770 927 -178 -1008 570 45 -551 993 171 -1384
2054 -1384 780 1878 -712 -683 603 -94 592 951 -604 -690 824 -51 -698 1077 399 -1305 -228
$$ packed form
1941A572M90m071K117J948l840J038L702l796r32L607j993j675K594j583j581
1956b403M192o69m109K508J695l359J471K378k724R36K204l409Q0L658k674j683
1972a908L943n81k795J991q0k119K727K94l454K274K198l716J49K884k146m18
1988g57K292j651j108K730j838k067L421Jl479J823J496k291P76P73k205J651
2004d33K340k799o78L108j338j557K821p9j873J861p73j770K467M42l430J328
2020c63K353j886p32J249j687k3K213j399q56K222j446j904K682N19k131P10P46
2037B67j047J543P5k693O65K722j436q66J697j105q30J578n25n96J544q22j555
2054a384K164J098k590K9J286o97O86L59j555q6J514q75o47J775o78j704J077
$$ plain form
2071 -228 479 -308 39 -277 -1273 464 1342 -499 -954 309 -272 -251 728 163 -385 -108 -349 -670 625
2090 625 466 -883 -250 864 294 -249 -80 -314 385 985 123 -146 574 -54 -703 288 606 -83 -72 -342
2110 -342 -313 138 -221 -1165 -455 554 397 -272 -60 -81 -1 210 -33 311 670 262 -3 168 369 71 -190
2131 -190 -22 318 117 -374 -596 -382 -42 -256 -425 -55 135 -250 -539 -262 177 -52 -78 266 96 265
2151 265 -53 -267 268 609 468 -164 97 459 -5 -56 151 -147 374 605 -352 -227 -59 -439 -405 355 256
2172 256 -502 -292 -278 -666 -57 -142 -940 1 520 -326 -369 46 -431 -199 635 121 59 602 38 -498 783
2193 783 756 -353 469 701 -249 319 511 -672 -67 899 193 -100 771 -383 -815 681 267 -425 603
2212 603 -77 -1059 333 290 -1048 -343 365 -693 -258 485 -1013 -957 291 -517 -611 981 -62 -1056 662
$$ packed form
2071b28P07p87L47l16r96J737Q78j841m55J263n81K1R79n65n48K77k41l21J295
2090F25j59j349O33J114n70n43J69k34O99O00q62k69P20o28o49R91L18o89J1k70
2110c42K9M51l59r44P10J009j57o69K12k1Q0K11k43L44L59m08k65J71K01k98k61
2131a90J68L40k01m91k22K14L40k14j69L70J90l85k89K77M39k29k6L44j70J69
2151B65l18k14N35L41j41o32K61L62m64n1K07k98N21K31r57J25J68l80L4P60r9
2172B56p58K10J4l88O09q5p98R41N19q46m3M15m77K32Q34n14o2N43n64n36J281
2193G83k7j109Q22K32r50N68J92j183O05R66p06k93Q71j154m32J496m14o92J028
2212F03o80r82J392m3j338P05P08j058M35P43j498N6J248q08r4J592j043r94J718
$$ plain form
2231 662 352 -651 695 1078 -371 602 1362 -491 9 1098 -325 18 1421 -53 -730 752 -324
2248 -324 -1299 435 210 -1299 142 279 -1371 -155 573 -1338 -497 990 -556 -551 1029 -625 -1107
2265 -1107 1130 201 -779 1015 493 -1223 683 970 -1018 259 1063 -830 148 1279 -660 -735 1371
2282 1371 -363 -627 1478 12 -1483 734 367 -1245 565 740 -1393 -40 671 -1417 -440 943
2298 943 -921 -663 1296 -352 -1184 1084 -69 -1016 1272 525 -1252 647 938 -1030 281 1211 -1069
$$ packed form
2231F62l10j003J346L83j449R73P60j853N00J089j423L43J403j474o77J482j076
2248c24r75J734k25j509J441J37j650J216P28j911Q41J487j546NJ580j654m82
2265a107K237r29r80J794n22j716J906K87j988J277Q04j893R78J131j939p5K106
2282A371j734k64K105j466j495K217l67j612J810J75k133J353P11k088R77J383
2298I43j864K58J959j648q32K268j153r47K288p47j777J899K91j968J311R30k280
$$ [...]
8191c0
##END NTUPLES=NMR FID
##END=
