##TITLE=1H_Pr 5-Me-2
 DMSO+CDCl3
 8 sc, 
 14.3.2024
##JCAMPDX= 6.0         $$ Bruker NMR JCAMP-DX V2.0
##DATA TYPE= NMR FID
##DATA CLASS= NTUPLES
##ORIGIN= UXNMR, Bruker Analytische Messtechnik GmbH
##OWNER= root
$$ XWIN-NMR		Version 3.5
$$ Thu Mar 14 13:56:41 2024 Russian Standard Time (UT+4h)  she@DPX200
##.OBSERVE FREQUENCY= 200.1313
##.OBSERVE NUCLEUS= ^1H
##.DELAY= (6, 6)
##.ACQUISITION MODE= SIMULTANEOUS
##.ACQUISITION SCHEME= undefined
##.AVERAGES= 8
##.DIGITISER RES= 18
##SPECTROMETER/DATA SYSTEM= spect
##.PULSE SEQUENCE= zg30
##.SOLVENT NAME= CDCl3
##.SHIFT REFERENCE= (INTERNAL, CDCl3, 0, 15.7039)
##AUDIT TRAIL= $$ (NUMBER, WHEN, WHO, WHERE, WHAT)
$$ ##TITLE= Audit trail, XWIN-NMR		Version 3.5
$$ ##JCAMPDX= 5.01
$$ ##ORIGIN= Bruker BioSpin GmbH
$$ ##OWNER= she
$$ F:/spectra/data/she/nmr/H-F/1/audita.txt
$$ ##AUDIT TRAIL=  $$ (NUMBER, WHEN, WHO, WHERE, WHAT)
(   1,<2024-03-14 13:55:12.15 +0400>,<she>,<DPX200>,
      <created by zg, POWCHK disabled, PULCHK disabled
       configuration hash MD5:
       00 E9 B6 7A A2 85 ED C7 34 08 36 98 17 FE 4E 26
       data hash MD5: 16K
       76 77 93 6E FD F7 EC 8B D6 43 CA 47 3F 16 47 48>)
$$ ##END=
$$ 
$$ hash MD5
$$ 0F BC F8 D7 DE C4 50 4D 20 42 6A 3C E0 BE F9 1B
##$RELAX= 
##$RELAX= 
##$RELAX= 
##$RELAX= 
##$RELAX= 
##$RELAX= 
$$ Bruker specific parameters
$$ --------------------------
##$DU= <F:/spectra>
##$EXPNO= 1
##$NAME= <H-F>
##$PROCNO= 1
##$TYPE= <nmr>
##$USER= <she>
##$AMP= (0..31)
100 100 100 100 100 100 100 100 100 100 100 100 100 100 100 100 100 100 
100 100 100 100 100 100 100 100 100 100 100 100 100 100 
##$AQSEQ= 0
##$AQ_mod= 1
##$AUNM= <au_zg>
##$AUTOPOS= <>
##$BF1= 200.13
##$BF2= 200.13
##$BF3= 200.13
##$BF4= 200.13
##$BF5= 200.13
##$BF6= 200.13
##$BF7= 200.13
##$BF8= 200.13
##$BYTORDA= 1
##$CFDGTYP= 0
##$CFRGTYP= 5
##$CHEMSTR= <none>
##$CNST= (0..31)
1 1 145 1 1 1 1 1 1 1 1 1 1 1 1 1 1 1 1 1 1 1 1 1 1 1 1 1 1 1 1 1 
##$CPDPRG= <>
##$CPDPRG1= <>
##$CPDPRG2= <>
##$CPDPRG3= <>
##$CPDPRG4= <mlev>
##$CPDPRG5= <mlev>
##$CPDPRG6= <mlev>
##$CPDPRG7= <mlev>
##$CPDPRG8= <mlev>
##$CPDPRGB= <>
##$CPDPRGT= <>
##$D= (0..31)
0 1.2 0 0 0 0 0 0 0 0.06 0 0.03 0 0 0 0 0.0002 0 0 0 0 0 0 0 0 0 0 0 0 
0 0 0 
##$DATE= 1710410111
##$DBL= (0..7)
120 120 120 120 120 120 120 120 
##$DBP= (0..7)
150 150 150 150 150 150 150 150 
##$DBP07= 0
##$DBPNAM0= <>
##$DBPNAM1= <>
##$DBPNAM2= <>
##$DBPNAM3= <>
##$DBPNAM4= <>
##$DBPNAM5= <>
##$DBPNAM6= <>
##$DBPNAM7= <>
##$DBPOAL= (0..7)
0.5 0.5 0.5 0.5 0.5 0.5 0.5 0.5 
##$DBPOFFS= (0..7)
0 0 0 0 0 0 0 0 
##$DE= 6
##$DECBNUC= <off>
##$DECIM= 32
##$DECNUC= <off>
##$DECSTAT= 4
##$DIGMOD= 1
##$DIGTYP= 9
##$DL= (0..7)
0 120 120 120 120 120 120 120 
##$DP= (0..7)
150 150 150 150 150 150 150 150 
##$DP07= 0
##$DPNAME0= <>
##$DPNAME1= <>
##$DPNAME2= <>
##$DPNAME3= <>
##$DPNAME4= <>
##$DPNAME5= <>
##$DPNAME6= <>
##$DPNAME7= <>
##$DPOAL= (0..7)
0.5 0.5 0.5 0.5 0.5 0.5 0.5 0.5 
##$DPOFFS= (0..7)
0 0 0 0 0 0 0 0 
##$DQDMODE= 0
##$DR= 18
##$DS= 0
##$DSLIST= <SSSSSSSSSSSSSSS>
$$ [...]
##$SUBNAM2= <"">
##$SUBNAM3= <"">
##$SUBNAM4= <"">
##$SUBNAM5= <"">
##$SUBNAM6= <"">
##$SUBNAM7= <"">
##$SUBNAM8= <"">
##$SUBNAM9= <"">
##$SW= 18.0517328524113
##$SWIBOX= (0..15)
0 0 2 0 0 0 0 0 0 0 0 0 0 0 0 0 
##$SW_h= 3612.71676300578
##$TD= 16384
##$TD0= 1
##$TE= 0
##$TE2= 300
##$TE3= 300
##$TEG= 300
##$TL= (0..7)
0 120 120 120 120 120 120 120 
##$TP= (0..7)
150 150 150 150 150 150 150 150 
##$TP07= 0
##$TPNAME0= <>
##$TPNAME1= <>
##$TPNAME2= <>
##$TPNAME3= <>
##$TPNAME4= <>
##$TPNAME5= <>
##$TPNAME6= <>
##$TPNAME7= <>
##$TPOAL= (0..7)
0.5 0.5 0.5 0.5 0.5 0.5 0.5 0.5 
##$TPOFFS= (0..7)
0 0 0 0 0 0 0 0 
##$TUNHIN= 0
##$TUNHOUT= 0
##$TUNXOUT= 0
##$USERA1= <user>
##$USERA2= <user>
##$USERA3= <user>
##$USERA4= <user>
##$USERA5= <user>
##$V9= 5
##$VALIST= <valist>
##$VCLIST= <CCCCCCCCCCCCCCC>
##$VD= 0
##$VDLIST= <DDDDDDDDDDDDDDD>
##$VPLIST= <PPPPPPPPPPPPPPP>
##$VTLIST= <TTTTTTTTTTTTTTT>
##$WBST= 1024
##$WBSW= 4
##$XGAIN= (0..3)
0 0 0 0 
##$XL= 0
##$YL= 0
##$YMAX_a= 258684
##$YMIN_a= -162683
##$ZGOPTNS= <>
##$ZL1= 120
##$ZL2= 120
##$ZL3= 120
##$ZL4= 120
##$ABSF1= 10
##$ABSF2= 0
##$ABSG= 5
##$ABSL= 3
##$ALPHA= 0
##$AQORDER= 0
##$ASSFAC= 0
##$ASSFACI= 0
##$ASSFACX= 0
##$ASSWID= 0
##$AUNMP= <proc_1d>
##$AZFE= 0.1
##$AZFW= 0.1
##$BCFW= 1
##$BC_mod= 2
##$BYTORDP= 1
##$COROFFS= 0
##$CY= 11.3945322036743
##$DATMOD= 1
##$DC= 2
##$DFILT= <>
##$DTYPP= 0
##$F1P= 15.7292609196834
##$F2P= 12.9074282941183
##$FCOR= 0.5
##$FTSIZE= 0
##$FT_mod= 4
##$GAMMA= 1
##$GB= 0.15
##$INTBC= 1
##$INTSCL= 1
##$ISEN= 128
##$LB= 0.24
##$LEV0= 0
##$LPBIN= 0
##$MAXI= 10000
##$MC2= 0
##$MEAN= 0
##$ME_mod= 0
##$MI= 1.114404
##$NCOEF= 0
##$NC_proc= 0
##$NLEV= 6
##$NOISF1= 3.799351
##$NOISF2= 2.8
##$NSP= 1
##$NTH_PI= 0
##$NZP= 0
##$OFFSET= 15.70392
##$PC= 1
##$PHC0= -25460.9
##$PHC1= 11.38731
##$PH_mod= 1
##$PKNL= yes
##$PPARMOD= 0
##$PSCAL= 0
##$PSIGN= 0
##$REVERSE= no
##$SF= 200.130013532006
##$SI= 16384
##$SIGF1= 3
##$SIGF2= 2
##$SINO= 400
##$SIOLD= 16384
##$SREGLST= <1H.CDCl3>
##$SSB= 0
##$STSI= 0
##$STSR= 0
##$SW_p= 3612.71676300578
##$SYMM= 0
##$S_DEV= 0
##$TDeff= 0
##$TDoff= 0
##$TI= <>
##$TILT= no
##$TM1= 0
##$TM2= 0
##$TOPLEV= 0
##$USERP1= <user>
##$USERP2= <user>
##$USERP3= <user>
##$USERP4= <user>
##$USERP5= <user>
##$WDW= 1
##$XDIM= 8192
##$YMAX_p= 0
##$YMIN_p= 0
$$ End of Bruker specific parameters
$$ ---------------------------------
##NTUPLES= NMR FID
##VAR_NAME=  TIME,          FID/REAL,        FID/IMAG
##SYMBOL=    X,             R,               I
##VAR_TYPE=  INDEPENDENT,   DEPENDENT,       DEPENDENT
##VAR_FORM=  AFFN,          ASDF,            ASDF
##VAR_DIM=   8192,          8192,            8192
##UNITS=     SECONDS,       ARBITRARY UNITS, ARBITRARY UNITS
##FACTOR=    0.0002768,     1,               1
##FIRST=     0,             0,               0
##LAST=      2.2672688,     0,               0
##MIN=       0,             -162683,         0
##MAX=       2.2672688,     258684,          0
$$ Real data points
##PAGE= N=1
##DATA TABLE= (X++(R..R)), XYDATA
0@%%%%%%%%%%%%%%%%Oj4J6j6J6j6K4l2L2m0M8n4O2p2Q4r3J05j20J37j56J75j96
38a04K20k48K78l07L40l80M21m63N12n66O23o85P56q34R18j012J117j234J369
57G21j521J693j892K127k412K762l201L777m565N715p585J1276l2479J08328M6835
72A29579j18451r8978p4833L7283J12068O4586l5216k4176J1838l565J6807Q3431
84A00373J5175o1779k5938k1440m6814L105Q908k5124R542N5919J3756l1258N139
97d36K0604l7827k5832K1297Q041K7943L7264n1837o3133M3699Q3944K3658l1742
110E5643n4340o0085j0333O4852L6283k4158L472r98m1853N308L6042j0357j4333
123a4857J6176Q408o495N283j628k4244K0914N6310k4763p1118j8266K826J6580
$$ plain form
0 0 0 0 0 0 0 0 0 0 0 0 0 0 0 0 0 0 6 -8 8 -8 8 -8 16 -16 16 -24 24 -30 32 -40 44 -49 56 -64 73 -83 92 -104
38 -104 116 -132 146 -161 179 -201 220 -243 269 -297 326 -359 397 -437 481 -531 586 -648 721
57 721 -800 893 -999 1128 -1284 1478 -1723 2054 -2511 3204 -4381 6895 -25584 82744 129579
72 129579 11128 -87850 -162683 -125400 -13332 51254 16038 -8138 3700 135 16942 100373
84 100373 115548 53769 27831 6391 -40423 -37318 -28410 -53534 -43992 11927 25683 -5575 -436
97 -436 20168 -17659 -43491 -22194 -14153 13790 51054 -783 -63916 -20217 63727 87385 55643
110 55643 1303 -58782 -69115 -4263 32020 7862 11334 10336 -31517 -26209 9833 -524 -14857
123 -14857 1319 9727 3232 8515 6887 -17357 3557 59867 35104 -36014 -54280 -51454 -34874
136c4874M8206J2985k5110R047L0444r775k9930Q634J4531j7114l439o862m0060
149d3317P98L6357k222m506J7758q586k3613R495K7880L600J839K3201n47j3658
163B4479O085k9501m6263K2767M1721r122k9649k3647q154L0881N5122J2697m4065
176C351k1751J3706n048N376K4516j0447j0540K0285M68j7861p25M53j3361j4
190a1592K0368q242l1828O092J9511K657J7571K350k9965l32K3540l822j3073
203f765J1905K2163L811o756j4078l2878n625L3582k5k7332m192k609J128K8253
217E82K2451n067q016N098j105j0759N278K64k0451Q777K3967j3251j9742n701
231a7675o291J1187K2720l647k5695m180K7240J5276k533L483j0225j2223J3296
$$ plain form
136 -34874 13332 26317 1207 10254 40698 30923 993 9627 24158 7044 3605 -3257 -43317
149 -43317 -42519 -6162 -8384 -12890 4868 -3718 -27331 -17836 10044 13644 15483 38684 38137 24479
163 24479 30564 1063 -45200 -22433 19288 10166 -19483 -43130 -51284 -20403 34719 47416 3351
176 3351 -18400 -4694 -9742 -4366 20150 9703 -837 19448 19916 2055 1330 1783 -11578 -11592
190 -11592 8776 534 -31294 -25202 -5691 -3034 14537 16887 -13078 -13410 10130 6308 -6765
203 -6765 5140 27303 31114 24358 10280 -22598 -28223 5359 5334 -21998 -26190 -28799 -27671 582
217 582 23033 17966 9950 15048 13943 3184 8462 8726 -11725 -2948 21019 7768 -11974 -17675
231 -17675 -23966 -12779 9941 6294 -19401 -23581 3659 18935 16402 19885 9660 -2563 10733
244A0733l404k5694j228J2835M484O533O072o446j3440M091J2795n410k536M351
258C736j4156j331K0111K33p317O609L408o615j0705r000m425R440K5703L231
272A8922k6030n976J0766O209J1432l095k2365o112J3255J1033O02k747j196o147
286a449J443J0464j1400j8194J601L344P966J6386j413j1417J421J0817N582p186
300G965o324j875l892N714K662j2134L069J3344k941q364r027p549N929J3073
314c50Q321m063p625O652P815K193L329j1497j6096M163P795J013j909p709q79
329h847R419Q957l38j5242j0179P654P044N955K805q316K38R552J336k760o153
344A125n702J781k39j153j579l065Q595R842k073m737q409m670R427O176k354
$$ plain form
244 10733 7329 -18365 -19593 -6758 -2274 4259 10331 3885 -9555 -5464 7331 1921 -615 3736
258 3736 -10420 -11751 8360 8593 1276 7885 11293 4678 -6027 -15027 -19452 -10012 15691 18922
272 18922 -7108 -13084 -2318 3891 15323 12228 -10137 -16249 -2994 8039 8641 5894 4698 -1449
286 -1449 -6 10458 -942 -19136 -17535 -14191 -6225 10161 8748 -2669 -1248 9569 15151 7965
300 7965 1641 -234 -4126 1588 4250 -7884 -4815 8529 5588 -2776 -11803 -19352 -13423 -350
314 -350 7971 3908 -3717 2935 10750 12943 16272 4775 -11321 -7158 637 1650 -259 -7968 -8847
329 -8847 572 9529 9191 -6051 -16230 -8576 -1532 4423 7228 -1088 -850 8702 10038 7278 1125
344 1125 -4577 -2796 -3035 -4188 -5767 -8832 -237 9605 7532 2795 -5614 -10284 -857 5319 2965
359B965m940n228P484J1368R2n586j0533o032O990L231k156k436l713O970R599
374H075k22k054o035m733N265Q26m029j21Q18N796M813m537m992m276K043Q058
390D695m551q937l14K277J0551J1057n068r244l928J872N814j302n049n112l864
405a1103R613Q844n020k093p69l492M903K170n702j426M825P220L21n046k33k867
421A45j290M784r160j1544O161P336M630M957l609n518K570R076L834r447o417
436c492M27j496Q873Q196j1460o843L749m44M5N18m157l955M027R950P5n265O311
453E059J779n302L927l585j0508N492Q678j904l137j95L4J11N421Q95j5252o307
469a4794J0314J571J611O542p517m984J1361O339n444n648n43k043j86R996M09
$$ plain form
359 2965 -1975 -7203 281 11649 11741 6155 -4378 -10410 -3420 -189 -2345 -4781 -8494 -1524 8075
374 8075 7853 5799 -236 -4969 296 1122 -2907 -3028 -2210 3586 8399 3862 -1130 -5406 -3363 4695
390 4695 144 -8793 -9107 -6830 3721 14778 9710 466 -3462 -1590 4224 2922 -2127 -7239 -11103
405 -11103 -1490 7354 2334 241 -528 -4020 883 3053 -2649 -4075 750 7970 8291 3245 3012 145
421 145 -1145 3639 -5521 -17065 -10904 -3568 1062 6019 2410 -3108 -538 8538 12372 2925 -3492
436 -3492 -3065 -4561 4312 12508 1048 -5795 -2046 -2490 -2445 -1927 -6084 -10039 -6012 3938 4013 -1252 5059
453 5059 6838 1536 5463 1878 -8630 -3138 5540 3636 499 304 338 449 5870 6765 -8487 -14794
469 -14794 -4480 -2909 -1298 5244 -2273 -7257 4104 10443 4999 -649 -1192 -3235 -3421 6575 6984
484F984j1201M838O161q120L09J792q914M74R659M47o547J696P525j732j098L534
500E807j1628p251J3734K796p699L798K051k166O790O415p245r774M026L550p072
515c868L365M114j1130J812J1320o603o127M749j676k830O251M074p081K78J5136
530A1784Q95j0001K375l720p773J1037M028j4778l413Q578K280p42L685l843j2646
545a2254L565J1578o701j778R207n951j690J4635J445r600Q4J890n456j340O977
560D611m079q022J0182K050j4374L479Q996o035K04K992q579o85J6100Q462j0338
575D964n328L972o102O33J2217r001j3703P501L120k832R867M430j1757n136R827
590B672K044p489L755J058r619P994J0176j2901l886J0741l631p210L628N61l715
$$ plain form
484 6984 -4217 621 6782 -1338 -1029 763 -8151 -7677 1982 2429 -4118 -2422 5103 3371 2273 5807
500 5807 -5821 -13072 662 3458 -4241 -443 1608 -558 6232 12647 5402 -4372 -346 3204 -3868
515 -3868 -503 3611 -7519 -5707 5613 -990 -7117 -2368 -4044 -6874 -623 3451 -3630 -3352 11784
530 11784 12679 2678 5053 1333 -6440 4597 8625 -6153 -9566 -988 1292 550 4235 392 -12254
545 -12254 -8689 2889 -3812 -5590 3617 -2334 -4024 10611 12056 2456 2540 4430 -1026 -2366 4611
560 4611 532 -7490 2692 4742 -9632 -6153 2843 -3192 -2988 4 -8575 -9260 6840 15302 4964
575 4964 -364 3608 -2494 -1861 10356 1355 -12348 -4847 -1727 -4559 5308 9738 -2019 -7155 2672
590 2672 4716 -2773 982 2040 -7579 415 10591 -2310 -6196 4545 914 -6296 -2668 -2107 -5822
605e822P076Q640r314n910J2974l30r907O076j763j1885O563Q873n473j361N282
620C719m711p021Q813O320j2773k049R880m596J118J0756o913o798J1407J996
634I148j2437k708P370j309k952O333n040r400J3015P515j3246m89N040p412J549
649e023J2276j80q040K033L283o284M481R420j4186j1620J1357K540m233P508
663C332n36q505M473O662p017m511J0794J978j1939K894O721n269O012O429j4316
678b798o529R758N2n497M022K920p749L17J1724k119n722O400n339q666J3176
693C950O772j2300l689O240N59M92M141o308j1714O854J0254r086j572J0295m615
708B73k916R063j907n954N081J006r152r23R340k551p504Q028J869r329M132L092
$$ plain form
605 -5822 1254 9894 580 -5330 7644 7314 -2593 3483 1720 -10165 -3602 5271 -202 -1563 3719
620 3719 -992 -8013 800 7120 -5653 -7702 2178 -2418 -1300 9456 2543 -4255 7152 9148
634 9148 -3289 -5997 1373 64 -2888 3445 -1595 -10995 2020 9535 -3711 -4200 840 -6572 -5023
649 -5023 7253 7073 -967 1066 4349 -1935 2546 11966 -2220 -13840 -2483 57 -4176 3332
663 3332 2796 -5709 -1236 5426 -1591 -6102 4692 6670 -5269 -2375 4346 -923 5089 11518 -2798
678 -2798 -9327 431 483 -5014 -992 1928 -5821 -5504 6220 4101 -1621 4779 -560 -9226 3950
693 3950 10722 -1578 -5267 973 1532 2024 6165 -143 -11857 -5003 5251 -3835 -5407 4888 273
708 273 -2643 6420 4513 -1441 3640 4646 -4506 -5429 3911 1360 -6144 1884 3753 -5576 -1444 1648
724A648p725M284P361p377l824R886N180p361k377L345n129J139P288j0225p623
739a1510J2408L467o920J783J472m642J658O615k808o407N734K363o669P786P610
754A1940j1618n189N474j581L4L961n249q097N756J0228l805m767O585k311n827
769d466O572L31n002O711K126r394j424P800J057n692j88m40o399M809Q754n404
785b49r80O221n274l206Q573J975o957m004Q89K5L187P004n525j0362O886N972
801D175n593J182J267n416J706N653j294k453L904J826o808j085O496l726l025
816c191N684k897l229N750l12m646K745L011m573m604M566L701k943K604J177
831B843n495N161N707p573m173L554M6j382R03l43k664J456N574l117m211N017
$$ plain form
724 1648 -6077 -1793 5568 -1809 -5633 4253 9433 2072 -305 3040 -2089 -950 6338 -3887 -11510
739 -11510 898 4365 -2555 -772 700 -3942 -2284 4331 1523 -4884 850 3213 -3456 4330 11940
754 11940 322 -4867 607 -974 -940 3021 -2228 -10325 -4569 5659 1854 -2913 3672 1361 -4466
769 -4466 2106 2437 -2565 4146 6272 -3122 -4546 3254 4311 -1381 -1569 -2009 -8408 -3599 5155 -249
785 -249 -1229 4992 -282 -3488 5085 7060 103 -3901 -3012 -2987 200 7204 1679 -8683 -1797 4175
801 4175 -1418 -236 1031 -4385 -2679 2974 1680 -773 3131 4957 -1851 -2936 3560 -166 -3191
816 -3191 2493 -404 -3633 2117 1805 -2841 -96 2915 -1658 -6262 -1696 2005 -938 1666 2843
831 2843 -2652 2509 8216 643 -3530 24 70 -1312 -409 -752 -3416 -1960 3614 497 -3714 1303
847A303q52m085N519J808l843R04J389j302J46J153k509n777K687N937l714j299
863b535L361k037J955M629l854l797K403J661j614j765J994n2j908L446m8m591
879b752K744R88m312J997K512j578k71J364J251j218n71J317k610j76L628l379
895a066k505M738J417q81l01l061j004K110K164r11m133Q75L285m40K444R92m656
912i33k04J559j142J196J00j756p93M12K935N53k335R70j046j181K971p00j365
929g59K615o0j339n92q45J530J23j562q38k114J028M520j13n45J20j972J276J631
947B104r47k24k189j036K059L79J242J96k725N62R15o17Q12j428n57K327n85j78
965A10M79j661J321Q36k460k82j65R81K523l06l00k70j104K402M50k598j08j524
$$ plain form
847 1303 451 -3634 1885 3693 -150 754 2143 841 987 2140 -369 -6146 -3459 2478 -1236 -2535
863 -2535 826 -1211 744 5373 1519 -2278 125 1786 172 -1593 401 349 -1559 1887 1839 -2752
879 -2752 -8 980 -3332 -1335 1177 -401 -672 692 1943 725 154 1471 -1139 -1315 2313 -1066
895 -1066 -3571 1167 2584 1703 1402 -1659 -2663 -553 1611 700 -3433 -2558 727 287 2731 3723 -933
912 -933 -1137 422 -720 476 576 -1180 -1973 -1561 1374 1927 -408 562 -484 -1665 1306 606 -759
929 -759 1856 1796 457 -135 -980 550 673 -889 -1727 -3841 -2813 1707 1594 1049 1169 -803 473 2104
947 2104 1157 933 -1256 -2292 -233 146 1388 1584 -1141 -579 336 -281 531 -897 -1454 873 288 110
965 110 589 -1072 249 1085 -1375 -1657 -1822 -841 1682 1376 1076 806 -298 2104 2554 -44 -152 -1676
983a676j352K932O56q57j8p08Q89M37j14P84k234l15K957j588k26K386j594l23
1001C6J267j634r15N16J310M41j704R23N46j756K789M43m659J21J344j059J522
1018d69J134j243o48J384K725j306j686J890k366j191M008j184k664K384l11j479
1034a022Q85K79j169j183K068J285l200J482K966k743J072K369m502o92L076n74
1050C97j113M87O82j230L18L648j621l733L173n22l431L289P79l444J657K121
1066A457j346j036J538O61k930J174K506m112J53N375k430j989K614k183j905
1081b453L111J420l056j645K985K01j836L983l03n817K475K672l751J093K855
1096A934k932r57L228J053k675O11K732m038j262M676k809k732N167q04m247K399
$$ plain form
983 -1676 -3028 -96 560 -297 -315 -1023 -134 303 189 973 -1261 -1576 1381 -207 -433 1953 359 36
1001 36 1303 -331 -1246 -730 580 1021 -683 240 786 -970 1819 2262 -2397 -2276 -932 -1991 -469
1018 -469 665 -578 -1226 158 2883 1577 -109 1781 -585 -1776 2232 1048 -1616 768 457 -1022
1034 -1022 -137 142 -1027 -2210 -142 1143 -2057 -575 2391 -352 720 3089 -1413 -2105 971 397
1050 397 -716 -229 453 -777 -459 3189 1568 -2165 1008 486 -2945 344 1123 -2321 -664 1457
1066 1457 111 -925 613 1274 -1656 -482 2024 -2088 -1935 3440 1010 -979 1635 -548 -2453
1081 -2453 658 2078 -978 -2623 362 563 -1273 2710 2407 -3410 -935 1737 -2014 -921 1934
1096 1934 -998 -1955 1273 2326 -349 262 2994 -1044 -2306 2370 -439 -3171 1996 1192 -3055 -656
1112f56J827k115K52K420j926l275M318L121m596J453K449n464O22M715l220k852
1128b927K358J72k043K216L489l247k366M865j528m016M769J02m942L009K268
1143B179l631J78L685j185l470K236J610m238K292M954n337j860M889k446j916
1158b060M191j165m802J225M077j535j450M343j468m543N114J814o031K191K679
1173B580m675J15M068j448k772K794J638m600L87M787m143j641N928k533l820
1188c335M888J005m176J257J899l110j044N026m47n317L705L066n175J880L653
1203C775n804r54M877j555k824K738J443l869N55N012l202l187N207j330m507
1218c625N062J039n126K155L779l262k231L366j62l637L316K568o297Q91O024
$$ plain form
1112 -656 1171 -944 -692 1728 -198 -3473 845 3966 -630 823 3272 -2192 -1570 3145 -75 -2927
1128 -2927 -569 -397 -2440 -224 3265 18 -2348 2517 989 -3027 1742 1844 -3098 -89 2179
1143 2179 -1452 -1274 2411 1226 -2244 -8 1602 -2636 -344 4610 -727 -2587 2302 -144 -2060
1158 -2060 2131 966 -3836 -2611 1466 -69 -1519 2824 1356 -3187 1927 3741 -2290 -99 2580
1173 2580 -2095 -1980 2088 640 -2132 662 2300 -2300 -1913 2874 -1269 -2910 3018 485 -3335
1188 -3335 1553 2558 -1618 -361 1538 -1572 -2616 2410 1963 -3354 351 3417 -1758 122 3775
1203 3775 -2029 -2983 1894 339 -2485 253 1696 -2173 -1618 3394 192 -2995 2212 882 -3625
1218 -3625 1437 2476 -2650 -495 3284 22 -2209 1157 995 -2642 674 3242 -3055 -2164 3860
1233C860l964j845M672k516l759L475J503l452P25L946k559l304N595J49n160
1248b634L811J625n740J569L844l010o77L803j096m906K118M307l855q20M031
1263B370m554j658P077q76m781K844R22l339R38L918k203l353M051N51m580L961
1279A288K847o580Q5M463k995j240L482r00l300K677L193l834q55N065l059m035
1295c698N011K30l617L513N37m860J118M558j644l474K272J130l848K875M001
1310D104m994l34M332l777j827M645p27m186J011K697j933n23L718k140l374N323
1326B015Q17n582K592K917l455N67K509k328j928K821P26m478R90M003l926j406
1342c146N017j665j918M190j096l424K391K319k854j312L050n26l786L148J789
$$ plain form
1233 3860 -104 -1949 2723 207 -3552 -77 1426 -2026 -1301 2645 86 -3218 2377 2526 -2634
1248 -2634 1177 2802 -2938 -1369 2475 -535 -1212 2591 1495 -3411 -1293 3014 -841 -1661 2370
1263 2370 -2184 -3842 3235 2359 -2422 422 1344 -1995 -1057 2861 658 -2695 1356 1907 -2673 1288
1279 1288 4135 -2445 -2360 2103 -892 -2132 1350 450 -2850 -173 3020 -814 -1669 3396 337 -3698
1295 -3698 1313 1543 -2074 1439 1976 -2884 -1766 2792 1148 -2326 -54 1076 -2772 103 4104
1310 4104 -890 -1224 3108 -669 -2496 2149 1422 -2764 -1753 944 -989 -1512 2206 66 -3308 2015
1326 2015 2832 -2750 -158 2759 -696 -129 2380 52 -1876 945 1671 -2807 -1817 2186 -1740 -3146
1342 -3146 1871 206 -1712 2478 1382 -2042 349 2668 -186 -1498 1552 1026 -2760 388 2177
1357B177m146J960J817m666N55M778j227k797J248J157j499J221K444l716k280
1372b974M575r68k936L825J86l751J381K071j461k52J451j455k954L266L049m087
1388a034j49K992k847J13L306k022j881K272j5k586Q32L203j353l005K386k76
1404f4j966L789L05m374J503K578j540j26J614q22k537P06J657k039M16K395l444
1421a949j033M839l2k132J018l06r64J335J286j618k044K209L78k983J778J559
1437A341l092M66J507j721R16K189q55j790J104J899j313j192J970j316j386K342
1453A069q13j825K448k13k119L43J434m5j250K41O75j161J840J727l110K82K554
1470B077j195o00R16j141q30O12L74p17o00J203q97j542K543P59j848Q17K38l29
$$ plain form
1357 2177 -1969 -9 1808 -2858 -2303 2475 1248 -1549 -301 856 -643 578 3022 -694 -2974
1372 -2974 1601 633 -2303 1522 1708 -2043 -662 1409 -52 -304 1147 -308 -3262 4 3053 -1034
1388 -1034 -1183 1809 -1038 -925 2381 359 -1522 750 735 -1851 -1019 2184 831 -2174 212 -64
1404 -64 -2030 1759 2064 -2310 -807 1771 231 105 1719 897 -1640 -934 723 -1316 -900 1495 -1949
1421 -1949 -2982 1857 1825 -307 711 405 -559 776 2062 444 -1600 609 987 -1996 -218 1341
1437 1341 -1751 -1285 222 -1499 -583 1606 751 -1039 65 1964 651 -541 1429 113 -1273 1069
1453 1069 256 -1569 879 666 -1453 -1110 324 279 -971 -730 -55 -1216 624 2351 -759 -477 2077
1470 2077 882 282 1198 57 -773 -161 213 -504 -1104 99 -798 -2340 203 962 -886 -69 169 -160
1488a60J826M37j409r26L30N24j038o47J165j302l09J554q31M11J693r26r84O84
1506I2O36N15p16m82mj133J194O08j649O53J33j258R34J057R3J43p22k22O15K91
1526G78O32j264j765J191L40k25Q39j011k89R28m51L47L14o67K28n45k0J481k61
1545E80k39J46p91Q54K45o52K80m53n14N95o55J41P43r41l26K02o7J112J70j60
1565B70L21n47J070P87j450M2J30j382O18N5r15J72o0J07L09l8J094n52o70J541
1585I02j31q41J094n84o89J151l00q70k82O3M80p41L05Q64j473P09J304j305J53
1604a91J280j280l29Q90L9k54k22O79m99j040J552j88j679J419p2j870J520Q78
1622F33p66L13L47n04m08R21J196j885m93J372j469j87K137j673j202J262J12
$$ plain form
1488 -160 1666 2103 694 -232 98 622 -416 -1063 102 -1200 -1509 45 -786 -375 1318 392 -592 92
1506 92 728 1243 527 45 41 -1092 102 710 -939 -286 -153 -1411 -477 580 673 816 94 -128 487 778
1526 778 1410 146 -1619 -428 -88 -313 526 -485 -774 154 -297 50 364 -303 -75 -620 -640 841 580
1545 580 341 487 -304 550 795 143 423 -30 -544 51 -604 -463 280 -661 -987 -785 -852 260 430 270
1565 270 591 44 1114 1901 451 493 623 -759 -141 -86 -1001 -829 -889 -782 -473 -511 583 31 -639 902
1585 902 771 -70 1024 440 -249 902 602 -268 -550 -487 -7 -748 -443 421 -1052 -343 961 -344 -191
1604 -191 1089 -191 -520 370 409 155 -67 612 113 -927 625 437 -1242 177 105 -1765 -245 633
1622 633 -133 180 527 23 -385 536 1732 -153 -646 726 -743 -930 1207 -466 -1668 -406 -294
1639b94o47P13J042o40q78J684N17j742J588O01k950O93J149j918j8J337p73j099
1657a635Q97J208r98OK050j704j089K719k85j586J611l72j970Q95J115r49j116
1674a203J242K02k013J733J598k592N77K006k246k40K297r69j397J248O96j547
1690f08k12K362j352j807K441m99k270K507P61k464P47J522j247n48J809p6k351
1707a285R98J807k441J25K433k316j023K835q19j836J554O89j664Q5K261q47j631
1724a075K437L2k928K001J295l053P58J777j829p80J810K55k071R49J586k463
1740a299j02L332j784j718K948n69k207K265O96k316p0K098j135j802K395M79
1756A211l094J696J927l075M61K680k298q78K366r9k104J081J845k199q12K663
$$ plain form
1639 -294 -941 -228 814 174 -704 980 1497 -245 1343 1944 -1006 -313 836 -1082 -1100 237 -536 -1635
1657 -1635 -738 470 -528 -522 1528 -176 -1265 1454 1169 -417 1194 822 -1148 -253 862 -87 -1203
1674 -1203 39 241 -1772 -39 1559 -1033 -456 1550 -696 -936 1361 392 -1005 243 939 -608
1690 -608 -820 1542 190 -1617 824 325 -1945 562 1323 -1141 -394 1128 -119 -667 1142 1066 -1285
1707 -1285 -287 1520 -921 -796 1637 -679 -1702 1133 314 -1522 32 721 -943 -858 1403 556 -1075
1724 -1075 1362 1394 -1534 467 1762 -1291 -533 1244 -585 -1365 445 700 -1371 -422 1164 -1299
1740 -1299 -1401 1931 147 -1571 1377 808 -1399 866 1562 -754 -824 1274 139 -1663 732 1211
1756 1211 -1883 -187 1740 -1335 -874 1806 -492 -1370 996 897 -1207 -126 1719 -480 -1292 1371
1772A371j514k127L310o5l014K121J484k303L88K056j256j737K145O44l109J176
1788d30K364l298m43L229j900j563K729j59k193J492J885j745p02K778j019k594
1804a569K753N69l478J696J548l113K39K690j250j810J775R46k446R10K640k600
1820e00r84L444j546k010L109p5k732J142J460j961p67K368l63k689K260J275
1836A431l332J471K578k763m43K592j253j428K044O87k549Q4K400j949j279L111
1852A402j018k648K870P89k751J289J701j956o97K251l85k503J641J512l064O21
1868i46K825k652o84K926j070j814K062P57k020O8K073j394j838K876k17k995
1884b043K128J016k872J185K224k086q24K094N4j824J169J522k667l13K950j887
$$ plain form
1772 1371 -143 -2270 1040 975 -2039 82 1566 -737 -349 1707 451 -1286 859 1503 -1606 -430
1788 -430 1934 -1364 -1807 1422 -478 -2041 688 529 -1664 -172 1713 -32 -734 2044 1025 -1569
1804 -1569 1184 1753 -1725 -29 1519 -1594 -1355 1335 85 -1725 50 996 -1450 -540 2100 -500
1820 -500 -1484 1960 414 -1596 1513 1438 -1294 -152 1308 -653 -1420 948 585 -2104 156 1431
1836 1431 -1901 -430 2148 -615 -1058 1534 281 -1147 897 1584 -965 -881 1519 -430 -1709 1402
1852 1402 384 -2264 606 1395 -1356 -67 1634 -322 -1019 1232 847 -1656 -15 1497 -1567 -946
1868 -946 1879 -773 -1457 1469 399 -1415 647 1404 -616 -548 1525 131 -1707 1169 952 -2043
1884 -2043 85 1101 -1771 -586 1638 -448 -1272 822 876 -948 221 1743 -924 -1237 1713 -174
1900a74j306L033q44k329J840Q49j794O0J690j198j512K342L15k608J727J524
1916A615k720M09K394j693n94J893o68j629R75J524k238o69K389j399j649K656
1932E96j83k328K178R85j798L55J632q70j293J378P98k387P96J432k469J37K508
1949A467j960j218K208j38j378Q85R96j204m78K128o07j991K153L08k618J383
1965f4J244j828L01J115q40r34J287O44j905K58J795j708l89K465j219j252J867
1982H37l54j392J175P20j348p62J431J53j485J434M55k208J068J742j913K30J332
1999A115j147p85R65N00j094j53J108j361m92K160m96j577J766N6j202J245O79
2016A287j108k78O98n2j335Q55Q85k031J93J432j338J62J492j232o53J232L70
$$ plain form
1900 -174 -1480 1553 709 -1620 220 1069 -725 -665 1025 -173 -1685 657 972 -1636 91 1615
1916 1615 -1105 -696 1698 5 -589 1304 636 -993 -18 1506 -732 -1401 988 -411 -2060 596
1932 596 413 -1915 263 1248 -550 -195 1437 567 -726 652 1450 -937 -141 1291 -1178 -1041 1467
1949 1467 -493 -1711 497 359 -1019 -134 862 -342 -820 1308 701 -1290 863 1171 -1447 -64
1965 -64 1180 -648 -347 768 -72 -1006 281 925 -980 -722 1073 -635 -1024 1441 222 -1030 837
1982 837 483 -909 266 986 -362 -1124 307 460 -1025 409 864 -1344 -276 1466 -447 -217 1115
1999 1115 -32 -817 148 648 -446 -599 509 -852 -1344 816 320 -1257 509 565 -637 608 1287
2016 1287 179 -99 599 547 -788 67 952 -1079 -886 546 -792 -630 862 -370 -1023 209 579
2033E79o24J06O79n13q95J376j25j398J142R6j543J085P21r49j96M53o1l57M07
2052a7O46j295o6J579q08n19J374n37p74Q32j46m46J72K97l35p19Q67M02j161
2071f54N43M05j037P39O04q42J81M59j02l04m4N37n21n93P35l28m47J182m96p56
2091g39R86J65l58L13l09Q9j68J89L36o81n4N98q00J58P11q28J42J31l84M44K24
2112A65qo1l57N18K64n24K75M0n97M62j10m14N76l08k67Q9k85O09J32n74M14j00
2134f1N8P62n59j8K25n53K74L2m96N06m93n63P88q4Q7K96n09K97J62R9K85n04
2156C1o5N54o37j24O18p91R6K05m46L33M7J01K39m91N77K46o42N68Lp16N98j4
2178B90p31N15N4l17j16r9L84m11n1P13n24k87J270p97l18R95k69k48K13J6k26
$$ plain form
2033 579 -45 61 740 227 -668 708 583 -815 327 423 -1120 -35 686 -263 -459 -6 -67 -424 -17
2052 -17 629 -666 -732 847 39 -480 894 357 -417 415 269 -177 -5 292 -43 -762 105 507 -654
2071 -654 -111 294 -743 -4 600 -242 -61 398 296 -8 -52 485 -36 -629 106 -222 -669 513 17 -739
2091 -739 247 412 54 367 58 147 -21 168 504 -177 -231 367 -433 -275 436 -392 -250 -119 -503 -59 165
2112 165 157 96 -261 257 521 -3 272 312 -285 177 67 -347 229 -79 -346 -257 -542 67 199 -375 39 -61
2134 -61 -3 759 200 182 407 -146 128 160 -336 170 -323 -886 -98 -182 -95 201 -308 -11 151 250 535 31
2156 31 -34 520 -117 -241 377 -414 -318 -113 -559 -226 -179 -78 161 -330 247 493 -149 419 422 -294 304 290
2178 290 -441 74 128 -189 -305 -404 -20 -431 -482 231 -293 -580 690 -107 -425 570 301 53 266 282 56
2199E6j38L25l2p70N80M41j209M89Q06j087J51O12n44K80L27J03m57j86Q56m25
2219A78p76J204m31r13J197k22p89P52J49n64o3N23N7o36K95O07j232K41J307
2238H84j268k04J236p96m08Q10J33o32l2O57k95o51J205m5j416J099M27j438P06
2257b8P80j069o2N54Rp15L86P34j224j38J571j088n59J794o71q21J081J80q51
2276a37L30O03o56q96J096K26j615P39R66j813N69J275j141n8J172l50o48O43
2294C05Q27j215l29J356r82j124J835m37j544J382M13j311M57R77n48p09R13M85
2312G51j487P54J251j863o2J656j223o36J532m64r40O86N84q13l30J578p51j367
2330a144J689K78j808J212P77j728K87J203r10n89R95L75j439L69J412j499k51
$$ plain form
2199 56 -82 243 211 -559 21 462 -747 -258 548 -539 -388 224 -320 -40 287 390 -67 -253 603 178
2219 178 -598 606 175 -738 459 237 -552 200 349 -215 -278 245 302 -334 -39 568 -664 -423 884
2238 884 -384 -588 648 -148 -556 254 387 -245 -277 380 85 -566 639 594 -822 277 704 -734 -28
2257 -28 752 -317 -379 175 184 -531 -145 589 -635 -773 798 -290 -849 945 274 -547 534 714 -137
2276 -137 193 796 140 -756 340 566 -1049 -310 656 -1157 -588 687 -454 -512 660 310 -338 305
2294 305 1132 -83 -412 944 -38 -1162 673 236 -1308 74 487 -824 -367 610 62 -647 266 751
2312 751 -736 18 1269 -594 -656 1000 -223 -859 673 209 -731 -45 539 -274 -604 974 223 -1144
2330 -1144 545 823 -985 227 1004 -724 -437 766 -144 -733 262 637 -802 -433 979 -520 -771
2347g71J951j234r33J747j62j459R64P57r98m31J150k89j431J444N12k038J000
2364b21J291j833L15J557j011p43J124O5j157K27J481j521q26K166p49j421J910
2381F54j6j659R99J088j396j96J195k73j319J172P57j854M67J512j833j32J891
2398A057j029q80J210J93j136L35J138r96q79J670k76j732J842M03k049R69J107
2415I47j206j33J169n54r70Q05R35j711o5J969j644n39K052p77j145J353K01j354
2433f67N07J146j018r09J333J19j693J202Q33j915O86J363j436j61J485m59j110
2450f94P77Q75j210l87J565j148j134K128m99j595J434M81j407N47J122q19p14
2467f78J267J42j546P24J411j992J66J468j343n19J503n12r34R01O35j023m51
$$ plain form
2347 -771 1180 -54 -987 760 598 -861 103 860 -138 -569 581 292 -1139 305 817 -1221 -221
2364 -221 1070 -763 -448 1109 98 -645 479 544 -613 -386 1095 -426 -1252 914 165 -1256 654
2381 654 638 -1021 -22 1066 -330 -526 669 396 -923 249 1006 -848 -381 1131 -702 -834 1057
2398 1057 28 -852 358 551 -585 -250 888 -108 -987 683 407 -1325 517 920 -1129 -160 947
2415 947 -259 -392 777 223 -747 58 993 -718 -783 1186 -458 -997 1055 278 -867 486 687 -667
2433 -667 -160 986 -32 -941 392 511 -1182 20 853 -1062 -376 987 -449 -610 875 416 -694
2450 -694 83 958 -252 -639 926 -222 -1356 772 273 -1322 112 593 -814 -267 855 36 -678
2467 -678 589 731 -815 -91 1320 -672 -506 962 -381 -900 603 91 -843 58 693 -330 -781
2484g81J544n86j155J596J06j706J251O84j672M34J134q61p94J080J66j212N35
2501b37J151j365l65J932j020q07J513l65j227P76O39j019j19R69l97j084J292
2518B67N35j639Q94Q78j528L41J214r32n07Q30J12r79K04J140j150o84J593n82
2536Gj033J576j21j247J000O47j132Q5P73k54r05P83N29j380M03J309j500j37
2554e97J305q98m86R29Np21K69Q35p74m97J229k68j163J228J21j325J011M26r71
2573c42K6P64k33o67M25N82j041N7J208j115k68J259o56o25R56O6p89K76N64l95
2593E2n04Q21j31j036R35L69j243N88O93q91O0O72k78k11L24K39n80j81R31n61
2613F8o96J209n87p15R33J6p20M62J83k26j66N05K72p64L35M87j015K97P57j029
$$ plain form
2484 -781 763 177 -978 618 724 -982 269 953 -719 -285 849 -12 -806 274 440 -772 -237
2501 -237 914 -451 -816 1116 96 -711 802 437 -790 -14 625 -394 -513 456 59 -1025 267
2518 267 802 -837 57 935 -593 -252 962 30 -477 353 465 -514 -310 830 -320 -1004 589 7
2536 7 -1026 550 429 -818 182 829 -303 -218 555 301 -604 179 708 -672 -269 1040 -460 -597
2554 -597 708 -190 -676 253 258 -463 -194 641 -133 -630 599 331 -832 396 517 -808 203 629 -342
2573 -342 -316 448 215 -452 -27 555 -486 -429 779 -336 -604 655 -1 -626 330 396 -393 -117 447 52
2593 52 -452 369 238 -798 137 506 -737 -149 544 -347 -287 385 107 -104 220 459 -121 -302 629 68
2613 68 -628 581 -6 -721 212 228 -492 -30 153 -73 -239 266 538 -226 109 596 -419 -122 635 -394
2633c94L3P08m55k47L37J72j94l21P85m13m26Q77j68p05P40q5n02K68J72l13n5
2654a86J86J35l32m6N68n82J39O64o22k22P95n29o7K27o9j33k13L00J34n05M44
2675H6O0n62M43K77m78K54M1k13J28J6O1r8j28K25j61k25N96k08m19N18j16k39
2697a42L82j49j54L9J2K58l96Q8K81l40M3K13k58K52Pl70L25On0J1q7M5Q9k73
2721a68K38Pl06L63j15k64N26k65j0J40l59K72J56l08J70K0k77L38k05R0j8k55
2743b30L10Rk23M02k28j66L59k79p1L38k21k4L6j01K30k59l1L14m67J56M18m16
2765a44J50K46m31J17K70j30L5j98J40p9k35M15r9n19O04n0m73M53J87m62K55
2786E2M7j9j61O0L06n39M3O20o14k41P45m19k26O40k72j29J96M0r5k73M09O4o31
$$ plain form
2633 -394 -361 347 -108 -355 -18 154 -40 -361 424 11 -415 462 294 -411 329 244 -258 10 182 -131 -186
2654 -186 0 135 -197 -243 325 -257 -118 546 -76 -298 497 -32 -99 128 59 -74 -287 13 147 -358 86
2675 86 146 -416 27 304 -174 80 121 -92 36 52 113 15 -113 112 -49 -274 322 114 -305 213 97 -142
2697 -142 240 91 -63 -24 -12 246 -150 -62 219 -121 -78 135 -123 129 136 -234 91 97 47 58 -29 16 105 -168
2721 -168 70 77 -229 134 19 -245 281 16 6 146 -213 59 215 -93 77 97 -180 158 -47 43 25 -230
2743 -230 80 89 -134 268 40 -126 233 -46 -117 221 0 -24 12 -89 141 -118 -149 165 -302 -146 272 -144
2765 -144 6 252 -179 -62 208 78 113 -85 55 -24 -259 156 57 -462 142 92 -381 72 259 -203 52
2786 52 99 80 -81 -21 285 -254 -211 409 -205 -446 299 -120 -346 294 22 -107 89 129 34 -239 170 234 -397
2809c97M70K84p89L46M37n62rM89j69j37J21K48m99L1O76o24k14O63l94n29O85
2830A27N0n78K96K32k27j6L52J15p57M81M42r36L28O73q73R6O21m72k66L74Q8
2851A50m11q3P57m31m61Q67k25p97Q58J43p74M59L06n69j8N34O9p11M26M81q65
2872b95O0R02p95l68J035m37n84N56J79o30OQ02m10o74R97L0r16O94M99j043L59
2893c3O00o77q1N34m8p01K70N96q64m6J083q24n69J213j97q97Q29L26q59J72O86
2914E13l79o73Q99Q7j051O22N96j129J99R11p26l35Q15j61o71M28M82o59j23Q95
2934E40m43q74J207j38r52P97M12q62J55O91m21m81O89Q3r34L71Q15j118KJ070
2954F09q03l51P68j77n53N72M67o71j62R80n38q42J090J60j168N76O68j075J45
$$ plain form
2809 -397 73 357 -432 -86 351 -211 -220 269 100 -37 84 332 -167 -136 540 -84 -298 365 -29 -558 127
2830 127 177 -401 -105 127 -100 -116 236 351 -406 75 517 -419 -91 582 -291 -195 426 -46 -312 62 150
2851 150 -261 -344 413 -18 -479 388 163 -634 224 367 -407 52 358 -211 -229 305 374 -337 89 570 -295
2872 -295 -235 667 -128 -496 539 102 -482 74 253 -377 -371 431 21 -653 344 374 -542 152 651 -392 -33
2893 -33 567 -110 -191 343 295 -406 -136 460 -404 -450 633 -191 -760 453 256 -641 188 514 -345 -173 513
2914 513 134 -539 360 447 -604 18 614 -515 -316 595 -131 -466 349 188 -483 -55 427 -232 -355 540
2934 540 97 -777 430 292 -660 137 549 -313 -158 533 112 -369 320 403 -531 -160 655 -463 -461 609
2954 609 -194 -545 223 46 -507 65 532 -139 -301 679 141 -701 389 549 -619 -43 625 -450 -305
2973c05Q12o51m50P81J07q45M67O98j002j96J286p73o86J167n3r17N43M56o93
2992b54o4P80j71r38Q71M84j325N40P86j128J8R37p14m14P20J66p95K69Q64p01
3012f9l73J195m63q43R22M1j024N86N42p70j20O27j50p32Q23K57r65L94Q79j034
3032b77j73J162p38n41P26J51o43J90N59o40m01J230m09r24R53K78j146O52N48
3051E57q12j43P86j36p14N83M14r22J43R13q26k95R63m77o15Q92J8p25K61O16
3071D81n63l66P36N6r32O64N22j129L94P21q01j50Q09k86n76L98N93q89J0Q78
3091E70o48o34J265k94r44R34K0p48L52N17m58l33P36J39r19M16N36r19J41R45
3111F74q09k66P28j36n50L81L17n00j78Q11m16o08Q88r6r66P96M29q04P5O49m50
$$ plain form
2973 -305 507 -144 -594 187 294 -551 -84 614 -388 -584 702 -71 -757 410 357 -560 -17 439 -254
2992 -254 -318 462 291 -647 224 708 -617 -77 709 -419 -401 536 -178 -592 128 294 -501 -232 632 -69
3012 -69 -442 753 290 -553 369 410 -614 -28 514 -256 -376 251 101 -631 192 449 -516 -122 757 -277
3032 -277 -450 712 -26 -567 159 310 -333 -143 416 -224 -625 605 196 -728 225 503 -643 9 557
3051 557 -255 -398 388 252 -462 121 535 -387 -244 669 -157 -452 511 34 -581 311 329 -396 -135 481
3071 481 -82 -448 288 344 -588 76 598 -531 -137 584 -217 -367 442 156 -420 -22 571 -318 -308 570
3091 570 -78 -712 553 259 -685 249 269 -479 -127 390 -68 -401 335 474 -445 -29 507 -412 -271 674
3111 674 -135 -401 327 191 -359 22 339 -161 -339 472 56 -552 336 240 -726 70 499 -305 -230 419 -31
3132c1m07P26j6n61J36O17p07MR03q38k86P22j51n56M71J91m39K6N14j71m84N98
3154B61J54q17L77M15o94P8O31n26j36M12l5l93P6O28n79l52J027m99n07Q36j06
3175B51n59L95J36l03m8K00J0m34L94L17p29K39O22q08Q5O28n13j28N95l14k69
3196b33P5M21l89l59P43k6o29N68P3o16M94J81n28J82J87P5m50K00J55l87oO72
3218D03n79k21P29l69k92N14l0j77J56j35O0k46L06J04n91M38K06n93K77L43m12
3239a09M7J63q3n6o3K02j37r4M28l37j57L96k06k36M30j57k61L38p6P0k04J9K11
3262A28l39J09L81n47K8N37n89J99J75j55O3J9K2Kj09K34k7l28L29m7l63L93O
3285A21k88K28k14N2J65q6R1Kj12L18k52k6J23j91M5J71l25J53Q2j65K05j25L0
$$ plain form
3132 -31 -438 288 272 -289 -153 464 -243 -239 664 -174 -460 262 111 -445 26 217 -222 -196 318 147 -337 261
3154 261 415 -402 -25 390 -304 -226 405 -121 -257 155 120 -273 -197 431 -148 -500 527 28 -479 357 251
3175 251 -308 87 223 -80 -128 72 82 -352 42 359 -370 -131 491 -317 -232 396 -117 -245 350 36 -233
3196 -233 -158 263 -126 -485 258 232 -397 171 244 -372 122 303 -225 -43 144 219 -231 -31 124 -263 -269 403
3218 403 -176 -397 332 -37 -329 185 155 -22 134 -1 59 -187 119 223 -368 70 276 -317 -40 303 -109
3239 -109 -62 101 18 -38 -101 101 -36 -130 298 -39 -196 200 -6 -242 188 31 -230 108 32 102 -102 -83 128
3262 128 -211 -102 279 -268 -240 297 -292 -93 82 -73 -10 9 31 33 -76 158 131 -197 132 85 -278 115 121
3285 121 -167 61 -153 -101 64 -22 69 71 -41 277 25 -1 122 -69 -24 147 -178 -25 57 -108 97 -28 2
3308BJ19j73NJ69j74M6J83l27K01m3j27K47k88R5J13k36J12K07k69J50Lm4J83
3331A54q9l9J13j97J7J03k39K55j36j14K51m7j06R2J5J8o2k2J75j68o6K44q3j78
3355a09K36k14p1J64L1N4q5pJ35k00J54Q6l55J55J76l52J39J70k13k4J78k2o8
3378d2k8L05p0k91L57o6k68L62k20k36K86j40j26Q2Q8Nk22K52J78l73O9M27n00
3401a71KM39l51k9K45p3j12J2K55j79k92L69M5m96M47Q3l87J57L04l82LJ48q5
3424d8j56J19K67l73q2O47m31j78N34j47l72M02j83j46N7L60j89k30L22L6o12
3445d03M26L41o46J82L41m25k3M51r8k91J12L36m21k4N39m18l91Q32l00m39N21
3466B02n5m09J94K06p8j94K11P0m91K57M82p24K33M68n21j51O86l32l13M38Lk90
$$ plain form
3308 2 121 -52 -47 122 -52 -6 177 -150 51 8 -119 128 -160 -65 48 -188 -76 131 -138 12 15 -29 154
3331 154 65 26 139 -58 -41 62 -177 78 -58 -172 79 32 -74 18 33 51 -11 -33 142 -26 -92 152 69 -109
3355 -109 127 -87 -158 6 37 91 6 -1 134 -66 88 174 -181 -26 150 -202 -63 107 -106 -130 48 26 -42
3378 -42 -70 235 165 -126 231 165 -103 259 39 -197 89 -51 -177 -95 -7 -2 -224 28 206 -167 -98 329 -171
3401 -171 -169 270 -81 -110 135 62 -50 -38 217 38 -254 115 160 -336 111 194 -193 -36 268 -114 -111 37 -48
3424 -48 -204 -85 182 -191 -273 374 -57 -235 299 152 -220 182 -1 -147 -90 270 81 -149 173 209 -403
3445 -403 23 364 -282 -100 241 -184 -207 244 146 -145 -33 303 -118 -142 397 -21 -412 420 120 -319 202
3466 202 147 -262 -68 138 60 -134 77 147 -344 -87 395 -329 -96 372 -149 -300 386 54 -259 179 182 -108
3488a08q3N50l75l19N16J6o22N22J20o57L27M11m00j40L36J8l53K78L58n52M1
3509a16M97m07l36O83r5n13L83J56l68j15N41j72n11N22K56p54L69M07q39K07
3529b05M83k48l02M58m5l34K3N28m81j80P17l68m45O29k4n48M01K21n69J33M02
3550B46l28k37L03K65o36K88N35p33P5O66m02l20M97j13l66J88L56l85k11O58
3570C46k66o27P52Mo13M02L75n55l5N24j49m51L78J67m99K9O08m31l32P75l84
3591A8m58O92m4m32K22K97l93k15O29q9n88N02K09q53M52N76o79j17N87k10l85
3612b79N30l2m26N7O22m74l33O66k12n24N79rn26L22K81k03k11M78j42m68L20
3633A6M52p59J22O33o22j33O07l26l03L82J24l82l3M57k39l10O07j04n55N31J23
$$ plain form
3488 -108 -191 359 -16 -335 181 197 -425 97 217 -440 -113 298 -102 -242 94 112 -241 37 395 -157 -116
3509 -116 381 -26 -362 321 226 -287 96 252 -116 -231 310 138 -373 149 405 -349 20 427 -412 -205
3529 -205 278 30 -272 186 141 -193 -170 358 -123 -303 414 46 -399 230 206 -342 59 280 -289 -156 246
3550 246 -82 -319 -16 249 -387 -99 436 -297 -222 444 42 -278 219 106 -260 -72 284 -101 -312 346
3570 346 80 -547 205 209 -404 -2 373 -182 -217 307 158 -293 85 252 -247 -218 390 -41 -373 402 18
3591 18 -440 252 208 -224 -2 295 -98 -313 316 227 -361 141 350 -503 -51 525 -154 -271 316 106 -279
3612 -279 251 219 -207 -150 472 -2 -335 331 119 -405 174 165 -361 -39 242 39 -172 306 164 -304 16
3633 16 468 -291 -169 464 -158 -291 316 -10 -313 69 193 -189 -222 235 -4 -314 293 189 -366 165 288
3654B88n87K44L87m23j78M12Nm98L30L60n52j4P39o08l06P29k40n17M02J93l14
3675a48k4M43k32l55N21M6o08M71K86o03J17L93l50k90N13j32m20L08K78l99r8
3696b83O26l38k99O32j77m46L91J05k96n2L38k2n34L07K55m78K27L61n08PM49
3717B65l41j32M76k61k23K09J97l08N0L72k90m13O69l8m73L03J36k56qK85j39
3738H0k51K19J21l48O5K72l20j42N61m06m8M02j11l38K86L2j45m9K17o9k86L19
3760F1J30m99J96L87m06J20J75j91j51K35P9j86q4K91k70O8L13k31l37M92j25
3781F7k78J79J47j60k2J41L2k86J92L06n29J46K28m02J17K90q8k03K62l4k13Q2
3803b6J97r9l49M02p6k83M11J1l60K23Qj74%J99N8k04J03N6j16j16L46k15q2L42
$$ plain form
3654 288 -299 -55 332 -91 -269 143 148 -350 -20 340 -212 -226 513 -95 -401 328 88 -429 -27 166 -148
3675 -148 -172 271 39 -316 205 251 -357 114 400 -203 -86 307 -43 -333 180 48 -372 -64 214 -185 -283
3696 -283 343 5 -294 338 161 -285 106 211 -85 -137 201 179 -355 -48 207 -271 -44 317 -191 -184 265
3717 265 -76 -208 268 7 -216 -7 190 -118 -68 304 14 -399 270 232 -241 62 198 -58 -66 219 80
3738 80 -171 48 169 -179 -114 158 -162 -304 257 -149 -197 205 94 -244 42 74 -71 -120 97 28 -258 61
3760 61 191 -308 -112 275 -131 -11 164 -27 -178 57 136 -50 -134 157 -113 -45 268 37 -300 192 67
3781 67 -211 -32 115 -45 -67 74 106 -180 12 318 -211 -65 163 -239 -122 168 80 -123 139 105 -108 -26
3803 -26 171 72 -277 125 49 -234 177 188 -172 51 59 -115 -115 84 142 -62 41 97 -19 -135 211 -4 -86 256
3827B56k66q3J81Jj81J4J70l8j13J10N0j92J76J45l88J90J13k60Q3k7J52n0j21
3850g8Q2o0j08L36j39j73K46j08k1Q4j7j06R8k19K52j06n4L2j10J27J37j79p7
3873a61L21j54J12j05MM2p7L1O7j18j4L5p1O2P3r1J68j47M8l4JN8m8p5J59j23
3899c7M3R9j39j7L6n6P6l3o6N4joK30j13j90J39k3q6P9o9J38r7L4L2l9L5O7j19
3927b9pR2r2K3P0m8no4J17l1j23P7K3n5R2j3j89J18N2o1P2N4p5n3lJ08j9k1O7
3956G7j38l4R6n9k7K40j22j04R2P6j7j30J53n5k11R2K34m27J84K97k73P3J05o2
3980F0p5R6K7j5k40L34l49o7L48j43j03K33j09j27J68k9k7J2J26k9k82J58K25
4003A92l42J20L04l05p7J81j45M1L4L6j0j87K84r1j87L04o3m09L53L4k22J60R9
$$ plain form
3827 256 -10 -93 88 89 -92 -78 92 54 -59 51 101 -91 85 230 -158 32 145 -115 -32 -59 93 43 -78
3850 -78 4 -56 -164 172 33 -140 106 -2 -23 61 44 -62 36 -183 69 -37 -91 -59 -169 -42 95 -84 -161
3873 -161 160 6 118 13 17 59 -18 13 80 -38 -52 -17 -88 -26 47 -44 124 -23 25 -9 -8 50 2 -73 86 -37
3899 -37 6 105 -34 -51 -15 -71 5 -28 -94 -40 -41 -47 183 70 -120 19 -4 -90 -11 -80 58 -39 -5 27 -12 23 90 -29
3927 -29 -36 56 -36 -13 57 9 4 -60 57 26 -97 -20 3 -52 40 27 -162 -44 8 -53 19 73 -2 -55 -58 50 31 10 77
3956 77 -61 -95 1 -58 -85 155 33 -71 21 97 80 -50 103 48 -163 -71 163 -264 -80 217 -56 17 122 60
3980 60 -15 81 108 93 -147 187 -162 -229 119 -24 -127 106 -3 -130 38 9 -18 -6 120 91 -191 -33 192
4003 192 -150 -30 274 -31 -108 73 -72 -31 3 39 29 -158 126 35 -152 152 89 -320 33 67 -155 5 104
4026A04j87O8P1L5j33K1K29l29P3K08k46r7L68j34j77J51n6j17P7K39n3k40K25
4049A00K3l84K98K00m43J17K77k19k02K85J5k33N2K43k09j84M71k64j70M06k9
4070A50k87L06l8k97O3K26j02k08K60L3k87Q5L30m36Q9L82k88j16L04j06k32R7
4092g2K08j45j98M66k07l00L92q7k99K08K52l91M9K50j23k10K52P9l15R6L06l77
4114a66p0O10l79k56L56P1l49K17J70j82j14K51L0n05M64P3m42J77L17l34j13
4135a74L73k87l9J52M8k39L1L94l26j59M22j42l42M37J7l59J35K17j17j65L40
4156B17l0k58R4J00l71J23L71l39l3K42j34j35K71Qk02J50J08j17l26M16l4l56
4178b35M09kl61J41J87k56Q0J43jl05J23L13l38Q3K83l37j72N97k77k17L05r7
$$ plain form
4026 104 -83 -15 56 91 -42 -21 208 -121 -48 160 -86 -183 185 51 -126 25 -31 -148 -71 168 115 -125 100
4049 100 123 -261 37 237 -206 -89 188 -31 -233 52 67 -166 -114 129 -80 -264 207 -57 -227 179 150
4070 150 -137 169 131 -166 -103 123 21 -187 73 106 -181 -96 234 -202 -113 269 -19 -135 169 63 -169 -72
4092 -72 136 -9 -207 259 52 -248 144 57 -242 -34 218 -173 -124 126 3 -207 45 124 -191 -95 211 -166
4114 -166 -236 374 -5 -261 95 166 -183 34 204 22 -92 159 189 -316 148 221 -221 -44 273 -61 -174
4135 -174 199 -88 -127 25 73 -166 -135 259 -67 -226 196 54 -288 149 166 -193 -58 159 42 -123 217
4156 217 187 -71 23 123 -248 -125 246 -93 -126 116 -18 -153 118 126 -76 74 182 65 -261 155 121 -235
4178 -235 174 172 -189 -48 139 -117 -37 106 105 -200 -77 236 -102 -19 264 -73 -245 352 75 -142 163 66
4200F6k47R1K43q9k49L45P6m13K61K25n77L16O5k97Q9Q7o2n6J07K37l44L8K49
4223A61j64k64N51k22l48M08L1k76L9K25k20j67L12O7m30K54K31m42J70K88k18
4244a4j57L07q1j91J08K01k67o5L33j43j42K36K1m97L56J92k96J51J6l5j80J43
4266dJ21l77J70L44m15k1M19m72J35K85Kk74L9K41k11j02K91q7k14J38K46m35
4288a81J79J18k01k3K80j76j50J88J11l16J63K64k86j38K85j13j89L12j42k08
4308b23J70K42k01j42L16n7l75K30K91l81P2L74m67Q9K11j82p9J46Q0j65j4K83
4330B18j78j67K46Ll44K51J14l77J47J60j73J01J55p5j53Q3J09j54OK09k98K9
4352h8K68j07k01K05p0j74J61O2o4j21J84nk16K80m8j84J19Q3k43J63J07j11Q
$$ plain form
4200 66 -181 -90 153 64 -185 160 236 -177 84 309 -268 48 113 -184 -95 -8 -70 -126 -19 218 -126 -88 161
4223 161 -3 -267 284 62 -286 122 153 -123 -84 141 -79 -246 66 133 -297 -43 188 -254 -84 204 -14
4244 -14 -171 136 55 -136 -28 173 -94 -159 174 31 -111 125 146 -351 5 197 -99 52 68 33 -147 -4
4266 -4 117 -260 -90 254 -161 -182 237 -235 -100 185 187 -87 -48 193 -18 -120 171 84 -130 8 254 -181
4288 -181 -2 116 -85 -108 172 -4 -154 34 145 -171 -8 256 -30 -168 117 4 -185 127 -15 -223
4308 -223 -53 189 -12 -154 162 105 -270 -40 251 -130 -58 316 -151 -62 149 -33 -112 34 114 -51 -65 218
4330 218 40 -127 119 122 -222 29 143 -234 -87 73 -100 1 156 81 -72 11 120 -34 -28 181 -117 -88
4352 -88 180 73 -128 77 7 -167 -6 56 -8 -129 55 50 -166 114 66 -118 1 84 -159 4 111 0 8
4375Hr5K65k42lK24m0k84K82j5j76M0J28j66J32L9k55Q3J4J53j65Q2J30k13R2
4399A8P0j26kP6K9j47K7P6lm6K9M8j20K22r3j47J85P0k87J17K9n2N0Lj1l9o0K11
4427A27k31r9K82k40J36J06q9n6P7J8Mn4R4r5r3R7J11k18J09J38l04K24K9j1j20
4452e8J48n9jRQ6j03p5Q3Q3k13K22k04L1R1r1P7j04K5Q0j16K5J71j40O1O2l6n1
4479CM0j74K90k78J47Kk5J4Q4j47O8K1j64K48n6q7Qk9l5J97k10O3mP2j0o9j9J68
4507A18j54Lm7J38l3r7mQ2j6j2J03j27k9J68j11R0n8j98J03O2QJ46j76lP5oPR
4535D1j46M6J46j25O0n5pJ45j47PN9oJ7L0j13J37j1n8l3o3P8j0k8J93k14NK65
4562B13k28pJ28k03N0J68k02O2Q2pK7j55P9N6r8J51j7k07K06J9q3n6R3q3r8J42
$$ plain form
4375 8 -87 178 -64 -67 157 117 -167 115 100 -76 -36 92 -74 58 97 -158 -75 -61 92 -73 9 139 -74 18
4399 18 88 -38 -40 36 65 -82 -55 21 18 -28 1 49 -71 151 58 -89 96 166 -121 -4 25 -27 23 26 15 -24 -84 127
4427 127 -104 -203 79 -161 -25 81 -8 -64 13 31 35 -19 75 -20 -113 -16 95 -123 -14 124 -180 44 73 62 -58
4452 -58 90 31 30 39 125 22 -53 30 113 -100 122 -82 -51 40 -51 26 -78 -53 27 -89 -64 107 -33 28 90 54 3
4479 3 43 -131 159 -119 28 30 5 19 103 -44 24 45 -119 129 73 -14 -6 -35 -70 127 -83 -20 -24 48 38 -31 -50 118
4507 118 -36 -33 -80 58 25 -72 -76 6 -10 -22 81 -46 -75 93 -18 72 14 -184 -81 -19 -11 135 -41 -44 31 25 32 41
4535 41 -105 -59 87 -38 22 -33 -40 105 -42 -35 24 18 35 65 -48 89 78 20 -13 -76 2 -8 -36 157 -57 -52 213
4562 213 -15 -22 106 -97 -47 121 -81 -19 63 56 83 -72 7 63 -35 116 99 -108 98 117 34 -22 71 -12 -110 32
4588C2J32j09j55J83o8q8J54j11k8J73j3r5o0K3l0j33J56N1p4j9K20j32m9J95
4612A55j44j28K10q8p9J48kl8k52L36j06k72L22M1j95J78K7k47J10P2o4n6Q4J00
4636A12j06m6J06j62J3J28j66Q5R2N3k29J36N8j35P5K1Ok56K03J14k62J75J25
4659A40k41J3J34k5j53J04J79j81n1J27n8p3K21n5k13K61r2j08J25r8P4j9R8p7
4683C2k02K26N8j63J6J68j90N7J46k40M4J7L8j25Q0J26q8j64L40r1j46J42lj51
4707g3P0J97l49O9P1J06k91K04J29k30N3K33k54L2J29j68p3J22Q1j98N9J52k6
4730D5j35J73L9l39K43J69k96N5J92j84L5J73j01k08J24J52k40JK92j42j70K10
4752H8j5k22J72M8j72R1J35q2k08J27Q9j55J05Q1k48PK81k12k1K07M9k61J20J11
$$ plain form
4588 32 164 55 -100 83 15 -73 81 -30 -58 115 102 7 -53 -30 -60 -193 -37 14 -60 -79 141 9 -40 155
4612 155 11 -117 93 5 -74 74 72 34 -218 118 12 -260 62 103 -92 86 113 -134 -24 48 -16 -72 12 112
4636 112 6 -40 66 -96 -83 45 -121 -36 56 109 -120 16 74 -61 14 35 41 -215 -12 102 -160 15 140
4659 140 -101 -88 46 21 -132 -28 151 -30 -81 46 -12 -85 136 81 -132 129 37 -71 54 -44 30 11 109 32
4683 32 -170 56 114 -49 -33 135 -55 2 148 -92 -48 -31 7 -118 -38 88 0 -164 176 85 -61 81 78 -73
4707 -73 -3 194 -155 -86 -15 91 -200 4 133 -97 -44 189 -65 -33 96 -72 -145 -23 58 -140 -81 71 45
4730 45 -90 83 122 -217 26 195 -101 -46 146 -38 -3 170 69 -139 -15 137 -103 -102 190 48 -122 88
4752 88 73 -149 23 71 -101 -10 125 43 -165 -38 51 -104 1 82 -166 -159 122 -90 -111 96 145 -116 4 115
4776A15n6j30K06q8j93K17p1j81K38P5k10R1J15j39q5J72J23l84J53K36l16P8
4798c4J59j21k08L09j86k1J58K1m2m0J04q1j99K67o1j85K16J08k86O0K14j45j10
4821a03J95l8j17O2K19k70j18K53j41r0K12o1j27Q7J05j71O4K28j34j48J44O6
4843A17j83P5R9j56L5O6o3j20J42M7j15N5J04j34n8K23m2l17K73O0k57K23pj50
4867h3r7L23p5j49O8J30k11p0L12j92Q2oj03l4J78%j99O2J79k24J30J04r8j54
4891a27J14J06j94J55M7k5k24K08Op2m4J23o8n0P7K9k78L22o4j54K54k5j76l3
4915i3J46q0j12K08O7l04J08K66l18J4J60j3j73K45j83j28K16O0j65p2K56nk11
4938a11J32R7k00R7Q3j74K1J01K2o4J7q8k0N6P2j58N4J31m3j3J26q7j01K0J3j6
$$ plain form
4776 115 59 -71 135 47 -146 71 0 -181 57 132 -78 13 128 -11 -96 76 199 -185 -32 204 -112 -34
4798 -34 125 4 -204 105 -81 -102 56 77 35 -5 99 18 -181 86 25 -160 56 164 -122 -62 152 7 -103
4821 -103 92 54 -63 -1 218 -52 -170 83 -58 -148 64 3 -124 -37 68 -103 -39 189 55 -93 51 117
4843 117 -66 9 108 -48 -13 53 -10 -130 12 59 -56 -1 103 -31 -89 134 92 -225 48 108 -149 74 67 -83
4867 -83 -180 143 68 -81 -13 117 -94 -164 148 -44 38 32 -71 -105 73 73 -126 -64 115 -109 21 125 27 -127
4891 -127 -13 93 -101 54 101 76 -148 60 66 -6 -50 73 5 -45 32 61 -217 105 41 -113 141 116 -60 -93
4915 -93 53 -27 -139 69 136 -168 -60 206 -112 -98 62 49 -124 121 -62 -190 26 86 -79 -151 105 100 -111
4938 -111 21 118 -82 15 98 -76 -55 46 68 4 21 -67 -87 -31 41 -117 -63 68 25 12 138 51 -50 -30 -17 -33
4964c3K6J6Q0r8p2J69k31J46Q8j19N7Pq8RJ19l7j16L9L02k72j56K66r2q8J81J0
4990A13j78M4J2p0P6R0q1j00J17O7k15J17J18m8p5J37j91J47q5j5Q0m2lO9j67
5015h3K41m9k29L03j08j20J23pj16K4q8J29j13Q2K4no7K66j91L9Ol8NO6j21P4
5041D7o2LK2J1N9m7p3P0J7j16J45mo8%p5J26l6j34J69m8p9P9J5j04J47nl6N3j10
5070c4O4M1Kj60L6QL1K4j5L4j8q1J86q1Jl4l9O3K0j86J31j3N4q7j0R2J1p0Jr7
5100a26J42J09r0k2j0r9J37N8j37K2L0n5J37j12N9j24N5P1J7j28J13N9p0k5O2
5125G3pJ8k9Rj42N7P4j19L6R1l5p0O9j0j38Q1L7J7p2j8J26j91K22o9l2j5J88k87
5153a36J13L4n1P6J9M3n2k6J6m3L5O0k05J69m2K8m3N9j25QO2J9M4o2l4O6p0M1
$$ plain form
4964 -33 -7 9 89 -9 -81 88 -143 3 91 -28 29 36 -52 -43 76 39 -77 -38 264 -8 -164 102 10 -78 103 113
4990 113 -65 -21 -9 -79 -3 87 6 -94 23 90 -125 -8 110 62 -13 124 -67 80 -5 -20 60 18 15 84 -83
5015 -83 158 109 -120 183 75 -45 78 71 -45 -21 -109 20 -93 -11 13 8 -59 207 16 55 61 23 28 94 -27 47
5041 47 -15 -12 10 21 80 33 -40 30 47 -69 76 72 4 4 -71 55 19 -115 54 6 -73 6 21 -83 64 59 23 76 -34
5070 -34 30 71 73 -87 -51 -43 -12 12 -3 31 13 -68 118 37 38 4 -35 28 48 -138 -7 -20 34 -53 -63 29 40 -30 -29 -126
5100 -126 16 125 35 13 3 -96 41 99 -38 -16 14 -41 96 -16 43 -81 -26 45 62 -66 47 106 36 11 73
5125 73 66 84 55 64 -78 -21 53 -66 -30 61 26 -44 25 15 -123 -42 -5 12 -60 -78 48 -143 79 10 -22 -37 151 -136
5153 -136 -23 11 -40 36 55 98 46 20 36 -7 28 88 -117 52 10 38 -5 54 -71 -63 -1 18 62 0 -34 32 -38 3
5181CP6r6k8J12j25L3J72j92M0oj0rj06K35qk24J10O5j43J16j7o4J51r5p0N9L9
5208A8lLN0N9j50j26K33p6N2m3o9l9M2K5p4R9m7kn5J20N7j09O9Mn1lQ7j46J27
5237E2nK7j64O7M3q4K0K29k15%J29o9r1%R3L2k5M9l2j95K68L8k55J55K7j68O2
5264a2K1q6J45l2m3j9j1R1j46JK21j11q7K33k01L0OP6n6o2K02k16n3Q7J46l08
5290a84J71J34k54N5J64o5j60K09k05KK23n8r8j06K33m8k05K21o0o7J37J01k73
5313a33O5J64j64J8P7L2j03J24Mk09pK11j58KJ84o9j22R1L5j08J4K9N3j34J24
5338B0M7k03L8K37k66J18K1j86J74P2n4r9k7L06k06j8J80j53k21L57k19l0J61
5361D9o1Q0j32N2J34j70P6J76k78M5J00n0j6Q0j74O5Q2l6n9j1R3n5j61K26o0r6
$$ plain form
5181 3 79 -17 -45 67 -58 -25 147 -45 -5 -11 -21 -30 -136 99 91 -133 -23 42 -101 15 -2 -66 85 -10 -80 -21 18
5208 18 15 18 68 127 -23 -149 84 8 60 17 -52 -91 -49 -24 -98 1 -46 -48 -103 17 74 -35 34 38 -13 -16 71 -75 52
5237 52 47 74 -90 -23 20 -64 -44 185 -30 -30 99 30 -61 -61 32 64 39 88 56 -139 129 167 -88 67 94 -74 -12
5264 -12 9 -77 68 36 -7 -26 -37 54 -92 -91 130 19 -68 165 -36 -6 0 76 20 -42 160 -56 -109 -22 124 -184
5290 -184 -13 121 -133 -78 86 21 -139 70 -135 -133 90 32 -66 -172 61 13 -192 29 -31 -98 39 140 -133
5313 -133 -68 96 -68 -50 27 59 -44 80 84 -125 -132 79 -79 -77 107 38 -84 7 42 -66 -52 -23 30 -104 20
5338 20 67 -136 -98 139 -127 -9 12 -174 0 72 18 -81 -108 198 -8 -26 154 1 -220 137 -82 -112 49
5361 49 -12 68 -64 -12 122 -48 28 204 -74 -29 71 21 5 85 -89 -24 58 22 -37 -48 45 -10 -171 55 -5 -101
5387a01K89j85j62J31J05k29L7K52j68r5R8R6j46p9K05j00j3K11l32J13J77j20
5409a6q6nK00j4j03Q9L7j82K09j62j12J4P7j0QJ52m9j43J23pj83N7J19j32N4J73
5435A08j27J6J09o3q5R2Lj0m0M1l1o8R1N6k44N9K42k10j5J78q4N7K0p7q5K9J80
5462A42j36j03K11r3r0O3L0K0r6K03j92P0j1QM6m7J34j81k2J20m1j32K08j58k3
5487g0rM4q2M0J87Rl07J88R3j54N1M5p1m0J51j02o4J36M2j88O9J30k03l0K29j05
5513a1K9L5J5j49J06M1j34N1N2r2k2J23O8k42M9J45j94Q1O9l8j19L2RM4R6l9l5
5540c0o8J11Or4J03O7j60N4J07j93R1l7R1r9k4J39m6k1J47k02K9J44j44O0n4M9
5566B6p2N9O9r6j02K43j02k5Q8N9k47R4O7J6j35J35q7j7n8P9j8j1J6J15j34L9
$$ plain form
5387 -101 188 3 -159 -28 77 -152 -115 137 -31 -126 -28 68 -78 -157 48 -52 -65 146 -186 -73 104 -16
5409 -16 -102 -107 93 79 -24 65 102 -80 129 -33 -145 -131 -54 -64 -56 96 47 -96 27 20 -163 -106 13 -119 -65 108
5435 108 -19 -3 106 43 -42 50 53 43 3 44 13 -55 36 92 -152 -93 149 -61 -76 102 18 75 95 18 -67 -38 142
5462 142 6 -97 114 21 -69 -6 24 44 -52 151 -41 29 18 26 72 25 159 -22 -44 76 35 -97 111 -47 -70
5487 -70 -79 -35 -117 -77 110 119 -188 0 93 -61 -10 35 -36 -76 75 -27 -91 45 87 -101 -32 98 -105 -135 94 -11
5513 -11 18 53 68 -81 25 66 -68 -17 35 -57 -79 44 112 -130 -81 64 -130 -49 20 -18 -137 -105 -96 -52 44 5 -30
5540 -30 -98 13 19 -75 28 95 -65 -11 96 -97 -6 -43 48 -51 -75 64 18 -3 144 -58 -29 115 -29 31 -23 26
5566 26 -46 13 82 -14 -116 127 25 0 88 147 -100 -6 61 77 -58 77 -10 -27 -85 -6 -24 -35 -19 96 -38 1
5592Al5J31q5P6p9Pn3k2K7J00N5k21J16R8j24R7Oj17q1J86l8j30J53j14J5M2N
5619A6r9N0J20j32lO6q5O0P7j64J37qK5L1l3L9p5r1PJ16q9RJ42j74n3R1L0NjQ2
5649I6j15o5L4J03o9J5m9J4L0Q4j04j8j4N3LJ93j99kM5k7J10j93R4jm6J54j10
5676A6l1J2j00J30j9l6J56k53J81K8j30J5M5J4L5q1n8J37j64J35j04Q0Ml6J9j9
5702b4j0P8o2n2J01l5N7p6O8n5j0j9JQ5ML5j7j43J09j5o3J30o5j35J17j32k8K02
5730D6qo3o2J07m1j7j3J20k94K02q0Q3j20J51j4p4J15Ro6o0J30Rj4q6N0l2p4R2
5758dk5N5K2q3J8j7Q9n6N8l1k7p8R9Ol7Lj04q1K40p6J8L1n6k6k7J21m3l9N5J28
5788A33j94J35p9m0M2j1J01q4K5R2j39l3Q7%j73K19L1j22J2J8j0p3K9ON7n7R3
$$ plain form
5592 1 -34 97 12 88 9 16 -37 -59 -32 68 123 -98 18 116 -8 89 95 -22 -103 83 45 -85 68 -46 -31 11 16
5619 16 -83 -33 87 -45 -48 18 -67 -7 70 -94 43 35 60 91 58 97 22 -69 -62 54 -35 -26 116 -58 -111 -20 10 15 14 96
5649 96 -19 -84 -50 53 -16 -1 -50 -36 -6 78 -26 -44 -58 -5 -2 191 -8 -10 35 8 118 -75 19 18 -28 126 16
5676 16 -15 -3 -103 27 8 -28 128 -125 56 84 -46 -31 14 28 63 -18 -76 61 -103 32 -72 8 12 -24 -5 -24
5702 -24 -34 44 -18 -70 31 -4 53 -23 45 -10 -20 -39 -38 47 51 86 69 -74 35 20 -43 87 22 -113 4 -128 -156 46
5730 46 38 -25 -87 20 -21 -38 -51 69 -225 -23 -103 -20 -140 11 -3 -77 38 47 -19 -79 51 60 46 -40 10 -22 -96 -4
5758 -4 -29 26 48 -35 -17 -34 55 -1 57 26 -1 -79 20 26 -11 -8 -112 -193 47 -29 -11 20 -36 -62 -89 32 -11 -50 5 133
5788 133 -61 74 -5 -45 -3 -14 87 3 28 120 -19 -52 35 35 -138 81 112 -10 2 20 10 -63 -34 -28 29 -28 65
5815F5j09n1J16k4m3N3j11O9J30j55M1nQ1q0R8n0Qj28L7M1o7J01q4l5J78M2j41
5842b3o5J39k0j26N5N3r7Q3J04p8q8J32p8k3N7mj9n6J74r0k7O5l5p2N5L7p5J18
5870I6j7n2l4M7O8j25%N9%j26J72n2j69J33P2j05N8M1q6j04Q1J09r5J11k9o6m4
5897e7J28j87R3J07n3j07J10r4p0J10o4Q5m3J04p9M6o9O8n9K1J34r0q4K25j37
5922C8q1P1k4Jp9K53k73L8J41j42p0Q4J8j27R2K6K0q2J12L8j27J58K7j68J9Q4
5948D7j11O3J12j79R5P7p4j40P0R1p6NJ09J2j09J18n5q1l0R0p2j00J78M6j95J58
5974D9m1o7J42M9j65n6K60j23j26Q7m1O4j8N0n2l6J5Pm6O7R7j93KO5M0j8R8o2
6002D8j08J4P4r6l2J11j00J01M6n2q1M7J10r4M4O4n1p3M9m9L7O9m0j21P3Q8Pj71
$$ plain form
5815 65 -44 -95 21 -3 -46 7 -104 -35 95 -60 -19 -24 57 -23 75 25 33 -95 -58 -17 -84 17 -67 -102 76 118 -23
5842 -23 -88 51 31 -95 -40 13 -84 -1 103 25 -63 69 -9 -32 25 21 2 -54 120 30 3 68 33 -39 16 53 -22 96
5870 96 79 27 -7 40 108 -17 -17 42 42 -84 88 36 -133 0 72 -33 25 66 -20 -124 -43 66 -29 82 53 -13 -57
5897 -57 71 -116 -23 84 31 -76 34 -60 -130 -20 -84 1 -42 62 -17 29 -40 28 -31 -10 124 34 -50 175 38
5922 38 -43 28 4 5 -74 179 -94 -56 85 -57 -127 -43 -25 -152 -60 -34 -14 -96 16 54 -73 85 112 -56 -37 47
5948 47 -64 -1 111 -68 27 104 30 -110 -40 51 -25 -20 89 101 -8 110 55 -26 -56 34 -38 -138 40 86 -109 49
5974 49 8 -59 83 132 -33 -89 171 48 -78 9 -32 32 14 64 12 -24 -9 -2 -48 19 116 -77 -75 -10 30 12 110 48
6002 48 -60 -46 28 -68 -100 11 -89 12 58 6 -75 -28 82 -12 32 96 45 -28 21 -28 9 78 38 -83 -10 78 85 -86
6030h6K18j64M8K0NJ0J2l0n0j01J09m4o2K53j36K0l6M9l9qJ5J36k19J4R1m4L9
6057B0P8k06Q7J13r1m9M9J14j07m7J41j15j27J29l2Ol6RR2q4QKk4Q7O0k41J10
6084e4J73j47PJ21o7l8j6J43j67K1Q3o4j0K9p7l9J82Nq1M9p0o6P6%n3K6N7m0p1
6113h8J6L3L3j00J72j2j53J57o5q7N2N2j12N3M9M6j10M3J25k00K19j3j26J01j13
6138b8O8k0M5l5N6r9O6m2m5k5N3M7j0Rk7k3P6K2q4j0R1r7n3J49k5j26J15q0k7
6167e9J50p3k7m0J7P%O8J13j72OR2j47J5Q0m6rRmO3q8J11q2J09Nj08p9M4K3J01
6197G9j49J51j22k8K9J27j08P0p8M0M4L4j31Nm3J02mm0J10j40J9o6K4J46j7j19
6223f5O5L4l6L9n5p2J13m3M4n2J24p8n4O2M1q1p7N0K3r1J14P6r3m0J0O1M8j12
$$ plain form
6030 -86 132 -32 16 36 41 51 63 33 -17 -118 -9 -53 -115 138 2 22 -14 35 -4 -12 3 139 -80 -66 25 -19 20
6057 20 98 -108 -21 92 1 -48 1 115 8 -39 102 -13 -140 -11 -43 -37 -73 -64 28 -56 -48 -46 -70 17 77 -164 -54
6084 -54 119 -28 -21 100 33 -5 -21 122 -45 -24 59 -5 -15 14 -63 -102 80 85 4 53 -17 -83 -7 -7 -60 -34 23 -17 -88
6113 -88 -72 -39 -6 -106 66 54 -99 58 -7 -94 -42 10 -102 -49 0 46 -64 -21 104 -96 123 110 -16 85 -28
6138 -28 40 20 65 30 86 -13 53 11 -34 -59 -6 41 31 40 13 -10 66 88 4 -6 85 -12 -65 84 59 -67 48 -32 -59
6167 -59 91 18 -9 -49 -32 -25 -25 43 156 -16 -10 82 -65 -50 30 -16 -25 -16 -20 43 -45 66 -16 93 98 -10 -89 -45 -22 79
6197 79 -70 81 -41 -69 -40 87 -21 49 -29 11 55 89 -42 -37 -80 22 18 -22 88 -52 -33 -99 -75 71 54 -65
6223 -65 0 34 -2 37 -18 -90 23 -20 24 -28 96 18 -36 26 67 -14 -91 -41 -18 -109 5 81 -12 -52 -42 19 67 -45
6251d5K8K4j9P1j5k11R5K1lN0rO0rj78J19KR3km1n2K9j9P4Ol7k2j59P6P0o6L8
6282c1k7N7J7jPp7J4J8N5m1Q3M5q6j56J43M2p2L8j9j40J55m1L2q2O6o4M8%j5L1
6312aL9N9j75J41%o0K1Mj22K1L2N3q2k7L0Q8Lm6mk4P2n1J00m9N1M0q9Mo9P5j25
6343i1J64j66J18J08k23O6P0p7l6J35j3o6M7nK6o8L2Kj0k2o6n5J58k1oL3k8K8
6371C4k8mK0j14k1J81j52P8M7j7K9J3o3J0n5P0L5m3KL1q6qM5q1Q2Kj08O7j9J17
6401F4q3K6J1n8M9J04j92L1R4k3l5n2N1n8K5P0j0N3n6K9M3j21J20o5o8J78j51
6428b4JN9k8q9RnJO4o4Q4o1J62pj22M6L0p0o2J77j00K5n3N8Po5K9m7K8JL2n3L
6460c4O9m2O0m7J4Rj34O4O8L2qj89J89N2k16J23L5K9k5o3nm2K7J5r5k2K02M6j95
$$ plain form
6251 -45 -17 7 -12 59 44 -167 -72 -51 -54 -4 -13 47 38 -140 -21 -19 74 72 31 -21 8 -11 63 69 32 10 -149 -73 -3 -69 -31
6282 -31 -58 -1 16 15 22 -55 -41 -23 32 -9 74 119 33 -123 20 62 -10 28 9 -131 24 -17 15 -67 -1 -65 -17 -17 -32 -1
6312 -1 38 97 -78 63 63 3 24 28 -94 -73 -41 12 -70 -97 -67 21 24 -22 -26 -50 22 -29 71 22 73 113 24 28 -41 34 -91
6343 -91 73 -93 25 133 -90 -24 46 -31 -67 68 55 -11 36 31 57 -11 21 23 13 -9 -75 -130 28 7 1 34 6 34
6371 34 6 2 22 -92 -113 68 -84 -6 41 24 53 66 3 13 -42 28 63 20 22 53 -33 -41 4 -77 5 7 -101 -34 -53 64
6401 64 -19 7 18 -40 9 113 -79 -48 46 23 -12 -64 -13 -71 -46 24 14 67 11 40 83 -38 82 17 -51 127 -24
6428 -24 -23 36 8 -81 -72 -77 -76 -12 -76 8 -53 109 102 -20 26 56 -14 -76 101 1 26 -27 31 38 -27 2 -45 -17 -16 16 -37 -34
6460 -34 35 -7 53 6 20 29 -105 -41 27 59 51 -138 51 103 -113 10 45 74 49 -14 -19 -61 -34 -19 -114 -136 66 112 -83
6489h3J24Oj06O9Lj9K0n1K5n6qJ17q2O1J13j63K9l4Q5k2o8K2j6k6J85j63J1O4
6517C7M2r4N4N8j88R3l2l8N1J12j89J39r5J21r7jK0l3N9j5O0o6Jp0k1J06Kl7q5
6546a06K10p1j14J74r0j2NP0p5JL2K1j7N1L5p4l4K5j27N5R0m8Jp9J43j20O7n5
6574d2M5j26J06L2l6J45n0q0j4L0o3o1J33q8P4l9m2K7r9K31j33l1P1j6o9M6J36
6601H7j77L4O5p2QOR8j28J30O9j43RJ02j11K1L3j9P0j67J34o0KN2j8m0J11l6q4
6629b4m7J15j21Q9k3O0n1j6rJ5PR7o2j13J27Lo8R5J3j27l7J20o0P7p1M5j16M1
6657d1J68j70J52n6p6o5J65j48K24j43j7J0p3J45k1k0Q0j44n1J38n4o1O2p9L8
6682c7M0P1l5j04J92o4j%O2j61P0j60M3J73p1j29J51n8J11n9p6J32j44N0p9L1
$$ plain form
6489 -83 41 47 -59 10 13 -6 14 -37 -12 -68 -76 41 -41 20 133 -30 -1 -35 50 28 -40 -18 -34 -60 125 -38 -27 37
6517 37 79 -15 39 97 -91 2 -30 -68 -17 95 -94 45 -50 71 -26 -27 -7 -40 19 4 64 -2 -1 -71 -92 14 16 -21 -106
6546 -106 104 33 -81 93 3 -9 -4 66 -9 -8 24 45 28 79 114 40 6 31 -96 -41 49 1 2 -77 66 -54 13 -42
6574 -42 3 -123 -17 15 -21 124 74 -6 -20 10 -53 -114 19 -69 5 -34 -76 -49 -148 83 -50 -81 -10 -26 -95 -49 87
6601 87 -90 -56 9 -63 -55 -49 49 -79 51 120 -23 -14 88 -23 -2 31 12 82 -85 49 -11 -9 43 25 -15 96 60 -24
6629 -24 -71 44 -77 12 -11 49 -2 -18 -27 -12 -5 92 30 -83 44 47 -21 74 87 -40 -77 43 -17 60 -11 34 -82 -41
6657 -41 127 -43 109 53 -23 -88 77 -71 153 10 -7 3 -70 75 54 34 114 -30 -81 57 3 -58 4 -75 -37
6682 -37 3 74 39 -65 127 63 62 62 124 -37 33 -127 -84 89 18 -111 40 -18 93 34 -42 90 -54 -4 -83 -52
6708e2mQ5N5m9m0m4J12n7l3J35j93J73k1p9l0J80k40J9Q4j1OO7k6k1q1N1l7m8
6736i9O6O9Po8m3M6n5P9Pq5P1M9k2q7J44o0l2J36l5j17J73j68N1PP7j57N4j6R8
6765I0j19J36q5j0m3K4J2r3O8J03n4qj7Q7l6O5r5q7J02j1k00J59N2o7R1q0m4n5
6793a15J60j02kK8rQ2K3o8q7KJ63l9m2j6R4o0r7O9R3j20L5rr7R8NK1m8M7p5j5
6823h1J06p4P4j34J49o0L7O5j27j6ON2M2Q6k14L6J41j54J20k9K3m8%l5R9j0j02
6850d8Q2OJ04k13J31n2J34j55Ol7k1J84j21P0j01J01n6N9oj00j3mRj05J40O2O8
6877A24j19k4l8j3Q4j1l4k7J8P4k6m8j4l8L5N5Q2r4l1O0J60j41%l7J2K5J6j36
6905h6J23L8n3O2p6K8l5j8Q6q2l4L7J07j35m3K2K02j51PO9j01R6q7K9N6k9mLp0
$$ plain form
6708 -52 -56 29 84 35 -5 -49 63 6 -27 108 -85 88 67 -12 -42 138 -102 -83 1 -10 -4 63 37 16 -65 -14 -51 -99
6736 -99 -33 36 43 -25 -68 -22 -77 2 9 -76 -5 44 22 -65 79 19 -13 123 88 -29 144 -24 27 34 111 -46 8 -8 90
6765 90 -29 107 22 12 -31 -7 5 -88 -20 83 29 21 4 91 55 120 25 -62 40 29 -171 -12 40 -27 64 -16 -60 -115
6793 -115 45 -57 -59 -31 -40 42 65 -3 -90 -88 75 36 -6 -22 72 12 -85 -16 77 -43 -8 -17 -114 -16 -11 10 -38 9 -66 -81
6823 -81 25 -49 25 -109 40 -20 17 82 -45 -61 -55 -3 39 125 -89 -53 88 -66 54 25 48 0 0 -35 64 54 -48
6850 -48 34 40 144 -69 62 10 144 -11 -5 -42 -63 121 0 70 -31 70 14 73 67 -33 -46 -50 -41 -146 -6 56 124
6877 124 5 -19 -57 -70 14 3 -31 -58 -40 34 8 -40 -54 -92 -57 -2 80 -14 -45 15 175 34 34 -3 9 34 50 -86
6905 -86 37 75 22 84 8 36 1 -17 69 -13 -47 -10 97 -38 -81 -59 143 -8 -1 68 -33 63 -24 5 61 32 28 31 -39
6934c9Q4MJo5J10q3j19J11N3j08P1r4J09K6M4pj32K0K2k1J2L6J9p8N4q8roJ34
6963F1r8L1k7p5O6O3K3n6M8o0Lk9N8k3L6m9J11j27P7n2j21J28J5o0O1l7K6pM4
6992C0k9j3L7R5q5j26J85j05j20R2J02J02j38o6R1qpOo9j9j6R5m6q0J58r3O0K1
7020E4m7M2o7M7p5M0M6q0QJ70k39j2J55n9J40j26jl3K1Q7j10J6o3J42j15P2j34
7047a21R0k5K70k46M1p6L1O1J6o7J1P3l1p2P5L7n9q4J52Mj33M1K5q0OO1L4q0O5
7076A9K0lO5p6k9P1p6j2%JN1k5k6P5j1o7Qjo4J62j07O6r3N1K4n5J11m9q6J23p2
7107eJ7Q4o8kj40J50l2l0p3J91j87J10j00J82j20M1n2m7N6N7m4P8j09N7m3j1K8
7134a2j29J98Pj34NJ06l4K8oq4P7M4j83N8M7nk5L0Q1m1or2K3k9J16j26K6J31p
$$ plain form
6934 -39 45 49 50 -15 95 12 -107 4 57 -51 20 -74 35 61 105 98 -34 -14 8 -13 -1 35 54 -24 30 -58 -67 -73 61
6963 61 -37 -6 -33 -108 -42 21 44 -12 36 -24 -21 -50 8 -15 21 -28 83 -44 33 -19 -140 -12 3 -57 4 -33 -7 -14 30
6992 30 1 -12 25 120 35 -91 94 -11 -131 -39 63 165 27 -39 52 44 37 43 -26 -45 -61 34 -12 -92 66 -27 33 54
7020 54 7 49 -18 29 -46 -6 40 -40 -32 138 -101 -113 42 -17 123 -3 -4 -37 -16 71 -39 -23 -86 56 -59 13 -121
7047 -121 -31 -56 214 -32 9 -67 -36 25 41 -26 -15 58 27 -45 30 67 8 -76 76 80 -53 -12 13 -67 -61 0 34 -46 19
7076 19 39 36 101 25 -4 67 -9 -21 -21 -20 31 6 -20 55 44 -23 -15 -16 -80 82 -25 41 -52 -1 23 -32 79 30 -56 67 -5
7107 -5 12 96 28 26 -114 36 4 -26 -99 92 -95 15 -85 97 -23 18 -34 -81 -25 32 -12 66 -43 14 -29 -40 -12
7134 -12 -141 57 64 -70 -65 41 7 35 29 -55 22 66 -117 -59 -12 -17 -42 -12 69 28 22 -70 -47 -76 40 -86 -60 71 64
7163F4j23JJ44l7l2rN7l2m2k0J7o6M2lk9R0R8j91jJ45j61J23j4L6j65J14km9M2
7192cJ27q4o5J5P7j00n0R7j05MJ53j10N2N5j6J3l8p9O2j16J98o1q4J14mn6m5R5
7220D6j2j02J09o8P4q8M1J2O9o5rk2l2Q8o3L6K9j9l0M9M4j69O5N5k01J07J13n6
7248AJ0kq7M1J59j66L0Q7o8Q5j53Q7P9j98R1Ll6J67o7r2qJ8L3J5l1q1O1j6P5O3
7278A00j29J66p6j3m0m8KM6J2m7J6Q8rj52M7J46o2J6j07Q4o9J6M0J%k5j19J67
7306E1n0l7Q2j09qR5J06r8l5qJ11j21M2n0j6P5p0J15m4o7L2L1l4k7K3J2r5J05
7334A1J1r6J50j30l9O2RrO1Oo5P6o8oM9pP9j71O0j7k6K4P7p3J3J14l2r9J12j3
7364F3j4q1K4QjM0j3r1m1k1J27m7J00QR4j89r3N9O2m5Q7m1RR1q3J5k0kJ6j20J29
$$ plain form
7163 64 -59 -58 86 49 17 8 65 33 -9 -29 -12 -78 -36 -39 -68 22 120 -71 -72 73 -88 35 21 57 -108 6 4 -45 -3
7192 -3 124 40 -25 -10 67 -33 -83 14 -91 -87 66 -44 8 63 47 60 22 -57 5 -111 87 26 -58 56 52 -4 -49 46
7220 46 34 -68 41 -27 47 -41 0 12 81 16 7 -15 -47 41 -22 14 43 24 -6 43 87 -82 -17 38 -163 -56 57 1
7248 1 11 9 -78 -37 122 -44 -14 73 5 90 -63 24 103 -95 -4 -1 -37 130 63 -29 -37 -19 14 29 -2 -83 -22 -38 37 100
7278 100 -29 137 61 48 8 -40 -38 8 20 -27 -11 77 68 -84 -37 109 47 63 -44 40 -29 -13 27 28 28 3 -116 51
7306 51 1 -36 46 -63 -71 24 130 32 -3 -11 100 -21 21 -29 -45 30 -40 75 31 -36 -4 27 -7 -34 -11 1 -94 11
7334 11 22 -74 76 -54 -93 -31 -22 -31 30 36 -29 47 -21 -27 22 15 94 -77 -17 -34 -60 -36 41 -32 -19 95 63 -36 76 63
7364 63 49 -32 -8 0 -1 39 26 -65 -106 -127 0 -47 53 61 155 -34 -127 -68 -6 -51 36 -5 4 95 12 27 7 5 21 -99 30
7395C0L7J9l8j02K0M5M6l3k4pm9N8m1J09m8r2MJ88j12p8J20j44N4Q0JM5j48J21
7423F1m3n9J52j46J1L1j9K4j2%n3j0L5l1J12r6pLN7L6j51J48l6r2J40p6qJ26j05
7452hO7o8m1N8k8k3P8q6N2m9j2J9J14j64J84n2j00OK5N2O3o6Kn8P6j6o2r1J00
7481b8%LO0J8k3r1Q6j1p3L4Q7j10N3o9l4K4J87j70J64j63L1K14j87j5M9o0Q0r7
7509d1%N8n5J26j26On2J45q9L2O4J0j33Q0p9jL9O0j3r5k2M6M5n5Q1K4o6j16J36
7538Il5n4L3J64n4pk6P5j57O5m3j7QJ3NL6p1Q6K6p5l0m3J15m8J23j48J3J08r3
7567b2m0O0J19j08J6pkk0k6l2J77j91J18j28J17p7j5N6m4N3J3Q4j93k3J00J07
7593I2j25N8N1K6q2k3o9O4K7n5k9J29k7Rm0r7J55p1O5j31L2j2N1J2r7J46j5n9
$$ plain form
7395 30 67 86 48 -54 -34 11 57 24 0 -7 -56 2 -39 70 22 -70 -66 122 10 -68 52 -92 -38 42 43 88 -60 61
7423 61 18 -41 111 -35 -24 7 -12 12 0 0 -53 -63 -28 -59 53 -43 -50 -47 10 46 -105 43 7 -85 55 -21 -29 97 -8
7452 -8 59 -9 -50 8 -20 -43 35 -51 1 -48 -60 -41 73 -91 93 41 -59 -53 -28 24 87 21 23 -35 41 25 -37 -128 -28
7481 -28 -28 -25 35 53 30 -61 25 14 -59 -25 62 -48 5 -64 -98 -74 113 -57 107 -56 -25 189 2 -13 36 -24 56 -41
7509 -41 -41 17 -38 88 -38 -32 -84 61 -28 4 68 78 -55 25 -54 -55 -16 44 31 -64 -86 -40 5 -50 31 55 -11 -127 9
7538 9 -26 -80 -47 117 63 56 30 105 -52 13 -30 -47 -39 -26 -21 15 -56 30 56 -19 -49 -92 23 -25 98 -50 -37 71 -22
7567 -22 -62 -2 117 9 25 18 16 -4 -30 -62 115 -76 42 -86 31 -46 -61 -5 -49 4 17 101 -92 -115 -15 92
7593 92 -33 25 76 102 20 -3 -72 -8 19 -36 -65 64 37 46 6 -91 64 -7 58 -73 -41 -53 -2 10 -87 59 44 -15
7621a5J03p2k1l1Q9j11M2J7M0j03M8J04j11L1k7q7J81K2L7j76j3J7OJ37m1j00
7647c4OJ15j03M0O7m2q8P4j4k8m2N4K1oR3r8p7M3L9o7O9O7n3N2j36L2r2J62J06
7676A60k21M2J36j44J1pL8n0O2j9m7K0R8r9j8L8L6n3k1R9j34R4N0m4q8J07l9j48
7704a41J59K3rq8O6K3j61J70j07J15o8N0q8K1J16j08l8K5J27j23p3P4J31j3m3
7729D0j8j12J47j6knnN3j38L2l2L5K29q7j97M5J25j78%J42m8R3m2m8m2n0J04o6
7757d1k0J66r1j05J12q7Q2J5o9L9OK7L0M9q5O1j11L9Jn3J05l8o5q5J15J54j92
7784d1J22l4n9N0K3O0j68J20j70N4k3M9NQ2o8O1o0J9Q1j54K8R3j07J50n5l6p4
7811e2J01K2m1K4r4QN1j9km6J10o6q3J44om8j3Oj2k2Q0p4j6O1K9j46O1J24q8p1
$$ plain form
7621 -15 88 16 -5 -36 53 -58 -16 1 41 -62 -14 90 -21 10 -17 -104 77 99 136 -40 -53 -36 -30 107 66 -34
7647 -34 -28 87 -16 24 91 49 -39 35 21 -7 -49 5 26 20 113 15 -62 -19 20 -47 22 89 36 88 -48 -16 -108 54 160
7676 160 -61 -19 117 -27 -16 -23 15 -35 27 8 -39 -19 79 -20 -38 0 36 -17 -38 61 -73 21 71 27 -61 46 7 -141
7704 -141 18 41 32 -56 10 33 -128 42 -65 50 -18 32 -56 -35 81 -27 -65 -40 87 -36 -109 -35 96 83 40
7729 40 22 -90 57 41 39 34 29 82 -56 -24 -56 -21 208 121 -76 -31 94 -84 -84 58 10 103 61 13 -29 -79 25 -41
7757 -41 -61 105 14 -91 21 -66 16 31 -38 1 7 34 64 113 28 89 -22 17 18 -35 70 32 -33 -118 -3 151 -41
7784 -41 81 47 -12 38 61 121 -47 73 -97 -43 -66 -17 -12 70 2 63 3 22 103 -51 -23 70 -37 113 58 22 -52
7811 -52 49 71 30 54 -40 -32 19 0 -2 -48 62 -4 -87 57 51 3 -10 -4 -16 -38 42 -32 -48 13 42 -104 -43 81 -7 -78
7841g8Q3n3J29p3j23Q3O2o0K6O3O3j51j7M2L9J0p7J49k11R3m1j5LP7pN4j04k7
7869f1L9l9K3N1m6lJ05q1J7N7n2o0K0J33j18J6J7n4Q7m6rMM2K3q8l3P1j1k6p3
7899i5J58p2l0N0p8J1M8K6m7N8m2k7p6J04O5o3K8M7j12O6j47Q4K2j7J7JJ19k52
7927a54J24R2pn8M5mm2k0O9j7j8J6o0m6K3K7J04j54P6k2M5M2j12O3O6l1p0M4j10
7956h9J40j5k7J2j05R5j16J4J7P2q0Q8j61Q5R3r3K2OO2l2Q3j80J50j8r5O4R9l9
7984E2np2R3mm2kJ17k58J05k1J34m0j19J66q2m3l2R4j4rq5Q5J4Qj12J02j13O3
8012b0M4p4J29q0R7j80R4pN5r4Q5q8pK35k17O5M8q5K7L0l5j01N3M1q2J6M2j28
8040a37J15N2o2j35K38p6n3R2Kj0jr5K9m7K7J90j32J03j26P2j2r8J30j05J19j13
$$ plain form
7841 -78 5 -48 81 8 -115 -32 30 -30 -4 59 122 -29 -46 -4 35 45 -32 117 -94 -1 -42 -57 -54 23 16 70 -34 -61
7869 -61 -22 -61 -38 13 -33 -36 69 -12 5 62 10 -50 -30 103 -15 1 18 -36 51 5 -4 0 42 65 -23 -56 15 4 -22 -95
7899 -95 63 -9 -39 11 -67 -56 -8 18 -29 29 -13 -40 -116 -12 53 -10 18 65 -47 19 -128 -44 -22 -39 -22 -21 98 -154
7927 -154 -30 62 55 -3 42 38 -4 -24 45 28 10 26 -34 -80 -57 -30 74 -80 -4 -26 19 61 -51 12 78 47 -23 21 -89
7956 -89 51 36 9 21 -84 11 -105 -91 -74 -2 -82 6 -155 -70 23 -70 -48 -42 20 -12 71 -109 41 23 -72 -8 91 52
7984 52 47 -25 68 64 22 20 137 -121 -16 -37 97 57 -62 104 22 -21 -53 41 27 18 -67 18 32 40 -72 30 -83 -20
8012 -20 24 -50 79 -1 96 -84 10 3 58 -36 49 -39 -46 189 -28 37 85 0 27 57 22 -79 -26 15 -67 -51 -9 -137
8040 -137 -22 30 -32 -167 71 -5 -58 34 36 26 25 -70 -41 -88 -61 129 -3 100 -26 46 34 -64 66 -39 80 -33
8066c3J17j63P1n5J7q3K40Jj05l9O7n4L9L3p3N8j36J45k7L6j00m5J77r8L3L8N
8093F6p0j0J0kPn8Q4Q5j64Q5n0O1j48R4Ql9k8J96q6p0k1k0K4m1J15k6M2o4N1J7
8123D8j1Q4j21N3j4j21p4K19k3pJ2o6np4J52n5N8k0j0jJ05r4p0J08o8n9Q0LJ4
8152D3k1J9j5Nm2K2K1k8K7p9R9p5%K4M9j04P3j3p9P1J8mK5J1k3qJ9L6%J05k02
8183b6j6P8j12J46o6j6NN8
$$ plain form
8066 -33 84 -79 -8 -63 -46 -129 111 112 7 -32 35 -19 20 53 -20 38 -98 47 20 56 -44 -89 88 -10 23 61 66
8093 66 -4 -14 -4 -6 1 -57 27 112 -52 33 -17 44 -104 -10 -2 -41 -69 127 41 -29 -50 -70 -46 -87 28 2 44 -20 31 48
8123 48 37 121 0 53 39 -82 -156 63 40 33 45 -21 -26 -100 52 -3 55 35 25 24 129 35 -35 73 5 -54 26 29 43
8152 43 22 41 26 31 -11 11 32 4 31 -48 51 -24 -24 0 49 -55 18 5 -74 -3 15 11 36 47 24 16 35 71 71 176 -26
8183 -26 -42 36 -76 70 4 -12 -7 51
8191E1
$$ Imaginary data points
##PAGE= N=2
##DATA TABLE= (X++(I..I)), XYDATA
0@%%%%%%%%%%%Oj4J6j6J6k4L2l5M3n6O4p2Q8j04J20j41J65j92K21k53K88l25L68
34A95m14M67n27N91o60P36q22R15j013J122j241J373j517J672j844K032k237K463
52A291k716K997l310L662m062M520n050N673o413P316q446R903j1871J4686j9070
67a0890K6913m5266J69208J18719k47566r6242m3494O2092P4469J6439r2096m2009
79a09723K5663M0032K5310P6757J3893o5256k2187K4298j5256J7462K7862j4801
91B4054m797L5912r588n4278j7916J9889k6950k2185L7571K4286M060J6221m3844
104a7565n0638N5088P9950j1400o4080m6264j1917L3337P9520L6695m5093k4437
116A3196J654l5961m676L5180j3746k7831J4556J3671n674O173J2046n047J6637
$$ plain form
0 0 0 0 0 0 0 0 0 0 0 0 0 6 -8 8 -8 8 -16 16 -19 24 -32 32 -40 48 -56 64 -77 88 -104 117 -136 152 -173 195
34 195 -219 248 -279 312 -348 388 -434 481 -532 590 -651 722 -795 877 -967 1065 -1172 1291
52 1291 -1425 1572 -1738 1924 -2138 2382 -2668 3005 -3408 3908 -4538 5365 -6506 8180 -10890
67 -10890 16023 -29243 139965 258684 11118 -85124 -128618 -66526 7943 24382 -67714 -109723
79 -109723 -84060 -44028 -18718 58039 71932 6676 -15511 8787 -6469 10993 38855 24054
91 24054 19257 55169 45581 -8697 -26613 -6724 -33674 -55859 -18288 5998 10058 26279 -17565
104 -17565 -68203 -13115 66835 55435 -8645 -54909 -66826 -33489 46031 82726 37633 13196
116 13196 14850 -21111 -25787 9393 -4353 -32184 -17628 -3957 -9631 -3458 8588 3541 20178
129B0178M1801k9737p6637l250L4237J5224K3118n901m4218n533K7628n049k1835
142b9974J9941L5352l833l575R686j9748M42L4571j2596l5425m545j6539k9147
155e5390Q714L1127P100k595K0594Q512j4069Q012l477k4430K9819M4069k4052
168C3934m5274j5305O377K7404L0628j3410n7108k2937L1330J4197K680K3076
180A5592m464j6883J7642M822k0624l37R402m549J463J7320m293k8664O261K5987
194A8675o151o766o249l2195n198K8188J218j1496J6245K5463J966j1923o595
207E182j1051N063L4789l46l9211r263N855k409J3683P612k0336j6889N720Q391
221a3210j040J1453J5255n912Q785K5033j5224k8462j515N39L956J0443j2800
$$ plain form
129 20178 61979 32242 -44395 -47645 -13408 1816 24934 19033 -25185 -30718 -3090 -8139 -29974
142 -29974 -10033 25319 21486 17911 27597 7849 8291 42862 30266 -5159 -9704 -26243 -55390
155 -55390 -46676 -15549 -8449 -11044 9550 18062 3993 12005 8528 -15902 13917 57986 33934
168 33934 -11340 -26645 -20268 7136 37764 24354 -32754 -55691 -24361 -10164 -7484 15592
180 15592 11128 -5755 11887 16709 -3915 -4252 5150 601 2064 19384 15091 -13573 -7312 18675
194 18675 12524 5758 -491 -32686 -37884 -9696 -8478 -19974 -3729 21734 23700 11777 5182
207 5182 -5869 -806 33983 33637 -5574 -14837 -8982 -11391 2292 9904 -10432 -27321 -21601 -13210
221 -13210 -14250 -2797 12458 6546 15331 40364 25140 -3322 -4837 -4298 -342 10101 -2699
234b699k7281N9L0278J5310j2102l653j829p788J3480O231k0098K720K0777K275
248A5680m490k851j0649j2378L747J4081m026p655O840m534j033K0649J521j4373
262E29K571K511r174q282r88O376J2013J6521l623k9377o794J8530M993p11n845
277g50j9197k98K1555J2139k946n831l40j051J59P463q376j7462O114J0700K081
292C960O222p342j6878P56J1202L473p014m425O309M834P007P013q192m30J1806
307A8301p722j5917o645k822P480J0906P86q203q211O605J0304j474j346o016
321c974r433J0705J4652o37m237n297q80P813K016q304j5229p394J2595J0439
335B835K80m34o810p58J0583P42o069l637k070M950L670j227K18j057M708N956
$$ plain form
234 -2699 -29980 -29921 357 15667 3565 -88 -1917 -9705 3775 10006 -10092 -7372 13405 15680
248 15680 11190 8339 -2310 -14688 -10941 3140 -886 -8541 -1701 -6235 -7268 13381 14902 529
262 529 3100 5611 -3563 -11845 -12833 -6457 5556 22077 18454 -10923 -17717 813 5806 5095 -750
277 -750 -19947 -20245 1310 13449 10503 4672 4332 3281 3440 10903 2527 -14935 -8821 1879 3960
292 3960 10182 2840 -14038 -13282 -2080 1393 -5621 -10046 -3737 1097 8104 15117 6925 6495 18301
307 18301 10579 -5338 -11983 -14805 -7325 3581 4367 -3836 -12047 -5442 4862 3388 2042 -3974
321 -3974 -13407 -2702 11950 11313 7076 1779 899 8712 10728 2424 -12805 -20199 -7604 2835
335 2835 3115 2681 -4129 -4887 5696 6438 369 -3268 -5338 -388 3282 2055 2273 1216 5924 11880
351A1880q593j0108m561r32J0509O879n345l847n5P672R881m227j0070o428j419
366h764R448N408m987k603j017M599O967n378p298l694k488O766M508l699J852
381c80L749L631K492o762o034o45K208N947m103r789L203O630O219N142r261j1369
397i122Q47O080O533m69n211r85J322P674O611r641q163K85l075K221L187m885
413f791J78P639O381j12n547K68J506j403L222n057r739P750R074k459k499o569
429d158o977L263P756J944q154l936Q427N451O530O616j1342r460O452J234l420
444B26q31l894k505M113P211j032q192L076L907o750J329J619p047O515J1522
459I267l255n259P94J553M76J601n19j1504m505J4143M210n269K256o438p040
$$ plain form
351 11880 3287 -6821 -11382 -12314 -1805 5074 -271 -4118 -4173 3499 13380 9153 -917 -7345 -8764
366 -8764 684 6092 1105 -1498 -2515 2084 9051 3673 -3625 -7319 -9807 -3041 1467 -2232 -380
381 -380 3369 7000 9492 2730 -3304 -3949 -1741 4206 103 -9686 -6483 147 6366 11508 2247 -9122
397 -9122 -8275 -2195 4338 3869 -1342 -2327 -1005 6669 13280 3639 -4524 -4239 -7314 -5093 -1906 -6791
413 -6791 -6613 1026 7407 7295 1748 2016 3522 2119 5341 284 -9455 -1705 7369 4910 2411 -4158
429 -4158 -11135 -7872 -116 1828 -6326 -10262 -1835 3616 10146 16762 5420 -4040 2412 3646 226
444 226 -605 -4499 -7004 -2891 4320 3288 -4904 -1828 2079 -4671 -3342 -1723 -8770 -2255 9267
459 9267 6012 753 1547 3100 3576 5177 4658 -6846 -11351 2792 7002 1733 3989 -2449 -9489
474i489R626M930q931n899K898L994K400Q038K103j0982J854Q819q251m433M375
489A052o118l19R792L58p572Q49P533j505n452K030n704o198J3690N347j1878
504d095N95M554l407K914M163p109p490O856R335m108J053P078p712k180J0734
519A1181p074j1428M085K45m559L742L608n855j004J2575J374j3077J538M586
533f3m672R295P166j3385k950J2440K607n249j158l624r712K268J2386n589p907
548h147Q288k360n780J1557J610j2479K20O876r52M53Q200K85p449O733M707j4576
564b814j242J0641p579o334L876m960o70J4220N472j2764o904Q173R89r55J0519
579I668n065j4487Q729Q712o083K981K056j2867n467J1033M537p688J586O036
$$ plain form
474 -9489 137 5067 -3864 -9763 -6865 -2871 -471 7567 9670 -1312 542 9361 1110 -3323 1052
489 1052 -5066 -5385 4407 4765 -2807 -1958 5575 4070 -1382 648 -5056 -11254 2436 7783 -4095
504 -4095 -3500 1054 -2353 561 4724 -2385 -9875 -3019 6316 2208 3261 10339 2627 447 11181
519 11181 4107 -7321 -3236 -2991 -7550 -3808 -200 -6055 -7059 5516 6890 -6187 -4649 -63
533 -63 -4735 4560 11726 -1659 -4609 7831 10438 5189 4031 407 -9305 -7037 5349 -240 -8147
548 -8147 141 -2219 -7999 3558 5168 -7311 -7091 -215 -1167 -714 7486 7771 322 7055 11762 -2814
564 -2814 -4056 6585 -994 -7328 -3452 -8412 -9082 5138 10610 -2154 -9058 -885 104 -851 9668
579 9668 4603 -9884 -1155 7557 1474 4455 6511 -6356 -11823 -790 3747 -3941 -2355 3681
593C681n977M085J1057j1605q329J1455j533j0040L492L513l314L613O703q039
607a238p691J1852L643j2026L782M716r091N587J1602o538n578M576k783o856
621f043N943O497j1878m829J2343j044m294Q786m308r279R897M590j1691j593
635f903J0966J915n003L881j289r236Q696P901j5429n598R132m107r49J1434m24
650D987r905J447O685l148Q25Q238r666j1390J3863P647q434K402N65r990J732
665d142P036n974n609R216M259j1336J367J1268l522j42O207j1350o930J2799
679C147L101p574J629L674o504j886R688j765j0245M016O75p465J1034R017j2820
694b278m215J0390K399k617Q82m441r131N944J1464q425p000R995j990p202P811
$$ plain form
593 3681 -2296 1789 12846 1241 -7088 4367 2834 -7206 -3714 -201 -3515 98 6801 -1238
607 -1238 -8929 2923 6566 -5460 -1678 3038 -6053 -466 11136 4598 -980 3596 813 -6043
621 -6043 -100 6397 -5481 -10310 2033 989 -3305 5481 1173 -8106 1791 6381 -5310 -6903
635 -6903 4063 5978 975 4856 3567 -5669 3027 10928 -4501 -10099 -967 -5074 -6023 5411 4987
650 4987 -4918 -3471 3214 66 891 9129 -537 -11927 1936 9583 1149 3551 4116 -5874 -4142
665 -4142 2894 -3080 -8689 527 4786 -6550 -5183 6085 2563 2421 8628 -2722 -9652 3147
679 3147 6248 -1326 303 3977 -2527 -4413 5275 3510 -6735 -2719 -2044 -9509 1525 10542 -2278
694 -2278 -6493 3897 6296 3679 4561 120 -9011 -3067 8397 -28 -7028 2967 977 -6225 1586
709A586M61p469M504M049o250P9J0182j83r044M808M154j0688m7O010p224N00
725d572P969n953m922R857N005q296l819O133p80j290P086n660p984J2173N228
740A0175j0981j543K953m241k73N503k251o874M710N884n503L412Q278j0255o475
755g481R621J932k510K729l565o460N169Q896n331r165M419Q37o751N712M383
770B435n548M608M469p878j070Q919J135p631k046K052l658K243Q241n640n724
785e093O198k359m481Q130K794p704k633M572L304J339L249n003r923N764Q286
800F440p159k849L453l813R38O352j271l949K583K031n629j763P402r85m925N571
816B427J77m579M849J337n823J289K980m232m107M168M565l964p25K580m151K344
$$ plain form
709 1586 2047 -5422 -918 3131 -3119 -3040 7142 6959 -2085 2723 6877 -3811 -3858 2152 -5072 -4572
725 -4572 3397 -2556 -7478 2379 7384 -912 -4731 1402 622 -668 6418 758 -7226 4947 10175
740 10175 -806 -2349 604 -3637 -3910 1593 -658 -7532 -2822 3062 -2441 971 9249 -1006 -7481
755 -7481 2140 4072 1562 4291 726 -5734 -565 8331 3000 -6165 -1746 -909 -7660 -1948 2435
770 2435 -3113 1495 5964 -1914 -2984 5935 7070 -561 -2607 -555 -4213 -1970 6271 631 -5093
785 -5093 1105 -1254 -5735 2395 5189 -2515 -5148 -576 2728 4067 7316 2313 -7610 -1846 6440
800 6440 -719 -3568 -115 -3928 -2990 3362 2091 -1858 725 2756 -2873 -4636 2766 1781 -3144 2427
816 2427 2604 -1975 2874 4211 -1612 -323 2657 -1575 -5682 -1514 3051 -913 -1638 942 -3209 -865
832h65O404o615m604O606K499j817N76%k042j48L430k918o360L859J748m613M115
849g45L924m448N02L196q13k05O32j507l850K057O035l589m612L650o15j089L800
866B323l309l972L721L119j234j323K127J165k238J366Q29n217J283K722m069
881b707R44L831j965r67J490N78j263j217J114r08j042L687j421k988M989J900
897D055l220q12j524n85K883J341j633l447O64M171o85n33Q79m112m90L731l74
914C09M23R96j824k79Q56J607r8l616l58O52j326K456O95j862K651R39j880R7
932D38J25R75L70k445p57l92M94L645j054k831L90j144J052K271j032n06m18k86
950a105K701Q00p39l64k607l18J828q30R5J49n74K399K43j364Q36j328K39R23
$$ plain form
832 -865 5539 -1076 -5680 926 3425 1608 2184 2184 142 -6 3424 506 -5854 -1995 -247 -4860 -745
849 -745 3179 -1269 -767 2429 1616 1411 2043 536 -3314 -1257 4778 1189 -3423 227 -388 -1477 2323
866 2323 -986 -4958 -1237 1882 648 -675 1452 2617 379 1745 2574 -2643 -1360 1362 -2707
881 -2707 -1763 2068 103 -864 626 1204 -59 -1276 -162 -1070 -2112 1575 154 -2834 2155 4055
897 4055 835 23 -1501 -2086 797 2138 505 -2942 -2278 1893 1208 675 1554 -2558 -3048 683 309
914 309 732 1728 -96 -375 481 2088 1990 -1626 -1984 -1332 -2658 -202 493 -1369 1282 2221 341 438
932 438 563 1538 1908 -537 -1294 -1686 -1192 2453 1399 -1432 -1042 -2186 -1134 1137 105 -401 -819 -1105
950 -1105 1596 2396 1657 1293 -1314 -1632 196 -634 -539 -390 -964 1435 1678 314 1150 -178 61 984
968I84k580p26J207N04J603o33j387M72l12J803J351k870K0R25q88K654J007k826
986C08m99m46j1N40r01L63q28n83L338l46j738K439q25j785J342j056j036J147
1004e77J196L29j325M04J709j490J009J317m348l59L234r92L17O31k086p32J091
1021f72J690j143k406J808K00j301M123M14l482K196Q96k495L49M68j399p84J268
1038b70J353k624K63L582k394q54K796l149j648M281o7k050N45P66o30j64K353
1055B089q78m070K616J934l732K413K431l908N68K741j933j695J268N50k294K19
1071a681L238k482j181N607j491l971K712n15k395K818J698l350j491L039J407
1086A962k477J859P60n474J479M538l433o41L332k542j736L195J048k918m35K899
$$ plain form
968 984 -1596 -2322 -1115 -611 992 359 -1028 -556 -868 935 2286 -584 -564 361 -527 2127 3134 308
986 308 -191 -637 -648 -108 -1009 -646 -1474 -2057 1281 935 -803 1636 811 -974 368 -688 -1724 -577
1004 -577 619 948 -377 27 1736 246 1255 2572 -1776 -2135 1099 107 424 1055 -1031 -1763 -672
1021 -672 1018 -125 -2531 -723 -523 -1824 2299 2713 -769 1427 2323 -172 177 645 -754 -1538 -270
1038 -270 1083 -1541 -1278 2304 -90 -944 1852 -1297 -2945 1336 1269 -781 -236 530 -100 -264 2089
1055 2089 1211 -2859 -243 1691 -2041 372 2803 -1105 -537 2204 271 -1424 -156 394 -1900 -1681
1071 -1681 1557 -925 -2106 3501 2010 -1961 751 236 -2159 659 2357 -993 -2484 555 1962
1086 1962 -515 1344 2104 -3370 -1891 2647 -786 -1427 1905 -637 -2373 822 1870 -1048 -1483 1416
1102A416k012k110M862j88l836M253Q00n449J604K657k801j035J920r88k854L460
1118c01M002m266p84M038l645q29N695k434m177K819J315k384Q46K587k801l406
1134c725M259Q10m650L678K533n240J836L881l737j036L423j123l756J379K901
1149A433k986L71N245l821l616N695k62l717L459r5m915J105M441j396l157K836
1165F20J84m670L588L745n749L84N031l791j006M729r72l628J734K042m009q81
1181b649M962k273l447N515k45n249M270K452m973P3K826k150j574M057O50n341
1197c096K042M702m493o16M707m252k246N758l97l881K141J808l466o71M509j949
1213F00m682M630J227n290L862L257n714R32M427l044l093L241J221l592J521
$$ plain form
1102 1416 -596 -2706 2156 1968 -1868 2385 3185 -2264 -660 1997 -804 -1839 81 -907 -3761 -301
1118 -301 3701 -565 -1349 2689 -956 -1785 3910 1476 -2701 118 1433 -951 -105 2482 -319 -3725
1134 -3725 534 1344 -3306 372 2905 -2335 -499 3382 -355 -1391 2032 909 -2847 -1468 1433
1149 1433 -1553 -1182 4063 242 -3374 2321 2059 -1658 1801 1706 -3209 -2104 2337 941 -2216 620
1165 620 804 -3866 -278 3467 -2282 -1898 3133 -658 -1664 3065 2093 -1535 199 2241 -1768 -2649
1181 -2649 2313 40 -3407 2108 1863 -3386 884 3336 -1637 -1564 1262 -888 -2462 1595 2245 -3096
1197 -3096 -1054 3648 -845 -1461 3246 -1006 -3252 2506 2109 -1772 369 2177 -1289 -1960 2549 600
1213 600 -4082 548 1775 -3515 347 3604 -2110 -1178 3249 205 -2888 353 1574 -2018 -497
1228d97L541m827q87O710k627m169M615o70m347L135K453l396o57L683j569l886
1244c395M176J986n691J882L841n285L84N307k396k159L469m91m451J391M848
1259C416l027k805M174k023k969O267J56o380J864K775l222J22L829j575l594
1274b992L267K474m524J838M077n855j387N976j828k942L276k02l449J673L246
1289B648l329k248M677j023m739M628K570m678J875K172m555M26M544j673m217
1304b922J792K321k997R36M454m040k340N198j756l106M554L32m400Q57L243j451
1320F75k053K708j039l965L717K323n699J152M793k998p72L398j352k194K611
1335A305J372l920k24M265k811l045M588k32l938L090K42l842K159L166k351j729
$$ plain form
1228 -497 3044 -1783 -2670 4040 1413 -2756 1859 1189 -3158 -23 2430 -966 -1623 2060 491 -3395
1244 -3395 781 2767 -2924 -1042 2799 -2486 -2102 3205 809 -1350 2119 1628 -2823 -1432 3416
1259 3416 389 -2416 1758 -265 -3234 3033 3189 -3191 -1327 1448 -1774 -1652 2177 602 -2992
1274 -2992 275 2749 -1775 63 4140 -1715 -3102 2874 1046 -1896 1380 1178 -2271 -598 2648
1289 2648 -681 -2929 1748 725 -4014 614 3184 -1494 381 2553 -2002 -1576 2968 1295 -2922
1304 -2922 -1130 1191 -1806 -870 3584 -456 -2796 2402 646 -2460 2094 2426 -1974 -1117 2126 675
1320 675 -1378 1330 291 -3674 43 2366 -3333 -2181 2612 -386 -1158 2240 888 -1306 1305
1335 1305 2677 -1243 -1467 2798 -13 -3058 1530 1298 -2640 450 692 -3150 -991 2175 -176 -1905
1351a905L241P28l593J946K837m088k51L049l777o86N103j169l864J412K089j212
1367a40M1K007k607k595M487P96l956K632J671m279P70L074j508j152J307o99
1383a51k202K483L302l926j788L727j598j527L409j176k669K410R79k159M63K894
1399B471j145l501J724J480k569K004J056m304R61L688j363r59J780m63k016P11
1415d45K319j391j090K076k290j997M282K50l685M63R87p08J309J528j123j553
1431a068J950J595k924N14K303l060q28K035j354k85K001r80j737R50J965r23
1447A54j564K031M9j793K201M69k451J925Q14k775L07J628l80j540j56R16o41
1464h06M40J496k570p28L315o98j308J388k51k86R67O61n55q33L76l06j851J295
$$ plain form
1351 -1905 1336 2064 -1529 417 3254 -834 -1085 1964 -1813 -2499 2604 1435 -2429 -1017 1072 -140
1367 -140 -99 1908 -699 -3294 1193 1989 -1967 665 2336 -1943 -1173 1901 393 -759 548 -151
1383 -151 -2353 130 3432 -494 -2282 1445 -153 -1680 1729 553 -2116 294 1273 -886 -423 2471
1399 2471 1326 -2175 -451 1029 -1540 464 1520 -2784 -1823 1865 502 -457 1323 860 -1156 -445
1415 -445 1874 483 -607 1469 -821 -2818 1464 1714 -1971 -1508 -521 -1229 80 1608 485 -1068
1431 -1068 882 2477 -447 67 2370 -690 -1518 517 -837 -1122 879 -101 -1838 -888 1077 154
1447 154 -1410 621 670 -1123 1078 1547 -904 1021 1835 -940 -633 995 615 -925 -1081 -165 -806
1464 -806 -366 1130 -1440 -2168 1147 449 -859 529 278 -8 959 1620 1065 232 608 302 -1549 -254
1482b54J126k690m8J498o41J311P28j504j74J075J048n77r28J215o68j218J284
1499E83o40j018J336r58j258J187J087L71l85l75O46l25M63Q04j744l87Q77j518
1517a254M57J344n68l31m25k2J329K59K9n86j398J464Q80r01L67n73p57P63q0
1536ck14L99p15K8n6l9J336l62p84K03m34N23Q18o72J00K12l78R70j30m56O18
1557I64r28p32L17l45M79j4r82L67J62M77J153j087j03J281o26L01P59r97m1l9
1577C66n26Q8m24J04k26j094J191O49j084J124K82p87J168L02j131PL82J57l93
1596A55l08O53r19j94J475j273o53J446o98o06R71L15k77j8M15j55r21J281M34
1615A123j883P92P79j826P47J307j297m58M81m35k18Q55J118j232q27K038l53
$$ plain form
1482 -254 872 -1818 -1866 -368 -1009 302 1030 -474 -648 427 1475 898 -30 1185 517 -701 583
1499 583 -57 -1075 261 -697 -1955 -768 319 690 305 -70 576 251 714 1518 -226 -613 264 -1254
1517 -1254 -797 547 -21 -352 -777 -799 530 789 818 232 -1166 298 1178 277 644 71 -686 77 -3
1536 -3 -217 182 -533 -505 -561 -600 736 374 -410 -207 -641 -118 700 28 128 340 -38 932 802 346 964
1557 964 36 -696 -379 -724 -245 -259 -1241 -874 -712 -235 918 -169 -272 1009 383 684 1443 446 405 366
1577 366 -160 -72 -496 -392 -618 -1712 -521 128 -956 168 450 -337 831 1133 2 9 391 548 155
1596 155 -153 500 -419 -613 862 -411 -1064 382 -316 -922 49 364 87 69 484 329 -592 689 1123
1615 1123 -760 32 811 -1015 -268 1039 -258 -716 -235 -670 -888 -33 1085 -147 -974 1064 711
1632G11p75K127j075k191J228L70j222J32P12p40j035J246J264j617R42J448k158
1649f33L05K301j167q17J436o80j623L95J119j121r50J526p73j580K791O73k175
1666i73J490N90j845O65J576r08j314R57N63j733O98J898k364o87K514j561j108
1683a542K517m32j677R68J115j308l59J892m28k344J847R24k776J713J642k750
1699i98J8J950j011p84J378K22k128N40K533j775q73K648j410j973K893p8k637
1716a485J218J085j781k72K041k53k145J822J123k960J284K410k619m39K801j503
1732C27j365J966K68k005J12J783j745j122L170q35k795K786N29k687J635J461
1748A483k350q6K163n31k024J806J303k897N03K552k671p82K959j388j813K385
$$ plain form
1632 711 -64 2063 988 -1203 25 395 -827 -695 17 -723 -1758 -512 752 -865 77 1525 -633
1649 -633 -328 1973 806 -11 1425 745 -878 -483 636 -485 -1435 91 -682 -2262 529 1202 -973
1666 -973 517 1107 -738 -73 1503 595 -719 238 801 -932 -234 1664 -700 -1387 1127 -434 -1542
1683 -1542 975 543 -1134 -166 949 -359 -718 1174 746 -1598 249 1173 -1603 110 1752 -998
1699 -998 -980 970 -41 -825 553 775 -1353 -813 1720 -55 -928 1720 310 -1663 1230 1152 -1485
1716 -1485 -267 818 -963 -1235 806 553 -1592 230 1353 -1607 -323 2087 -532 -971 1830 327
1732 327 -1038 928 1196 -809 -697 1086 -659 -1781 1389 554 -2241 545 1074 -1613 22 1483
1748 1483 -867 -953 1210 679 -1345 461 1764 -1133 -630 1922 -749 -1531 1428 40 -1773 612
1764F12K96k079P44K131j631j522K501k38k789K507J040l458J215K246k298n52
1780a275K386p61j902J697J521k429J88L009k326j664L418j205k617K224M93k565
1796a808P50K144j541j256K499J98k919K122K022l118M50K662k563n71K814j045
1812H40k306J252J295k333nK650j696k068L332k19k648K570J009k836O31K186
1828A654j582j073K157K16k824J258J991k985r6L164k399j560K971l45j807J620
1844C60J131k174k77K535j122k093K627L26l336J854J817k937L55K341j585j090
1860a268K123J88k249J065K125k606p09L265j868k031K935m77k422J864J323k080
1876h22n6K125o09j988K301Q84l168Q27K209k743P3K598j864j557K244M27j855
$$ plain form
1764 612 908 -1171 -427 1704 73 -1449 1052 814 -1975 532 1572 -1886 -671 1575 -723 -1275
1780 -1275 1111 350 -1552 145 1666 -763 -575 2434 108 -1556 1862 657 -1960 264 757 -1808
1796 -1808 -1058 1086 -455 -1711 788 986 -1933 189 2211 -907 -457 2205 -358 -929 1885 840
1812 840 -1466 -214 1081 -1252 -1257 1393 -303 -2371 961 742 -1906 664 1673 -1163 -532 1654
1828 1654 72 -1001 1156 1372 -1452 -194 1797 -1188 -1284 1880 -519 -2079 892 547 -1260 360
1844 360 1491 -683 -960 1575 453 -1640 987 1313 -2023 -169 1648 -1289 -934 1407 -178 -1268
1860 -1268 855 1043 -1206 -141 1984 -622 -1331 1934 66 -1965 970 493 -1929 -65 1258 -822
1876 -822 -878 1247 638 -1350 951 1835 -1333 -506 1703 -1040 -967 1631 -233 -1790 454 881 -974
1893i74N37J740j801j037L075r39k214K646J75k807J401J764k042l96J904p06
1909C26j610J628J058k733N89K315k621o78K969j201j459K147J09j579Q30J610
1925A700j499j285K367l27k481K029N19k787J222J619k200j77K063o70j303J394
1941A84J223j921J72K161j811q35K596j236k180K011L53j869O20J160r50p66J542
1958D54K23k183J610J208k546Q00J989j778l39J592p39j073J060P93j748k47J959
1975A035j019j440K437l82k142J806N09j740J014J087j286q42J412L99j410N28
1991c4R53k052J69K224j492p21J734o57p85J165O95j117l54R72p03j163J820q9
2009E65k050J081P55j330O16R77r30k80J012J87p23L85J238j538n78J754j035
$$ plain form
1893 -974 -437 1303 -498 -1535 1540 601 -1613 1033 1208 -1599 -198 1566 -476 -872 1032 326
1909 326 -1284 344 1402 -1331 -742 1573 -1048 -1726 1243 42 -1417 730 839 -740 90 1700
1925 1700 201 -1084 1283 956 -1525 504 1023 -1764 -542 1077 -1123 -1300 763 93 -1210 184
1941 184 1407 -514 -342 1819 8 -827 1769 533 -1647 364 717 -1152 -532 628 -322 -1088 454
1958 454 677 -1506 104 1312 -1234 -434 1555 -223 -562 1030 291 -782 278 1071 -677 -924 1035
1975 1035 16 -1424 1013 631 -1511 295 804 -936 78 1165 -121 -963 449 848 -562 -34
1991 -34 919 -1133 -964 1260 -232 -953 781 124 -661 504 1199 82 -272 700 -3 -1166 654 565
2009 565 -1485 -404 351 -979 -363 614 -316 -596 416 603 -120 265 1503 -35 -613 1141 106
2026A06q75J318o74j224J149N61p43l1O19j69p43J122M61j509O10Q56j420N85
2044aJ121j073n44P22lm13J07N21p94o43J521l31j226J395r2j054R67K98p10L84
2064A52M14l15n38M87P38j140k44Q45j102K49J009r48j83R61l00k58K36L41j73
2083B31o25N93K40r28O28J15j152J045J97o62J05o9O6K99r8M23m06k07P89m65
2103A19l35R48o57n51N07k68P4L48l21r7j72J59O39o30J71M64o73N47L35o21M57
2124D43Ln89L93l78J52K21p81J60K08k06O68l96k54N42k45K14M45n13K97j46n18
2145b80M92N2n12K10m11j24M53j50L47p6l49Q31j47l63O68m23l15M40m85j8J89
2166B9j07r2k71O4N89n73Q8O00o83L75N06p96M45L64l00p4q7J21l1m98L74l2o61
$$ plain form
2026 106 -769 549 -125 -1349 -200 361 -382 -413 206 37 -706 416 877 -632 -22 834 -586 -1
2044 -1 1120 47 -497 225 222 -191 -84 437 -357 -1000 521 190 -1036 359 267 -787 180 478 -232 152
2064 152 566 251 -287 200 938 -202 -446 399 -703 -454 555 -393 -576 385 85 -173 63 404 231
2083 231 -394 199 439 -489 139 254 -898 147 344 -318 -213 -282 -216 83 -15 408 2 -205 584 119
2103 119 -216 732 75 -476 31 -237 -163 185 -136 -233 -405 -246 393 -237 -66 398 -275 272 607 -14 443
2124 443 446 -143 250 -128 24 245 -536 -376 -168 -374 294 -102 -356 186 -59 155 600 87 384 238 -280
2145 -280 212 264 -248 -38 -449 -573 -120 -270 77 1 -348 483 336 -27 641 218 -97 343 -142 -160 29
2166 29 -78 -170 -441 -377 212 -361 -273 327 -356 19 525 -271 174 538 238 164 77 198 167 -331 43 11 -650
2189f50J028m14q95J064P9o55N15p9j17P1K96K99o98J32P33r19m5J029j032k84
2209e42Q76n03k42N08j7l86j57P22j8q98J014J44j280J086L74j077L87M65p11
2228b55j11O10J76p38Q2Q91q02m46J449q65q89J555o30q38J029P9p03rP40j12
2248B13p96Q11M43j516O96J027j378K89J083j055k46R46o6o27J59N32o96o17J425
2267F27m23j313J392j42j331J083O08r72L21R12l81q52Q49P88j502J81J253j658
2285e60j41J418r63q66J283j30p43M81Q10n39p28J483j69j385J382L41j855R31
2303E0Q45j552P7J040n32p41O56P53j321L07J638j459p42J998q23r81J387j2j353
2322g65N99Q16q18n88J201p1j575J356P89j871N97J448j637N8J257n23j028R27
$$ plain form
2189 -650 378 -36 -931 133 212 -443 72 -7 -124 -53 243 542 -156 -24 709 -210 -255 774 -258 -542
2209 -542 334 -169 -411 97 80 -306 -463 259 241 -657 357 501 -779 307 681 -396 -9 456 -255
2228 -255 -366 244 420 -318 -236 655 -147 -593 856 -9 -898 657 27 -811 218 297 -406 -415 325 213
2248 213 -583 228 671 -845 -149 878 -500 -211 872 -183 -429 517 451 -176 -17 515 -181 -798 627
2267 627 204 -1109 283 141 -1190 -107 501 -471 -150 762 381 -471 378 1166 -336 -155 1098 -560
2285 -560 -701 717 -246 -1112 171 41 -702 -221 589 50 -678 805 636 -749 633 974 -881 50
2303 50 895 -657 -580 460 -72 -813 -157 596 -725 -418 1220 -239 -981 1017 194 -787 600 588 -765
2322 -765 -166 650 -168 -756 445 374 -1201 155 944 -927 -330 1118 -519 -461 796 273 -755 172
2340A72O39j286j06J545j022r31J772l73j785J703M80j664P11R47r46m97J249
2357F08K2j318R01R69k039J80J705j485n45J767o30j086J102N42j206JJ590q38
2375B40j328J700J66j877J330O11j885P28J268j279m88J391j11j282Q52J093j618
2392d89k04J832j321q04K006p18j386J103Q69j361J13J120o76j139J503M59j923
2409a016J022J164k181L13J751j229m87J204j17j209P47J144j441n05J837q96
2425A01j364J849L3j726J170O41j473K87J481p45r66R65O58j728O81J295k002
2442h43L1J793j265q38J638j51j169O87R20r09o35J693n27j533J781K96j912Q49
2460i4J064j640K9J106m69r53J050N47j308L74J549j453o43J911q06j122J578
$$ plain form
2340 172 811 -475 -581 964 -58 -989 783 410 -1375 328 808 -856 -145 802 -144 -641 608
2357 608 630 -688 213 1182 -857 -677 1028 -457 -1002 765 135 -951 151 693 -513 -512 1078 240
2375 240 -1088 612 778 -1099 231 842 -1043 -315 953 -326 -814 577 466 -816 36 1129 -489
2392 -489 -693 1139 -182 -986 1020 302 -1084 19 888 -473 -360 760 84 -1055 448 907 -1016
2409 -1016 6 1170 -1011 -698 1053 -176 -663 541 424 -785 -38 1106 -335 -840 997 101
2425 101 -1263 586 619 -1107 63 704 -769 -482 999 254 -712 253 911 -817 -136 1159 -843
2442 -843 -812 981 -284 -1122 516 365 -804 -117 803 -106 -741 952 425 -1108 673 969 -943 -94
2460 -94 970 -670 -641 465 -4 -957 93 640 -668 -294 1255 -198 -841 1070 264 -858 720
2477G20k03j485P77Q76r51n44J318j20j504J311O45j727P13J259j429k15J546
2494I87q02j015R61M65j009q4J264j041q05J845l69j467J440L22j435P65Q22q74
2512c0l64Q93r3j202Q48Q16j585J29J473j204n43J732o36r33R36M09r23M8J122
2531H93o23r44J259m0j578J214M57j605O48R32r02j68P75R8j022O55P82j262j26
2550e57J564j050q37J605m26j096Q67L43q16K12O67l31r00J158J63j410Q22Q06
2568G84j436N07P73q27j65P83p7q92M95O97q19m26J324q21p58J353k54r69Q90
2587A62K54q12K05O25l63n44O74L62j038M25Q89j204N7Q88r28k24R61l81m79M90
2607A9K34m32k76R71k15q26Q94L2r61O76L92r02J57M36k77l53M19J94o10R6R08
$$ plain form
2477 720 517 -968 -191 685 -266 -810 508 388 -1116 195 840 -887 -174 1085 -344 -559 987
2494 987 185 -830 131 596 -413 -497 767 -274 -1079 766 397 -1070 370 692 -743 22 844 -30
2512 -30 -394 499 406 -796 52 868 -717 -588 885 -319 -862 870 234 -699 237 646 -277 -229 893
2531 893 270 -674 585 545 -1033 181 638 -967 -319 613 -289 -457 318 416 -606 49 831 -431 -557
2550 -557 1007 -43 -880 725 299 -797 70 413 -403 -191 476 145 -755 403 566 -844 -22 784
2568 784 -652 -145 628 -199 -364 419 342 -550 -55 642 -177 -603 721 -100 -858 495 241 -728 162
2587 162 416 -396 -191 434 71 -473 201 563 -475 -50 839 -365 -308 580 -348 -572 389 8 -471 19
2607 19 253 -179 -455 516 301 -525 369 401 -560 116 508 -394 -237 199 -78 -431 -12 182 -428 -332 576
2628E76q71k1R61n61m57P60k53m23L46M0l35n7L04K18p55N59L67r43N52N27p16
2649a82J44L45l73m9J48J28m19j25O23k64m78Q40l64l25O20p0l94L65L4k46P8
2670C6K6K04m32J21J97m55J27N02m76r4L70k61J4K39o1oj52J79P2l54M26N2o98
2693d24M28J49l78L69o8j43L6QM4P1k19L01l22K3L52l20n6K76k82J37J85k72J63
2716E8l8j62K81j95J16N8k60J96L2k28K37j26j89L64l06J95J39l30R3J99k11J31
2738E4O2k20J78n1jJ00k05J12P6m12L65K1k50L28l3k50K60m8J41j61k48K94j03
2761Ik01N07m30k17M83k80q1L26q1p7M0n3L03l29K22K33o92K68M18o60J92K44
2783A44m25J28J11M2l2J1L12k57j96N28k51m32N54p0n08L80O5l92J55K79j52j19
$$ plain form
2628 576 -295 -316 645 84 -373 387 134 -289 57 97 -238 -295 9 227 -528 31 398 -545 7 534 -182
2649 -182 -38 307 -66 -115 33 161 -258 -383 240 -24 -502 338 -26 -351 269 199 -195 170 204 -42 36
2670 36 62 266 -166 -45 152 -303 -176 326 -150 -244 126 -135 -121 118 57 51 -101 78 150 -204 222 274 -424
2693 -424 4 153 -225 144 76 -67 -31 -23 21 92 -127 174 -148 -125 227 -93 -149 127 -155 -18 167 -105 58
2716 58 20 -142 139 -56 60 118 -142 54 86 -142 95 -31 -220 144 -162 33 172 -158 -65 134 -77 54
2738 54 116 -104 74 23 22 122 -83 29 105 -307 58 79 -171 157 124 -126 134 86 227 66 -182 112 9
2761 9 -192 315 -115 -332 151 -129 -210 116 35 -42 -2 -55 248 -81 141 374 -318 -50 368 -292 -100 144
2783 144 -281 -153 -42 0 -32 -21 291 34 -162 366 115 -317 237 167 -341 39 104 -288 -133 146 -6 -125
2805a25J66L47o63J71O23q43J28N72n62j91N00n8l66K39J99j92k99P44j41p20
2825d71P75J12r09P39J44o98J68L33l12j17L30J88o35J69O86o69k09Q24n31k56
2845c39P94k49m97M55J09m60p9N23j23o38O37Q9p84O31M46r39J78O51n26j19L22
2866H2R4m88P8P38o49l69J155m81p36R24J2p86N56K35n89O2L50j72n39O17K92
2887C86j034M37Q07r20j1Q31m58m42O81M8n47J08O87n71n07J055l87q53Q77K24
2907D11j138O03N24q03R5O07j81n36M73M25q55K76Q54j043j23J071n95o22Q90
2926C33O8p75K51O40n49m51Q54j67r05R41K62j215N70O81r37n3R41l35n50N80
2946A84L93r94K29R57q01n96J312n49p68R82j25p32L19N18n77l07P44J71j015
$$ plain form
2805 -125 41 388 -275 -104 519 -324 -196 376 -186 -377 123 65 -301 -62 137 -55 -354 390 249 -471
2825 -471 304 416 -493 246 390 -308 -140 193 -119 -236 94 282 -353 -184 502 -167 -376 448 -83 -339
2845 -339 455 206 -291 164 273 -187 -266 257 134 -504 133 222 -562 69 515 -424 -246 405 -121 -240 82
2866 82 176 -312 -234 504 -145 -514 641 160 -576 348 360 -426 130 365 -224 -162 188 16 -523 94 386
2887 386 -648 -211 596 -324 -335 496 38 -404 277 325 -222 -114 573 2 -505 550 163 -690 187 411
2907 411 -727 -124 400 -403 -308 299 118 -418 55 480 -375 -99 755 -288 -411 660 65 -557 333
2926 333 401 -374 -123 517 -32 -483 371 204 -701 240 502 -713 -143 538 -399 -452 489 154 -396 184
2946 184 577 -417 -188 769 -32 -628 684 135 -633 349 224 -508 -189 329 -248 -555 189 360 -655
2965f55P90N70j171L15Q42r67j26J045m37o84O28K23o97N5P94n83n79J170l07
2984B26r42R16L39j054L54M88m88l55Q53J5j015O50P00j188J39J138q49l91J068
3003F04l91p31P27K37q07J4Q22m54p09J045J07j122Q49M40j124M17O96p13l09
3022d02O53Q4q51L46O98r19j81J223p17p40J218j92q15O74L97p07P7O58m17o07
3042e20Q88J13j159O01P79j254K57R71p01m94Q21o4o62M10O00p49l87J190m96
3061A44p75R80m9j016P77M66q77J47O36l41n46P21K54j022M38O69r29j28J089
3080F38p26n17R93j95n10K81M65m89l89R59l47q16R91P4j033N28O97r56R5N50
3100B93k61m65N87K05q18J11R11p06m08J159n32n38P30o1o91L66N10n05k86O12
$$ plain form
2965 -655 135 705 -466 -151 691 -276 -402 643 206 -478 150 373 -324 -269 525 -58 -637 533 226
2984 226 -716 200 539 -515 -161 327 -161 -516 337 352 -663 -13 687 -501 -362 776 -73 -464 604
3003 604 213 -518 209 446 -361 -347 475 21 -688 357 464 -658 191 631 -493 -76 620 -93 -402
3022 -402 251 335 -516 -170 528 -391 -572 651 -66 -806 412 220 -595 79 476 -231 -154 504 87 -520
3042 -520 368 481 -678 -77 702 -552 -295 676 -25 -519 302 238 -424 -14 586 -163 -550 640 144
3061 144 -631 349 300 -716 61 527 -350 -203 433 92 -454 267 521 -501 -63 606 -323 -451 638
3080 638 -88 -605 388 193 -317 -36 429 -60 -449 510 163 -653 338 412 -621 -93 604 -352 -257 293
3100 293 32 -433 154 359 -459 -348 563 -143 -551 608 76 -462 268 207 -484 -118 392 -113 -399 213
3120B13K5p53P72L57j130M77O09q00p5O88k31m78M71N0n20P4P25n59l17R16k47
3141B67q00P98J48q65M69L62n14j64M22m9m92M67M25q35J72P10o69n4P01m97k86
3162b84M48J42m18j91N34k23n02P00o8p00P11J68o47L69L41m95k8L32O0m81J60
3183g2N10o72j18P70n96k60P27k82l86N68O0m34M4L30r0l91L85K09o00K16M06
3204C24p22K83M00m36l7L41oj73%L58l73k03N56k16n70O75r2n04M21J60l19PL65
3227B39j94j43N6K94m11J43L50n05n2N38m72m9M89k60j21J24J75j31k80L68L1
3248A89m21L71Q0m91L15N1l19K57l5n4L5J7P8q8k2L10l15j40N25m07j14L65j75
$$ plain form
3120 213 238 -515 257 614 -516 -39 570 -230 -305 383 152 -326 145 195 -325 -251 474 -85 -402 514 267
3141 267 -533 265 413 -452 17 379 -135 -299 123 74 -418 49 474 -361 -189 521 -148 -202 499 2 -284
3162 -284 164 306 -112 -303 231 8 -494 206 138 -562 149 317 -330 39 380 -115 -143 189 249 -232 -72
3183 -72 438 -234 -352 418 -178 -438 289 7 -379 189 249 -185 -141 189 99 -292 93 302 -298 -82 324
3204 324 -398 -115 285 -151 -188 153 147 -26 -26 332 -41 -244 312 96 -474 201 109 -395 26 186 -133 -126 239
3227 239 45 -98 -42 252 -159 -16 334 -171 -223 315 -157 -206 283 23 -98 26 201 70 -210 158 189
3248 189 -232 139 219 -272 43 94 -225 32 -3 -57 -22 -5 73 -15 -37 273 -42 -182 343 -64 -178 187 12
$$ [...]
8191a02
##END NTUPLES=NMR FID
##END=
