##TITLE=1H_Pr 5-BrBzt
 CDCl3+DMSO,8 sc, 
 11.03.2021
##JCAMPDX= 6.0         $$ Bruker NMR JCAMP-DX V2.0
##DATA TYPE= NMR FID
##DATA CLASS= NTUPLES
##ORIGIN= UXNMR, Bruker Analytische Messtechnik GmbH
##OWNER= root
$$ XWIN-NMR		Version 3.5
$$ Thu Mar 11 13:29:04 2021 Russian Standard Time (UT+4h)  she@DPX200
##.OBSERVE FREQUENCY= 200.131506
##.OBSERVE NUCLEUS= ^1H
##.DELAY= (6, 6)
##.ACQUISITION MODE= SIMULTANEOUS
##.ACQUISITION SCHEME= undefined
##.AVERAGES= 8
##.DIGITISER RES= 18
##SPECTROMETER/DATA SYSTEM= spect
##.PULSE SEQUENCE= zg30
##.SOLVENT NAME= CDCl3
##.SHIFT REFERENCE= (INTERNAL, CDCl3, 0, 15.7039)
##AUDIT TRAIL= $$ (NUMBER, WHEN, WHO, WHERE, WHAT)
$$ ##TITLE= Audit trail, XWIN-NMR		Version 3.5
$$ ##JCAMPDX= 5.01
$$ ##ORIGIN= Bruker BioSpin GmbH
$$ ##OWNER= she
$$ F:/spectra/data/she/nmr/H-F/1/audita.txt
$$ ##AUDIT TRAIL=  $$ (NUMBER, WHEN, WHO, WHERE, WHAT)
(   1,<2021-03-11 13:28:05.76 +0400>,<she>,<DPX200>,
      <created by zg, POWCHK disabled, PULCHK disabled
       configuration hash MD5:
       00 E9 B6 7A A2 85 ED C7 34 08 36 98 17 FE 4E 26
       data hash MD5: 16K
       3A 92 38 91 5F DF BD 0E 9B 6B EB 68 C6 92 F0 E0>)
$$ ##END=
$$ 
$$ hash MD5
$$ 51 82 17 2E D4 F8 53 70 20 42 E7 B7 69 E0 1A C7
##$RELAX= 
##$RELAX= 
##$RELAX= 
##$RELAX= 
##$RELAX= 
##$RELAX= 
$$ Bruker specific parameters
$$ --------------------------
##$DU= <F:/spectra>
##$EXPNO= 1
##$NAME= <H-F>
##$PROCNO= 1
##$TYPE= <nmr>
##$USER= <she>
##$AMP= (0..31)
100 100 100 100 100 100 100 100 100 100 100 100 100 100 100 100 100 100 
100 100 100 100 100 100 100 100 100 100 100 100 100 100 
##$AQSEQ= 0
##$AQ_mod= 1
##$AUNM= <au_zg>
##$AUTOPOS= <>
##$BF1= 200.13
##$BF2= 200.13
##$BF3= 200.13
##$BF4= 200.13
##$BF5= 200.13
##$BF6= 200.13
##$BF7= 200.13
##$BF8= 200.13
##$BYTORDA= 1
##$CFDGTYP= 0
##$CFRGTYP= 5
##$CHEMSTR= <none>
##$CNST= (0..31)
1 1 145 1 1 1 1 1 1 1 1 1 1 1 1 1 1 1 1 1 1 1 1 1 1 1 1 1 1 1 1 1 
##$CPDPRG= <>
##$CPDPRG1= <>
##$CPDPRG2= <>
##$CPDPRG3= <>
##$CPDPRG4= <mlev>
##$CPDPRG5= <mlev>
##$CPDPRG6= <mlev>
##$CPDPRG7= <mlev>
##$CPDPRG8= <mlev>
##$CPDPRGB= <>
##$CPDPRGT= <>
##$D= (0..31)
0 1.2 0 0 0 0 0 0 0 0.06 0 0.03 0 0 0 0 0.0002 0 0 0 0 0 0 0 0 0 0 0 0 
0 0 0 
##$DATE= 1615454885
##$DBL= (0..7)
120 120 120 120 120 120 120 120 
##$DBP= (0..7)
150 150 150 150 150 150 150 150 
##$DBP07= 0
##$DBPNAM0= <>
##$DBPNAM1= <>
##$DBPNAM2= <>
##$DBPNAM3= <>
##$DBPNAM4= <>
##$DBPNAM5= <>
##$DBPNAM6= <>
##$DBPNAM7= <>
##$DBPOAL= (0..7)
0.5 0.5 0.5 0.5 0.5 0.5 0.5 0.5 
##$DBPOFFS= (0..7)
0 0 0 0 0 0 0 0 
##$DE= 6
##$DECBNUC= <off>
##$DECIM= 32
##$DECNUC= <off>
##$DECSTAT= 4
##$DIGMOD= 1
##$DIGTYP= 9
##$DL= (0..7)
0 120 120 120 120 120 120 120 
##$DP= (0..7)
150 150 150 150 150 150 150 150 
##$DP07= 0
##$DPNAME0= <>
##$DPNAME1= <>
##$DPNAME2= <>
##$DPNAME3= <>
##$DPNAME4= <>
##$DPNAME5= <>
##$DPNAME6= <>
##$DPNAME7= <>
##$DPOAL= (0..7)
0.5 0.5 0.5 0.5 0.5 0.5 0.5 0.5 
##$DPOFFS= (0..7)
0 0 0 0 0 0 0 0 
##$DQDMODE= 0
##$DR= 18
##$DS= 0
##$DSLIST= <SSSSSSSSSSSSSSS>
$$ [...]
##$SUBNAM2= <"">
##$SUBNAM3= <"">
##$SUBNAM4= <"">
##$SUBNAM5= <"">
##$SUBNAM6= <"">
##$SUBNAM7= <"">
##$SUBNAM8= <"">
##$SUBNAM9= <"">
##$SW= 16.9725357007746
##$SWIBOX= (0..15)
0 0 2 0 0 0 0 0 0 0 0 0 0 0 0 0 
##$SW_h= 3396.73913043478
##$TD= 16384
##$TD0= 1
##$TE= 0
##$TE2= 300
##$TE3= 300
##$TEG= 300
##$TL= (0..7)
0 120 120 120 120 120 120 120 
##$TP= (0..7)
150 150 150 150 150 150 150 150 
##$TP07= 0
##$TPNAME0= <>
##$TPNAME1= <>
##$TPNAME2= <>
##$TPNAME3= <>
##$TPNAME4= <>
##$TPNAME5= <>
##$TPNAME6= <>
##$TPNAME7= <>
##$TPOAL= (0..7)
0.5 0.5 0.5 0.5 0.5 0.5 0.5 0.5 
##$TPOFFS= (0..7)
0 0 0 0 0 0 0 0 
##$TUNHIN= 0
##$TUNHOUT= 0
##$TUNXOUT= 0
##$USERA1= <user>
##$USERA2= <user>
##$USERA3= <user>
##$USERA4= <user>
##$USERA5= <user>
##$V9= 5
##$VALIST= <valist>
##$VCLIST= <CCCCCCCCCCCCCCC>
##$VD= 0
##$VDLIST= <DDDDDDDDDDDDDDD>
##$VPLIST= <PPPPPPPPPPPPPPP>
##$VTLIST= <TTTTTTTTTTTTTTT>
##$WBST= 1024
##$WBSW= 4
##$XGAIN= (0..3)
0 0 0 0 
##$XL= 0
##$YL= 0
##$YMAX_a= 54808
##$YMIN_a= -34446
##$ZGOPTNS= <>
##$ZL1= 120
##$ZL2= 120
##$ZL3= 120
##$ZL4= 120
##$ABSF1= 10
##$ABSF2= 0
##$ABSG= 5
##$ABSL= 3
##$ALPHA= 0
##$AQORDER= 0
##$ASSFAC= 0
##$ASSFACI= 0
##$ASSFACX= 0
##$ASSWID= 0
##$AUNMP= <proc_1d>
##$AZFE= 0.1
##$AZFW= 0.1
##$BCFW= 1
##$BC_mod= 2
##$BYTORDP= 1
##$COROFFS= 0
##$CY= 11.3945322036743
##$DATMOD= 1
##$DC= 2
##$DFILT= <>
##$DTYPP= 0
##$F1P= 15.9154993809931
##$F2P= -4.1035820241983
##$FCOR= 0.5
##$FTSIZE= 0
##$FT_mod= 4
##$GAMMA= 1
##$GB= 0.15
##$INTBC= 1
##$INTSCL= 1
##$ISEN= 128
##$LB= 0.24
##$LEV0= 0
##$LPBIN= 0
##$MAXI= 10000
##$MC2= 0
##$MEAN= 0
##$ME_mod= 0
##$MI= 1.114404
##$NCOEF= 0
##$NC_proc= 0
##$NLEV= 6
##$NOISF1= 3.799351
##$NOISF2= 2.8
##$NSP= 1
##$NTH_PI= 0
##$NZP= 0
##$OFFSET= 15.70392
##$PC= 1
##$PHC0= -11113.96
##$PHC1= 3.800938
##$PH_mod= 1
##$PKNL= yes
##$PPARMOD= 0
##$PSCAL= 0
##$PSIGN= 0
##$REVERSE= no
##$SF= 200.130013532006
##$SI= 16384
##$SIGF1= 3
##$SIGF2= 2
##$SINO= 400
##$SIOLD= 16384
##$SREGLST= <1H.CDCl3>
##$SSB= 0
##$STSI= 0
##$STSR= 0
##$SW_p= 3612.71676300578
##$SYMM= 0
##$S_DEV= 0
##$TDeff= 0
##$TDoff= 0
##$TI= <>
##$TILT= no
##$TM1= 0
##$TM2= 0
##$TOPLEV= 0
##$USERP1= <user>
##$USERP2= <user>
##$USERP3= <user>
##$USERP4= <user>
##$USERP5= <user>
##$WDW= 1
##$XDIM= 8192
##$YMAX_p= 0
##$YMIN_p= 0
$$ End of Bruker specific parameters
$$ ---------------------------------
##NTUPLES= NMR FID
##VAR_NAME=  TIME,          FID/REAL,        FID/IMAG
##SYMBOL=    X,             R,               I
##VAR_TYPE=  INDEPENDENT,   DEPENDENT,       DEPENDENT
##VAR_FORM=  AFFN,          ASDF,            ASDF
##VAR_DIM=   8192,          8192,            8192
##UNITS=     SECONDS,       ARBITRARY UNITS, ARBITRARY UNITS
##FACTOR=    0.0002944,     1,               1
##FIRST=     0,             0,               0
##LAST=      2.4114304,     0,               0
##MIN=       0,             -34446,          0
##MAX=       2.4114304,     54808,           0
$$ Real data points
##PAGE= N=1
##DATA TABLE= (X++(R..R)), XYDATA
0@%%%%%%%%%%%%%%%%%%mJ2j6J6j6J6j7K5l2L2l8M6m9N7o5P3q2R1j05J19j34J50
$$ 0 0 0 0 0 0 0 0 0 0 0 0 0 0 0 0 0 0 0 -4 8 -8 8 -8 8 -9 16 -16 16 -22 24 -25 32 -33 40 -42 49 -56 63 -71 79
40G9j66J82k00K22k47K75l02L31l66M03m44M90n41N94o53P23q02Q92r95J118j267
$$ 79 -87 95 -105 117 -130 145 -157 174 -192 211 -233 257 -284 310 -343 380 -422 470 -525 593 -674
61f74J445j664J949k331K876l721N215q679L2355K8037j3273Q563o917l319j7726
$$ -674 771 -893 1056 -1275 1601 -2120 3095 -5584 26771 54808 41535 50098 43181 39862 22136
76B2136M34j2135q93m225P949L163N591J1826k8O457m419J55j2155p559q786j1230
$$ 22136 22570 10435 9542 5317 13266 16429 22020 33846 33818 40275 35856 36011 23856 16297 7511 -3719
92c719n121p148M278m938J0101J148O507K242R41n89p421k201j1412l670r329
$$ -3719 -8840 -15988 -11710 -16648 -6547 -5399 1108 3350 4291 3702 -3719 -5920 -17332 -21002 -30331
107c0331M64m579K857O135J839R782J878Q518k557L116l559k872m453l988l48
$$ -30331 -29867 -34446 -31589 -25454 -23615 -13833 -11955 -3437 -5994 -2878 -6437 -9309 -13762 -17750 -18098
122a8098m397O680o79Q342L351Q514M085K085M478l194M64o921J207p358O60j069
$$ -18098 -22495 -15815 -16494 -8152 -4801 3713 7798 9883 14361 11167 11631 4710 5917 -1441 -781 -1850
138a850Q55M031J503P509o47O487k352J402m728k440m258o548p84n568J955k975
$$ -1850 -995 3036 4539 12048 11401 17888 15536 16938 12210 9770 5512 -1036 -1820 -7388 -5433 -8408
154h408M924j32K777K216L02L32m620N52q334o99n911j528k507m78L333o86N825
$$ -8408 -3484 -3616 -839 1377 1679 2011 -2609 -2057 -10391 -11090 -17001 -18529 -21036 -21514 -18181 -18867 -13042
171a3042J91M427j810L374k867k076j025m105P56m174M238j262M739K049M747
$$ -13042 -12851 -8424 -10234 -6860 -9727 -11803 -12828 -16933 -16177 -20351 -16113 -17375 -12636 -10587 -5840
186e840L256J393M016k635K449l861J358m239N96R3p79L034J135M615j86N189
$$ -5840 -2584 -1191 2825 190 2639 -1222 136 -4103 -3507 -3414 -4193 -1159 -24 4591 4405 9594
202I594j269K145j668j571j115m675P78m700J414k052K795o94J737K087o49J532
$$ 9594 8325 10470 8802 7231 6116 1441 2219 -2481 -1067 -3119 -324 -1018 719 2806 2157 3689
218C689k816J206n211J88l578j909j594r54J371j774M189j034L018l08J885r90
$$ 3689 873 2079 -3132 -2944 -6522 -8431 -10025 -10979 -9608 -11382 -7193 -8227 -5209 -5517 -3632 -4622
234d622j779O99l329R03l143K409j892K781J165K179K568O68L641k124K883k206
$$ -4622 -6401 -5702 -9031 -8128 -11271 -8862 -10754 -7973 -6808 -4629 -2061 -1393 2248 124 3007 801
250H01Q54k017M50J8r51K893o52L433p47M056m27J217L97j191O8k588P27l147
$$ 801 1655 -362 88 106 -845 2048 1396 4829 4082 8138 7711 8928 9325 8134 8202 5614 6341 3194
268C194J295j873J429l27Q40J690j460K159k069J223l389m6k134j578o87j938
$$ 3194 4489 2616 4045 3718 4558 6248 4788 6947 4878 6101 2712 2666 532 -1046 -1733 -3671
284c671J224j868K742j512K065n37P52m10j012P14k781Q52k332J514j932K132
$$ -3671 -2447 -4315 -1573 -3085 -1020 -1557 -805 -1215 -2227 -1513 -4294 -3442 -5774 -4260 -6192 -4060
300d060Q19K29K311M4K809j639K512j464J035p36j64L43r71K395j111K682nK444
$$ -4060 -3241 -3012 -701 -657 2152 513 3025 1561 2596 1860 1696 2039 1068 3463 2352 5034 5029 7473
318G473k06J306O23o94Q86k014J223k435J299j465N72J14j62J554j304J637j564
$$ 7473 7267 8573 9196 8502 9388 7374 8597 6162 7461 5996 6568 6682 6520 8074 6770 8407 6843
335F843P93k018q6j284j655j69j827Q15k103J534j379P85l32j57j1j010O88k652
$$ 6843 7636 5618 5532 4248 2593 2424 597 1412 -691 843 -536 249 -83 -240 -251 -1261 -573 -3225
353c225R85k044M05q44L82K65k95J769o07J643r21J906j079N28k16m20R31n27
$$ -3225 -2240 -4284 -3879 -4723 -4341 -4076 -4371 -2602 -3209 -1566 -2487 -581 -1660 -1132 -1348 -1768 -837 -1364
371a364J672r26J988J66J345P9J194J022n37J142j334J351j706J085o18O6Q83
$$ -1364 308 -618 1370 1536 2881 2960 4154 5176 4639 5781 4447 5798 4092 5177 4559 4625 5508
388E508o24J370q12J393j588J198j102m78n87j245K89j699O20j903J067j386Q68
$$ 5508 4884 6254 5442 6835 5247 6445 5343 4865 4278 3033 3322 1623 2243 340 1407 21 889
405H89o16n52M07j672Q31k133Q23j887q1p50l16L5o95J172p54J601j183J118n84
$$ 889 273 -279 128 -1544 -713 -2846 -2023 -3910 -3991 -4741 -5057 -5022 -5717 -4545 -5299 -3698 -4881 -3763 -4347
424d347R5L55r59J056q07J413j110J787q07J533L63O20R39l61J398r64J181r62
$$ -4347 -4252 -3897 -4856 -3800 -4607 -3194 -4304 -2517 -3324 -1791 -1428 -808 131 -230 1168 204 1385 423
442D23J069m75L57P15m53J363r14J602r96R81m84J7k8r15J72j446R03j438P89
$$ 423 1492 1017 1374 2089 1636 2999 2085 3687 2691 3672 3188 3205 3177 2262 2434 988 1891 453 1242
461A242r20J02K37j092N19j151O08j467L40j403l1l99m43J85j135J237j310R70
$$ 1242 322 424 661 -431 88 -1063 -455 -1922 -1582 -2985 -3016 -3415 -3858 -3673 -4808 -3571 -4881 -3911
479c911o13L11j37J38J85j140J110j140J240j156J096J35K94O49k38J326o93J345
$$ -3911 -4524 -4213 -4350 -4212 -4027 -5167 -4057 -5197 -3957 -5113 -4017 -3882 -3588 -2939 -3177 -1851 -2544 -1199
497a199q33J144m79N96j6M0J131q02J399o23J126m53Q22p2l02P19q80P13j017
$$ -1199 -2032 -888 -1367 -771 -787 -747 384 -418 981 358 1484 1031 1853 1781 1479 2198 1318 2031 1014
516A014O44q76M29l98Q5K97p30O95q86Q60j501P25j036n7j39p12M08j193J019
$$ 1014 1658 782 1211 813 898 1195 465 1160 274 1134 -367 358 -678 -735 -874 -1586 -1178 -2371 -1352
535a352q47P52o40K6j81j09M44q28Q13j037N93n51O01j55M81M52n86J196n64R30
$$ -1352 -2199 -1447 -2087 -2061 -2242 -2351 -1907 -2735 -1922 -2959 -2366 -2917 -2316 -2471 -1990 -1538 -2124 -928 -1492 -562
555e62m61Q81o06M12N57o42Q02l29Q95l14P22k53N59j41l00R25o72P76p70O82
$$ -562 -1023 -142 -748 -336 221 -421 381 52 947 633 1355 1102 1661 1520 1220 2145 1473 2249 1479 2161
575B161p90L04k05j5K48k94L88r43J111j128M04n93k72L31q08K18n58O95r57O31
$$ 2161 1371 1675 1470 1455 1703 1409 1797 854 1965 837 1241 648 376 707 -101 117 -441 254 -703 -72
595g2o23RL12m30M27r05R41j083K61j50L65L4L8L34m48Q13n50J122o21K86K12
$$ -72 -695 -686 -374 -804 -377 -1282 -341 -1424 -1163 -1313 -948 -914 -876 -542 -990 -177 -727 395 -226 60 272
616B72K6J4k19Q34m47R96o68O98j12L70M71n38P04m48O15q16N15k10K70j46k89
$$ 272 298 312 93 927 480 1476 808 1506 1394 1764 2235 1697 2401 1953 2568 1752 2267 2057 2327 2181 1892
637A892N07l97M37q43P76p83Q1m8m31J94o98L59n05L93r16L22l49m3J05n00N99
$$ 1892 2399 2002 2439 1596 2372 1589 1670 1622 1191 1385 687 1046 541 934 18 340 -9 -52 53 -447 152
658A52r75N90q49L09k18J48J38n70N92o95R78n23K12j46L32K68l33L82k49Q66
$$ 152 -823 -233 -1082 -773 -991 -843 -705 -1275 -683 -1378 -400 -923 -711 -857 -525 -257 -590 -208 -457 409
678D09p01Q93p69R33L1J63K56k53M34m33P97o46O58k21J4K55l85N16n69N42l57
$$ 409 -292 601 -168 765 796 959 1215 962 1396 963 1760 1114 1772 1551 1565 1820 1435 1951 1382 1924 1567
699A567K10l66L35o7l96m2k92K77n80J7m75K96l17rp0m23M81r08L41n06J50k29
$$ 1567 1777 1411 1746 1679 1283 1241 949 1226 646 663 188 484 167 158 88 -335 146 -762 -421 -927 -777 -1006
721a006j07j18k94O23n96N05n52K59k70L23k6l31N76n38O29m58O16m02L62K29
$$ -1006 -1113 -1231 -1525 -902 -1498 -993 -1545 -1286 -1556 -1233 -1259 -1590 -1014 -1552 -923 -1381 -765 -1167 -805 -576
741e76nM44l21N57k94O18m41M62j25K51J46r9L27l22O50r40O07N4NR3k87M80q16
$$ -576 -581 -137 -458 99 -195 423 -18 444 319 570 716 617 944 622 1272 332 939 993 998 1091 804 1284 468
764D68O24o28L35n46J53m8k85L19m64M08n88L11n77K59l86k03J15k82J29k94K01
$$ 468 1092 464 799 253 406 358 73 392 -72 336 -252 59 -518 -259 -645 -848 -733 -1015 -886 -1180 -979
785i79k85M42o72L52l55J99M02p99P78p67N74j30L8J76j88M93j38N99q03O33p1
$$ -979 -1264 -822 -1494 -1142 -1497 -1298 -896 -1695 -917 -1684 -1110 -1240 -1202 -1026 -1214 -721 -859 -260 -1063 -430 -501
806e01K2K35r8M76k86N63n70N79m32O19k12m5J36j02J96m63L66j45K25j12q2p5
$$ -501 -479 -244 -342 134 -152 411 -159 420 -12 607 395 350 486 384 580 117 483 338 563 451 369 294
828B94l5nj05N88q07L47l99K0j80j82K16j89K06n27J43%J26l08J69Rk95L33m48
$$ 294 259 254 149 737 -70 277 -122 -102 -282 -464 -248 -437 -231 -758 -615 -615 -489 -797 -628 -619 -914 -581 -1029
851a029O14n85L29n4J96J15l28O02m21N31m07N24k39L1J78o2K23m89P17m46M39
$$ -1029 -415 -1000 -671 -725 -529 -414 -742 -140 -561 -30 -437 87 -152 -121 57 -5 218 -271 446 0 439
872D39l14J29M5k18N37n74M07j31L63m33K79k37N3jj99L02k66J95k98P6j25J3
$$ 439 125 254 299 81 618 44 451 320 683 250 529 292 345 344 145 447 181 376 78 154 29 42
894D2Q8l25L28n57M35k77K35l12M20k00j93J19l14L58n13M49k93L94k65K42J25
$$ 42 130 -195 133 -424 11 -266 -31 -343 77 -123 -316 -197 -511 -153 -666 -217 -510 -116 -381 -139 -14
915a4k06M92l29J87j08Rp3m0J32O0M04k14K63k76N54m20PK09j38J44l17M07o05
$$ -14 -220 272 -57 130 22 31 -42 -82 50 110 514 300 563 287 841 421 428 637 499 643 326 733 128
938A28M66k28K12j69j61L60l18K37m75L37k50K38k59j27L03n15J41j46J91m08
$$ 128 594 366 578 409 248 608 290 527 52 389 139 377 118 -9 294 -221 -80 -226 -35 -443
958d43K16m11L43L7k9N5k18K20k67K74m81N33j35j49K60k9n5r7L77k16K62j63
$$ -443 -227 -638 -295 -258 -287 -232 -450 -230 -497 -223 -704 -171 -306 -455 -195 -224 -279 -376 1 -215 47 -116
980a16J48K25p7L00n45K06o7L22j74J78L27k72J81j47K42k78J05j11K23j28j84
$$ -116 32 257 180 480 -65 141 74 396 222 400 727 455 636 489 731 453 558 447 670 542 358
1001C58L94n55M61l76N04o17J38k46N0P5o8r6j14J97k49K30k56J54j55q0J13k19
$$ 358 752 197 658 282 786 169 307 61 111 186 118 22 -92 105 -144 86 -170 -16 -171 -251 -138 -357
1023c57k6j58P9K0R8j10j99K75j36K20j26K91l49J51Q7J05J2k70M70k84J00j78
$$ -357 -383 -541 -462 -442 -344 -454 -653 -378 -514 -294 -420 -129 -478 -327 -240 -135 -123 -393 77 -207 -107 -285
1045b85L16J7n9J63j60L53m05L29j90K61K9j07K60k13L71n24N23k76k29%K05P0
$$ -285 31 48 -11 152 -8 345 -60 269 79 340 369 262 522 309 680 156 679 403 174 174 379 449
1067D49m24N03n43M17o16M36j06l3k7m7q2M2J84l91K78n12K22r7J11M13m77R3
$$ 449 25 528 -15 402 -214 222 116 83 56 9 -73 -31 153 -238 40 -472 -250 -347 -236 177 -300 -207
1089b07k79L82l45N7J19n1r2J86L51n83J35j55M51l13J97j22O6K41j17J69l89
$$ -207 -486 -104 -449 -392 -273 -324 -416 -230 121 -462 -327 -482 -31 -344 -147 -269 -203 38 -79 90 -299
1110b99O53m19NK53j52J43J6J00l58M79j69j32K67k94K54m66M05j26J03j04J32
$$ -299 354 -65 -60 193 41 184 200 300 -58 421 252 120 387 93 347 -119 286 160 263 159 291
1131B91j32r0n4k8L1K5N6j17K24n89M09j97L8J58k85J05j66M1k5L38l23J23J05
$$ 291 159 69 15 -13 18 43 99 -18 206 -383 26 -171 -133 25 -260 -155 -321 -280 -305 33 -290 -167 -62
1154f2j98J34k86J85J03j36j79N00j06qK68m44L40k26L31l70K61j52K86J33m95
$$ -62 -260 -126 -412 -227 -124 -260 -439 61 -45 -53 215 -229 111 -115 216 -154 107 -45 241 374 -121
1175a21O46l60J30l24J07P7J52k74j43L95l68J82j1j43L8LNN1m9m6K79m37K14
$$ -121 525 165 295 -29 78 155 307 33 -110 285 -83 99 88 -55 -17 -14 -9 42 -7 -53 226 -211 3
1198Cl18N5O8P1J56j12Lk08L19k75K65m8j10m9K7K16l53L62k70J54j44J88J53
$$ 3 -315 -260 -192 -121 35 -77 -74 -282 37 -238 27 -21 -131 -180 -153 63 -290 72 -198 -44 -188 0 153
1221A53l67J56J90j07K6K78m24R8K7N9K27l3j5q0Mm0J41m0k3J08j4k10j42J88
$$ 153 -214 -58 132 25 51 329 -95 3 30 89 316 283 268 188 192 152 293 253 230 338 324 114 -28 160
1245A60k07J68Qp6N5j01k23J36J52k23L44k03j30K9k31L15k64J07j07N3L4R9k72
$$ 160 -47 121 129 53 108 7 -216 -80 72 -151 193 -10 -140 -111 -342 -27 -291 -184 -291 -238 -204 -105 -377
1268c77j74J68K5K44l03K49j51K80k32J60J5q7K72l45L58m35O40k76q0L57l12
$$ -377 -551 -383 -358 -114 -417 -168 -319 -39 -271 -111 -96 -183 89 -256 102 -333 307 31 -49 308 -4
1289dJ03J7rp6k4J84o1J32O8l3k11J58m5Q8J03j00o4P1Pj75J39k6j57j8J04Q7
$$ -4 99 116 107 31 7 191 130 262 330 297 86 244 199 287 390 290 226 297 304 129 268 242 85 67 171 258
1315B58k96p6j5j9l28K73k25L16j75K23n1l21K81k42K04J3j14M4j19O1j17J22
$$ 258 -38 -114 -129 -148 -476 -203 -428 -112 -287 -64 -115 -436 -155 -397 -193 -180 -294 -250 -369 -308 -425 -303
1337c03J33Q9j31K03o9j06K35km3q9J18n3J00j61J34N0k0J81k09J77k36M44l9
$$ -303 -170 -81 -212 -9 -78 -184 51 49 6 -83 35 -18 82 -79 55 105 85 266 57 234 -2 442 403
1360D03N4l34L37l00j31J44M7J48l66M21l10J63j74P4k81Q6J65j70j64J75J03
$$ 403 457 123 460 160 29 173 220 368 2 423 113 276 102 176 -105 -19 146 -24 -188 -13 90
1381I0k76J04O9k23J64l34L08l78L64J20L2l19l4K73k01q5R6K57k06N6k06K68
$$ 90 -186 -82 -13 -236 -72 -406 -98 -476 -112 8 40 -279 -313 -40 -241 -326 -230 27 -179 -123 -329 -61
1403f1J38l72L03m8R6r4L49n07J32L30k32L66k84O0O0R8Q0p9k76k5J05J00k11
$$ -61 77 -295 8 -40 56 -38 311 -196 -64 266 34 400 116 176 236 334 414 335 59 34 139 239 28
1426B8l8L14l90K92o9N2J8J6J31k40J27k20J76k00J32j92J56k28M0J1p1M27n23
$$ 28 -10 304 -86 206 137 189 207 223 354 114 241 21 197 -3 129 -63 93 -135 -95 -84 -155 272 -251
1449b51J85k2R8l2j06K72k12j03K8l4K51j97L0Q8L3j68oJ97J2j38J6K66k75m4
$$ -251 -66 -88 10 -22 -128 144 -68 -171 -143 -177 74 -123 -93 -5 28 -140 -146 51 63 -75 -59 207 -68 -112
1473a12N2L90l52K90l20K11km1lo5L23k91L48j92j12o2M4K5l23K52L62l78k6O4
$$ -112 -60 330 -22 268 -52 159 157 116 113 48 371 80 428 236 124 62 106 131 -192 60 422 44 18 82
1497H2j10J50j63k13K73k69M59m90L81N8l01k0m9K02q4n9k1j29L53l30OK78k46
$$ 82 -28 122 -41 -254 19 -250 209 -281 100 158 -143 -163 -212 -10 -94 -153 -174 -303 50 -280 -274 4 -242
1520b42J54N8j92L98O2m9J8m02L19L3J05j91M7k40L07j74p3R1K12k24q1R9%k0
$$ -242 -88 -30 -222 176 238 189 207 -195 124 157 262 71 118 -122 185 11 -62 29 241 17 -64 35 35 15
1544A5J08kN6Mj44J21q7J89Kj82m11M62m9n8Q9n9j32K2l67N04j95j27M54m98J27
$$ 15 123 121 177 181 37 158 71 260 262 80 -331 131 82 24 113 54 -78 -56 -423 81 -114 -241 213 -285 -158
1569a58O4k46J64Q0l5j32K9J35k17K37J6o1P3k88L91j96J07J2M8J90k49M6K1m7
$$ -158 -94 -340 -176 -96 -131 -263 -234 -99 -316 -79 -63 -124 -51 -339 52 -144 -37 -25 23 213 -36 10 31 -16
1593a6J82l1k1J31pq4Q2k10J06M53n04J09r1J37nj31J17l9j23j23J08J29j01K
$$ -16 166 135 114 245 238 154 236 26 132 585 81 190 99 236 231 100 217 178 55 -68 40 169 68 70
1617G0J55l20L9R9j35o4Q3Q6k68J86n6K2j65J24N8j76n2L05k64P8J29j35K11l58
$$ 70 225 -95 -56 43 -92 -156 -73 13 -255 -69 -125 -103 -268 -144 -86 -262 -314 -9 -273 -195 -66 -201 10 -348
1641c48K43j06j60K89J72j30J01j87p7K32L6j97Q1J50M1r7K16M1j40K9k94M31
$$ -348 -105 -211 -371 -82 90 -40 61 -126 -203 29 65 -132 -51 99 140 43 259 300 160 189 -105 326
1663C26k25J39r0K0r2K9K09j54L00n66K34k54K7K20N1m8J3M5j19jj35j29o7L59
$$ 326 101 240 150 170 78 107 316 162 462 -104 130 -124 -97 123 174 126 139 184 65 64 -71 -200 -267 92
1687I2p3Pl02M99m04k2K5j11O1m6K83m90K29O1qK62j03j96K99j11J42K4k58J09
$$ 92 19 26 -276 223 -181 -203 -178 -289 -228 -274 9 -481 -252 -191 -199 63 -40 -236 63 -48 94 118 -140 -31
1711c1j39J07J13j76P5K23j34N8P1j34Q7R5R2l21N1J24j49J0L36k29J20R1J03
$$ -31 -170 -63 50 -126 -51 172 38 96 167 33 120 215 307 -14 37 161 12 22 358 129 249 340 443
1734D43m82K25j35L39l32J26k0k03K46k72j6J16O2j86J16k24K96o5o5M3j70J57
$$ 443 -39 186 51 390 58 184 164 -39 207 -65 -81 35 97 -89 27 -197 99 34 -31 12 -158 -1
1756ar2J24k70m5J47L8L4K56l81O2J29j44N8r8P5j66L24j24J24L9j33J42L4l98
$$ -1 -93 31 -239 -284 -137 -99 -65 191 -190 -128 1 -143 -85 -183 -108 -274 50 -74 50 89 -44 98 132 -266
1780b66L05l8K4J45k18J43J29r8r7K65l90L22j23p4L05k13r3Q3n4j3J38j86L00
$$ -266 39 1 25 170 -48 95 224 126 29 294 -96 226 103 29 334 121 28 111 57 44 182 -4 296
1803B96m6l30NP3L3j20l0k25K88r3R1K5j57K03j4Mo0o1L2J57M0q8q8j12J28j21
$$ 296 250 -80 -75 -2 31 -89 -119 -344 -56 -149 -58 -33 -190 13 -1 3 -57 -118 -86 71 111 23 -65 -177 -49 -170
1829a70j6o3K56P0m8L9j70J58j08K24m24L96p4J19L7k77j00j0O3J72l1r2J33j19
$$ -170 -186 -249 7 77 29 68 -102 56 -52 172 -252 144 70 189 226 -51 -151 -161 -98 74 43 -49 84 -35
1853c5J60j20l3K37j97P0P0k21J13k80K70o5N5k03N6R1P6o2j14J03M2M6k42J5
$$ -35 125 5 -28 209 12 82 152 -69 44 -236 34 -31 24 -179 -123 -32 44 -18 -132 -29 13 59 -183 -168
1877a68R8p4L04k23j99N2k8L41l11o1K90k34K69j40rK5QK1J10r2r2P9R3o4j22
$$ -168 -70 -144 160 -63 -262 -210 -238 103 -208 -269 21 -213 56 -84 -93 -68 -60 -39 71 -21 -113 -34 59 -5 -127
1902a27J22K15k90K67k98K42o3P4K27l22J86j90K86k49K7q3j13j49M63j43O7j85
$$ -127 -5 210 -80 187 -111 131 68 142 369 47 233 43 329 80 107 24 -89 -238 225 82 149 -36
1924c6J10j28l05L52J93l25J54j09N4j44J05J07k00R7k11J1L89j33K9k69K50j48
$$ -36 74 -54 -359 -7 186 -139 15 -94 -40 -184 -79 28 -172 -75 -286 -275 114 -19 10 -259 -9 -157
1946a57l7M7r2N3k6j41J33J73J70k03k6j73K98j15K6J74j60J8K30P8k65L07j09
$$ -157 -194 -147 -239 -186 -212 -353 -220 -47 123 -80 -106 -279 19 -96 -70 104 -56 -38 192 270 5 312 203
1969B03m5O2p3J60l50L06j18j66l2J33k7l9J96j43j6L1L5M9j17j74J06Jn5j67
$$ 203 158 220 147 307 -43 263 145 -21 -53 80 53 14 210 67 51 82 117 166 49 -125 -19 -18 -73 -240
1993b40K61O9m8j56K8O1qo8n7K87j13l23M03j29p0o4J48j65p7K39Nj49Q2k21O0
$$ -240 21 90 42 -114 -86 -25 -33 -101 -158 129 16 -307 96 -33 -103 -167 -19 -184 -261 -22 -17 -166 -84 -305 -245
2018b45J94p0k6K54o6l9j91Q0K04j59K69j21j45jK09n4l2M3j1P4j12J46J19k62
$$ -245 -51 -121 -147 107 41 2 -189 -109 95 -64 205 84 -61 -62 147 93 61 104 93 167 55 201 320 58
2042E8M2j60J60j9K11l6K5k85m3J74lk62J9K08j84J42j50P5j24m2J52n7J9O0K08
$$ 58 100 -60 100 81 292 256 281 -4 -47 127 124 -138 -119 89 -95 47 -103 -28 -152 -194 -42 -99 -80 -20 188
2067A88q4k24J28M7l34K91n1n0m8J19j2J03k48O1K7r9M2J88j06J07r7J70m6J61
$$ 188 104 -120 8 55 -279 12 -39 -89 -137 -18 -30 73 -175 -114 -87 -186 -144 44 -62 45 -52 118 72 233
2091B33l77P7o3K1J60o8J28k42J68n5Q1j06NL04r9jk48J71p2r7J65p4J03j83L58
$$ 233 -144 -67 -130 -109 51 -17 111 -131 37 -18 63 -43 -38 266 167 166 -82 89 17 -80 85 11 114 -69 289
2116B89k30m7Rj2J23l06J69L2N2j43J07k03K18J8k49L05j99l7k16M27k69Q2N3
$$ 289 59 12 21 9 132 -174 -5 27 79 -64 43 -160 58 76 -173 132 -67 -104 -320 107 -162 -80 -27
2139b7j58K18j37J53j11N1j68J9K6K89l05J08L7R1rJ27j99j02L09k4k15p7J58
$$ -27 -185 33 -104 49 -62 -11 -179 -160 -134 155 -150 -42 -5 86 77 204 5 -97 212 188 -27 -104 54
2162E4o0L11K4l18J74l1q7j64L2K99k76m9J36k7k0M2J45j52J00q9n5J85l08L34
$$ 54 -6 305 329 11 185 154 67 -97 -65 234 -42 -91 45 18 -2 40 185 33 133 44 -11 174 -134 200
2186B00l57m0J62q2Q6Q2j46J68j18J97j32j10O4M5m0p7J62j47M4K8j63K16r6Q6
$$ 200 -157 -197 -35 -117 -31 51 -95 73 -45 152 20 -90 -26 19 -21 -98 64 -83 -39 -11 -174 42 -54 32
2210C2n2k1p8n1K87m4J02j65j2j69K33j33K85k30J20Nk28J29k2J23M1j60j60L20
$$ 32 -20 -41 -119 -170 117 73 175 10 -2 -171 62 -71 214 -16 104 109 -119 10 -12 111 152 -8 -168 152
2234A52j45j21K87k48N0o5R1J40r3Ql2K12k55o6J86J0m1n5O2j68j28J04J58Nj38
$$ 152 7 -114 173 -75 -25 -90 1 141 48 56 24 236 -19 -85 101 111 70 15 77 -91 -219 -115 43 48 -90
2259i0J72n6j29K04m2l7J0J12l57P3J21J23k77J84K3Rm3K38k49O7q3J28kM3k81
$$ -90 82 26 -103 101 59 22 32 144 -213 -140 -19 104 -173 11 34 43 0 238 -11 56 -27 101 99 142 -139
2284a39J47J59j85L91l41R5j73K02k13J82j75J44K8j64R3k7M22n78P9k6J73nj44
$$ -139 8 167 -18 373 32 127 -46 156 -57 125 -50 94 122 -42 51 24 446 -132 -53 -79 94 89 -55
2307e5j8J9o2o7K42j07j89K78k11L03j95k24K46J1p1k2K90l15J41N0O9j76p5N05
$$ -55 -73 -54 -116 -183 59 -48 -237 41 -170 133 -62 -286 -40 -29 -100 -122 168 -147 -6 44 113 -63 -138 367
2331C67k65k36J91j08J36n8J31m4k96L7K97k10K16j93J96j12j44J62L3k47N6K68
$$ 367 102 -134 57 -51 85 27 158 114 -182 -145 152 -58 158 -35 161 49 -95 67 100 -147 -91 177
2353A77j65J7l9K95l91N4o2J16K8j3M6j34J26n6l1m8q4J24K9p7J19k34L22j17
$$ 177 12 29 -10 285 -106 -52 -114 2 30 17 63 -71 55 -1 -32 -80 -164 -40 -11 -88 31 -203 119 2
2377Bm7J11j00j0L6o8%PN6q7j7o6K67jk10j71M52j69LJ88k32J2J71l2p8l5J32
$$ 2 -45 66 -34 -44 -8 -76 -76 -69 -13 -100 -117 -183 84 83 -127 -298 154 -15 -12 176 -56 -44 127 95 17 -18 114
2404A14k83K43m4P1k06o2Q6P4M5j25J81p9J15o5J94l11K4L2J7j71J19K05k71L31
$$ 114 -169 74 30 101 -105 -167 -81 -7 38 -87 94 15 130 65 259 -52 -28 4 21 -150 -31 174 -97 234
2428B34k10J0j26J09j84J09j10L99k20j76Q9M1j4m2P6j1j5M6P9o8j15N2O3l0J37
$$ 234 24 34 -92 17 -167 -58 -168 231 11 -165 -76 -35 -49 -91 -15 -26 -41 5 84 16 -99 -47 16 -14 123
2453A23j54rN4j01J0P7j72K12j3O8jK02k16J50j93P3k44J69J02k31N9K4L03j41
$$ 123 -31 -40 14 -87 -77 0 -172 40 27 95 94 296 80 230 37 110 -134 35 137 -94 -35 -11 292 151
2477A51l1l6P9Qp6K4o1J82l21J81k93M11l19J73j17j1L3Q3r1q3J77J79l82N0j05
$$ 151 120 84 163 171 95 119 58 240 -81 100 -193 218 -101 72 -45 -56 -23 60 -31 -114 63 242 -140 -90 -195
2502a95K91j44j33J19k44K85M8k77J77k3l2N2j7j06PQ7J17J27r6k38K7L17k6l20
$$ -195 96 -48 -181 -62 -306 -21 27 -250 -73 -96 -128 -76 -93 -199 -192 -105 12 139 43 -195 -168 149 123 -197
2526a97K02J81j47J68m31J63Oj87K19j43K03K08r6j69Nn6L4j79J31JJ30M5Q2k94
$$ -197 5 186 39 207 -224 -61 -55 -242 -23 -166 37 245 149 -20 -15 -71 -37 -216 -85 -84 46 91 173 -121
2550a21J58J72l20J30P5k35K75k61J80J00P4m9k57L8Q1j93K80l47O6m3M18q6r3
$$ -121 37 209 -111 19 94 -141 134 -127 53 153 227 178 -79 -41 40 -153 127 -220 -154 -197 221 135 42
2573D2n1k16J46j4K08m77O15k02j47O6j8p9J99j20K8K73j89J52m8j59p9L33l01
$$ 42 -9 -225 -79 -93 115 -362 253 51 -96 -30 -48 -127 72 -48 -20 253 64 216 168 9 -70 263 -38
2596c8M61k68o4j68K0J54j11Jj82K89q3K44j67ml93L53j28J78q4J30k43L42k17
$$ -38 423 155 91 -77 -57 97 -14 -13 -195 94 11 255 88 84 -309 44 -84 94 10 140 -103 239 22
2619B2j58J14l6J38n1L0j83M6j58K69PQ7j59J55k18M6O0K8j51K27p6O7j10j81
$$ 22 -136 -22 -58 80 29 59 -124 -78 -236 33 40 127 -32 123 -95 -49 11 39 -112 115 39 106 -4 -185
2643a85Q3J06K6K22l27K8j11K71r9K1K49l54N8L5j89L47j74R0K02l9j97l2j85
$$ -185 -102 4 30 252 -75 -47 -158 113 14 35 284 -70 -12 23 -166 181 7 97 299 260 63 31 -154
2666a54J88N8m5P4k4r0O0R9j90J26n0j17r1J45K7q6P6j04J76j57J66r8j77J92
$$ -154 34 92 47 121 97 7 67 166 -24 102 52 -65 -156 -11 16 -70 6 -98 78 -79 87 -11 -188 4
2690Dl35K72M9OO7k67L27l63M01k04K26l33%J18q3j9m6R8R4PJ07j46J32L1Rq1
$$ 4 -331 -59 -10 -4 63 -204 123 -240 161 -43 183 -150 -150 -32 -115 -134 -180 -82 12 19 126 -20 112 143 152 71
2716G1j17M4J16L3q6J6o9o6j61J33lK27q5n3J16M0j18J6Oo0k51P1O7K11m6o4j25
$$ 71 -46 -2 114 147 61 77 8 -58 -219 -86 -89 138 53 0 116 156 38 54 60 0 -251 -180 -113 98 52 -12 -137
2743a37o4K43N6j73Q4j18K31j88j2J54l11K52r5o7J15k95J20L26j35j0J48j37
$$ -137 -201 42 98 -75 9 -109 122 -66 -78 76 -235 17 -78 -145 -30 -325 -205 121 -14 -24 124 -13
2765a3j78J76L7j55K60k55o5K57J5K8q2J41j17q6J92M7k49M6m7J17K31k56R5o6
$$ -13 -191 -15 22 -133 127 -128 -193 64 79 107 25 166 49 -37 155 202 -47 -1 -48 69 300 44 139 73
2789G3M4j4n6M8j65L86l00J19j25k4J0J16l6nj75j67J13J75j53O9O4M1P8k77Q5
$$ 73 117 103 47 95 -70 316 16 135 10 -14 -4 112 76 71 -104 -271 -158 17 -136 -67 -3 38 116 -161 -76
2814g6K90j28o2J32j46J71j53n7K66k10kk43O7N4M6J58k20J65j91L40l1nm4k60
$$ -76 214 86 24 156 10 181 28 -29 237 27 25 -218 -151 -97 -51 107 -113 52 -139 201 170 165 121 -139
2838a39M02j33l65j3K60J00r5j24L47q4k76J91q1K75k78J38j09m3K10l48K85k50
$$ -139 263 130 -235 -248 12 112 17 -107 240 156 -120 71 -10 265 -13 125 16 -27 183 -165 120 -130
2860a30PJ39j21K90o5J3k30J29j17J23o5p9j66L12J53j81qj1Kk1L22m97J15p6
$$ -130 -123 16 -105 185 120 133 -97 32 -85 38 -27 -106 -272 40 193 12 4 -7 -5 -26 296 -201 -86 -162
2884a62L33O6k47l6j4P8n4j04J56J98j58j96J26k17L64j35l30N14j82Q9K0rk56
$$ -162 171 237 -10 -46 -60 18 -36 -140 16 214 56 -140 -14 -231 133 -2 -332 182 0 89 109 100 -156
2907a56K95k22j25M86j34l41J31J09n1L32j61j2r0k83K70O4l23L25q7j00J97j28
$$ -156 139 -83 -208 278 144 -197 -66 43 -8 324 163 151 61 -222 48 112 -211 114 27 -73 124 -4
2929dJ8R0k53q7P5L2Q6J0k7o9O0LJ44l2o3K1J68l38J97J3M3Rn5Q5k43J13K86o9
$$ -4 14 104 -149 -236 -161 -129 -43 -33 -60 -129 -69 -66 78 46 -17 4 172 -166 31 44 87 96 41 126 -117 -4 282 213
2957B13k70p0J84J0o8M3j03K45k43j03J25K44j49p7P8k6oj59L63Qk21j08L55k73
$$ 213 -57 -127 57 67 -1 42 -61 184 -59 -162 -37 207 58 -19 59 33 27 -132 231 239 18 -90 265 -8
2981hJ43p1k00J47j96J06P4P6j10J40m46K14m7K29r2kL82n75K15k28K68k1m4o6
$$ -8 135 64 -136 11 -185 -79 -5 71 -39 101 -345 -131 -178 51 -41 -43 339 -236 -21 -249 19 -2 -46 -112
3005a12O0k3J31m9o5M9or8l6M30l11J83j38K8J39j27O8rj28pJ35j30J93j77j65
$$ -112 -52 -75 56 7 -58 -9 -15 -113 -149 281 -30 153 15 43 182 55 123 114 -14 -21 114 -16 177 0 -165
3030a65L48j67K27k31n5o6K62q5Mj05J52j96qJ65Q5j65Q8k57K90oJ12j52k97J88
$$ -165 183 16 243 12 -43 -109 153 68 72 -33 119 -77 -85 80 165 0 88 -169 121 115 227 75 -222 -34
3054c4J26k26K22l8p5N8k25K07pn9J00K52l78K1L17k06K5j29k8K2R2o9N3pP8o2
$$ -34 92 -134 88 50 -25 33 -192 15 8 -51 49 301 -77 -56 261 55 80 -49 -77 -55 37 -32 21 14 92 30
3080C0j87M33m93J54K23k12K00l20K58j08m2J61l7r9J67n0j69K22j13j81O4J48
$$ 30 -157 276 -217 -63 160 -52 148 -172 86 -22 -64 97 60 -39 128 78 -91 131 18 -163 -99 49
3102D9j80N2K01j85k14L39r9j28J33m3j03J69K1Q8O7j35N7j14o3r7L24q4j76J00
$$ 49 -131 -79 122 -63 -277 62 -37 -165 -32 -75 -178 -9 12 100 167 32 89 -25 -88 -185 139 55 -121 -21
3126b1j4j6J53j60LJ56j62j9j14K99J85m36O0K21R0k09J35m3j45kK62j25n4p9
$$ -21 -35 -51 102 -58 -55 101 -61 -80 -194 105 290 -146 -86 135 225 16 151 108 -37 -39 223 98 44 -35
3150c5J27r0J72j62R4k82R2J95P9r3p7O6n5J84l99L44k20J29j56J86l50L11l42
$$ -35 92 2 174 12 106 -176 -84 111 190 97 20 86 31 215 -184 160 -60 69 -87 99 -251 60 -282
3173b82K62K17k70K22L0k79J45j81O8J06K7p2k05K70j64L8k2JR3N6j7j04J32M4
$$ -282 -20 197 -73 149 179 -100 45 -136 -68 38 65 -7 -212 58 -106 -68 -90 -89 4 60 43 -61 71 115
3197A15p5L02k60k77K18N6O9m6j63J63kj24R2n6m1J75k2k69P1P8k5j67J63j29
$$ 115 40 342 82 -195 23 79 148 102 -61 102 100 -24 68 12 -29 146 124 -145 -74 4 -21 -188 -25 -154
3221a54J86J95j82M8M9k69O3j26K57j58K30j8K2q9k13J88j20M23k38l77K67J21
$$ -154 32 227 45 93 142 -127 -64 -190 67 -91 139 121 143 54 -159 29 -91 332 94 -283 -16 105
3243A05j02j1j4j78K87L4P6O9m04O8P4j29J07k80M48k51j11L83k12J53l4k64L02
$$ 105 3 -8 -22 -200 87 121 197 266 -138 -70 4 -125 -18 -298 150 -101 -212 171 -41 112 78 -186 116
3266A16j00j5Q0K49l86J50m8J51k22J32Q0n0R7j14l5qj40P0j27nJ16J6k34R7K72
$$ 116 16 1 81 330 -56 94 46 197 -25 107 187 137 234 120 85 77 -63 7 -120 -125 -9 7 -227 -130 142
3291A42l64L87k58J82k00P9n3J72R2m81L59J4j26P6J2P9m9j20P0o0M39l90R0l34
$$ 142 -222 165 -93 89 -111 -32 -85 87 179 -302 57 71 -55 21 33 112 63 -57 13 -47 392 2 92 -242
3315b42J22J23j29K83k73K01m8m4r4j91N32l12J10p1J58n3k35J35m3K01k09Q8
$$ -242 -120 3 -126 157 -116 85 37 -7 -101 -292 240 -72 38 -33 125 72 -163 -28 -71 130 -79 9
3337Ikk69L02j4R0j32j00J58K10l18J99j2l06K68k08K79k10OR7o0J79j65L2k09
$$ 9 7 -262 40 26 116 -16 -116 42 252 -66 133 121 -185 83 -125 154 -56 -50 47 -13 166 1 33 -176
3361a76J14J95J03m28L75L0k38J93m4k05O6j00J20j87L83m04K03J1j80K77j65
$$ -176 -62 133 236 -192 183 213 -25 168 124 -81 -15 -115 5 -182 201 -203 0 11 -169 108 -57
3382e7K2PJ9J52k22J69M5n1j05Ko0L41l79RO5Lk3j13K46k15K23o6q2J04N2p0j62
$$ -57 -35 -28 -9 143 -79 90 135 84 -21 -19 -79 262 -117 -108 -43 -40 -63 -176 70 -145 78 12 -70 34 86 16 -146
3409a46J00J38k70Q8K3l4L10k75Q2kj26L9R1n4Nj29J89J00l0j97P6q5N5MQ3q2
$$ -146 -46 92 -178 -90 -67 -101 209 -66 16 14 -112 -73 18 -36 -31 -160 29 129 99 -98 -22 -107 -52 -48 35 -47
3435d7N1q6o2L04J64k29k64L61j22n3J09l10K89L3j22j06O0J11j52p9J77R5k56
$$ -47 4 -82 -144 160 324 95 -169 192 70 17 126 -184 105 138 16 -90 -30 81 -71 -150 27 122 -134
3458a34r5L56l73K36J15p6j93M0j12k9N94m46l3K61j8j22m9R7j55L6J80J2j30
$$ -134 -229 127 -246 -10 105 29 -164 -124 -236 -265 329 -117 -150 111 93 -29 -78 19 -136 -100 80 92 -38
3481c8k58L94K05k50m4j97L22j20KN1RN1lj66J30l8P5m73K23M3K56l35J09J02
$$ -38 -296 98 303 53 9 -188 134 14 16 67 76 127 124 -42 88 50 125 -348 -125 -82 174 -161 -52 50
3505E0j24J72J11r2j67J42j08O7r6j06J45Q1J45j39k26K92l56K86j27K70J4j26
$$ 50 -74 98 209 117 -50 92 -16 51 -45 -151 -6 75 220 81 -145 147 -209 77 -50 220 234 108
3527A08k4r3J21n6q2J08k0p5J79m2k41J29k97K91R6PL3r9N9J83l90K15rj61P9
$$ 108 84 -9 112 56 -26 82 62 -13 166 124 -117 12 -285 6 102 109 142 43 102 285 -105 110 101 -60 19
3552A9M6J00k80J41j40M2J17L73m57j29L10l08r6L93p1j44j11J97K20l68oL07
$$ 19 65 165 -115 26 -114 -72 45 418 -39 -168 142 -166 -262 131 60 -84 -195 2 222 -146 -152 155
3574A55o4j20L9O8j42P9J19n7j40K4J28l88N70l94L29n4k01J09q4Q9p4M7O4l49
$$ 155 91 -29 10 78 -64 15 134 77 -63 -39 89 -299 271 -123 206 152 -49 60 -24 65 -9 38 102 -247
3598b47J41L63Ol12Q2J53j68j63M37k00k47J28N7J57j91q1j5J70j73o0J79q0J20
$$ -247 -106 257 263 -49 33 186 18 -145 292 92 -155 -27 30 187 -4 -85 -100 70 -103 -163 16 -64 56
3621E6L2l9N7n4N1p5n4Q4o2j38L79j85j31K05j04j65J52n8P2pR0l01q1J95J66
$$ 56 88 49 106 52 103 28 -26 58 -4 -142 237 52 -79 126 22 -143 9 -49 23 16 106 -195 -276 -81 85
3646H5j32L1J06O2O9k84P9%j69L22k21j12L18j62M14m93R3j16k34M31l2k69K66
$$ 85 -47 -16 90 152 221 -63 16 16 -153 169 -52 -164 154 -8 406 -87 6 -110 -344 87 55 -214 52
3669E2j11j4q4J71M0J61k14N5L0q4J5k06K27j30J75o9l0p1L79k93J44k30J30L2
$$ 52 -59 -73 -157 14 54 215 1 56 86 2 17 -189 38 -92 83 14 -16 -87 292 -1 143 -87 43 75
3693G5r8R8j53K07j02m4M4j55K43n5j41K74k03J52L4q3Q3k02k15L00m6q0p6N07
$$ 75 -23 75 -78 129 27 -17 27 -128 115 60 -81 193 -10 142 176 93 176 -26 -241 59 13 -67 -143 364
3717C64n34p6J47J23O9j32nK27k17J42oo5O9m7jk23L0L35k87P3j2R9n3Q2R4j44
$$ 364 -170 -246 -99 24 93 -39 -44 183 -34 108 102 37 106 59 58 -165 -135 200 -87 -14 -26 73 20 102 196 52
3743E2jl04L86n7k65L01j10P8oM0J47m71K87l8J08j45J7k70M04k09nJ93j4j35
$$ 52 51 -253 133 76 -189 112 2 80 74 114 261 -210 77 39 147 2 19 -251 153 -56 -61 132 118 -17
3767a7J2K07k16K04j43k26J43J34J2k32J72O3j59m2j1J90m8K09l60L0kk8N4p9
$$ -17 -5 202 -14 190 47 -179 -36 98 110 -122 50 113 -46 -88 -99 91 43 252 -108 -78 -80 -108 -54 -133
3791a33p3K37J90k42J38j94O8J80l70K48M5k80L00k17J51q8J06K01k24M3j86j2
$$ -133 -206 31 221 -21 117 -77 -9 171 -199 49 94 -186 114 -103 48 -40 66 267 43 86 -100 -112
3813a12K03j0KL7o7j51J05j30L29m68K91j9n1J92k56J28j42N2J3J06J5M2l6K1
$$ -112 91 81 83 120 53 -98 7 -123 206 -262 29 10 -41 151 -105 23 -119 -67 -54 52 67 109 73 94
3837I4k0k80J71N5m3q6J94j24K68k31j02oJ15j29N8K51j29R2q6k2J0m5j5k0o4
$$ 94 74 -206 -35 20 -23 -109 85 -39 229 -2 -104 -110 5 -124 -66 185 56 148 62 40 50 5 -10 -30 -94
3862i4K83k89k17K28J07M8k24M07l25J64K1k60R2J16k51M1J27K6j34K9L32k17
$$ -94 189 -100 -317 -89 18 66 -158 249 -76 88 109 -151 -59 57 -194 -153 -26 0 -134 -105 227 10
3884A0P3j3j17k8o6J23Lm4J7o0K89m01K18J5j61L30k62P0L51m63L6j12J41K21
$$ 10 83 70 -47 -75 -141 -18 -15 -59 -42 -102 187 -214 4 19 -142 188 -74 -4 347 -116 -80 -192 -51 170
3908A70j24r0M5j37J95j3K6j55R5r5J96j29l7J56k13J06j68J20k42K37q5J92l4
$$ 170 46 -44 1 -136 59 46 72 -83 12 -83 113 -16 -53 103 -110 -4 -172 -52 -294 -57 -142 50 16
3931A6j03O9k5j14K80k17J61j63J21p8j23N3K86l51n7M74k24l01K21l2K75O4j2
$$ 16 -87 -18 -43 -157 123 -94 67 -96 25 -53 -176 -123 163 -188 -245 229 5 -296 -75 -107 168 232 220
3954B20j97J58j12m8k17K11o9K34j80J1L6N4J28j65q4M9k2J30j27k0pK32j48k4
$$ 220 23 181 69 21 -196 15 -54 180 0 11 47 101 229 64 -20 29 7 137 10 -10 -17 215 67 43
3978D3MJ31m2J11l52L0P6j58J54j55L25M4l47K46m6k32J29o5L61k80j4K53l15
$$ 43 47 178 136 247 -105 -75 1 -157 -3 -158 167 211 -136 110 64 -168 -39 -104 257 -23 -37 216 -99
4001i9P3J22m2n2k3M8M9j13o9J3P0RP8k62J86%N2k28J47oJ05j37q1J67J04j07
$$ -99 -26 96 54 2 -21 27 76 -37 -106 -93 -23 -14 64 -198 -12 -12 40 -188 -41 -47 58 -79 -160 7 111 4
4027Dpj36R1m1r0J89k0o7J20q4j0P6k7m6o3K05l5j71J65j87Q6K23j97q5K02j8
$$ 4 -3 -139 -48 -89 -179 10 -10 -77 43 -41 -51 25 -2 -48 -111 94 59 -112 53 -134 -48 175 -22 -107 95 77
4053G7k2Oj59oK65k65m0L9L1J76M7o0j00J60No2l9PJ19m05L54l98J23K60J3l07
$$ 77 55 61 -98 -104 161 -104 -144 -105 -74 102 149 89 -11 149 154 92 53 60 179 -226 128 -270 -147 113 126 -181
4079a81J83P9o5j40K8L6J62q2k35L8J46M7J25j59j53R6J20R1j10n4J87j61j22
$$ -181 2 81 16 -124 -96 -60 102 20 -215 -177 -31 16 141 -18 -171 -75 45 136 26 -28 159 -2 -124
4102a24J94k7j31m0K07o3rm4L07l30M1Q8j9j18L30k39K0j61J70j46J09O0j98o4
$$ -124 70 43 -88 -128 79 16 7 -37 270 -60 -19 69 50 -68 262 23 43 -118 52 -94 15 75 -123 -187
4126a87R7J01k25L00p1K83n20K70k12J14P8J20j42r9J92o5N7k32P7J35j76j39
$$ -187 -90 11 -214 86 15 298 -222 48 -164 -50 28 148 6 -93 99 34 91 -141 -64 71 -105 -244
4148b44K41j73L3L03N2k67M7o4K29k08K07o7J87j2j90K19k70R6l53L10j20J72
$$ -244 -3 -176 -143 160 212 -55 -8 -72 157 -51 156 89 276 264 74 293 23 119 -234 76 -44 128
4170A28o4J18j08j46P5J47k38O7q8M5p7L63k77K0k06L0N04l92K8k1l2M2J3j53
$$ 128 64 182 74 -72 3 150 -88 -21 -109 -64 -141 222 -55 -35 -241 -211 293 -99 -71 -92 -124 -82 -69 -222
4194b22J68R5O9q6J04j73J13P5j55L4M3j93K02J03j09k47K03j44K55k73K11j4
$$ -222 -54 41 110 24 128 -45 68 143 -12 22 65 -128 74 177 68 -179 24 -120 135 -138 73 59
4216E9k54J81j9K9rkL7Q9k11J23J42r2j70K9J7j18J84J70j45R5j63K4N2k39J15
$$ 59 -195 -14 -33 -4 -13 -15 22 111 -100 23 165 73 -97 -68 -51 -169 15 185 40 135 -28 -4 48 -191 -76
4241g6J59p7j97L30K8j68M0L0o5Q7J65k40J05j63O2j95J39K6k56K57J87J08j68
$$ -76 83 6 -191 139 167 -1 39 69 4 91 256 16 121 -42 20 -175 -36 -10 -266 -9 178 286 118
4264A18q6L8k34L3M01k50L9k7j21K38q1J7k31p5L16j10K9k2O3Oj86K38q6j99J2
$$ 118 32 70 -164 -131 270 20 59 32 -89 149 68 85 -146 -221 95 -15 14 -8 55 61 -125 113 27 -172 -160
4289a60J49N6j03j26K56p2k64J92M9qj45l6J77J43K3k1k99J96M8k5j61J26M7j05
$$ -160 -11 45 -58 -184 72 0 -264 -72 -23 -31 -176 -212 -35 108 131 110 -189 7 55 30 -131 -5 42 -63
4313f3l6K00q5K34k29K6k2M3q2r7R5L86m43O3O2o5j35J19P3p4k4J7N8N4r7j13
$$ -63 -99 101 16 250 21 47 25 68 -14 -111 -16 370 -73 -10 52 -13 -148 -29 44 -30 -54 -37 21 75 -22 -135
4339a35K73j64R6l8j19nM5O7j62K48k06J64j57P5j41L6J36Q3J66n09L60Q9l4q3
$$ -135 138 -26 70 32 -87 -92 -47 20 -142 106 -100 64 -93 -18 -159 -123 13 96 262 -247 113 202 168 85
4363H5J23j13l3j58N0P2K36l66J18J4QN8j18M5Q2j66K33m54L09j55K90j28L62
$$ 85 208 95 62 -96 -46 26 262 -104 14 28 36 94 -24 21 103 -63 170 -284 25 -130 160 32 394
4386C94l07rq1m9J64O8Pj90k07K05L1J45k08K86m03L29J28j91k78J36N2k6j06
$$ 394 87 78 -3 -52 112 180 187 -3 -210 -5 26 171 -37 249 -154 175 303 112 -166 -30 22 -4 -110
4409a10k4M46m06Q5K07k08O0j12JK2N6n2J07P6j91rk51L10j5j74L05k12KP1o7
$$ -110 -134 312 -94 -9 198 -10 50 -62 -61 -39 17 -35 72 148 -43 -52 -303 7 -8 -182 123 -89 -87 -16 -83
4434h3J06j08P2m1o4P7K19l47J30J48j49k8J09l4K3n6j3K06m5r4M8j78J29J58
$$ -83 23 -85 -13 -54 -118 -41 178 -169 -39 109 -40 -68 41 7 30 -26 -39 167 122 28 76 -102 27 185
4458A85l3j24l48J97J70p0q9P3o2J30r7J17k33O6m2NL23l11R9J05j65K11k5j89
$$ 185 152 28 -320 -123 47 -23 -112 -39 -101 29 -68 49 -184 -118 -160 -155 168 -143 -44 61 -104 107 82 -107
4482a07P4JJ83k46n4nK0n5L63j24K5k63o1N9M74m64K94k86k7J13N3J60m8j53R9
$$ -107 -33 -32 151 -95 -149 -154 -134 -189 174 50 75 -188 -249 -190 284 -180 114 -172 -199 -86 -33 127 79 -74 25
4507B5j58J95M3k48K07o2P2j6m1m01N00k64L52l34O6r1O7J36L1l2j22J68k0K94
$$ 25 -133 62 105 -143 64 2 74 58 17 -384 116 -148 204 -130 -64 -155 -88 48 79 47 -75 93 73 367
4531C67n72J71K6N2o9k13L28j53J13J08p1p6n0P5p9r0K71k56J91L9Ok6j93l1J74
$$ 367 -205 -34 -8 44 -25 -238 90 -63 50 158 87 11 -39 36 -43 -133 138 -118 73 112 118 92 -101 -132 42
4556D2k0n9K42l06J73J69l31J33J03Mj43l6J5J27l7r3M0j9p1J85k50L6K10k22
$$ 42 22 -37 205 -101 72 241 -90 43 146 150 7 -29 -14 113 76 -17 23 4 -67 118 -132 -96 114 -108
4580a08K34n2j72R2m7j20K4J66k73L26r3k23J58K66j34p8j55J45R6R3q1k2p0Q3
$$ -108 126 74 -98 -6 -53 -173 -149 17 -256 70 -23 -246 -88 178 44 -34 -189 -44 52 145 64 42 -28 55
4604E5k1j07J6j03K08J04m35K20j25R0J23q9J22q0N7k97N08l36L65j45r1o4R3
$$ 55 34 -73 -57 -160 48 152 -283 -63 -188 -98 25 -64 58 -22 35 -262 246 -90 275 130 39 -25 68
4627F8K56k19j16j08J67j3j55L03j79J62k75K16pM8j02l0N4Kj81J35QK9J42l93
$$ 68 324 105 -11 -119 48 35 -120 183 4 166 -109 107 100 148 46 16 70 72 -109 26 34 63 205 -188
4651a88K18J7O1J2k92J36J99k60L18j16J51q3j27R4n1r4J06j70K73k70j8J97L8
$$ -188 30 47 108 120 -172 -36 163 -97 221 105 256 173 46 140 89 -5 101 -69 204 -66 -84 113 151
4674A51k02K6M9O8K7l28K94l6n9k5j20J35rK4J05j68N7K19k09q7Q0K27k65K38
$$ 151 -51 -25 24 92 119 -209 85 49 -10 -35 -155 -20 -29 -5 100 -68 -11 208 -1 -88 -8 219 -46 192
4698A92J10l42JO1J30q2r2j87J49J42m3j66R3l24L52n8Q0jJ42j65M8l7j97J83
$$ 192 302 -40 -39 22 152 70 -22 -209 -60 82 39 -127 -34 -358 -6 -64 16 15 157 -8 40 3 -194 -11
4722a1J90j93L1p0p8K24k43L00q4j1J16k96Q6L7j41J59rJ01j82J53j27j08J69
$$ -11 179 -14 17 -53 -131 93 -150 150 66 55 171 -125 -39 -2 -143 16 7 108 -74 79 -48 -156 13
4745A3L0J43k56K8P8o3mR2l00J52R1O6j20%K51n7j93j07J58J43j37J27L7j14j14
$$ 13 43 186 -70 -42 36 -27 -31 61 -239 -87 4 70 -50 -50 201 144 -49 -156 2 145 8 135 172 58 -56
4770e6K73l45J81k3O3j2r8L7R4k15J38j87j6K26l25N36k32P8j36J54q9J00J84
$$ -56 217 -128 53 30 93 81 -17 20 114 -101 37 -150 -166 60 -265 271 39 117 -19 135 46 146 330
4793C30m17P5r4K05l22M08l81N76m05K2J02k83L80j46j42L10km5q5k5M8j44J08
$$ 330 -87 -12 -106 99 -223 185 -196 380 -25 -3 99 -184 196 50 -92 218 216 171 86 61 109 -35 73
4816G3P9o1j59L15k43k39j8L49k50J61J51l25L17r6L1j15M4P1l6r9r1J38K10l88
$$ 73 152 91 -68 247 4 -235 -253 96 -154 7 158 -167 150 54 85 -30 14 85 49 -50 -141 -3 207 -181
4840a81J61N4p0j44K15j44p2J57J56j21K3rJ08k38K99k48L72m38J41J16j82q2
$$ -181 -20 34 -36 -180 35 -109 -181 -24 132 11 34 25 133 -105 194 -54 318 -120 21 137 -45 -127
4862a27L2K07j05o2J07k34L01n2Jj08k04L82J0M6l74K1k61O31r5j19J19j45J1
$$ -127 -95 112 7 -55 52 -182 119 67 68 -40 -244 138 148 194 -180 -159 -420 211 116 -3 116 -29 -18
4885a8L6r6J67r5J15o2K05k11L7l3Q0Q8l74K6lL45l55J87N2L4p8k84L07q6j13
$$ -18 18 -78 89 -6 109 47 252 41 78 45 125 213 -161 -135 -138 207 -148 39 91 125 47 -237 70 -16 -129
4910a29R1J70j36J85m19P8K74j35N6r9J86nO0k44L56n29J99K7J5J99K9j03k3k79
$$ -129 -38 132 -4 181 -238 -160 114 -21 35 -64 122 117 177 -67 289 -240 -41 -14 1 200 229 126 103 -176
4934a76R9P9j85J42J44J6R2m20J17n5J16J9J00o1K1k54K30o6N5p0j7K07j84M3
$$ -176 -77 2 -183 -41 103 119 211 -209 -92 -147 -31 -12 88 27 48 -206 24 -42 13 -57 -74 133 -51 -8
4958hK25k10k25J38P4n0n9N7L0r3M6l1K05j6Q4k31K65l56r0K58j1Mq4Q9N8r1O4
$$ -8 217 7 -218 -80 -6 -56 -115 -58 -28 -121 -75 -106 99 83 167 -64 201 -155 -245 13 2 6 -78 11 69 -22 42
4985D2r1l6K07q8R3k81J00J82k66NK14p7J06l19L8L02p6Q6r3j16K80o4j08no2
$$ 42 -49 -85 122 34 127 -154 -54 128 -138 -133 81 4 110 -209 -171 131 55 141 48 -68 212 148 40 35 -27
5010b7q1R1n4q2J45o1J2J05o7P6j80K73k10K65k36N4j9j78K03J00k27R7j47R4
$$ -27 -108 -17 -71 -153 -8 -69 -57 48 -19 57 -123 150 -60 205 -31 23 4 -174 29 129 -98 -1 -148 -54
5034e4J32j45k09J28R9L6J11j74K52l31K45J20j59n0J58j97J42K95m28R7j00n6
$$ -54 78 -67 -276 -148 -49 -13 98 -76 176 -155 90 210 51 1 159 -38 104 399 -29 68 -32 -88
5056h8K27j97l9J74J17k01j42O5k6k6J03K74o4n13J70L09k79O3K55r0q5J08k90
$$ -88 139 -58 -97 77 194 -7 -149 -84 -110 -136 -33 241 177 -336 -166 143 -136 -73 182 92 7 115 -175
5079a75J30P0k8K79l40j46K78m00K47J92J3j65M9j47K29j48K12j60n9j14K05N9
$$ -175 -45 25 -3 276 -64 -210 68 -332 -85 107 120 -45 4 -143 86 -62 150 -10 -69 -183 22 81
5101H1j69l8N2J10P2J15k31K9J13j15m6N1m5j47j60K65M8J46j83j07Q5J18k34
$$ 81 -88 -126 -74 36 108 223 -8 21 134 19 -27 24 -21 -168 -328 -63 -15 131 -52 -159 -74 44 -190
5124a90J82M7q3n4R3K43j69J26l15K28k75P7Q7Q3j43J73O0j61m34K99M58m72L36
$$ -190 -8 39 -44 -98 -5 238 69 195 -120 108 -167 -90 -3 80 -63 110 170 9 -425 -126 332 -140 196
5147A96k75P7L9M0l44J70J98k70K07j30J2P8r3J67l1J06j67j32o7J77L98m16K05
$$ 196 -79 -2 37 77 -267 -97 101 -169 38 -92 -80 -2 -95 72 41 147 -20 -152 -219 -42 356 -60 145
5170A45k02Q8K1P8j74K81k02j11q1L48k32J39n9J19P2P8k92K2q8L24l49O1K86
$$ 145 -57 31 52 130 -44 237 35 -76 -157 191 -41 98 39 158 230 308 16 38 -50 274 -75 -14 272
5193B72n55K98P7R3k70J67J2q0J8J12k21J35k55R3l6J8J40j10J86j02j80J12m1
$$ 272 -283 15 92 185 -85 82 94 14 32 144 -77 58 -197 -104 -140 -122 18 -92 94 -8 -188 -76 -117
5216a17P0k15L28jp9p4j2P6M4j24J49R5M3o2j64m2J38J99l32P6n8j11J87J43j43
$$ -117 -47 -262 66 65 -14 -88 -100 -24 20 -104 45 140 183 121 -43 -85 53 252 -80 -4 -62 -173 14 157 14
5241A4K6j4q9K4J92n9j42l0K32l54K07j50J54n2j14K97n6r9P4k23J57j5M3m6o
$$ 14 40 26 -63 -39 153 94 -48 -78 154 -200 7 -143 11 -41 -155 142 86 -13 61 -162 -5 -20 23 -23 -29
5266b9L2j05J84l5K0Rq5J15j80j48J09L7l4k5j3J56Q8J9J5l18K46j56m8L71k59
$$ -29 3 -102 82 47 67 76 -9 106 -74 -222 -113 -76 -110 -135 -148 8 96 115 130 -188 58 -98 -146 225 -34
5291c4m4P9j15M6m9J04q0J27k8J1k87L45J0K8K6k20L12j74Q8j33j12N9J79J00
$$ -34 -78 1 -114 -68 -117 -13 -93 34 6 17 -270 75 85 113 139 -81 231 57 145 12 -100 -41 138 238
5315B38k70J40j11M0K21k82j51m8K12K30k07rP7j23J85j58j62J52k7P5l9j65K09
$$ 238 -32 108 -3 37 258 -24 -175 -223 -11 219 12 3 80 -43 142 -16 -178 -26 -53 22 -17 -182 27
5338B7J57l02J07L3L5k35K73j92J86j56J92k35K62k84rK86J01j39j53q1k5J03
$$ 27 184 -118 -11 22 57 -178 95 -97 89 -67 125 -110 152 -132 -141 145 246 107 -46 -127 -152 -49
5360d9q0J62k14J36J89k18J67k99J50J08N7j0L6r3j20K22q7j13M8R9k47J59j81
$$ -49 -129 33 -181 -45 144 -74 93 -206 -56 52 109 99 135 42 -78 144 57 -56 -8 91 -156 3 -178
5383a78J45M7O8j59K68k64K72k17j03R5j55K54j15j13J85P9p8M9j27K8j59J52
$$ -178 -33 14 82 -77 191 -73 199 -18 -121 -26 -181 73 -42 -155 30 109 31 80 -47 -19 -178 -26
5405b6l70K88J59m4K7J34k79j43M88l00J45lk20K51pk1k37J18N6r3N3m2J54P7
$$ -26 -396 -108 51 7 34 168 -111 -254 234 -66 79 76 -144 107 100 79 -158 -40 16 -77 -24 -66 88 165
5429A65l38J62J8M7k17J27J86j32L0q8k5P7j01n8R3r2J24Q0q0J4K4J44l32K16
$$ 165 -173 -11 7 54 -163 -36 150 18 48 -40 -65 12 -89 -147 -54 -146 -22 58 -22 -8 16 160 -172 44
5453D4j0j67k6R2l5L0K39k5j04N0q5o8K80l21K85p7k34J59J93l24JP6l4m2J68
$$ 44 34 -133 -159 -67 -102 -72 167 142 38 88 3 -65 215 -106 179 102 -132 27 220 -104 -103 -27 -61 -103 65
5478F5q9m7K02k66N5n4J35j38J17J29O5j49P9j85Q9R9m1n4lj12L37k72K29n9k00
$$ 65 -24 -71 131 -135 -80 -134 1 -137 -20 109 174 25 104 -81 8 107 66 12 9 -103 234 -38 191 132 -68
5503f8j26L43l01pL06j99M2k43R5K05J9l9Q9o8m9j24L16j04j5Q9l42J23J60j61
$$ -68 -194 149 -152 -159 147 -52 -10 -253 -158 47 66 27 116 48 -1 -125 191 87 72 161 -181 -58 102 -59
5527e9j11J21O1J7o2P2M4j71N9j09L8R9J3P0j27J20k00K83k14J14L1j55j02n2
$$ -59 -170 -49 12 29 -33 39 83 -88 -29 -138 -100 -1 12 82 -45 75 -125 158 -56 58 89 -66 -168 -220
5551b20J22L35j57k85J53j63K10J72j14oj28J01n5K14k31K09l90R8K42j14j05
$$ -220 -98 237 80 -205 -52 -215 -5 167 53 47 -81 20 -35 179 -52 157 -233 -135 107 -7 -112
5572a12J48Lj72M2O9J75o3p4j18O4j69L92j74L40k95k0L9k27K19j67l3K59J06
$$ -112 36 39 -133 -91 -22 153 90 16 -102 -38 -207 185 11 351 56 36 75 -152 67 -100 -133 126 232
5595B32j89p6r6o4R7J81j45K48j50q1J04K8j08K06k30J19k24K83l08N3J62KLJ90
$$ 232 43 -33 -129 -193 -96 85 -60 188 38 -43 61 89 -19 187 -43 76 -148 135 -173 -120 42 44 47 237
5619B37j03q0Nj46L15k85m8K64k79nM5J10J5j7r6k7K2lJ28L74m76J24j39J73r8
$$ 237 134 54 59 -87 228 -57 -105 159 -120 -125 -80 30 45 28 -68 -95 -73 -76 52 426 -50 74 -65 108 10
5644A0L5M0m3J65k04j10J66k30K35nj02R9N4j14k6j36J46J95n2J7p5kj34L8j10
$$ 10 45 85 42 207 3 -107 59 -171 64 59 -43 56 110 -4 -30 -166 -20 175 123 140 65 63 -71 -33 -143
5669a43J23J76k82J90j13k5K06q6j7P3j80J90Jr7l0rj26K2R7P4o5J00K7l31K83
$$ -143 -20 156 -126 64 -49 -74 132 46 29 102 -78 112 113 16 -14 -23 -149 -127 -30 44 -21 79 106 -225 58
5694E8R5k06J33J7j5O4j43n4R0j53m8J07J22j95K50o9Q4l30K10LJ9j60k1L0N2
$$ 58 153 -53 80 97 82 146 3 -51 39 -114 -162 -55 67 -128 122 53 137 -193 17 20 39 -121 -142 -112 -60
5719f0j5J51k43K18Ok69K18K97l76P0J48k79L8o5K17l50J79j55K21R2J83n17J91
$$ -60 -75 76 -167 51 57 -212 6 303 -73 -3 145 -134 -96 -161 56 -294 -115 -270 -49 43 226 -291 -100
5742a00NJ97k92K14J1J07k18L12l84K58J98k78kJ9j50K12j70Q3P8j30J7J13j08
$$ -100 -95 102 -190 24 35 142 -76 236 -148 110 308 30 28 47 -103 109 -61 22 100 -30 -13 100 -8
5765hJ32k45J46J26O1j19O5r9qK81k84L9j36J29j4o4Km6K63m44O0j4P8M40k21
$$ -8 124 -121 25 151 212 93 158 59 51 332 48 87 -49 80 66 2 4 -42 221 -223 -163 -177 -99 341 120
5790A20j17J48k03r5L13l42Q7QP2K13k88rJ62j92q4J41J23N3k1q6J4kl13L43p6
$$ 120 3 151 -52 -147 166 -176 -89 -81 -9 204 -84 -93 69 -123 -207 -66 57 110 89 3 17 15 -298 45 -31
5815c1j44l0m0K01p8K92j38m3M9OJ94j74k69K29r1Q1o4L5j20o6L58l23K85j97
$$ -31 -175 -205 -245 -44 -122 170 32 -11 38 44 238 64 -205 24 -67 14 -50 -15 -135 -201 157 -166 119 -78
5839g8n3K27N0j56J54l65J7m9P3K87l06J33kj00J82j28J13J16k57J7N9L95o33
$$ -78 -131 96 146 -10 144 -221 -204 -253 -180 107 -199 -66 -68 -168 14 -114 -1 115 -142 -125 -66 329 -304
5862c04L65m3P4n2j7Oj15N9P0P0q1j73K93K1k37M14l67j78J04NK9q0K15r1q1P5
$$ -304 61 18 92 40 23 29 -86 -27 43 113 32 -141 152 173 -64 350 -17 -195 -91 -86 -57 -137 78 -13 -94 -19
5888a9J26l10K64j14m1L04k95P8q7Q1J53Qj49K88l86K5J08l3J79l23L42k19J15
$$ -19 107 -203 61 -53 -94 210 -85 -7 -94 -13 140 148 -1 287 -99 -74 34 1 180 -143 199 -20 95
5911I5j91J85k82J81j60J40M7L6N4Nn7o3k7l2Pl5mJ38j95J78m5M2j03J92o4m4
$$ 95 -96 89 -193 -12 -172 -32 15 51 105 110 53 -10 -37 -69 -62 -97 -101 37 -158 20 -25 17 -86 106 42 -2
5937bl3j41J88K61m22N9J67j83J33O7k24P6J72k41J38l08O3o0K06P6p4K0Q9Qq
$$ -2 -35 -176 12 273 -149 -90 77 -106 27 94 -130 -54 118 -123 15 -293 -230 -290 -84 -8 -82 -62 27 35 27
5962B7J02r4j14J93j29m4J9K73l23L09k86j51K26l9J17j97K95j28k84L55k07O6
$$ 27 129 35 -79 114 -15 -59 -40 233 -90 219 -67 -218 8 -31 86 -111 184 56 -228 127 -80 -14
5984a4L8K11n49O1K99j48J91n6K38l24K5j3L3j8R8j93J95q1j1J00j27L0k34J51
$$ -14 24 235 -314 -253 46 -102 89 33 271 -53 -28 -41 -8 -26 72 -121 74 -7 -18 82 -45 -15 -249 -98
6008i8Q8Q7J07l4q3J57k26J1K75l18L0J34j35j01oRJ68J23j85J71r1j03J12k07
$$ -98 -10 77 184 150 67 224 -2 9 284 -34 -4 130 -5 -106 -112 -103 65 188 3 174 83 -20 92 -115
6032a15r5N4P7J23k25J89J20k07J50r3o4R6R8j96J08n7j66K41k15J49N7q1o6O4
$$ -115 -210 -156 -79 44 -181 8 128 -79 71 -22 -86 10 108 -88 20 -37 -203 38 -177 -28 29 -52 -118 -54
6056e4r3Q3P1P5j33J68j52j4K2M2K07l12J64K6k17J51o4j24K11j26K19l68L17
$$ -54 -147 -64 7 82 -51 117 -35 -49 -27 15 222 -90 74 100 -117 34 -30 -154 57 -69 150 -218 99
6079I9K3m5k8j27p3J00J05J45j98k07J98j5q4J81n0j33J36q2J1R5j08K81k39j06
$$ 99 122 77 49 -78 -151 -51 54 199 1 -206 -8 -23 -107 74 24 -109 27 -55 -44 51 -57 224 -15 -121
6103a21K94l19j92L76k0J2Pj17P7k61J94k46L63m8PQ8n7L2n8n8K07j37M3k2Q6
$$ -121 173 -146 -338 38 18 30 37 -80 -3 -264 -70 -316 47 -1 6 94 37 69 11 -47 160 23 66 44 130
6128A30r6n7j82n1K71k21K37N1j48Ro4N2l5J89k37K38m5j51J53j15J9J4J61k18
$$ 130 34 -23 -205 -256 15 -206 31 82 -66 -57 -121 -69 -104 85 -152 86 41 -110 43 -72 -53 -39 122 -96
6152i6MQ1m8R9k5R9P0n5k07R5m0N6j13J4K53o9j25j0J51k76J41oK16p1j8q8n5
$$ -96 -92 -11 -59 40 15 114 184 129 -78 17 -23 33 -80 -66 187 118 -7 -17 134 -142 -1 -7 209 138 120 32 -23
6179b3K41l36K45r7j38J76J7R1k13J50j13J43L8j79K06j58LM4j26m1n1N2J78j79
$$ -23 218 -118 127 30 -108 68 85 176 -37 113 0 143 181 2 208 50 53 97 -29 -70 -121 -69 109 -70
6203g0J50r2K0j5j56K88j05j20K78m00J99K54o7m1n7j02J74q2J39j69Q9j64J09
$$ -70 80 -12 8 -7 -163 125 20 -100 178 -222 -23 231 164 123 66 -36 138 56 195 26 115 -49 60
6226F0j71J18J47k05j68J86J48j56K21j22j06o0J73k75O3K94J69k35K60n55M5
$$ 60 -111 7 154 -51 -219 -33 115 -41 180 58 -48 -108 65 -210 -147 147 316 81 341 -214 -169
6247a69J22o9k6L5J96o8J70j78m4P1k3j08J16m0K00L1j30M4j11j62j6J8L0j26
$$ -169 -47 -116 -142 -107 89 21 191 13 -31 40 17 -91 25 -15 185 216 86 130 19 -143 -159 -141 -111 -237
6271b37M93k16k03K67M1k47K02O5j11k49L9M29m78L31p7j83K9K29j95J64j21j3
$$ -237 256 40 -163 104 145 -102 100 165 54 -195 -156 273 -205 126 49 -134 -105 124 -71 93 -28 -41
6293d1J10p7K54l80K38J29m15J51L7j44L8q7K09m2j30R3L23m8j11j43K77k03j03
$$ -41 69 -8 246 -134 104 233 -182 -31 6 -138 -100 -187 22 -20 -150 -57 266 218 107 -36 241 38 -65
6316f5K77l00Q7L9J21j21m2K5j02K20j71j18j4M11j78R8j64j18J6Q3j27J19j21
$$ -65 212 -88 -1 38 159 38 -4 21 -81 139 -32 -150 -164 247 69 167 3 -115 -99 -16 -143 -24 -145
6339a45K56j51K39l08J11J58j49j73L06k44J45Pk14J01J37Q1j88j44M53k25n1
$$ -145 111 -40 199 -109 2 160 11 -162 144 -100 45 52 -162 -61 76 157 -31 -175 278 53 2
6360Br5o7M9J9K7L9N2J54j35j85J91j51Q7J74j13Mk30L47j98K8R0r1K1O1k79P4
$$ 2 -93 -160 -111 -92 -65 -26 26 180 45 -140 51 -100 -13 161 48 52 -178 169 -29 -1 89 -2 19 80 -199 -125
6386a25J23Q5l9R9P1k04M0J05l53J82l7L12l51P0L6K28k54k28K69j4lR9k97Q1
$$ -125 -2 83 44 143 214 10 50 155 -198 -16 -53 259 -92 -22 14 242 -12 -240 29 15 12 111 -186 -105
6410a05J58J18q1M0j0j64P1N6j09R8Q9k48K96m65J64J25P5k8J17k50kp7j9L5j58
$$ -105 53 171 90 130 120 -44 27 83 -26 72 161 -87 209 -256 -92 33 108 80 197 -53 -55 -132 -151 -116 -274
6435b74J31J32J8j56K86r0j18J84J2k41K19R6j65R2k53rK61o7J9Q4l34L41n9O1
$$ -274 -143 -11 7 -149 137 47 -71 113 125 -116 103 199 34 126 -127 -136 125 58 77 161 -173 168 109 170
6459A70J65l54J09r4J4M0L9l47K84J2J85k85l9M22k53j91J92J50q7r8j68J56J8
$$ 170 335 -19 90 -4 10 50 89 -258 26 38 223 -62 -101 321 68 -123 69 219 132 34 -134 22 40
6482D0o8J48j61q0K51m2j51M0K34k69R7j63R6J7J08k74K46j88K30Qm3j65k06K07
$$ 40 -28 120 -41 -121 130 88 -63 -23 211 -58 39 -124 -28 -11 97 -177 69 -119 111 119 76 -89 -295 -88
6506h8L57m82K91k10mK02nm9R9L0n3J86k14j0k90L01%K4j40J19J31m12L29j01
$$ -88 269 -213 78 -132 -136 66 61 12 111 141 88 274 60 50 -240 61 61 85 -55 64 195 -217 112 11
6530A1j0LJ18k05L45k77J26q7L15l23l3J9R0j54K83k87K22l28j5J29P4j59J9J63
$$ 11 1 4 122 -83 262 -15 111 24 339 16 -17 2 92 -62 221 -66 156 -172 -187 -58 16 -143 -124 39
6554C9J18k08J90nk53Q2mK85k16J21o7j6N9M4o6k61L15j74P0L28l52Qj75K37k62
$$ 39 157 -51 139 134 -119 -37 -41 244 28 149 82 66 125 169 103 -158 157 -17 53 381 29 37 -138 99 -163
6579a63K40k91M57l58R1j03K34q1k39j18J63L15k95J77L8q4J51l57L88J7l00L50
$$ -163 77 -214 243 -115 -24 -127 107 26 -213 -331 -168 147 -148 29 67 -17 134 -223 165 182 -118 232
6601B32l32p1L88k4k38r8P4J67k42Q7q8L38l59K84j23L16m22K11k78J23J33j4
$$ 232 -100 -171 217 193 -45 -143 -69 98 -144 -57 -145 193 -166 118 -5 311 -111 100 -178 -55 78 64
6623F4j60L4Pj05K70n5Nr6p3J82q1Q0k42K66j74l5J41J67j42O9j88m2J56L6k12
$$ 64 -96 -62 -55 -160 110 55 60 -36 -109 73 -8 72 -170 96 -78 -113 28 195 53 122 -66 -108 48 84 -128
6648a28l9J22J85k03QJ1M1p1j65N06l32L5j07M3pJ97k27R4j1j80J09J3J40l3J09
$$ -128 -167 -45 140 -63 -55 -44 -3 -74 -239 267 -65 -30 -137 -94 -101 96 -131 -37 -48 -228 -119 -106 34 1 110
6673A10j10l3PK67l75K33k03j39K29%J46k11J88r6N8R8l07J27R9j04p8R3J06J3
$$ 110 0 -33 -26 241 -134 99 -104 -243 -14 -14 132 -79 109 13 71 169 -138 -11 88 -16 -94 -1 105 118
6697A18k62j49K07J99j53k8M3O2j18PJ89j22k3p7L7r1J27L13k84Q7k7k54P7J91
$$ 118 -144 -293 -86 113 -40 -68 -25 37 -81 -74 115 -7 -30 -107 -70 -161 -34 279 -5 82 55 -199 -122 69
6721F9o7l4L5o8Q0M8O5j19p2o5J09J53r5J54P7j25k12J26j64N1n4P7M6j44K4L0
$$ 69 2 -32 3 -65 15 63 128 9 -63 -128 -19 134 39 193 270 145 -67 59 -105 -54 -108 -31 15 -129 -105 -75
6747g5o6J21K78l98O2k1J61j51jq8J11O9pJ96l31P9R6m3m7K33k46J53l02J71q5
$$ -75 -141 -20 258 -140 -78 -99 62 -89 -90 -178 -67 2 -5 191 -140 -61 35 -8 -55 178 -68 85 -217 -46 -131
6772a31K26j78K2m2J87J7j16j1j48J13k3K39k16N1K6P4k33OO8m4N5J84l51K82
$$ -131 95 -83 -61 -103 84 101 -15 -26 -174 -61 -84 155 -61 -10 16 90 -143 -137 -69 -113 -58 126 -225 57
6796E7j08J06j00r1K43J91l19L6k9k7j13J38L2J1RM2q9k13J77M60l46P7r5k20
$$ 57 -51 55 -45 -136 107 298 -21 15 -14 -41 -154 -16 16 27 36 78 -11 -224 -47 413 67 144 49 -171
6820a71K1L82j43Mo6j1L0j32J18j87K87k86K02L1j87J84k06J57o8O8J66p3K4j06
$$ -171 -150 232 89 93 27 16 46 -86 32 -155 132 -154 48 79 -108 76 -130 27 -41 27 193 120 144 38
6844C8j48Q9R7J2p1k44K42R6N6k79r1K93o5o5J6R3q7j83L26J45m90J32J3L2K08
$$ 38 -110 -21 76 88 17 -227 15 111 167 -112 -203 90 25 -40 -24 69 -18 -201 125 270 -220 -88 -75 -43 165
6869A65o2o7Lq8p0K49q6q0o5J74J07j82q6J72J28l41J77l40L15j77L13J63m36
$$ 165 103 36 39 -49 -119 130 44 -36 -101 73 180 -2 -88 84 212 -129 48 -292 23 -154 159 322 -114
6892a14JP5k2L28j70l48K31M0J10j00k62R1L4m7K90k41J0O0L4J24j22l6j27J06
$$ -114 -113 -38 -60 268 98 -250 -19 21 131 31 -231 -140 -106 -153 137 -104 -94 -34 0 124 2 -34 -161 -55
6916e5mK10J10l86L51l53J20opJ33m2k21L27k50NJ81j10J05l1R7k32J53k49K79
$$ -55 -59 151 261 -125 226 -127 -7 -13 -20 113 71 -150 177 -73 -68 113 3 108 77 174 -58 95 -154 125
6940A25k23K59j02Q9j88j43J03K31k74P2L5O6n4j05R8J7q5K23l77L23j08j42J17
$$ 125 -98 161 59 148 -40 -183 -80 151 -123 -51 -16 50 -4 -109 -11 6 -79 144 -233 90 -18 -160 -43
6963d3n8K01l07J80J05l05L67n0j16n0J77Lj06l4MKP2k45K44J06J1k12m5L9R8
$$ -43 -101 100 -207 -27 78 -227 140 90 -26 -76 101 104 -2 -36 -32 -30 42 -203 41 147 158 -54 -99 -60 38
6988C8J6Kj94L53l8k57n6J60J11O5k79K15q9n7Kj09J43k7l3j31K38Rj35m8J75
$$ 38 54 56 -138 215 177 -80 -136 24 135 200 -79 136 47 -10 -8 -117 26 -1 -34 -165 73 82 -53 -101 74
7013G4l76L45k22J50r0K67K6J57m89Q8l6k6Q1q4J59k0J15j87K2k67M86j43JK32
$$ 74 -302 43 -179 -29 -119 148 174 331 -158 -70 -106 -132 -51 -135 24 4 119 -68 -46 -313 173 30 31 263
7037B63k48J86k52J27O1k19N1L8n1J8j6LK86m3k47Q6K4m01L88j35M0p5J48k62
$$ 263 15 201 -51 76 137 -82 -31 7 -44 -26 -42 -39 247 204 -43 43 67 -334 54 -81 -41 -116 32 -230
7061b30L04k93L05n7j86l5J88RN5m6K08k73J59J47k12k60K57l27K09j40J21J84
$$ -230 74 -219 86 29 -157 -192 -4 5 60 14 222 -51 108 255 43 -217 40 -287 -78 -218 -97 87
7083H7K2M4j08J72j46j01j45J92m5p3l2P7N4K12j44N7O8l11n8L88l27K08l27K13
$$ 87 109 153 45 217 71 -30 -175 17 -28 -101 -133 -56 -2 210 66 123 191 -120 -178 210 -117 91 -236 -23
7107b3L0j98R1J28j69J89o7l2K63l29j12K97J62K4n5k8N8l34J35j78J92p3P3J08
$$ -23 7 -191 -100 28 -141 48 -19 -51 212 -117 -229 68 230 254 199 171 229 -105 30 -148 44 -29 44 152
7131A52k50K31k78N0J47j91r1J65J91m31M69r8j39K60j54J07k36L13k80O9j95
$$ 152 -98 133 -145 -95 52 -139 -230 -65 126 -305 164 66 -73 187 33 140 -96 217 -63 6 -189
7152a89J59J51j97j9N3k3lJ69O6l62lL5L26k66J23o2K5K11p4j05m3Q2l8j9O4l7
$$ -189 -30 121 -76 -95 -42 -65 -68 101 167 -195 -198 -163 163 -103 20 -42 -17 194 120 15 -28 54 16 -3 61 24
7178B4L7j42J28k3j41L11q0J35j15j95j16O5L4J13k59K00J41n2j66J6l0N4L9N2
$$ 24 61 -81 47 24 -117 194 114 249 134 -61 -177 -112 -78 35 -224 -24 117 65 -101 -85 -115 -61 -22 30
7202C0j63K06j04j66J91k0nJ91j13K1o2P5O7l7o3r5O5r3J30l9Oo4n6jP3m1K13
$$ 30 -133 73 -31 -197 -6 -26 -31 160 47 68 6 81 148 111 48 -47 18 -75 55 16 22 -42 -98 -99 -26 -67 146
7229A46k29J96k32N8J36j49L2R9J32q2j9j96P0J40k06J38l1J5j91J66J96k78J86
$$ 146 -83 113 -119 -61 75 -74 -42 57 189 107 88 -108 -38 102 -104 34 3 18 -173 -7 189 -89 97
7252I7j46J99l41K06L5l7j17O8J01p7J66j85J59k7J63j32o4P0m8j74J67L3m34
$$ 97 -49 150 -191 15 50 13 -104 -36 65 -12 154 -31 128 101 264 132 68 138 90 -84 83 116 -318
7275c18o3L19N1L56n95P3Q4J60k08J29j36J16K8L7m5J5n6K93j66j07%J37l77M6
$$ -318 -381 -62 -11 345 -250 -177 -93 67 -141 -12 -148 -32 -4 33 -12 3 -53 240 74 -33 -33 104 -273 -227
7299b27J24O1J33l7K07j48J3p5j54L50j21j18n0M9l1j90K08k21L13J6k35M46m42
$$ -227 -103 -42 91 54 261 113 126 51 -103 247 126 8 -42 7 -24 -214 -6 -227 86 102 -133 313 -129
7322a29J86Jj20J86o0j74K86m91K60q8M7M0J09jN4P1j0j5j90N6n9J43j23J0l06
$$ -129 57 58 -62 124 64 -110 176 -315 -55 -143 -96 -56 53 52 106 177 167 152 -38 18 -41 102 -21 -11 -317
7347c17K34j3p6K85q1m51N46r3j90QJ92n0j26J1Q0L09j98L8r3P8j25K4j5Q3k1
$$ -317 -83 -96 -172 113 32 -419 127 34 -156 -148 44 -6 -132 -121 -41 268 70 108 15 93 -32 -8 -23 60 39
7372C9l7L4l6j7J86k37K03k51J23J33l36J34l0lK92j56L8M8k42L3K57l18J35k8
$$ 39 2 36 0 -17 169 -68 135 -116 7 140 -196 -62 -92 -95 197 41 79 127 -115 -82 175 -143 -8 -36
7396c6K92m2j39j1L9j95L3J17O8j57j41R9J96J46k3l83K33k16L6J42j30J30n1
$$ -36 256 214 75 64 103 -92 -59 58 126 -31 -172 -73 123 269 246 -137 96 -120 -84 58 -72 58 7
7419GlJ29j36J34J61n23J37J85j47j35K73r1j33J93jP9k67J31O0k98J80Pj61K45
$$ 7 4 133 -3 131 292 -231 -94 91 -56 -191 82 -9 -142 51 50 129 -138 -7 53 -245 -65 -58 -219 26
7443B6M3j19P2N4J2mJ5j13L10j90k15K3J21R7k05p6J68op8J66k28J3L11k75K71
$$ 26 69 -50 22 76 88 84 99 -14 296 106 -109 -86 35 132 -73 -149 19 13 -65 101 -127 -114 197 -78 193
7468A93j64l56M33j83L11k06p7J41m6J64n4k65K34k39m5J96k14K93Q0j28j96J8
$$ 193 29 -327 106 -77 234 28 -49 92 46 210 156 -109 125 -114 -159 37 -177 116 196 68 -128 -110
7490a10Q7KR2J04q4o4M6k27J19j21q1K15j7R5l6n8Nk7L3J08Q0j45q4l9j15J25
$$ -110 -23 -21 71 175 91 27 73 -154 -35 -156 -237 -22 -39 56 20 -38 -33 -60 -27 81 161 16 -68 -107 -222 -97
7516i7r7P4L11k38K54n9N6p0k70mM01l04O7M7J9j22L5M1k2K6J31k32J68lk28K24
$$ -97 -194 -120 191 -47 207 148 204 134 -136 -140 261 -43 24 71 90 -32 3 44 22 48 179 -53 115 112 -116 108
7542A08k94L91k31k6l9N5J20k73J49J62q2j1N7k76J76n1l3K2o4J98m6l4J64j23
$$ 108 -186 205 -26 -52 -91 -36 84 -189 -40 122 40 29 86 -190 -14 -65 -98 -76 -140 58 12 -22 142 19
7566A9r2K87l1j20p0J11k30K79k14J78l15J25j81J34J80k01K6O0M2Q5j43J15Q7
$$ 19 -73 214 183 63 -7 104 -126 153 -61 117 -198 -73 -254 -120 60 -141 -115 -55 -13 72 -71 44 131
7589A31k45K8N4J67k82L42l55k5M41k73k56K30J00j6rj36K52N3k57O2J39j42j37
$$ 131 -114 -86 -32 135 -147 195 -160 -185 256 -17 -273 -43 57 41 32 -104 148 201 -56 6 145 3 -134
7612a34J02J01K2J61k51J1j33K2K05j15K07l01J33M6j18J04Q7k74M03n37P6O7
$$ -134 -32 69 91 252 1 12 -121 -99 106 -9 198 -103 30 76 -42 62 149 -125 278 -259 -183 -116
7634a16K15k58J80J38j49L3K4K77l85j61R9J22j05K00j01o2Lk7J69m1k46L52l52
$$ -116 99 -159 21 159 10 43 67 344 -41 -202 -103 19 -86 114 13 -49 -46 -73 96 55 -191 161 -191
7657a91L77j94J66k61K26j54M8k13r1K02L31k27k49L97k64J28j23j5J7K14k01
$$ -191 186 -8 158 -103 123 -31 17 -196 -287 -85 246 19 -230 167 -97 31 -92 -107 -90 124 -77
7678g7J02kj09J70l57K06k21N28j71O3k69J36n1J43j95m5Q4K05m1j63K44m4j71
$$ -77 25 23 -86 84 -273 -67 -288 240 69 132 -137 -1 -52 91 -104 -149 -65 140 99 -64 180 136 -35
7701c5O3O9r9p3R1P0j9j39J00j90K99j88p0J47l46L94k11J88J48J5L3j07R0j68
$$ -35 28 97 -2 -75 16 86 67 -72 28 -162 137 -51 -121 26 -320 74 -137 51 199 214 247 140 230 62
7725F2J64k40j20J83j05J35Mk09J37L6J65k39M9j41K71o7n2l88J90K98q6J9J41
$$ 62 226 -14 -134 49 -56 79 83 -126 11 47 212 -27 22 -119 152 85 33 -355 -165 133 47 66 207
7748B07k09J49k17oP3m1j21Q0L44k84N8MO3j43N0j30L34p2k61K18k42K94l02K5
$$ 207 -2 147 -70 -76 -3 -44 -165 -85 259 -25 33 37 100 -43 7 -123 211 139 -122 96 -146 148 -154 -129
7772a29K15Kj34J48k07l6o4K17K86j5l98J46R6k89K05K7l71K07J04J13k85K74
$$ -129 86 88 -46 102 -105 -141 -205 12 298 283 -115 31 127 -162 43 70 -301 -94 10 123 -162 112
7794A12Lr6l3o5pr5K3J12j32K01L66m40J69O4r6j67Q6o6K8K5n3J96m0j54m0L7
$$ 112 115 19 -14 -79 -86 -181 -158 -46 -178 23 389 -51 118 182 86 -81 5 -61 -33 -8 -61 135 95 -59 -99 -62
7820f2j52L18mj51j17K2J81q1J09k16J67k6n8j64L42n4kKk7O0j77n0K60j05m5
$$ -62 -214 104 100 -51 -168 -146 35 -46 63 -153 14 -12 -70 -234 108 54 52 54 27 87 -90 -140 120 15 -30
7845c0o1K51K1j64M9j83K55l50L84j83k9J89j12O1k21J07M6k04l6m8M55k29J84
$$ -30 -91 160 181 17 66 -117 138 -212 172 -11 -40 149 37 98 -123 -16 30 -174 -210 -258 197 -32 152
7868A52p8M6j3l88K62J99k71J29J24j21J77j43L15j85m37J38m2NL2J98k72J23
$$ 152 74 120 107 -281 -19 180 -91 38 162 41 218 75 390 205 -232 -94 -136 -131 -99 99 -173 -50
7890e0L02j99k39K76j18m6J84p3L82l12k12KK09J63n4j93L4lj94l4K77l39K18
$$ -50 252 53 -186 90 -28 -74 110 37 419 107 -105 -103 106 269 215 22 56 53 -141 -175 102 -237 -19
7913a9L0L1L8J30j28k16K83l5p1l4n5J33qj17Q4j49J54j41N8J2j30j30L78j00
$$ -19 11 42 80 210 82 -134 149 114 43 9 -46 87 79 -38 46 -103 51 -90 -32 -20 -150 -280 98 -2
7937bo0qQ9M3q1L4j10J83Q3l62R0K8p7M8J70k50K60Q0K1j23r1j33K03J59j23k82
$$ -2 -62 -70 19 62 -19 15 -95 88 171 -191 -101 -73 -150 -102 68 -182 78 158 179 56 -35 -168 35 194 71 -211
7963b11K8L21M7j27K8K68o08M60l69J28j81J07Q6J27q7r2j71J57K81k64j06L1
$$ -211 -183 138 185 58 86 354 -254 206 -163 -35 -216 -109 -23 104 17 -75 -246 -89 192 -72 -178 -147
7985a47nJ72m5n9k03K44j91K22j76K22j28J11J97k37J43k81qK81J32k48l8lj38
$$ -147 -152 20 -25 -84 -287 -43 -234 -12 -188 34 -94 17 214 -23 120 -161 -169 112 244 -4 -42 -45 -183
8008a83J64L3L8O6j83J44J74k00M0j32J03n9Qj60n0K04K3j41K46l4l49J71l4j5
$$ -183 -19 14 52 118 -65 79 253 53 93 -39 64 5 13 -147 -197 7 30 -111 135 101 -248 -77 -111 -126
8032a26L26l6k76Q9J94j36M0k14o9M27k35K77k74K9j87L88k32o4J5j00J41K07
$$ -126 200 164 -112 -23 171 35 75 -139 -208 219 -16 261 -13 16 -171 217 -15 -79 -64 -164 -23 184
8054A84k53M6kK01j87J74n4k90L56k14J16k00o8K34j84n1K33j02q9K63k6j24l1
$$ 184 -69 -23 -25 176 -11 163 109 -181 175 -39 77 -123 -191 43 -141 -192 41 -61 -150 113 87 -37 -68
8077f8J00L97o09J22P3j50J81p0M6M8l9j1L7j43j4n0J32k4k2P9K12l93J04L07
$$ -68 32 429 -180 -58 15 -135 46 -24 22 70 31 20 57 -86 -100 -150 -18 -42 -64 15 227 -166 -62 245
8101B45J0j45l8k35p4L20k3M3j74K6L3J24p0J7j09Ok17P7K99J6p9m6O5j99L3j6
$$ 245 255 110 72 -163 -237 83 60 103 -71 -45 -12 112 42 59 -50 -44 -261 -184 115 131 52 6 71 -128 -95 -111
8127a11Q4J0R3k2j33K68j13J7q0j66J89J3Mj60K59KQ7k62QN6J25r2q9K1j13L6
$$ -111 -27 -17 76 54 -79 189 76 93 13 -153 36 49 53 -107 152 154 241 -21 -13 43 168 76 -13 8 -105 -69
8153f9P0o5K59r6j57q3J2O9J25j20J90O1j23l4J6p4R3j08j12Q5Q1J25j77j58r2
$$ -69 1 -64 195 99 -58 -141 -129 -60 65 -55 135 196 73 39 55 -19 74 -34 -146 -61 20 145 -32 -190 -282
8178b82L81o5J53l24J68r0k70N47k55O7K7j68l9
$$ -282 99 34 187 -137 31 -59 -329 218 -37 30 57 -111 -150
8191a50
$$ Imaginary data points
##PAGE= N=2
##DATA TABLE= (X++(I..I)), XYDATA
0@%%%%%%%%%%%%%%%%%%qJ6j6J6j6J6k1K9l2L4m2M8n5O4p3Q3r2J06j20J34j51J68
$$ 0 0 0 0 0 0 0 0 0 0 0 0 0 0 0 0 0 0 0 -8 8 -8 8 -8 8 -13 16 -16 18 -24 24 -31 33 -40 43 -49 57 -63 71 -80 88
40H8j85K06k30K56k82L10l43L81m22M65n12N64o21O84p56Q36r26J026j143J280
$$ 88 -97 109 -121 135 -147 163 -180 201 -221 244 -268 296 -325 359 -397 439 -487 539 -604 676
60F76j442J639j879K184k589L158m022N524q961L6564N569j4601l853j3817r388
$$ 676 -766 873 -1006 1178 -1411 1747 -2275 3249 -5712 30852 36421 21820 17967 4150 -5238
75e238k241M517k496J0408L118J0995m798Q512r050m118r306r303q409j0164J342
$$ -5238 -7479 -2962 -5458 4950 8068 19063 14265 22777 13727 9609 303 -9000 -17409 -27573 -26231
90b6231n436O276K564J0629M439O473O710l070L456q130n04j0166m20m800M83
$$ -26231 -31667 -25391 -22827 -12198 -7759 -1286 5424 2354 5810 -2320 -2824 -12990 -13410 -18210 -17727
105a7727L294M441R135L096J3666M90P186p75O11l429n661r79p133J605l010O451
$$ -17727 -14433 -9992 -857 2239 15905 16395 23581 22806 23417 19988 14327 13348 6215 7820 4810 11261
121A1261p3Q301M244L211N092j738K247q224q4q333l538n455j200o99j848O702
$$ 11261 11188 19489 23733 26944 32036 30298 32545 24321 24237 15904 12366 6911 5711 5012 3164 9866
137I866j339N946j400L933l540k511l276o735l080p175O79o322L771p25L330K292
$$ 9866 8527 14473 13073 17006 13466 10955 7679 944 -2136 -9311 -8632 -14954 -11183 -11908 -8578 -6286
153f286K241M160l098K768m397n40o419K9l629j186K407m44N796N63P699j91M815
$$ -6286 -4045 115 -2983 -215 -4612 -5152 -11571 -11542 -15171 -16357 -13950 -14394 -8598 -8035 -336 -527 4288
170D288O78P8j026k876P79n515K645k622L487M9M083L823J684M540p38K369l806
$$ 4288 4966 5044 4018 1142 1921 -3594 -949 -3571 -84 -35 4048 7871 9555 14095 13357 15726 11920
187A1920J358n390j469k437k119J12j882M507k146M155m81K359j738q19j413m621
$$ 11920 13278 7888 6419 3982 1863 1975 93 4600 2454 6609 6128 8487 6749 5930 4517 -104
203a04q90n523j69m123J580j110P91K033N47K710k024L003l770K72l306p15k195
$$ -104 -994 -6517 -6686 -10809 -9229 -10339 -9548 -7515 -6968 -4258 -6282 -3279 -7049 -6777 -10083 -10798 -12993
220a2993j898J481j813L382k47M918m39L482J011k27Q54k034J187l592K479k526
$$ -12993 -14891 -13410 -15223 -11841 -12088 -7170 -7609 -4127 -3116 -3343 -2489 -4523 -3336 -6928 -4449 -6975
236f975J913K51K194K078P06M070q57K589k009J698k877m76p22k103N48j351K378
$$ -6975 -5062 -4811 -2617 -539 167 4237 3380 5969 3960 5658 2781 2305 1583 -520 28 -1323 1055
253A055j673L300l28J470o96k17M0l603P80m120M42k957L89j261M79R24j17K080
$$ 1055 -618 2682 2354 3824 3128 2911 2951 -652 128 -3992 -3550 -6507 -6118 -7379 -6900 -5976 -6093 -4013
271d013j675K572l133P95j846j136j125j330R62j752K641q33K788l53K508O10
$$ -4013 -5688 -3116 -6249 -5454 -7300 -8436 -9561 -10891 -9929 -11681 -9040 -9873 -7085 -7438 -4930 -4320
287d320l4J736k113J542k170J769j751J167M46J119K002J26L433j268K983q71
$$ -4320 -4354 -2618 -4731 -3189 -5359 -3590 -5341 -4174 -3728 -2609 -607 -481 2952 1684 4667 3796
303C796J119j266l04K47j543J287j655K116j526K521l79L80Q87p22Q42k374P25
$$ 3796 4915 3649 3345 3592 2049 3336 1681 3797 2271 4792 4413 4793 5680 4958 5800 3426 4151
320D151k746J87k244N30j161p76J355j284J570j485J470j605N28j234j181m88
$$ 4151 1405 1592 -652 -122 -1283 -2059 -704 -1988 -418 -1903 -433 -2038 -1510 -2744 -3925 -4413
336d413j374Q00k202K043j373J592j71R90R52n48J860j458J273j387J192j094
$$ -4413 -5787 -4987 -7189 -5146 -6519 -4927 -5098 -4108 -3156 -3704 -1844 -3302 -2029 -3416 -2224 -3318
352c318R41M97j79K255k14K381o58K217k46Q39R2q7P50j588J718j345J689p39
$$ -3318 -2377 -1880 -2059 196 -18 2363 1705 3922 3676 4515 4607 4520 5270 3682 5400 4055 5744 5005
370E005J452Q7M83Q89o59P85j340J072k223L14j160l56j37p81Q51j659J245j150
$$ 5005 6457 6544 7027 7916 7257 8042 6702 7774 5551 5865 4705 4349 4212 3431 4282 2623 3868 2718
388B718O78j168%p62j480K40j877M56j727J213j220L12P3j84O56p21J251j320
$$ 2718 3396 2228 2228 1466 -14 226 -1651 -1195 -2922 -1709 -2929 -2617 -2544 -2728 -2072 -2793 -1542 -2862
406b862J216j562R73p33N2O19n91J928q54J896o05K040p61R67O31l24J008j149
$$ -2862 -1646 -3208 -2235 -2968 -2916 -2297 -2888 -960 -1814 82 -523 1517 756 1723 2354 2030 3038 1889
424A889J568r85J462q08J485K71K34R14p49J435j273J362j654Q29r69p21K95o25
$$ 1889 3457 2472 3934 3126 4611 4882 5116 6030 5281 6716 5443 6805 5151 5980 5011 4290 4585 3960
442C960P13j294R62q71N58q55k63m14o60P5j964O00j596N27r86P9l26r0L11r96
$$ 3960 4673 3379 4341 3470 4028 3173 2910 2496 1836 1911 -53 547 -1049 -522 -1508 -1429 -1755 -1845 -1534 -2530
462b530J215j685Q88j035O05n92m39N75q56J269r81J568r50J332k31N75O33o02
$$ -2530 -1315 -3000 -2112 -3147 -2542 -3134 -3573 -2998 -3854 -2585 -3566 -1998 -2948 -1616 -1847 -1272 -639 -1241
480a241O88n42J432j033R60j15N66M21o6J003l57J408j102J101p71L64m39k25
$$ -1241 -553 -1095 337 -696 264 149 715 1136 1070 2073 1716 3124 2022 3123 2352 2716 2277 2052
498B052M14p30O86j038J440j128M70k40n20L11j086O14j353O91j320L87o40l02
$$ 2052 2466 1736 2422 1384 2824 1696 2166 1926 1406 1717 631 1245 -108 583 -737 -350 -990 -1292
516a292P1o95J012j437J009j039M37p71r5j50k84K56j083J301j102J196n75P66
$$ -1292 -1221 -1916 -904 -2341 -1332 -2371 -1934 -2705 -2800 -2950 -3234 -2978 -4061 -2760 -3862 -2666 -3241 -2475
534b475j41O8R16r78J089p55J011o75Q51m79L70M65j83R92n38R87o33Q28l50M04
$$ -2475 -2616 -2548 -1632 -2610 -1521 -2276 -1265 -1940 -1089 -1568 -1198 -733 -916 76 -462 525 -108 720 370 774
554G74j62l79N33l50P15r08R49p40K90J74m09N87r10P38j363N22r57K86Jm62K60
$$ 774 612 233 766 416 1131 223 1172 432 722 896 487 1074 164 902 -461 61 -896 -610 -609 -1071 -811
575h11o07O14r99Q85p82J07m91J28J2n08J97q33J085r13P47m64N65K29n35R46
$$ -811 -1418 -804 -1803 -918 -1700 -1593 -2084 -1956 -1944 -2452 -2255 -3088 -2003 -2916 -2169 -2633 -2068 -1839 -2374 -1428
595a428p49J059r14P27l57L86qJ78P42n29R49o04J245p34O21J20J44L02p08R57
$$ -1428 -2177 -1118 -2032 -1305 -1662 -1276 -1284 -1106 -364 -893 56 -548 697 -37 584 704 848 1150 442 1399
615A399r06P32m00M29j15J21J78m63M16n62M75p48M77n14J58n94J3K97p88P09
$$ 1399 493 1225 825 1254 1139 1260 1438 975 1391 829 1304 556 1033 519 677 83 96 393 -395 314
635C14q63L56o04M07k89j06r5n09K19m91M90n52L51j56K71j9l74N71m02P29p69
$$ 314 -549 -193 -797 -390 -679 -785 -880 -1389 -1170 -1661 -1171 -1723 -1372 -1528 -1257 -1276 -1650 -1079 -1481 -752 -1521
656a521R12m62K90L21j35N85m55Q81p84J005l0K67J3N1O17q31Q02m46O83n26M31
$$ -1521 -609 -1071 -781 -460 -595 -10 -465 416 -368 637 607 874 887 938 1555 724 1526 1080 1763 1237 1668
677A668J93P3J18j48K93n52M62n47N76n06j87j18j48L88p08O40p96L21m60P4k31
$$ 1668 1861 1934 2052 1904 2197 1645 2107 1560 2136 1630 1443 1325 1177 1565 857 1497 701 1022 562 636 405
698D05l75K21n32K73p77M94n89N03n34K89j60k82K63p06R00o39L45j70J94J60
$$ 405 30 251 -281 -8 -785 -291 -880 -377 -911 -622 -782 -1064 -801 -1507 -607 -1246 -901 -1071 -877 -717
718g17l68M74k00N46l24Q42m47L97N3k3N21m36O98k58N28k81J08K26Q4K64l50
$$ -717 -1085 -611 -811 -265 -589 253 -194 203 256 233 754 318 1016 758 1286 1005 1113 1339 1423 1687 1337
739A337N54n23O12n27N24l46j5m3k97N64n62K33k08J09o91K26j01l13L57p43L18
$$ 1337 1891 1368 1980 1453 1977 1631 1616 1573 1276 1840 1278 1511 1303 1412 721 947 846 533 890 147 465
760D65m78M36n88J78r0m52M79o71L98o58N40p54M24l55Q2J89l62O06p40R51q32
$$ 465 -13 423 -165 13 -77 -529 -50 -721 -323 -981 -441 -1195 -771 -1126 -1044 -855 -1217 -611 -1351 -400 -1232
781a232O20k72K05P2k09N52m60Q21n14O28k00K10O5J2N47n25M47k38M93l89N74
$$ -1232 -612 -884 -679 -607 -816 -264 -724 97 -417 211 11 221 286 298 845 320 767 529 1022 633 1207
802A207m77j66L70l30K04j69K40k56L82k84K07j46k75K92n94L17o00L30m19q0
$$ 1207 730 564 934 604 808 639 879 623 1005 721 928 782 507 799 205 522 -78 252 -167 -247
822b47J31k97J11m39M41n08N94p92M06L1n46L66m46O90l72L34l03L43k6j35P3
$$ -247 -116 -413 -302 -741 -300 -808 -214 -1006 -600 -569 -1115 -749 -1195 -505 -877 -543 -846 -503 -529 -664 -591
843e91l67O76l93O37l04K12j70J33O7k47M79k84O99o46N55m98L08J14k86L66m04
$$ -591 -958 -282 -675 -38 -342 -130 -300 -167 -100 -347 132 -152 547 -99 456 -42 266 380 94 460 56
864E6L32k62L49m31L27k92j80K83l75M79l92M79l88o4l81L57Lk82J98m72M14k17
$$ 56 388 126 475 44 371 79 -101 182 -193 286 -106 373 -15 -79 -460 -103 -100 -382 -184 -656 -242 -459
886d59J79j05n3M2k70R2r2N32m72j03J48l0M43l81K74j73K67l97O26n13M13j31
$$ -459 -280 -385 -438 -396 -666 -574 -666 -134 -606 -709 -561 -591 -148 -529 -255 -428 -161 -558 68 -445 -32 -163
908a63K6J83l32N48m12L82k58L13r0M9k4k5K07l63K17l49M51k23P6J03j43J38
$$ -163 -137 46 -286 262 -150 232 -26 287 197 246 222 197 404 41 258 -91 360 137 213 316 173 311
930C11m75L96l91L72k23Qn9j83J5j51M37p66N60m67J82J89l36L42l29K43l37M48
$$ 311 -164 232 -159 213 -10 -2 -61 -244 -229 -380 57 -709 -149 -616 -434 -245 -581 -239 -568 -325 -662 -214
952b14o05M25p6Q2j84J60K40l58M03k19J10J31O9k09K90M2j78J55k07O12k16L31
$$ -214 -819 -394 -470 -388 -572 -412 -172 -530 -127 -346 -236 -105 -36 -245 45 87 -91 64 -143 469 253 584
974E84k48p4M11l34L76m12M30l14J08j18o6L17k92K32l85K77m49P30m17j01j89
$$ 584 336 262 673 339 715 303 733 419 527 409 343 660 368 600 215 492 43 773 356 255 66
995F6R1M9m03L32n21N22l93j1m5N0o0p1K91l10L68n82J47R4j38jl4K87k92L86
$$ 66 157 206 -197 135 -386 136 -257 -268 -313 -263 -323 -394 -103 -413 -45 -627 -480 -386 -524 -525 -559 -272 -564 -178
1019a78k89M35m40L53j9K00r3jJ45k98L03r3N1K31R5j26j57K18j39M96j83Q5R4
$$ -178 -467 -32 -472 -119 -138 62 -31 -32 113 -185 118 25 76 307 402 276 119 337 198 694 511 596 690
1042F90j5k42o9K39m3K0m60K09J41j50K21l03J69k87N30o74R4M8J11l09J7L62
$$ 690 675 433 364 603 560 580 120 329 470 320 541 238 407 120 650 -24 70 118 229 -80 -63 299
1064B99n43K39l51M53n50L00j76j5K18n08O02l44N6k52J86J84j95K84l90M14j98
$$ 299 -244 -5 -356 97 -453 -153 -329 -344 -126 -634 -32 -376 -320 -572 -386 -202 -397 -113 -503 -89 -287
1085b87J56m2LJ7o5k9L77l4j06n6J44L92j66Rj29P9J02j94M42m37J16n6J95n1
$$ -287 -131 -173 -170 -153 -218 -247 130 96 -10 -66 78 470 304 313 184 263 365 171 613 176 292 236 431 380
1109C80J48j08k85L43m08K05k75L00l04K30k96Q4P1l6J5l39J45R5L4j95m8K51
$$ 380 528 420 135 478 70 275 0 300 -4 226 -70 14 85 49 64 -275 -130 -35 -1 -196 -244 7
1131Gl46M82m00K28l79L56o0k81K19m29L49K29KM2J7k46K2L05l81K26k36N67m16
$$ 7 -339 143 -257 -29 -408 -52 -112 -393 -174 -603 -254 -25 -23 19 36 -210 -188 117 -264 -38 -274 293 -123
1154a23L72l37J54rrJ81q0K50m25L72k97J64k7O8p0qj90k15N02j93mR2n8J67l03
$$ -123 249 -88 66 57 48 229 149 399 -26 346 49 213 186 254 184 176 -14 -229 273 80 76 168 110 277 -26
1179b6K41n42M52k08K10l81K04q7r1K27j67L10l71J77j99K16j02K13k02L1J43
$$ -26 215 -327 125 -83 127 -254 -50 -137 -228 -1 -168 142 -229 -52 -251 -35 -137 76 -126 -95 48
1200D8j91K72j68j43K04Q8j66N5J61k52R0M1K80l18K77m4q8L6l09N40k16K35k58
$$ 48 -143 129 -39 -182 22 110 -56 -1 160 -92 -2 39 319 1 278 234 146 182 -127 413 197 432 174
1223A74M9j23j05K51R3j0l66L83l33J66l7p0J6j57J93l09J21j53K80j82k9J3r0
$$ 174 223 100 -5 246 339 329 -37 346 13 179 142 72 88 -69 124 -185 -64 -217 63 -119 -148 -135 -225
1246b25J25l76M17k73N4r6K16J15k15p3R6K31m15J38K33k41O1K71n4r7J73l44
$$ -225 -100 -476 -59 -332 -278 -374 -158 -43 -258 -331 -235 -4 -419 -281 -48 -289 -228 43 -11 -108 65 -279
1268b79P15n12L15j08Q7K04l57K26l25L71j04OJ2M4j42K50q7j18J15j13J80K4
$$ -279 436 -76 239 131 218 422 65 291 -34 337 233 239 251 295 153 403 316 198 313 200 380 404
1290D04k62Q6j10J43l10K40k38J25k55J44k48J95n8j79J93n3J17m10J49p3J35
$$ 404 142 228 118 261 -49 191 -47 78 -177 -33 -281 -86 -144 -323 -130 -183 -66 -476 -327 -400 -265
1311b65k19r4L36k26Q7J4J45l68K24J37j46L06m93N79n72J94L22j24J75J2J05
$$ -265 -484 -578 -242 -468 -381 -367 -222 -590 -366 -229 -375 -69 -562 17 -555 -361 -39 -163 12 24 129
1332A29l42M55k91J48R0J82k00M5j59L04J37l14J25j38M5N4K7j16J37k59N2oj96
$$ 129 -213 242 -49 99 189 371 171 216 57 361 498 184 309 171 216 270 297 181 318 59 111 105 -91
1355i1L5J45j37J84n5j99K37L2k98n0Q6L9j89j24J77k39L88j45k59Q9J37k19L20
$$ -91 -56 89 -48 136 81 -118 119 151 -147 -197 -111 -72 -261 -385 -208 -447 -59 -204 -463 -374 -237 -456 -136
1378a36k24kL4jO7m0R9Q1J05r6J12mk14J56J78l9l09K33K7J27j33O5m2j62L57
$$ -136 -360 -362 -328 -329 -262 -302 -203 -122 -17 -113 -1 -5 -219 -63 115 76 -233 0 27 154 21 86 44 -118 239
1403B39r9J83k91K92k18rK38l30J72j09J61p2j83L24j80J82q5j61o1J3qM5m5K7
$$ 239 140 323 32 324 106 97 335 5 177 68 229 157 -26 298 118 300 215 54 -7 6 -2 43 -2 25
1427B5Pj63K69n39N50l85K67j05j30o5K7K9N7j10J29Pj54KJ64j3j2N2J22j7J06
$$ 25 32 -131 138 -401 149 -236 31 -74 -204 -269 -242 -213 -156 -266 -137 -130 -284 -282 -118 -131 -143 -91 31 14 120
1452A20j09J50j02k07J43n6L02k01Jk71M57K6N3m6k49J23j19J34N5O4k66K65J15
$$ 120 11 161 59 -148 -5 -61 241 40 41 -230 227 253 306 260 11 134 15 149 204 268 2 267 382
1475C82k06LK0m8j96J00J05k58K49k11l3K09l29J9K51k18j1J91j45m3qm4O0J38
$$ 382 176 179 199 151 -45 55 160 -98 151 -60 -93 116 -213 -194 57 -161 -172 19 -126 -169 -177 -221 -161 -23
1499b3j31J47J34j99J21j66M8J26J58j06j03j40M55m6j01k7L7k9L6K62m69Q0r5
$$ -23 -154 -7 127 -72 49 -117 -69 57 215 109 6 -134 321 275 174 147 184 155 191 453 -16 64 -31
1522c1M65k58j37J98l49K48l2k16K58L4K25l07N7j0Pj70J66m8j98K58j29r9LR4
$$ -31 434 176 39 237 -112 136 104 -112 146 180 405 98 155 145 152 -18 148 100 -98 160 31 -68 -65 29
1546B9j84j03M43k01j07R8j15l9J88l79J44LK9J5q9J92k89J51M6q2L21o5j70R8
$$ 29 -155 -258 185 -16 -123 -25 -140 -179 9 -370 -226 -223 -194 -179 -268 -76 -365 -214 -168 -250 71 6 -164 -66
1570f6J21j4J31j31m2J01nj3L3J46o5j57J57%n8J8PJ77P3j49j38M9O1k17K3O0
$$ -66 55 41 172 41 -1 100 95 82 115 261 196 39 196 196 138 156 163 340 413 264 126 175 236 19 42 102
1596A02QJ44k9K0l17Q6mr3J43j75j11J49j47K6L7q7J21m5L5Q1j2j14k65P4O8K59
$$ 102 110 254 225 245 -72 14 10 -83 60 -115 -226 -77 -224 -198 -161 -248 -127 -172 -137 -56 -68 -182 -447 -373 -305 -46
1622d6j67J74N9l08Q4J12k2L7k65J12J97j00K37j34l43L22O3J6Q7N5j49Q3nJ44
$$ -46 -213 -39 20 -288 -204 -92 -114 -77 -342 -230 -33 -133 104 -30 -373 -51 12 28 115 170 21 104 99 243
1646B43j31j23P3K43k1o4o9%NK3l38K17j15J77nj81J99l17j65J26K4J91n9M5q8
$$ 243 112 -11 62 305 284 220 151 151 156 179 -159 58 -57 120 115 -66 133 -184 -349 -223 -199 -8 -67 -22 -110
1671a10M0J20k67Q3j37K05k26J7J72R1j29j65K00p4r4MK06j8n2j96J44q2M51l73
$$ -110 -70 50 -217 -134 -271 -66 -292 -275 -103 -12 -141 -306 -106 -180 -274 -270 -64 -82 -134 -330 -186 -268 183 -190
1695a90J33Q2j61J72Jn0J64r8O6j7j45J80k02L16l4j32l6J26N8j28J33j21J15
$$ -190 -57 25 -136 36 37 -13 151 53 119 102 -43 137 -65 251 217 85 49 175 233 105 238 117 232
1718B32j83K33j28J4k33O4j76L82K9j20j43P3Q1j98K2j6N0k93L18p7pOq1J04k2
$$ 232 49 282 154 168 -65 -1 -177 205 234 114 -29 44 125 -73 -51 -67 -17 -310 8 -69 -76 -70 -151 -47 -69
1743f9K5j22J23j35K1O3n6m7N3K19k16J29J58j25L9P2Ql87K30j23K74j24j6K32
$$ -69 -44 -166 -43 -178 -157 -94 -150 -197 -144 75 -141 -12 146 21 60 132 140 -247 -17 -140 134 10 -6 226
1767B26m36M31j65J1N1l2L4j34K42j78J82j84nl9L86l26r6K95k2J05k25M1k11
$$ 226 -210 221 56 67 118 86 120 -14 228 50 232 48 43 4 390 64 -32 263 241 346 121 162 -49
1790d9L3j66K01N4J35j43j16j3R9J6k01j03K80j15j09K3J8K06l58L35j75J89p6
$$ -49 -16 -182 19 73 208 65 -51 -64 35 51 -150 -253 27 -88 -197 -174 -156 50 -308 27 -148 41 -35
1813c5j22j91M09N9k33k0J88l67J96L16k84K84k36Q2J0J23l46K31m0K64j51j45
$$ -35 -157 -348 61 120 -113 -133 55 -312 -116 200 -84 200 -36 46 56 179 -167 64 24 288 137 -8
1835hJ27oj97K50J20K2k16J27k39J16l22M80k80L04j92k38J56j05L91m87J73P2
$$ -8 119 113 -84 166 286 308 92 219 -20 96 -226 254 -26 278 86 -152 4 -101 290 -197 -24 48
1857D8j89O8Q0l2R5r1k82L66P2k82l1K13k91J19M9J4n6n9J27J42k36J09n7J83
$$ 48 -141 -73 7 -25 70 -21 -303 63 135 -147 -178 35 -256 -137 -88 -74 -130 -189 -62 80 -156 -47 -104 79
1881G9P6j83M8j67L18k05l3j6K49j85J62j73j4K13j58P9o4L4J49j56J09p3j05
$$ 79 155 -28 20 -147 171 -34 -67 -83 166 -19 143 -30 -44 169 11 90 26 60 209 53 162 89 -16
1904a6J17j59Q2N4p0Jr9J24q8j82K67N1Q6j60q2n6K59n6j24k1j0l9J13r2O9j55
$$ -16 101 -58 24 78 8 9 -90 34 -54 -236 31 82 168 8 -74 -130 129 73 -51 -72 -82 -121 -8 -100 -31 -186
1930a86J74r1J73j18j18K9JJ0Q1k3J7N0K32p7j11k4o1L5%o0JM04rr7k53J68q7
$$ -186 -12 -103 70 -48 -166 -137 -136 -126 -45 -68 -51 -1 231 154 43 19 -42 -7 -7 -67 -66 338 329 232 -21 147 60
1957F0KR6ok72L81N7j81j30J04o0P1m11N12j84N7m8j44L3l79L35L25k32o7l9Q2
$$ 60 62 158 152 -120 261 318 137 7 111 51 122 -289 223 39 96 48 -96 -63 -442 -107 218 -14 -81 -120 -38
1982c8P2j31K98j75k63M85k95j26j69J15K45j08J02r0J75j73Q5l55L34k64L26
$$ -38 34 -97 201 26 -237 248 -47 -173 -342 -227 18 -90 12 -78 97 -76 9 -346 -12 -276 50
2003E0j0j97M35n36K51J9J67Qj50J05k28L36P4m05K47k17L76l29M0L2l4R2J34
$$ 50 40 -157 278 -258 -7 12 179 187 37 142 -86 250 324 -81 166 -51 325 -4 36 68 34 126 260
2026B60j52p6K23j35k37J35l5R8n4oL04l27m3L4m5l13K32P4j53L40j91r7j09J38
$$ 260 108 32 255 120 -117 18 -17 81 27 21 325 -2 -45 -11 -56 -369 -137 -63 -216 124 -67 -164 -273 -135
2050a35%j23N2n1M23k49OL5o3R9j28j18K63j21J40j06K49j22l9K89%l72r3R6j33
$$ -135 -135 -258 -206 -257 166 -83 -77 -42 -105 -6 -134 -252 11 -110 30 -76 173 51 12 301 301 -71 -164 -68 -201
2075b01J27J16J12J5k03M9J25R3k7l73M37j55r3J12q3L3K57r5k7q8m9q9K14j05
$$ -201 -74 42 154 169 -34 15 140 233 206 -167 270 115 22 134 51 84 341 246 219 131 82 -7 207 102
2099A02k8j41J85o1J60m01J82P5j09P7jm4qj75J28mR9j69J3J17j18J52j43K38
$$ 102 74 -67 118 57 217 -184 -2 73 -36 41 40 -4 -12 -187 -59 -63 36 -133 -120 -3 -121 31 -112 126
2123A26k95K51k43N9j9j7j51J56k2K77n1m1J3pp8j22L74j80K13l49M5k5N4K31
$$ 126 -169 82 -161 -102 -121 -138 -289 -133 -155 122 71 30 43 36 -42 -164 210 30 243 -106 -61 -86 -32 199
2147A99o5l7j43O9K43N2k55j49K55j44k92M62k3o2k25K96l58J95q6J85l9%j07
$$ 199 134 97 -46 23 266 318 63 -86 169 25 -267 195 172 110 -115 181 -177 18 -68 117 78 78 -29
2170b9J79k96K59k27O0j94K26n1j19K53o3Q6k10j3K97k53k18L65j23l7P4J71k74
$$ -29 150 -146 113 -114 -54 -248 -22 -73 -192 61 -2 84 -126 -139 158 -95 -313 52 -71 -108 -34 137 -137
2193a37J10J29j56j39K81j91q0K28J41j04J33k27k1J2k08o4M15q0n5q9J10o4p2
$$ -137 -27 102 -54 -193 88 -103 -183 45 186 82 215 -12 -33 -21 -229 -293 122 42 -13 -102 8 -56 -128
2216a28J69l3j76J80j7J01J50l47J7J52j18j12K81l43J80L0J19J55k32j15N4k33
$$ -128 41 8 -168 12 -5 96 246 -101 -84 68 -50 -162 119 -224 -44 -14 105 260 28 -87 -33 -266
2238b66K48q9l42L52m9p2R3j37K43R5K6j69l8o4J5K14l7O0j41J36j12LJ37m4L1
$$ -266 -18 -107 -449 -97 -146 -218 -125 -262 -19 76 102 -67 -105 -169 -154 60 23 83 -58 78 -34 -31 106 62 93
2263I3q4K01j58rj02K01P3j83J08k2k10J87J5j89J23QL1M1l69K29j7J30l0J06
$$ 93 9 210 52 43 -59 142 215 32 140 118 -92 95 110 -79 44 52 83 124 -245 -16 -33 97 67 173
2287A73l83J17j5p0J59L4J45m96L58l7k39K1J34J37K7k97N8K29j47p7J5q6K30
$$ 173 -210 -93 -108 -178 -19 15 160 -336 22 -15 -254 -233 -99 38 65 -232 -174 55 -92 -169 -154 -240 -10
2310a0P3j69J21Q6j37J9p4J66K29k51j05Q9M0r2K0J09k3Qr6o9Q1J03J38j32j13
$$ -10 63 -106 15 101 -36 -17 -91 75 304 53 -52 37 77 -15 5 114 91 99 3 -66 15 118 256 124 11
2335A1K13j9k80L7J52Q5j11J23k67N2J28k15k1J35j5r9N1Q6n3m4Q6p1p1J38O2
$$ 11 224 205 -75 -38 114 199 88 211 -56 -4 124 -91 -112 23 8 -91 -40 46 -7 -51 35 -36 -107 31 93
2360I3N7J7k60j01L3P0j47K28j51K5J37N7m28L88k00K74j53J06J02j75o8M0j19
$$ 93 150 167 -93 -194 -161 -91 -238 -10 -161 -136 1 58 -370 18 -182 92 -61 45 147 -28 -96 -56 -175
2383a75O4K07j18K11r6k10L18L6k92M7J33o1j42n1Q6K38Q1k35l4k6K47l15k5J49
$$ -175 -111 96 -22 189 93 -117 201 237 -55 -8 125 64 -78 -129 -43 195 276 41 7 -19 228 -87 -112 37
2407C7k73L29j61k7J35j21k9J38l12J85O4J1k52K24J08K06m26J22j88J35J49j35
$$ 37 -236 93 -68 -95 40 -81 -110 28 -284 -99 -35 -24 -276 -52 56 262 -164 -42 -230 -95 54 -81
2429h1q8r7K24K49k73m5L52j53k02P2q0mJ03K0Q2j24Q2L1j42m1J20J72j96r1M8
$$ -81 -169 -266 -42 207 -66 -111 241 88 -114 -42 -122 -126 -23 -3 79 -45 37 68 -74 -115 5 177 -19 -110 -62
2454f2J27L6L8j99J25m26M04%O3m6O2q6j0j79K85j20J40j5M7j73J17j29j49k6
$$ -62 65 101 139 -60 65 -361 43 43 106 60 122 36 26 -153 132 12 152 137 184 11 128 -1 -150 -176
2478a76J47J63n1j01QN2j61%J86rp2j91J21K3l9J35k9j29J98n4r3l1J97l08OM19
$$ -176 -29 134 83 -18 -10 42 -119 -119 67 58 -14 -205 -84 -61 -100 35 6 -123 75 21 -72 -103 94 -214 -208 211
2504B11l69K12n6N2K69j93j93K61p1J6j72j5P2M2J06r4p4K5k89L73j17O0j11j5
$$ 211 -158 54 -2 50 319 126 -67 194 123 139 -33 -48 24 66 172 78 4 29 -260 113 -4 56 -55 -70
2528g0M04l31N4l01M7K9K72mO2k69J48k5j66j48K48O9J9JQ1j67J2j05J63k26N4
$$ -70 334 3 57 -244 -197 -168 104 100 162 -107 41 16 -150 -298 -50 19 38 39 120 -47 -35 -140 23 -203 -149
2553a49J62m1l33J08J85O9N8qj83K25l3n6LJ90J4k99L09K8j03k8L4j11K0l04J69
$$ -149 13 -28 -361 -253 -68 1 59 51 -132 93 60 4 7 197 211 -88 221 249 146 118 152 41 61 -243 -74
2578g4p5L06j80j3J23P8J3j02o8p6J63R6k52m1OL32m78J84K91l14K62m9L3j1k03
$$ -74 -149 157 -23 -36 87 165 178 76 8 -68 95 191 -61 -102 -96 236 -242 -58 233 -81 181 132 165 154 -49
2603d9j67K01J32Q8j76P5l2j58r9n1M29k67L21l08J8J80l22J01L7p4J47k11rJ62
$$ -49 -216 -15 117 205 29 104 72 -86 -185 -236 193 -74 247 -61 -43 137 -185 -84 -47 -121 26 -185 -194 -32
2627c2MN8k48R1J62q8K35k23J17M5j75J42l7J28j04qJ8L3j04K15k19J46k88J16
$$ -32 -28 30 -218 -127 35 -53 182 -41 76 121 -54 88 51 179 75 67 85 118 14 229 10 156 -132 -16
2651a6J5P0J59j96jk09K81ql81J21K46j04j4N1K9j30K0P4jM7k53MJ49K6k5j0j71
$$ -16 -1 69 228 32 31 -178 103 95 -286 -165 81 -23 -37 14 43 -87 -67 7 6 53 -200 -196 -47 -21 -46 -56 -227
2678b27O6J47j7lq7J97K2p3k22J92J79j13K07k40K3n7J12N1j34m8J75j50J82o1
$$ -227 -161 -14 -31 -34 -121 76 98 25 -197 -5 174 61 268 28 51 -6 106 157 23 -25 150 0 182 121
2702A21K04j27p4n3K47l82J04k67L14j51Q3j97K58O4p8N4n2j29J0K13k09j97K92
$$ 121 325 198 124 71 318 -64 40 -227 87 -64 19 -178 80 144 66 120 68 -61 -51 162 -47 -244 48
2725D8K7N0k24K2Q8p2J45p8n7n0K21k17K96p2n2O1j28p6j9p0J00Q7l7m7L4oO6
$$ 48 75 125 -99 -77 11 -61 84 6 -51 -101 120 -97 199 127 75 136 8 -68 -87 -157 -57 30 -7 -54 -20 -26 40
2752D0j7k4K7M3k43K85j91K21n6r3r6j8R6j42J02J78k2K9r1j01Rk8o5L92l82J76
$$ 40 23 -1 26 69 -174 111 -80 141 85 -8 -104 -122 -26 -168 -66 112 90 119 28 -73 -64 -92 -157 235 -147 29
2778B9K7o4J45l36L13k18J66J52k20L0N2k14KJ12P4j00Nj52M7K09j86J46%j66
$$ 29 56 -8 137 -199 114 -104 62 214 -6 24 76 -138 -136 -24 50 -50 -45 -197 -150 59 -127 19 19 -147
2802a47O3Mk26L45p0Q5k12j02K45m0N9k2k6n4J45l15J38K13j1q9n1R5L20n69M18
$$ -147 -84 -80 -306 39 -31 54 -158 -260 -15 -55 4 -18 -44 -98 47 -268 -130 83 72 -17 -68 27 347 -222 196
2827A96j04k46K65j32J8L11r4l12O3O2J86j72k54M01l04J88j36K33k23jK70m0
$$ 196 92 -154 111 -21 -3 308 214 -98 -35 27 213 41 -213 188 -116 72 -64 169 -54 -55 215 175
2849A75o7j36Q9j11q7kJ58j01Q3rj72K03R7k2k43J49J22k82K69j82J01n7J46o3
$$ 175 108 -28 61 -50 -137 -139 19 -82 1 -8 -180 23 120 98 -145 4 126 -156 113 -69 32 -25 121 58
2873E8N7k49r9K09J62o4p0Q2k6j3j68j6K03M2l86M82m35L53j36K38k26J31j79
$$ 58 115 -134 -233 -24 138 74 4 86 60 47 -121 -137 66 108 -278 204 -231 122 -14 224 -2 129 -50
2896e0J55k37K14k4l3pl0J88l66K42k7K01l13O3k26J48J72oO7p2j12j22K16j2
$$ -50 105 -132 82 58 25 18 -12 176 -190 52 25 226 -87 -24 -250 -102 70 64 131 59 -53 -175 41 29
2920B9K8p1M8j33J78Jj47n0L7L9L7J81j99K6q8R4Rj0j8J56j40J2o2Q4l6j28J47
$$ 29 57 -14 34 -99 79 80 -67 -117 -80 -41 -4 177 -22 4 -84 10 19 9 -9 147 7 19 -43 41 5 -123 24
2947B4n7J40j14j41K52M4J6j32nL4k7p7J57m9%l35K80M5Kp8L5k8o4Q9J35j01k48
$$ 24 -33 107 -7 -148 104 148 164 32 27 61 34 -43 114 65 65 -270 10 55 57 -21 14 -14 -78 11 146 45 -203
2974b03L05j24j46M8J0K49j74J8J38j53k6J11L4p5j35J00l8J1LL38j85j92O9K7
$$ -203 102 -22 -168 -120 -110 139 -35 -17 121 -32 -58 53 87 12 -123 -23 -61 -50 -47 291 106 -86 -17 10
2998A0J05j43P1M5l31K84n8J54m11K66j15P5J66l2K59l29J70l28O7L7L87m67K04
$$ 10 115 -28 43 88 -243 41 -17 137 -274 -8 -123 -48 118 86 345 16 186 -142 -75 -38 349 -118 86
3021H6k23K02o4j2J31j01K2j4M3j04J25j65J30k01J5K71k73mK02j39j36N25m40
$$ 86 -137 65 1 -11 120 19 41 27 70 -34 91 -74 56 -145 -130 141 -132 -136 66 -73 -209 316 -124
3044a24J49J63j07J20q3l52J87Ko6P0J11O6j0l05K97K7m0K7j88K10J4l90M04j14
$$ -124 25 188 81 201 118 -234 -47 -45 -111 -41 70 136 126 -179 118 145 105 132 -56 154 168 -222 182 68
3068F8r5P4L0R8o6r0O8L1l9Q6m6q6r3J88j69J33k15J61q6L73k47R7n87K70J58
$$ 68 -27 47 77 175 109 19 87 118 79 165 119 33 -60 128 -41 92 -123 38 -48 325 78 175 -412 -142 16
3093A6n8o3k05L66q8nO9L5q3j1M3J21j56l55M44k15J51J09k17J43Qr6K49j11K95
$$ 16 -42 -105 -310 56 -32 -37 32 67 -16 -27 16 137 -19 -374 70 -145 6 115 -102 41 49 -47 202 91 386
3118C86n65J20n7K26j02J86m3j40l5J49l65J48O8L1j78l8K41J7j34K77m7l21K88
$$ 386 -179 -59 -116 110 8 194 151 11 -24 125 -240 -92 -24 7 -171 -209 32 49 -85 192 145 -176 112
3141A12k70N3K7J20n2J23J60o1m16K21j46l8R5j09K0J72o8k45L23r6O7%o9j59
$$ 112 -158 -105 -78 42 -10 113 273 212 -204 17 -129 -167 -72 -181 -161 11 -57 -302 21 -75 -8 -8 -77 -236
3165b36Q2J89j54PK7K9j11J18K45k54j11q1mL64L6k01l0J14j66M16L3j17l65K29
$$ -236 -154 35 -119 -112 -85 -56 -167 -49 196 -58 -169 -250 -254 110 146 -55 -85 29 -137 279 312 195 -170 59
3189E9qj06j0p2K90j03j65J8J03k17p1L29r4j67J95J09j99J54L1M6k26QN8k9P4
$$ 59 51 -55 -65 -137 153 50 -115 -97 6 -211 -282 47 -47 -214 -19 90 -109 45 76 122 -104 -96 -38 -67 7
3214Gr0L4R0l9J99k19MRK7p0r6J91r7J41p1P6l29L81l9j41J07l9j5J6J11j7l03
$$ 7 -83 -49 41 2 201 -18 -14 -5 22 -48 -144 47 -50 91 20 96 -233 148 109 -32 75 36 21 37 148 131 -172
3241a72K28J18j99m4J9Q4J0p4K60l08p3N4K39l08q7K06J40j10j67j9K07j19K79
$$ -172 56 174 -25 -69 -50 34 44 -30 230 -78 -151 -97 142 -166 -253 -47 93 -17 -184 -203 4 -115 164
3264A64l25P6J77Pj45NL2j64K21j31J17o2R6K08m48J12R9K9k33N5L32k95J44k25
$$ 164 -161 -85 92 99 -46 -41 -9 -173 48 -83 34 -28 68 276 -172 -60 39 68 -165 -110 222 -73 71 -154
3288a54J52rr7l8R2qp8L7P0J66j84J12Oj8k4N3N2m2l92M36l37J62j86K85j18M0
$$ -154 -2 -11 -108 -146 -54 -62 -140 -103 -33 133 -51 61 67 49 25 78 130 88 -304 132 -205 -43 -229 56 -62 -22
3314b2j67K10j29K76k03R2j80j3J72j20k36J94j83L52l97L14q0K90k85K0n4P9
$$ -22 -189 21 -108 168 -35 57 -123 -136 36 -84 -320 -126 -309 43 -354 -40 -120 170 -115 -95 -149 -70
3336g0J19k19Q1L03P4m15J00j4J48m7j11J54j98o0J5K70n2K4J5r3j00J60j20L14
$$ -70 49 -170 -89 214 288 -127 -27 -41 107 60 -51 103 -95 -155 -140 130 78 102 117 24 -76 84 -36 278
3360B78j76q8j4j02p4O3J41o6J93m17K44J22j02J38k04J00k3q4K04j88k1j06P5
$$ 278 102 14 0 -102 -176 -113 28 -38 155 -262 -18 104 2 140 -64 36 13 -71 133 -55 -76 -182 -107
3383a07L9K40q1K3j53j70K51j33Q5q6P4Ln4J85J10l10J56j92j1j1L46l61J27n2
$$ -107 -68 172 91 114 -39 -209 42 -91 -6 -92 -18 -15 -69 116 226 -84 72 -120 -131 -142 204 -157 -30 -82
3407h2J54j38N0Rl4m0J23K2j20J69j16o7J78Q3m8k06K31k24Q2j51Q2J33jj31K47
$$ -82 72 -66 -16 -7 -41 -81 42 64 -56 113 -3 -70 108 191 143 -63 168 -56 26 -125 -43 90 89 -42 205
3432B05k67k9J64l2l6O2J4L3j13%k13L73j61J01n1n4j58k1K36k22kO0L16l21L6
$$ 205 -62 -91 73 41 5 67 81 114 1 1 -212 161 0 101 50 -4 -162 -183 53 -169 -171 -111 205 -116 -80
3457h0K92j47m4j96J90M5j0j5j22J23j50K22K79l85o5k7K78j12k31l0L28k01K03
$$ -80 212 65 21 -175 15 60 50 35 -87 36 -114 108 387 2 -63 -90 188 76 -155 -185 143 -58 145
3480A45j90o6j55J54Q7J37J82l32n4K9j15K1J5j95J68M7K6K15j5n2o2p8J45k02
$$ 145 -45 -111 -266 -112 -25 112 294 -38 -92 -63 -178 -157 -142 -337 -169 -122 -96 119 104 52 -10 -88 57 -145
3504a45Q7J02j14j95N61k71j63R3J42j6j57J53j64K49k29J27k20J69l0NJ17m7
$$ -145 -58 44 -70 -265 296 25 -138 -45 97 81 -76 77 -87 162 -67 60 -160 9 -21 -16 101 54
3526E4k8N7l2k71L22j58O0J51n0j82oJ43k00k8j3J17q7K89m1j97O1J78l09K8L04
$$ 54 26 83 51 -220 102 -56 4 155 105 -77 -83 60 -140 -168 -181 -64 -151 138 97 -100 -39 139 -170 -142 162
3551A62l11K56j45o0K36j63k46L75j54O3J45j37q7qm6j07J28j13K25k96L88J31
$$ 162 -149 107 -38 -98 138 -25 -271 104 -50 13 158 21 -66 -74 -120 -227 -99 -212 13 -283 105 236
3573B36l91J98K32l43J64j20r8m2J71J8l13K63J31j01KM5L2o2p8L2l5N2K5J60
$$ 236 -155 43 275 -68 96 -24 -122 -164 7 25 -288 -25 106 5 7 52 84 22 -56 -24 -59 -7 18 178
3597A78m00J50O0K38k57n0R3j3j3K8P0q0j18K82r1j27P1k1j20K96p6l31J60K01
$$ 178 -222 -72 -12 226 -31 -81 12 -1 -14 14 84 4 -114 168 77 -50 21 0 -120 176 100 -231 -71 130
3621A30q5J5j74J40J20k08J86K6j12o6K43k07J31L7Kr7n9k72K01K8J12k55J90
$$ 130 45 60 -114 26 146 -62 124 150 38 -28 215 8 139 176 178 81 22 -250 -49 -21 91 -164 26
3644B6o1j98M18m25K34l30K94m7L7O2m2N4J9l7p2J46k7j46n9O8K0j50L39m6k56
$$ 26 -35 -233 185 -240 -6 -336 -42 -89 -52 10 -32 22 41 4 -68 78 51 -95 -154 -86 -66 -216 123 77 -179
3669a79J52P7k67J52Jp6P0J34n9j97K47k8j46L10l44K13q0m8K29k92J34o3J97
$$ -179 -27 50 -217 -65 -64 -140 -70 64 5 -192 55 27 -119 191 -153 60 -20 -68 161 -131 3 -60 137
3692A37m47L33J49q7j31pJ8j22J72j21J52J27k87Q5J42p4j47j6L05k86J88k04
$$ 137 -310 23 172 85 -46 -53 -35 -157 15 -106 46 173 -114 -29 113 39 -108 -124 181 -105 83 -121
3714a21L6K23j48o5J23j87l5J45k04J06j10R7J43J51j87J22j15L4j26M2k08K93
$$ -121 -85 138 -10 -75 48 -139 -174 -29 -233 -127 -237 -140 3 154 -33 89 -26 8 -118 -76 -284 9
3736IM5j1j45p0J01p3K55k01R4n5J22N2K6l31J91N2o6L7m1k00K32r7R5q2K93j26
$$ 9 54 43 -102 -172 -71 -144 111 -90 4 -51 71 123 149 -182 9 61 -5 32 -9 -209 23 -74 21 -61 232 106
3762A06l52L33L0j64P1j53K02M4l01K38J32n0j60n3K03k48K70j74j67J59R1R1
$$ 106 -246 87 117 -47 24 -129 73 117 -184 54 186 136 -24 -77 126 -122 148 -26 -193 -34 57 148
3784A48j81Q2O6q2J53j71J57k95L72k33P8N7o8J58k51k18J66M5K7k06K25J53m13
$$ 148 -33 49 115 33 186 15 172 -123 249 16 94 151 83 241 -10 -228 -62 -17 10 -196 29 182 -231
3807b31L52k2m5k24J08P8j94o3L09P6l31L29j66P4m62L37O5J1M7J41n9k3k16K49
$$ -231 121 99 54 -170 -62 16 -178 -241 68 144 -187 142 -24 50 -412 -75 -10 1 48 189 130 107 -109 140
3831A40m08K00Q9r3k2J7K18j14N7k05J74l23L11j14J12Q4j35P9J49l47K31k32
$$ 140 -268 -68 21 -72 -94 -77 141 27 84 -121 53 -270 41 -73 39 123 -12 67 216 -131 100 -132
3853a32K08K6l24R2P8j77J58J94j16k49K13k4J37j34j9L35k85p6j0J31M3p8L2
$$ -132 76 102 -222 -130 -52 -229 -71 123 7 -242 -29 -53 84 -50 -69 266 -19 -95 -105 26 69 -9 23
3876B3p0M8P1j57J75n6k53J81N4J25k83J35R0j25p6M9Q5m4K1N3K47m63K65p0N6
$$ 23 -47 1 72 -85 90 34 -219 -38 16 141 -142 -7 83 -42 -118 -69 16 -28 -7 46 293 -170 95 25 81
3901H1J01j60p0M9%l8J52l81K77M6J38k63J71l2j42N2Q5p6M1J24k38j84L70k21
$$ 81 182 22 -48 1 1 -37 115 -266 11 57 195 -68 103 71 -71 -19 66 -10 31 155 -83 -267 103 -118
3925a18K0K3k07J75Q4p8J10j43P3k7J65Op9m8j03P5J02P0qj35J11o4P3j58J77
$$ -118 -98 -75 -282 -107 -23 -101 9 -134 -61 -88 77 83 4 -44 -147 -72 30 100 92 -43 68 4 77 -81 96
3950I6n7j07j6K37k7j77J29j37K13j59J35k79n5r5K40K9m4m2K01j35j70J26%J24
$$ 96 39 -68 -84 153 126 -51 78 -59 154 -5 130 -149 -204 -299 -59 -30 -74 -116 85 -50 -220 -94 -94 30
3974C0j46K08k77oQ0q3M10k27J21k35k28M43j42j9k1j49K01R3o4j1LN6j19M2R7
$$ 30 -116 92 -185 -191 -111 -194 216 -11 110 -125 -353 90 -52 -71 -92 -241 -40 53 -11 -22 -19 37 -82 -40 57
3999E7p0k25pJ31l6N9J55j13j57k5L89j98L3L8k30M2O0K04j52R7j04K3K33k28
$$ 57 -13 -238 -245 -114 -150 -91 64 -49 -206 -231 158 -40 -7 31 -199 -157 -97 107 -45 52 -52 -29 204 -24
4023b4j07K08k11K68k37J97l33L17q2j42j0J31n8J74j01r5Q5k34J95K5L55m31
$$ -24 -131 77 -134 134 -103 94 -239 78 -4 -146 -156 -25 -83 91 -10 -105 -20 -254 -59 -34 321 -110
4045a10J10m4J50r2k0j03J05j9R7r5K50l46J67j42jK08l55J62j0J75k06K87j39
$$ -110 0 -44 106 14 -6 -109 -4 -23 74 -21 229 -117 50 -92 -93 115 -240 -78 -88 87 -119 168 29
4068B9j70K41l44K00P6j75J31K17j61K34k67Q9k1j38j91K10j34K29o9m0M6r8P2
$$ 29 -141 100 -244 -44 32 -143 -12 205 44 278 11 100 79 -59 -250 -40 -174 55 -14 -54 -8 -106 -34
4091c4R4k04K70J8j59J36k31K72l75K77j95K99Pk01j73M8J24J19k48k9J98K96
$$ -34 60 -144 126 144 -15 121 -110 162 -213 64 -131 168 175 -26 -199 -151 -27 92 -156 -185 13 309
4113C09k74m7j50K62K5j48J47j44K06k69J99j76R0j67K71j08j0j25L16l9m89L22
$$ 309 35 -12 -162 100 125 -23 124 -20 186 -83 116 -60 30 -137 134 26 16 -109 207 168 -321 1
4135Am2N0K56l15j59J39R5j78K68k26m2R8J37k2k16K86k32R2k3M14m54KK22j03
$$ 1 -41 9 265 -50 -209 -70 25 -153 115 -111 -153 -55 82 60 -156 130 -102 -10 -33 381 -73 -71 151 48
4159D8K4J51l48K59o3L4j08j90K56j13o4K85j57q3J93k23o6M24k10j0K6J7j14
$$ 48 72 223 -125 134 71 105 -3 -193 63 -50 -114 171 14 -69 124 -99 -165 259 49 39 65 82 -32
4182c2n9J11k2n8J52Q3j47j18M6n9j36L02j05J7J64j43J00o6m4mJ08r0j16Q2j22
$$ -32 -91 20 -2 -60 92 175 28 -90 -44 -103 -239 63 -42 -25 139 -4 96 30 -14 -18 90 0 -116 -34 -156
4207a56J82r4M2L7M3J17j90L8J51n5j75j1PK21k66J66j19N7j7rj25K88l37N20
$$ -156 26 -68 -26 11 54 171 -19 19 170 115 -60 -71 -64 157 -109 57 -62 -5 -22 -31 -156 132 -205 315
4231C15l56L2r6R7L4n7J15k58K23k13K89j20j35M3p3M9K34j43K15k95p5K68J2
$$ 315 -41 -9 -105 -8 26 -31 84 -174 49 -164 125 5 -130 -87 -160 -111 123 -20 195 -100 -175 93 105
4254A05l14J92Q7K6k7j66K95q2j89J72j84l3K62P9l98O3L30k35k1j83J94J97k82
$$ 105 -209 -17 70 96 69 -97 198 116 -73 99 -85 -118 144 223 -175 -112 218 -17 -38 -221 -27 170 -112
4277a12K41R6l64L28j37Q0q5L4m5J14q1j41l1K85l77L71m43K38P9o8J36p1J4l7
$$ -112 129 225 -139 189 52 132 47 81 36 150 69 -72 -103 182 -195 176 -267 -29 50 -18 118 47 61 24
4301B4o3J72r9L0Kk64L05j09j6J7L03k70k93L57k4r1J63k31j02k8K75p0j80M5
$$ 24 -39 133 34 64 66 -198 107 -2 -18 -1 302 32 -261 96 72 -19 144 -87 -189 -217 58 -12 -192 -147
4325a47J13J09j43k9N7j18L27k00J71k97N8J63R4m7o8k25J54N6qJ93l19J67K30
$$ -147 -34 75 -68 -97 -40 -158 169 -31 140 -157 -99 64 158 111 43 -182 -28 28 20 213 -106 61 291
4348B91l37L21l45J85r8q1K73m35K99j47J87PrJ03l96K7J50L1k07J10J60j29M2
$$ 291 -46 275 -70 115 17 -64 209 -226 73 -74 113 120 111 214 -182 -155 -5 26 -181 -71 89 -40 2
4371BJ27l39J75j94N0J08J25n2k12K84l1j71J61j17r5O3J34o7k3L1J17k12K80
$$ 2 129 -210 -35 -229 -179 -71 54 2 -210 74 43 -128 33 -84 -179 -116 18 -49 -72 -41 76 -136 144
4394A44l83J36K19k42J8J93j25j1L69l29p2n7R0m5K32j70rQ1j34J81j98K34j58
$$ 144 -239 -103 116 -126 -108 85 -40 -51 318 -11 -83 -140 -50 -95 137 -33 -42 39 -95 86 -112 122 -36
4417c6J55j15J31K1j56L5L8o8pj2k0M2J1j0O5m7K6j77Q9nj64K93j25m7J43J48
$$ -36 119 4 135 156 0 35 73 5 -2 -14 -34 8 19 9 74 27 53 -124 -35 -40 -204 89 -36 -83 60 208
$$ [...]
8191C8
##END NTUPLES=NMR FID
##END=
