##TITLE=1H_Pr 5-6X
 CDCl3, 8 sc, 
 30.7.2019
##JCAMPDX= 6.0         $$ Bruker NMR JCAMP-DX V2.0
##DATA TYPE= NMR FID
##DATA CLASS= NTUPLES
##ORIGIN= UXNMR, Bruker Analytische Messtechnik GmbH
##OWNER= root
$$ XWIN-NMR		Version 3.5
$$ Tue Jul 30 14:56:11 2019 Russian Standard Time (UT+4h)  she@DPX200
##.OBSERVE FREQUENCY= 200.13155
##.OBSERVE NUCLEUS= ^1H
##.DELAY= (6, 6)
##.ACQUISITION MODE= SIMULTANEOUS
##.ACQUISITION SCHEME= undefined
##.AVERAGES= 8
##.DIGITISER RES= 18
##SPECTROMETER/DATA SYSTEM= spect
##.PULSE SEQUENCE= zg30
##.SOLVENT NAME= CDCl3
##.SHIFT REFERENCE= (INTERNAL, CDCl3, 0, 15.7039)
##AUDIT TRAIL= $$ (NUMBER, WHEN, WHO, WHERE, WHAT)
$$ ##TITLE= Audit trail, XWIN-NMR		Version 3.5
$$ ##JCAMPDX= 5.01
$$ ##ORIGIN= Bruker BioSpin GmbH
$$ ##OWNER= she
$$ F:/spectra/data/she/nmr/H-F/1/audita.txt
$$ ##AUDIT TRAIL=  $$ (NUMBER, WHEN, WHO, WHERE, WHAT)
(   1,<2019-07-30 14:55:05.57 +0400>,<she>,<DPX200>,
      <created by zg, POWCHK disabled, PULCHK disabled
       configuration hash MD5:
       00 E9 B6 7A A2 85 ED C7 34 08 36 98 17 FE 4E 26
       data hash MD5: 16K
       48 96 F9 65 A1 95 24 A2 8C 8B 48 76 73 66 08 C3>)
$$ ##END=
$$ 
$$ hash MD5
$$ AA 39 BA 1E 15 F4 0E 40 0F BA 1F 84 79 71 1D 44
##$RELAX= 
##$RELAX= 
##$RELAX= 
##$RELAX= 
##$RELAX= 
##$RELAX= 
$$ Bruker specific parameters
$$ --------------------------
##$DU= <F:/spectra>
##$EXPNO= 1
##$NAME= <H-F>
##$PROCNO= 1
##$TYPE= <nmr>
##$USER= <she>
##$AMP= (0..31)
100 100 100 100 100 100 100 100 100 100 100 100 100 100 100 100 100 100 
100 100 100 100 100 100 100 100 100 100 100 100 100 100 
##$AQSEQ= 0
##$AQ_mod= 1
##$AUNM= <au_zg>
##$AUTOPOS= <>
##$BF1= 200.13
##$BF2= 200.13
##$BF3= 200.13
##$BF4= 200.13
##$BF5= 200.13
##$BF6= 200.13
##$BF7= 200.13
##$BF8= 200.13
##$BYTORDA= 1
##$CFDGTYP= 0
##$CFRGTYP= 5
##$CHEMSTR= <none>
##$CNST= (0..31)
1 1 145 1 1 1 1 1 1 1 1 1 1 1 1 1 1 1 1 1 1 1 1 1 1 1 1 1 1 1 1 1 
##$CPDPRG= <>
##$CPDPRG1= <>
##$CPDPRG2= <>
##$CPDPRG3= <>
##$CPDPRG4= <mlev>
##$CPDPRG5= <mlev>
##$CPDPRG6= <mlev>
##$CPDPRG7= <mlev>
##$CPDPRG8= <mlev>
##$CPDPRGB= <>
##$CPDPRGT= <>
##$D= (0..31)
0 1.2 0 0 0 0 0 0 0 0 0 0.03 0 0 0 0 0 0 0 0 0 0 0 0 0 0 0 0 0 0 0 0 
##$DATE= 1564484104
##$DBL= (0..7)
120 120 120 120 120 120 120 120 
##$DBP= (0..7)
150 150 150 150 150 150 150 150 
##$DBP07= 0
##$DBPNAM0= <>
##$DBPNAM1= <>
##$DBPNAM2= <>
##$DBPNAM3= <>
##$DBPNAM4= <>
##$DBPNAM5= <>
##$DBPNAM6= <>
##$DBPNAM7= <>
##$DBPOAL= (0..7)
0.5 0.5 0.5 0.5 0.5 0.5 0.5 0.5 
##$DBPOFFS= (0..7)
0 0 0 0 0 0 0 0 
##$DE= 6
##$DECBNUC= <off>
##$DECIM= 24
##$DECNUC= <off>
##$DECSTAT= 4
##$DIGMOD= 1
##$DIGTYP= 9
##$DL= (0..7)
0 120 120 120 120 120 120 120 
##$DP= (0..7)
150 150 150 150 150 150 150 150 
##$DP07= 0
##$DPNAME0= <>
##$DPNAME1= <>
##$DPNAME2= <>
##$DPNAME3= <>
##$DPNAME4= <>
##$DPNAME5= <>
##$DPNAME6= <>
##$DPNAME7= <>
##$DPOAL= (0..7)
0.5 0.5 0.5 0.5 0.5 0.5 0.5 0.5 
##$DPOFFS= (0..7)
0 0 0 0 0 0 0 0 
##$DQDMODE= 0
##$DR= 18
##$DS= 0
##$DSLIST= <SSSSSSSSSSSSSSS>
##$DSPFIRM= 0
$$ [...]
##$SUBNAM2= <"">
##$SUBNAM3= <"">
##$SUBNAM4= <"">
##$SUBNAM5= <"">
##$SUBNAM6= <"">
##$SUBNAM7= <"">
##$SUBNAM8= <"">
##$SUBNAM9= <"">
##$SW= 24.9336996594482
##$SWIBOX= (0..15)
0 0 2 0 0 0 0 0 0 0 0 0 0 0 0 0 
##$SW_h= 4990.01996007984
##$TD= 16384
##$TD0= 1
##$TE= 0
##$TE2= 300
##$TE3= 300
##$TEG= 300
##$TL= (0..7)
0 120 120 120 120 120 120 120 
##$TP= (0..7)
150 150 150 150 150 150 150 150 
##$TP07= 0
##$TPNAME0= <>
##$TPNAME1= <>
##$TPNAME2= <>
##$TPNAME3= <>
##$TPNAME4= <>
##$TPNAME5= <>
##$TPNAME6= <>
##$TPNAME7= <>
##$TPOAL= (0..7)
0.5 0.5 0.5 0.5 0.5 0.5 0.5 0.5 
##$TPOFFS= (0..7)
0 0 0 0 0 0 0 0 
##$TUNHIN= 0
##$TUNHOUT= 0
##$TUNXOUT= 0
##$USERA1= <user>
##$USERA2= <user>
##$USERA3= <user>
##$USERA4= <user>
##$USERA5= <user>
##$V9= 5
##$VALIST= <valist>
##$VCLIST= <CCCCCCCCCCCCCCC>
##$VD= 0
##$VDLIST= <DDDDDDDDDDDDDDD>
##$VPLIST= <PPPPPPPPPPPPPPP>
##$VTLIST= <TTTTTTTTTTTTTTT>
##$WBST= 1024
##$WBSW= 4
##$XGAIN= (0..3)
0 0 0 0 
##$XL= 0
##$YL= 0
##$YMAX_a= 160901
##$YMIN_a= -240292
##$ZGOPTNS= <>
##$ZL1= 120
##$ZL2= 120
##$ZL3= 120
##$ZL4= 120
##$ABSF1= 10
##$ABSF2= 0
##$ABSG= 5
##$ABSL= 3
##$ALPHA= 0
##$AQORDER= 0
##$ASSFAC= 0
##$ASSFACI= 0
##$ASSFACX= 0
##$ASSWID= 0
##$AUNMP= <proc_1d>
##$AZFE= 0.1
##$AZFW= 0.1
##$BCFW= 1
##$BC_mod= 2
##$BYTORDP= 1
##$COROFFS= 0
##$CY= 11.3945322036743
##$DATMOD= 1
##$DC= 2
##$DFILT= <>
##$DTYPP= 0
##$F1P= 20.1537800932815
##$F2P= 0.134698688090026
##$FCOR= 0.5
##$FTSIZE= 0
##$FT_mod= 4
##$GAMMA= 1
##$GB= 0.15
##$INTBC= 1
##$INTSCL= 1
##$ISEN= 128
##$LB= 0.24
##$LEV0= 0
##$LPBIN= 0
##$MAXI= 10000
##$MC2= 0
##$MEAN= 0
##$ME_mod= 0
##$MI= 1.114404
##$NCOEF= 0
##$NC_proc= 0
##$NLEV= 6
##$NOISF1= 3.799351
##$NOISF2= 2.8
##$NSP= 1
##$NTH_PI= 0
##$NZP= 0
##$OFFSET= 15.70392
##$PC= 1
##$PHC0= -9225.814
##$PHC1= 23.00097
##$PH_mod= 1
##$PKNL= yes
##$PPARMOD= 0
##$PSCAL= 0
##$PSIGN= 0
##$REVERSE= no
##$SF= 200.130013532006
##$SI= 16384
##$SIGF1= 3
##$SIGF2= 2
##$SINO= 400
##$SIOLD= 16384
##$SREGLST= <1H.CDCl3>
##$SSB= 0
##$STSI= 0
##$STSR= 0
##$SW_p= 3612.71676300578
##$SYMM= 0
##$S_DEV= 0
##$TDeff= 0
##$TDoff= 0
##$TI= <>
##$TILT= no
##$TM1= 0
##$TM2= 0
##$TOPLEV= 0
##$USERP1= <user>
##$USERP2= <user>
##$USERP3= <user>
##$USERP4= <user>
##$USERP5= <user>
##$WDW= 1
##$XDIM= 8192
##$YMAX_p= 0
##$YMIN_p= 0
$$ End of Bruker specific parameters
$$ ---------------------------------
##NTUPLES= NMR FID
##VAR_NAME=  TIME,          FID/REAL,        FID/IMAG
##SYMBOL=    X,             R,               I
##VAR_TYPE=  INDEPENDENT,   DEPENDENT,       DEPENDENT
##VAR_FORM=  AFFN,          ASDF,            ASDF
##VAR_DIM=   8192,          8192,            8192
##UNITS=     SECONDS,       ARBITRARY UNITS, ARBITRARY UNITS
##FACTOR=    0.0002004,     1,               1
##FIRST=     0,             0,               0
##LAST=      1.6414764,     0,               0
##MIN=       0,             -240292,         0
##MAX=       1.6414764,     160901,          0
$$ Real data points
##PAGE= N=1
##DATA TABLE= (X++(R..R)), XYDATA
0 0 0 0 0 0 0 0 0 -8 8 -8 9 -16 16 -24 25 -32 40 -48 56 -66 80 -93 106 -124 143 -162 186 -213 239 -271
30 -271 305 -343 385 -432 482 -536 599 -664 737 -818 905 -1003 1108 -1227 1362 -1509 1676
47 1676 -1866 2084 -2337 2634 -2991 3423 -3972 4681 -5642 7031 -9222 13212 -22838 97420
61 97420 11507 -184921 14798 160901 71132 -75740 -5168 81017 36023 -36762 20419
72 20419 65547 9433 -49062 4967 60143 38805 -7591 -11675 -10471 -1220 25664 34292 -11792
85 -11792 -33967 15009 50519 -6548 -61180 -13126 60437 30755 -46404 -36400 34249 32708
97 32708 -30107 -34513 22062 30993 -19810 -30624 22306 44060 -11468 -57207 -16471 52635 51620
110 51620 -11639 -49348 -21839 29713 43212 4520 -34355 -18853 26356 32624 -5078 -22722
122 -22722 947 14676 -6566 -13564 19309 32139 -13144 -46494 -8229 38241 16337 -27675
134 -27675 -18027 16237 9118 -21224 -16607 9174 8469 -13721 -16617 -570 6047 745 -7610 -20880
148 -20880 -23017 6812 31534 1124 -42488 -23699 25991 18683 -31387 -27476 25635 31671 -22953
161 -22953 -39638 11385 38185 -2810 -32414 -119 32600 12616 -15518 -5151 15615 10845
173 10845 -3334 1774 18278 20837 6896 -5808 -3980 11378 28073 24812 -309 -11841 11058
186 11058 33496 18910 -6878 -1107 22108 21436 3132 7224 27476 17505 -16728 -12404 36617
199 36617 52701 1762 -37267 -3170 47664 35896 -14274 -23041 16680 38873 13350 -13527
211 -13527 -3853 17783 17318 2137 -1303 9180 16791 6639 -7212 -1164 16246 13219 -6257
224 -6257 -5613 17430 20728 -7750 -22634 4277 30598 12778 -19965 -14932 15589 20273 -1879
237 -1879 -14530 -4327 8234 8491 947 -4251 -1334 2578 -2771 -8880 923 14853 6907 -17874
251 -17874 -19441 10643 25502 -3457 -29948 -9270 24149 16552 -15936 -20609 3919 15655 575
264 575 -12712 -3500 10381 5461 -9290 -8039 5180 9444 -683 -7970 -967 9022 4499 -8973
278 -8973 -7411 8435 11010 -3759 -11392 525 12969 5625 -10862 -10861 6491 14909 -72 -14063
292 -14063 -5034 10398 6181 -9351 -10210 6295 12021 -4534 -15709 -1888 13477 4085 -12693
305 -12693 -10107 6062 11219 -1255 -12556 -6603 7284 8894 -4803 -11211 765 12222 2648
318 2648 -12515 -7423 12421 12863 -8582 -14263 7313 17882 -1005 -15259 -562 16496 8167
331 8167 -9097 -7227 9037 12684 -1604 -10092 609 13740 8538 -6728 -8701 6177 14934
344 14934 1542 -13333 -3395 16249 10004 -11512 -11271 9599 14655 -4112 -14630 153 14687
357 14687 4734 -12841 -8568 8604 10039 -5296 -11314 373 9941 2613 -10244 -7784 6509
370 6509 8849 -4573 -10977 449 9859 2370 -9176 -6619 6579 10007 -2216 -11178 -1104 11970
384 11970 6266 -9326 -9016 7746 14173 -1123 -13583 -1254 15572 7362 -11000 -7513 10411
397 10411 11523 -4047 -10086 1815 11276 3885 -7863 -5267 6313 8844 -2449 -9388 -949 9209
411 9209 5519 -8444 -9323 5753 10721 -4809 -13299 225 12166 548 -13122 -5903 8518
424 8518 5820 -8191 -9633 3443 7733 -2233 -9273 -3493 5066 4232 -3790 -7979 -1341 7041 3229
439 3229 -8131 -7457 4961 8698 -3372 -10413 -959 9419 2767 -9466 -6373 6586 7483 -4687
453 -4687 -9882 -537 8026 2815 -8115 -8209 3738 8079 -2887 -11871 -2913 8727 2880 -9960
467 -9960 -9227 3364 6319 -5351 -11810 -2077 6479 -555 -10846 -7577 3535 4930 -6220 -11735
481 -11735 -3048 7640 1588 -12441 -10419 5698 8470 -7140 -14035 -919 10102 1102 -12122
494 -12122 -6825 7433 5835 -6963 -8534 2437 6818 -919 -6610 -2276 5011 4906 -3489 -7450
508 -7450 1667 9742 2646 -8979 -5205 8896 10735 -4568 -11527 2656 13567 3225 -10576
521 -10576 -4653 8682 7729 -3739 -6769 1853 7281 1859 -5392 -3011 5232 5439 -3926 -6695 2532
536 2532 9034 954 -10616 -5351 9704 9422 -7494 -12516 2367 12491 1903 -10984 -6086 6794
550 6794 7523 -3752 -8330 -154 5959 112 -6272 -2306 4789 2047 -6567 -5923 3957 6886 -3982
565 -3982 -11646 -2067 9284 4193 -9513 -10081 2264 8318 -49 -10110 -7926 3484 5891 -3288
579 -3288 -9798 -3597 4213 972 -7563 -6405 2585 2521 -7270 -8734 2463 6628 -4470 -12483 -3726
594 -3726 8345 4310 -8838 -12016 295 9069 2029 -10273 -8584 3695 7269 -2077 -9345 -2615
608 -2615 6856 2285 -8187 -4738 6223 4480 -7067 -7430 4536 8062 -3353 -10351 -1065 9388
622 9388 3628 -9326 -8111 5545 9341 -2179 -11603 -4150 8314 6648 -7126 -10875 1547 9549
636 9549 169 -9715 -4594 6457 4520 -6299 -7329 3466 7350 -2515 -9196 -1263 8300 4344
650 4344 -6839 -6714 4945 9364 -720 -9453 -1435 10863 6647 -7126 -6948 6789 12277 579
664 579 -8749 -1655 10367 8265 -3014 -4590 4494 7529 918 -3192 2637 7936 2405 -5795 -1986
679 -1986 10117 9385 -5535 -11717 2275 14379 5363 -11292 -10225 6090 11811 -1454 -11928
692 -11928 -3822 6904 3525 -6720 -6688 1031 3283 -3771 -7308 -1394 3726 -2810 -9636 -4408 5148
707 5148 2237 -9630 -11120 1760 8328 -2069 -13642 -8115 6491 7247 -5353 -11758 -3525 5397
721 5397 3473 -4504 -6030 -276 2181 -1721 -3231 1553 3835 -2631 -7437 -971 8499 5900 -7049
736 -7049 -10998 1610 11610 3782 -9765 -8282 4430 9094 -341 -8169 -3683 5835 4161 -4755
750 -4755 -5216 2171 3838 -2908 -5414 682 4543 -1350 -6868 -1856 6061 2220 -7679 -6994 3880
765 3880 7578 -1875 -10003 -4191 6897 6923 -3924 -9164 -250 7624 2997 -5434 -3575 4268 4557
780 4557 -2561 -4082 3451 6862 -34 -6055 -521 7609 6401 -2207 -5456 1867 8288 4125 -3719
795 -3719 -2888 5269 6836 -503 -3878 2386 7920 2179 -5079 -2076 7277 6946 -2483 -5397 1909 6550
811 6550 1779 -3615 -994 3967 2820 -2920 -3036 3419 5560 -1601 -6930 -611 7387 4496 -5768
826 -5768 -7630 2328 8293 373 -7928 -3533 5929 4779 -3902 -6405 510 5964 1281 -5603 -4263
841 -4263 3264 4359 -2083 -5416 -173 3615 -162 -4661 -1145 4438 1328 -5976 -4707 4157 5825
856 5825 -2468 -7618 -2253 5042 3486 -2999 -5777 -1379 3124 1149 -3097 -2725 827 1069 -2655 -3712
872 -3712 1667 3566 -2339 -7119 -1706 6098 3040 -5927 -6506 2182 6117 247 -6812 -3352 4412
887 4412 4511 -2900 -5770 353 5376 1794 -4541 -3068 3187 4084 -1339 -3683 1543 4476 -599 -4352
903 -4352 74 5266 1868 -4504 -3780 3825 5939 -699 -5729 -1956 4950 3871 -2502 -4660 371
918 371 4583 485 -4690 -1760 4314 2334 -4275 -4489 2670 5006 -1038 -6389 -2022 4784 3576 -3544
934 -3544 -5111 878 4906 238 -4429 -2135 3541 3543 -2777 -4441 1514 5239 541 -5161 -1317 4931
950 4931 3124 -3105 -3714 2830 5128 -405 -4678 -2 5371 2548 -3505 -2969 3207 5498 -260 -5158
966 -5158 -952 5586 3262 -4088 -3774 3246 5044 -1149 -5555 -369 5268 2565 -4487 -4273 3029 4873
982 4873 -1099 -5264 -1286 4372 2928 -3339 -4414 1728 4277 -1307 -4548 -916 4074 1768 -3987
997 -3987 -2931 2676 3948 -1544 -4176 30 4524 1370 -3109 -2330 2532 3772 -685 -3697 -113
1012 -113 4606 2576 -3384 -3139 3033 4862 -762 -4863 -41 5163 2599 -3964 -3447 3311 4133 -1616
1028 -1616 -4700 -111 4110 1402 -3827 -3430 2139 3826 -1310 -5076 -834 3996 1410 -4149 -3861
1043 -3861 1924 3080 -1984 -5110 -551 3602 192 -4314 -2623 2246 2113 -1626 -3921 -788 3371
1058 3371 946 -3705 -2954 2496 3414 -1634 -4272 -596 4289 1651 -4254 -3304 3069 3605 -2026 -4479
1074 -4479 260 3897 678 -3892 -2614 2562 3138 -1876 -4457 -748 3573 1003 -3985 -3160 2224
1089 2224 3105 -1979 -5143 -795 3768 521 -4820 -2879 2775 2381 -2794 -4192 409 3597 215
1104 215 -4176 -2017 2814 2675 -2399 -4109 551 4151 1242 -4018 -2531 3404 3792 -1771 -3759 719
1120 719 4414 1200 -3294 -1022 3135 2717 -1664 -2410 1874 4412 684 -3118 -1041 3495 2780 -1920
1136 -1920 -3023 815 4339 869 -3746 -1851 3286 2983 -2135 -3415 698 3362 605 -3213 -1758
1151 -1758 2248 2083 -2164 -3224 948 2917 -247 -3716 -1668 2732 2081 -2939 -4402 1097 3827
1166 3827 -158 -4289 -1821 3697 2485 -2284 -4023 669 3572 215 -3333 -1527 2219 1825 -1776
1181 -1776 -2626 805 2444 -573 -3549 -652 3063 1311 -2871 -2765 1471 2946 -708 -3941 -1780
1196 -1780 2765 2115 -2751 -4032 268 3041 -104 -3596 -2140 1962 1447 -2287 -3472 290 1838
1211 1838 -1476 -3339 -952 2247 642 -3171 -2985 1650 2835 -1084 -4419 -1455 3490 2419 -2804
1226 -2804 -4019 515 3673 829 -3776 -1900 2856 2322 -2151 -2113 1264 2373 -717 -2483 210 3025
1242 3025 1117 -3092 -1723 2693 3250 -1207 -3712 -444 3847 2300 -3192 -3561 1566 3906 -198
1257 -198 -3737 -1458 2304 1455 -2327 -2246 1090 1630 -1412 -2718 65 2457 232 -2945 -1739 2229
1273 2229 2459 -1499 -3660 -607 3561 1485 -3145 -2869 2135 3415 -414 -3462 -784 3237 1622
1288 1622 -2249 -1725 1836 2443 -871 -2411 167 2874 967 -2229 -1660 2411 2728 -1006 -3115 113
1304 113 3344 727 -3269 -2367 2419 3230 -1848 -3916 -186 3367 554 -3467 -2593 1276 2029 -1254
1320 -1254 -2833 -812 1977 345 -2409 -1934 1272 1461 -1999 -2994 426 2483 -426 -3709 -1495 2469
1336 2469 1579 -2467 -3569 950 3329 475 -2722 -2316 1932 2769 -598 -3034 -442 2490 1402 -1339
1352 -1339 -1301 1615 1657 -1398 -1890 1151 2754 -661 -2968 -393 3369 2193 -2383 -2805 897 3857
1368 3857 715 -3389 -2405 1869 2672 -637 -3005 -781 1864 593 -1441 -1238 948 864 -1957 -1612
1384 -1612 1452 1833 -1584 -2998 -38 2946 1532 -2565 -3050 1220 3711 197 -3355 -1620 2030
1399 2030 2540 -560 -2352 -178 2164 681 -1665 -443 1619 952 -1467 -1290 1598 2072 -668 -2724
1415 -2724 -356 3042 2106 -2213 -2743 812 3450 695 -2910 -1308 1879 2379 -1329 -2536 483 1775
1431 1775 -64 -1868 -513 1024 441 -1721 -1499 1079 1686 -706 -2863 -384 2097 1246 -2321 -2426
1447 -2426 924 2875 -174 -2629 -1274 2417 1415 -1627 -1775 715 2028 -207 -1789 -499 2023
1462 2023 1344 -1517 -1649 1164 1966 322 -2165 -765 1893 1362 -1284 -1659 748 1747 -589 -2036
1478 -2036 57 1790 977 -1796 -1891 992 2050 -519 -2466 -490 1595 1156 -1697 -2253 438 2026
1494 2026 -258 -2459 -773 1870 1262 -1713 -1634 1001 1698 -944 -2560 -351 2382 975 -2043 -1580
1510 -1580 1513 2194 -200 -2525 -560 2557 1595 -1197 -1877 1014 2087 106 -1696 -304 1599 854
1526 854 -1073 -730 1381 1433 -871 -1668 526 2247 659 -2144 -1139 1394 2070 -616 -2432 -706
1542 -706 1826 1143 -1622 -1422 843 1769 -438 -2090 5 1875 591 -2216 -1121 1584 1526 -635
1558 -635 -2105 132 2004 878 -2055 -1485 1614 2171 -401 -2185 -177 2016 1177 -1546 -1686 1057
1574 1057 1833 -447 -1531 367 2140 588 -1823 -643 1750 1600 -924 -1905 306 2292 624 -2100
1590 -2100 -1496 1611 1584 -850 -1956 87 1842 412 -2012 -1157 1583 1162 -1291 -1746 148 1577
1606 1577 110 -2105 -1261 1014 1406 -902 -1731 99 1773 561 -1676 -747 1126 1414 -1056 -1890
1622 -1890 693 1906 433 -1601 -521 1734 1173 -934 -1609 311 1995 84 -1566 -880 1577 1878
1638 1878 -1153 -1702 340 2241 342 -1603 -734 1629 1149 -1102 -1592 419 1988 365 -1698 -988
1654 -988 1288 982 -1518 -1807 428 1770 -59 -1780 -1049 1399 1122 -1017 -1563 589 1644 -373
1670 -373 -1773 -230 1479 993 -1199 -1515 693 1738 -13 -1505 -389 1835 1246 -1211 -884 821
1686 821 1921 -30 -1614 -187 1597 1009 -1487 -1141 999 1737 140 -1682 -639 1799 1066 -1022
1702 -1022 -1362 498 1240 -309 -1553 -593 1476 979 -1241 -1695 745 1420 -198 -1674 -371 1225
1718 1225 878 -1205 -1348 921 1618 -580 -1682 -23 1479 727 -1314 -1246 967 1563 -374 -1466 -160
1735 -160 1737 740 -1048 -905 1344 1629 -270 -1110 147 1574 1026 -889 -920 1015 1433 -306 -1528
1752 -1528 174 1758 665 -1238 -956 689 1414 -214 -1755 -89 1718 474 -1066 -979 790 1226
1768 1226 -557 -1592 -377 1081 190 -1171 -1049 694 1219 -359 -1575 -5 1526 436 -1510 -1056
1784 -1056 1531 1231 -731 -1617 185 1525 429 -1553 -761 1243 1399 -643 -1275 294 1402 737
1800 737 -1120 -765 1213 1193 -581 -1130 378 1406 211 -1401 -264 1483 1221 -840 -1350 275 1549
1817 1549 105 -1325 -575 1121 1072 -865 -1517 -291 1205 424 -1320 -669 987 795 -504 -1194 76
1834 76 1163 94 -1498 -577 1192 1009 -1129 -1207 269 1517 4 -1244 -925 1133 900 -410 -1595
1851 -1595 290 1473 608 -1167 -651 1447 926 -521 -1093 267 1145 305 -1241 -399 1084 498 -761
1868 -761 -999 556 1309 -24 -964 -470 992 766 -894 -1338 500 1545 -114 -1428 -649 968 791
1885 791 -703 -1060 497 1170 -335 -1117 -168 769 567 -734 -890 463 1209 -160 -1408 -256 1486
1902 1486 778 -944 -1371 622 1369 80 -1232 -548 1316 787 -858 -1037 455 978 -181 -769 63
1919 63 786 417 -640 -673 787 1113 -186 -1082 -103 1377 614 -1096 -1123 602 1281 -360 -1454 -184
1937 -184 890 371 -780 -908 582 876 56 -1186 -220 949 123 -716 -753 386 1005 -304 -1309 -29
1955 -29 1199 503 -1042 -486 738 1297 -445 -980 -67 1006 729 -967 -791 625 1223 -76 -782 -100
1973 -100 1085 424 -697 -862 951 902 -493 -977 -50 998 250 -879 -251 461 722 -462 -1321 236
1991 236 1274 188 -694 -799 854 1026 -205 -892 -167 992 21 -783 -456 665 794 -485 -737 371
2009 371 645 4 -854 -305 1023 750 -484 -969 436 1557 451 -693 -722 637 1289 -457 -935 24
2027 24 1021 269 -487 -340 590 838 -292 -790 525 1139 -172 -1027 -126 808 238 -801 -1106 347 1304
2046 1304 -20 -1163 -831 1193 844 -592 -971 -166 668 348 -751 -337 497 330 -523 -567 416 887
2064 887 -129 -813 -285 1280 717 -701 -1135 738 1305 223 -852 -105 983 573 -620 -958 178
2081 178 1151 419 -738 -250 688 221 -482 -562 94 869 -156 -850 99 626 408 -439 -709 184 815 -316
2101 -316 -691 -371 819 190 -905 -848 368 665 -3 -715 -248 599 735 -735 -650 191 735 65 -927
2120 -927 -269 641 493 -639 -686 441 937 -23 -806 -273 930 503 -501 -706 553 891 -34 -899 -162
2139 -162 1119 446 -807 -568 567 1061 83 -667 317 985 569 -618 -464 282 641 -319 -771 -101 462
2158 462 165 -762 -678 471 902 -280 -1390 -353 1133 217 -771 -724 500 1111 -257 -656 99 930
2176 930 226 -424 -678 563 888 -491 -691 -10 1124 395 -588 -831 588 867 97 -896 87 1127
2194 1127 696 -643 -941 613 751 -146 -684 -56 870 -69 -443 -801 332 326 -315 -697 -19 796 49
2213 49 -1151 -588 557 632 -594 -973 -150 875 252 -959 -680 362 125 -589 -748 3 503 284 -527
2232 -527 -452 446 480 -561 -779 290 639 -48 -749 -375 707 589 -409 -428 200 582 63 -311 -602 675
2252 675 567 -240 -453 56 1036 -125 -625 -169 830 586 -578 -1158 392 902 312 -1045 -469 850
2270 850 135 -1107 -898 241 786 -214 -831 -415 371 432 -555 -802 219 640 179 -910 -596 813
2288 813 429 -609 -720 367 727 299 -850 -128 800 800 -414 -715 371 751 48 -666 -32 586 527
2307 527 -496 -722 302 1059 -60 -865 -261 942 476 -403 -730 421 824 68 -831 -409 791 667
2325 667 -454 -513 439 874 -188 -809 -590 852 489 -681 -899 101 744 -172 -707 -439 767 335
2343 335 -424 -691 398 827 -246 -912 -12 606 450 -208 -313 490 829 -323 -859 215 765 748 -331
2362 -331 -533 617 1216 -99 -1121 -118 879 600 -700 -627 581 1069 -359 -876 -130 648 250 -849
2380 -849 -775 585 698 -289 -808 21 571 170 -919 -480 364 703 -560 -817 30 571 90 -825 -683
2399 -683 395 504 -401 -875 -90 535 398 -824 -434 464 599 -219 -555 43 928 578 -628 -430 590
2418 590 630 -424 -677 -178 723 311 -759 -402 508 880 -508 -967 158 711 216 -744 -513 316 498
2437 498 -340 -779 -115 854 216 -813 -45 341 715 -337 -785 36 874 93 -735 -495 902 457 -397
2456 -397 -529 -29 842 -190 -636 -139 564 783 -508 -603 212 778 154 -644 -296 594 632 -585 -547 475
2476 475 996 196 -795 -239 574 465 -419 -657 197 883 -194 -1043 -431 634 398 -475 -778 199 635
2495 635 -108 -1125 -200 615 419 -662 -917 325 620 140 -787 -103 477 350 -627 -545 201 781 -295
2514 -295 -667 7 503 79 -542 -498 411 672 -57 -605 -108 783 406 -506 -540 285 729 -77 -542 -7 452
2535 452 21 -370 -318 366 608 -63 -686 -26 593 175 -785 -635 499 415 -392 -673 -148 695 312 -972
2555 -972 -847 437 812 -248 -926 -218 584 300 -631 -792 266 828 -212 -720 7 865 187 -854
2573 -854 -148 306 476 -313 -527 -78 736 327 -543 -504 662 710 -302 -445 403 751 386 -414 -718 369
2593 369 587 -68 -744 -297 763 411 -766 -231 322 776 -177 -388 52 525 140 -681 -422 220 289 -169
2613 -169 -901 -245 656 355 -706 -487 547 668 -234 -669 210 733 68 -644 -173 294 487 -355 -504
2632 -504 174 628 -106 -579 -215 662 572 -394 -756 507 845 336 -809 -256 503 776 -338 -484 83
2651 83 707 286 -527 -198 566 313 -348 -507 271 299 -99 -433 -335 789 293 -584 -830 246 693 -190
2671 -190 -701 -178 908 708 -340 -595 376 597 92 -757 -345 411 526 -276 -646 147 785 -120 -401
2690 -401 75 552 500 -700 -520 318 723 -196 -890 -31 425 597 -490 -345 274 469 -16 -180 -101 371
2710 371 487 -463 -548 312 582 8 -510 -19 749 383 -793 -795 471 354 -325 -728 -28 309 217 -523 -360
2731 -360 -26 628 26 -606 -176 414 400 -545 -136 246 767 -89 -578 -221 596 244 -739 -285 500 819
2751 819 1 -761 -78 456 507 -327 -584 64 681 -214 -593 -45 671 279 -597 -373 222 670 -170 -879
2771 -879 95 550 129 -640 -685 228 452 -26 -566 -43 844 312 -636 -690 395 540 -399 -413 -295 688 64
2792 64 -230 -787 373 641 -172 -517 135 841 94 -637 -274 508 756 58 -538 -121 631 192 -608 -375
2812 -375 342 583 -222 -795 155 769 245 -488 -458 602 250 -249 -890 343 644 87 -636 -172 493 227
2832 227 -379 -583 45 513 120 -544 -554 422 519 -357 -534 163 708 -37 -714 -287 617 218 -334 -427 239
2853 239 543 205 -473 -237 285 385 -409 -816 6 627 21 -324 -284 681 442 -463 -467 191 398 -62 -510
2874 -510 -108 343 424 -133 -523 35 581 92 -784 -305 306 575 -381 -705 255 472 -161 -488 -73 440
2894 440 486 -541 -366 268 517 -187 -620 -139 717 348 -452 -422 253 806 5 -454 -110 473 427 -267 -304
2915 -304 381 539 75 -700 -91 670 432 -408 -295 313 731 -56 -556 -97 802 475 -247 -703 391 692
2935 692 -237 -557 -101 684 220 -553 -600 526 643 94 -696 -83 947 145 -300 -778 150 546 -417 -514
2955 -514 -315 784 295 -560 -513 396 518 -252 -491 -68 363 -42 -124 -747 359 805 -211 -812 -84 875
2975 875 148 -643 -422 721 314 -228 -698 -297 403 243 -336 -401 56 725 -324 -664 269 575 170 -532
2995 -532 -629 341 396 -399 -603 -68 703 337 -737 -336 64 457 -354 -729 33 179 362 -659 -327 403
3015 403 547 -319 -575 130 661 171 -426 -342 202 593 226 -579 -37 694 304 -580 -590 493 533 -110 -631
3036 -631 -30 671 391 -463 -452 478 254 -214 -490 179 631 166 -626 -405 443 412 -238 -665 -92 809 459
3057 459 -201 -326 488 580 -109 -595 246 377 -104 -375 -586 685 605 -211 -745 57 534 68 -562 -129
3077 -129 346 233 -202 -137 283 610 -33 -185 36 393 662 -345 -288 90 648 268 -650 -193 476 123
3097 123 -205 -424 -347 253 217 -728 -240 369 232 -560 -781 75 139 40 -763 -257 356 179 -301 -666 16
3118 16 595 -219 -571 -404 802 517 -556 -419 216 328 52 -1086 -325 499 370 -217 -374 139 557
3137 557 -220 -577 -235 242 196 -237 -434 401 681 -181 -384 -151 805 606 -561 -407 222 718 -73 -690
3157 -690 -222 436 168 -536 -444 165 276 -26 -653 -258 468 224 -432 -628 148 856 -124 -616 -142 536
3177 536 140 -670 -471 356 586 44 -497 21 826 503 -197 -531 352 642 151 -469 -47 569 521 -335
3197 -335 -703 481 694 70 -479 215 685 189 -298 -507 445 417 -271 -471 -95 553 547 -376 -400 37 530
3218 530 86 -552 144 473 -58 -406 -541 340 521 -587 -810 -176 565 280 -346 -351 302 310 -323 -558 -186
3239 -186 451 322 -558 -313 553 567 29 -633 126 901 -174 -626 -397 590 265 -120 -602 298 598 14
3259 14 -381 -461 52 614 -152 -507 -75 210 17 -606 -667 260 563 151 -348 -169 314 157 -457 -171 233
3280 233 172 97 -426 -123 369 83 -479 -306 365 336 27 -448 -102 509 56 -262 -223 173 643 -220 -330
3301 -330 -44 430 -65 -413 -174 155 387 -504 -525 -80 621 50 -591 42 619 644 -189 -560 95 554 185
3322 185 -702 -85 630 338 -136 -296 55 926 91 -473 -254 521 302 -424 -458 337 571 212 -721 -262
3342 -262 540 236 -390 -578 196 474 281 -855 -56 615 332 -24 -658 -97 522 191 -344 -73 356 542
3362 542 -238 -302 194 433 -14 -872 -513 438 594 -204 -502 178 390 -264 -308 -78 622 391 -418 -317 292
3383 292 336 -39 -426 -38 286 369 -337 -316 114 329 -195 -648 -29 312 211 -366 -801 160 461 -158 -277
3404 -277 -222 429 505 -524 -524 152 415 -200 -305 -264 484 293 -510 -515 507 495 -101 -318 158 472 338 -465
3426 -465 -119 259 648 -178 -289 34 613 143 -516 66 35 534 58 -596 84 591 157 -457 -299 267
3446 267 370 -170 -450 -117 283 -63 -381 -713 84 594 -414 -587 -153 384 235 -523 -395 342 434 -33
3466 -33 -508 -88 425 96 -259 -316 241 561 -446 -505 102 464 246 -546 -376 516 628 34 -695 213 462
3487 462 161 -522 -378 500 535 -19 -440 311 635 64 -353 -267 498 567 87 -593 22 239 -114 -719 -403
3508 -403 471 534 -358 -322 282 476 69 -525 -740 610 313 -190 -537 73 204 -33 -274 -155 380 526
3528 526 -136 -328 93 594 -7 -363 -235 537 509 -288 -421 12 607 198 -436 -249 275 308 -205 -419 11
3549 11 567 181 -503 -155 360 341 -328 -584 174 565 2 -482 -133 212 251 -376 -427 182 695 -50 -303
3570 -303 -422 35 430 -234 -600 93 595 138 -542 -275 35 188 -360 -894 452 514 63 -392 -55 660
3590 660 425 26 -324 167 432 117 -279 -16 471 307 -367 -477 331 643 -76 -392 -338 290 500 -741
3610 -741 -595 46 239 15 -445 -327 326 393 -328 -251 283 534 45 -668 -410 342 244 -296 -192 117 561
3631 561 91 -301 -347 489 583 -193 -286 414 658 -123 -459 -106 476 153 -426 -155 -36 626 -26 -395 -45
3652 -45 371 137 -261 -389 385 654 -67 -462 19 817 216 -206 -532 426 549 -12 -435 -258 105 177 -397
3673 -397 -458 204 421 77 -564 -176 259 -42 -208 -200 147 352 -49 -707 -93 572 328 -295 -220 255 326 -403
3695 -403 -435 -71 455 200 -171 -428 344 183 -202 -449 -185 470 -6 -462 -732 303 42 -130 -533 -112
3715 -112 297 45 -385 -355 287 85 -324 -567 -80 616 112 -207 -322 430 252 -118 -693 -146 446 108
3735 108 -320 47 127 103 -141 -700 -139 441 347 -353 -145 420 409 -160 -403 16 539 -55 -242 -448 441
3756 441 507 -139 -568 -216 846 357 -290 -149 328 542 -125 -458 -7 572 21 -159 -153 187 568 -256 -626
3777 -626 -38 504 74 -666 -200 591 90 -105 -341 27 366 57 -535 -313 286 124 -166 -567 243 360
3797 360 -101 -545 -316 612 329 50 -513 291 453 205 -181 27 341 489 -367 -112 180 265 148 -304
3817 -304 26 270 163 -322 -461 13 738 383 -463 -94 810 -85 -497 -370 20 316 42 -786 -409 331
3837 331 178 -484 -444 58 520 -168 -561 -229 162 370 -161 -516 196 382 -23 -422 -345 529 253 -356 -375
3858 -375 107 447 -13 -375 -65 503 211 -481 -359 -195 471 66 -472 70 587 344 -27 -144 163 286
3878 286 -118 -427 112 679 199 -442 -364 216 454 18 -588 235 378 108 -165 -20 202 365 15 -360
3898 -360 -483 283 185 -44 -358 259 350 57 -528 114 440 190 -285 -279 320 452 -163 -612 -160 546 307
3919 307 -252 -674 119 614 29 -333 298 411 77 -366 -393 67 574 -82 -428 -33 552 306 -411 -120
3939 -120 375 417 -25 -396 -35 538 302 -132 -324 73 265 -318 -511 -42 221 177 -688 -296 282 359 -101
3960 -101 -571 48 585 350 -441 -334 354 355 37 -478 -19 486 106 -281 -22 528 526 -111 -341 39 665
3981 665 195 -594 -32 409 440 -157 -288 52 170 94 -699 -593 511 482 -57 -348 132 410 49 -255 -390
4002 -390 69 541 -331 -615 -16 453 20 -251 -151 198 199 -197 -411 -217 487 315 -489 -95 158 523 -57
4023 -57 -75 76 458 260 -614 -435 183 604 194 -341 202 364 299 -648 -189 370 646 -188 -306 302 16
4044 16 123 -266 -83 227 349 -110 -280 98 253 227 -303 -265 543 236 -539 -731 135 626 23 -370 -51
4065 -51 136 92 -396 -375 185 434 -72 -693 -261 280 167 -147 -467 255 689 282 -636 36 385 583 -184
4086 -184 -487 198 509 25 -327 -207 516 201 -228 -238 336 300 -213 -103 -170 394 472 -148 -265 158 395
4107 395 -137 -339 80 497 211 -323 -466 329 685 -227 -433 -25 468 -147 -428 -192 271 497 58 -437
4127 -437 -362 261 228 -256 -148 123 495 -65 -464 -467 266 316 -538 -255 20 281 -9 -534 -360 283 125 -428
4149 -428 -102 245 262 39 -490 -67 500 26 -276 -119 378 371 -378 -308 11 822 223 -443 -246 405 239
4170 239 22 -381 -67 168 231 -598 -121 70 163 -347 -567 -206 437 -23 -323 -245 61 219 -108 -321 84
4191 84 444 -191 -216 -527 202 239 -82 -368 113 375 68 -429 -225 223 371 -244 -275 52 400 134 -282
4212 -282 -281 30 283 85 -212 -117 421 327 -169 -91 59 107 -221 -407 -84 412 50 -501 -243 257 140 169
4234 169 -535 207 698 245 -234 -239 213 48 -181 -281 92 208 65 -116 -364 321 188 -74 -348 103 132
4255 132 162 -238 -347 375 120 -134 -382 164 491 170 -326 184 397 270 52 -347 -462 246 -173 -415
4275 -415 -184 438 300 -220 17 56 391 -80 -431 -209 53 231 -197 -312 101 259 89 -395 256 81
4295 81 316 -264 -23 77 332 -238 -424 -66 422 327 -286 -235 369 302 -47 -468 -264 224 -42 -411 -106
4316 -106 25 156 2 -372 58 261 105 -256 -443 -153 463 29 -521 89 460 244 -171 -455 197 253
4336 253 320 -383 -302 237 93 -233 -393 46 372 -239 -335 -217 415 286 79 -321 118 457 110 -557 322
4357 322 526 7 -112 -289 127 332 -72 -414 -330 249 152 -279 -195 307 617 -187 -230 43 474 365 -233
4378 -233 -36 239 383 257 -410 28 373 218 -113 -472 189 608 145 -401 -93 324 186 -201 -377 231
4398 231 174 -181 -626 53 409 283 -149 -125 -22 255 84 -458 -23 438 262 -225 -126 130 200 -181 -175 156
4420 156 584 300 -72 -300 307 349 81 -194 -85 286 197 -252 -97 189 475 152 -153 -161 277 -135 -474
4441 -474 -320 194 130 -94 -212 -185 291 134 -319 -180 534 339 -178 -121 -157 133 302 -326 -342 164 282 -194
4463 -194 -250 87 217 -52 -263 -169 -349 90 175 -281 -65 417 37 -259 -168 307 185 -142 -361 54 144 219
4485 219 -353 3 152 501 71 -230 -65 364 35 -434 -134 115 653 -112 -486 -168 -12 -32 -446 -41
4505 -41 86 344 7 -455 104 137 238 -234 -449 36 415 -194 -464 -113 207 -97 -377 99 174 69 -403
4526 -403 -347 -15 457 -97 -140 98 -17 265 -113 -398 128 315 -267 -269 -274 224 300 -166 -381 82 217 53
4548 53 -431 -181 197 155 -361 -382 15 467 -243 -536 -290 -18 179 -484 -22 148 275 -235 -477 -87 218
4569 218 113 -349 -233 16 175 -69 -115 -74 294 138 -159 -238 52 253 -149 -232 -78 257 352 -330 -303 196
4591 196 548 -2 -453 -62 407 62 -61 -107 178 447 -151 -234 -49 391 544 -112 -39 250 40 54 -149
4612 -149 -361 94 227 -108 117 220 393 292 -624 -156 321 475 -251 -246 90 167 14 -13 -113 276 -207
4633 -207 -315 -40 183 674 6 -121 -59 352 94 -105 -110 66 488 100 -537 21 504 186 -33 -65 274
4654 274 267 108 -323 -10 236 256 -175 -76 144 135 -258 -100 -150 297 245 -184 -115 191 331 -185 -42 182 355
4677 355 68 -129 -151 228 169 21 -233 -388 220 16 -568 -402 451 387 1 -392 -84 -112 331 -363 253
4698 253 296 415 -59 -217 41 239 172 -169 -305 224 172 -76 -583 97 408 242 -342 -197 359 248 -247
4719 -247 -72 -31 42 316 -322 -92 32 92 -115 -91 17 202 -28 -390 -351 341 88 -63 35 -59 166 -28
4741 -28 -220 -205 177 252 -364 -199 -101 219 40 -106 63 73 -71 -314 -245 195 407 -19 -168 -22 129 29
4763 29 -273 -425 199 226 147 -103 -236 64 166 -286 -349 124 149 44 -210 -400 315 8 -322 -481 -78 435
4785 435 35 1 -94 331 507 -310 -422 210 60 163 -566 -43 -40 -59 53 -162 -265 114 34 276 -181 111
4807 111 143 -143 -297 -263 301 120 -574 -239 174 113 -129 -403 359 316 -203 -307 -249 268 321 147 -182 120
4829 120 139 -442 -495 -71 80 201 -162 -80 -1 538 -253 -459 81 36 -71 28 -149 208 -106 -3 -159 -73
4851 -73 325 121 8 -198 531 312 -116 -453 -97 173 229 -276 -136 205 372 -274 55 -158 393 178 -412
4872 -412 -281 252 -104 224 -130 98 194 -138 -204 -273 -4 260 -11 -110 -465 198 122 -417 -27 25 20 -299 74
4895 74 14 272 142 -625 -232 133 325 -334 -270 100 317 -74 -314 1 51 295 -364 -195 -185 422 210 -78
4917 -78 -374 66 190 -275 -315 102 338 21 53 -209 503 140 -3 -219 86 -10 14 -96 -417 292 148 -300
4939 -300 -458 0 386 64 -219 157 217 314 -225 -254 -120 87 -22 -285 -484 363 421 -119 -145 -285 232 172
4961 172 -159 18 -113 101 -195 -286 7 220 157 -227 -205 208 301 64 -247 117 361 -21 28 216 446 125
4983 125 -74 -270 -122 446 123 -469 -122 346 144 -89 -436 405 471 -144 -338 -280 244 221 -228 -107 143
5004 143 170 -130 -210 -103 177 286 -258 -330 342 -54 -87 -226 -23 546 216 -221 -470 138 137 21 -231 -13
5026 -13 81 136 -149 -258 120 250 -130 -262 -108 237 152 -282 -417 -140 373 -51 -446 193 299 -17 -10 -128
5048 -128 222 304 -93 -356 -129 199 100 -204 -327 220 296 -4 -236 -54 218 -117 -432 -470 6 7 -40 -435
5070 -435 36 394 168 -147 -153 26 374 -224 -531 -57 262 204 -37 -437 179 331 -253 -358 -227 102 78
5091 78 169 -241 290 329 101 -489 -94 251 10 -80 -170 350 380 -281 -73 103 484 208 -282 -214 79 386
5113 386 27 -88 86 286 1 -312 -40 -72 304 118 -423 -92 407 193 -272 -193 242 156 -61 -213 -62
5134 -62 41 -34 -126 -72 106 136 -10 -237 202 151 157 -368 -40 287 382 -173 -381 21 329 -129 -128 -154 251 44
5158 44 12 -105 57 475 -12 -141 53 498 225 275 -171 58 280 272 -312 -148 355 139 -94 -438 38 174
5180 174 72 -326 -32 160 255 -335 -488 31 46 -254 -117 -158 141 -21 -281 -343 196 796 241 -324 56
5201 56 225 73 -122 -65 -173 339 116 -166 -200 0 349 -258 -310 147 460 -179 -213 -15 169 223 -113 -219
5223 -219 49 314 6 -222 -237 89 386 -247 -287 157 227 -44 -522 -211 422 164 40 -73 143 330 -337
5244 -337 -370 -337 66 289 -250 -110 259 155 52 -101 110 227 35 -169 -319 107 77 133 -506 -11 147
5265 147 165 -153 -265 179 357 -370 -382 221 305 -138 -281 -18 49 259 -169 -98 29 175 205 -88 -195 247
5287 247 362 36 -290 94 270 89 -256 -140 160 126 -189 -653 178 -51 76 -174 -9 379 185 -280
5307 -280 -343 -44 318 55 -269 -70 339 263 50 -58 -198 255 300 -384 -120 434 375 -132 -328 -201 261
5328 261 206 -171 99 101 283 -208 -495 27 216 -33 -27 25 -49 228 -127 -136 6 90 85 -260 -193 47 -64 -367
5352 -367 -169 63 505 -13 -314 -97 295 6 -287 -287 107 159 129 -387 -332 264 526 -321 -185 38 336 166
5374 166 -318 -187 310 455 -61 -178 35 427 -31 71 30 94 200 -157 -180 -73 184 138 -277 -291 313 139
5396 139 -14 -416 -201 196 182 -247 -169 429 131 -120 -229 140 332 14 -451 -71 350 116 -113 -217 -5
5417 -5 291 111 -246 -28 504 394 -29 24 27 313 -38 -197 -47 72 241 -306 -49 311 176 -151 -239 -10
5439 -10 38 106 -111 -215 231 182 -86 -339 -229 197 80 45 -163 145 318 -104 -261 -106 51 96 -112 -414
5461 -414 144 47 186 -224 -58 404 222 -30 -206 117 338 4 -430 149 384 -141 -174 -159 -6 19 -13 -231
5483 -231 -119 57 89 -344 -180 89 165 68 -354 149 312 276 -23 -97 -39 216 -70 -315 -205 106 140 -73
5505 -73 -99 -7 244 -115 178 90 359 97 -446 -224 38 388 -181 -564 -266 -1 86 -348 148 119 410 -334
5527 -334 -444 -151 68 -32 -31 90 -191 294 -133 -371 -134 411 211 -361 -306 183 243 -61 -400 -57 82
5548 82 -295 -273 -277 175 263 -170 -156 154 301 37 -473 -406 279 155 -240 -473 15 211 -176 -174 -204 318 190
5571 190 103 -291 -146 191 -70 -383 -95 47 97 -292 -282 -36 8 371 -234 77 252 212 -196 -118 -37 362
5593 362 -66 -383 -154 130 231 -131 -327 466 305 129 -149 -41 242 42 14 -31 46 254 183 -31 -177
5614 -177 97 17 -293 -424 17 188 17 -288 -85 137 511 -386 -427 137 225 -3 -228 210 405 557 -284
5635 -284 -627 -61 377 219 -92 -134 369 68 -168 -492 42 247 267 -397 -156 281 177 64 -204 -108 197
5656 197 -164 -205 -69 337 192 -226 -165 5 364 -58 -393 -8 403 463 -18 -426 285 340 250 -511 223 78
5678 78 150 -38 -114 -34 193 103 -306 -115 248 -3 -306 -290 30 308 -51 -224 -308 229 264 -174 -263 221 277
5701 277 -92 -309 23 332 325 -286 -69 113 126 76 -337 65 189 160 -46 -227 357 153 198 -327 -44 348
5723 348 72 43 -175 73 -40 68 -158 -204 257 254 -394 -470 191 383 -122 -139 -5 -8 185 -197 7 349 407
5746 407 -267 -290 -143 -246 112 -68 -451 254 274 56 -421 146 558 -167 -390 -95 4 238 -264 -286 -351 202
5768 202 -85 -272 -87 122 42 -179 -99 68 303 -16 -276 -246 294 78 56 -301 -208 124 238 -160 -128 251
5790 251 127 -351 -116 -64 321 202 -258 -197 9 107 -161 -367 39 248 144 -202 -203 379 165 13 -73 -21
5812 -21 190 21 -169 -321 243 454 63 -362 -344 -148 -213 -160 -245 60 476 -163 -178 106 573 196 56 -140
5834 -140 160 -183 84 -31 -37 439 17 -91 -236 -145 157 13 -94 40 211 -65 -288 -76 172 314 -141
5855 -141 -160 153 236 -76 -271 -52 86 277 -146 -178 -171 624 -133 -420 65 216 120 -186 -234 -208 273 246 188
5878 188 -179 -74 186 -214 -250 -14 564 98 -437 305 57 352 176 -105 116 495 173 -20 82 296
5898 296 -44 -165 -228 -60 245 9 -72 -205 232 188 45 -305 -19 289 57 -333 -122 65 155 -170 -141 -171
5920 -171 475 -71 -160 -60 422 -269 -457 -4 37 257 -100 -110 -112 225 163 -134 -279 194 360 -91 -482 -120
5942 -120 238 227 -220 -148 205 96 -60 -301 -20 262 239 -308 -403 47 442 240 -177 -71 433 208 -200
5963 -200 149 456 211 46 -183 -217 182 15 37 -140 208 209 -46 -359 -3 6 61 -165 -175 -108 150 30 -419
5986 -419 -33 134 133 -47 -226 179 257 -3 -116 -114 284 128 -199 105 215 363 -443 -105 -189 289 -95 -324
6008 -324 -149 50 6 -71 -290 140 187 93 -237 -160 113 213 -180 -74 105 356 32 -400 -145 -120 45 -134
6030 -134 -287 -140 301 359 -113 -409 -119 205 -197 -108 -21 214 216 -256 -156 192 42 -305 -271 67 208 244
6052 244 -61 -258 231 -117 -110 -341 48 28 -192 -203 -202 1 265 -121 -217 -82 434 -138 -445 -210 -66 292
6074 292 -25 -123 -284 274 46 -50 -179 -48 -106 -137 -279 146 53 52 -286 -24 -10 -84 -19 -477 -22 262 115
6097 115 -389 -73 140 367 -285 -259 231 289 40 -340 -105 141 -38 46 9 -156 369 330 -2 -47 83 -33
6119 -33 -342 -79 102 392 146 -394 -196 301 -202 -462 -78 140 409 99 -393 -481 405 448 86 -138 -9
6140 -9 98 -29 -79 -267 481 432 -48 -521 -85 271 109 -236 -7 263 194 -50 -200 168 187 -86 -226 -152
6162 -152 29 160 -363 -337 137 433 10 -313 -102 132 346 -226 -435 313 200 -228 -79 -45 426 327 -442
6183 -442 -244 -27 320 -96 -138 -99 228 253 -128 85 146 130 -25 -271 97 310 284 51 -433 -112 314 15
6205 15 -399 -280 286 325 -265 -360 110 302 145 -269 -40 175 234 -356 -210 363 552 94 -238 -242 180 84
6227 84 -334 -167 -101 98 -48 -180 -134 200 383 -238 -204 103 364 -141 -197 -118 35 264 -208 -192 -119 266 -53
6250 -53 -451 -216 6 -65 -382 -111 -154 253 88 -318 -166 157 316 -267 -3 274 390 137 -114 266 256
6271 256 67 -557 -143 264 582 -145 -354 -88 353 151 -27 -64 -32 369 36 -355 118 160 198 -288 -113
6292 -113 29 68 -416 -355 -101 -6 -88 -86 -144 -5 104 114 -396 83 406 -67 -172 -8 152 400 -311 -387 -12
6315 -12 133 5 -150 -603 -101 215 -34 -442 -77 210 164 -242 -331 317 386 -198 -103 78 346 21 5 -315
6337 -315 343 285 -185 -292 103 61 78 -403 -9 165 363 221 -386 -78 353 -52 -409 -37 59 143 14 -99
6359 -99 -169 185 -72 -99 -25 -155 416 -82 -160 111 352 41 -289 -87 -349 52 8 -177 97 286 -41 -177
6381 -177 -420 209 -98 16 -227 -238 158 -38 -356 13 160 68 -200 -217 102 -293 -162 -244 -108 320 140
6402 140 -76 -224 13 464 182 4 -101 212 -85 -439 96 146 282 170 -236 -153 -134 172 -308 -368 -122
6423 -122 217 -145 -258 -77 165 145 -267 -413 25 117 -22 -119 -291 339 225 -123 -215 152 146 -136 -26 -131
6445 -131 39 17 -136 -147 195 177 33 -221 190 65 184 85 -122 -7 135 194 -266 -335 278 -24 2 -164
6467 -164 -267 455 -379 -541 -115 53 108 -60 -96 197 101 -99 -138 59 -39 118 -176 -339 115 469 245 -31
6489 -31 124 249 199 -268 -328 229 310 -34 34 8 284 -38 -120 -137 196 238 -201 -446 128 488 401 -196 179
6512 179 423 560 90 -175 116 168 20 -105 -49 -57 404 -126 -6 -142 157 95 40 -240 4 -37 61 -322 182
6535 182 327 6 -145 -231 -180 72 -168 -367 -119 -111 30 -129 207 -18 276 -44 -110 -34 71 246 -337 -42
6557 -42 383 397 -105 -224 -149 243 253 -180 -275 135 339 -336 -459 71 237 -26 -249 -158 112 226 -84 -132
6579 -132 24 236 -38 -212 81 75 258 -268 -43 34 137 74 -50 -185 192 192 -70 -350 43 65 375 -279
6601 -279 86 -24 272 -176 -391 290 404 27 -296 175 178 378 98 -31 -88 235 53 -300 -221 -145 296 -168
6623 -168 -173 -98 289 3 -46 -155 402 266 -243 -136 -4 225 -9 233 -88 400 107 -8 -514 -79 274
6644 274 34 3 10 97 515 223 -327 257 233 131 -220 238 356 147 -97 -237 269 5 60 20 -143 417
6666 417 166 -323 -574 4 319 53 -168 -219 176 -104 -327 -123 225 114 272 -164 -89 66 356 -215 -577
6687 -577 33 116 49 -61 -113 375 178 -104 -145 162 246 108 -119 194 187 117 -389 -162 148 280 60 91 78
6710 78 235 59 -168 22 7 112 -65 42 -89 160 183 -14 -244 236 221 -168 -176 -324 65 74 61 62 15 128
6734 128 107 -469 55 25 397 -177 -267 131 -88 -178 -576 169 285 -17 -22 86 389 -85 -223 -129 65 117 60
6757 60 -505 -348 430 21 35 -153 -32 259 73 -353 -92 149 315 36 -66 -238 152 180 -140 149 368
6778 368 52 -319 148 -128 322 68 17 -94 274 124 -58 -239 -60 369 -129 -333 -171 17 90 -205 -140
6799 -140 185 508 -256 -121 106 -223 350 43 -109 -38 640 -99 -188 -185 174 229 51 -58 -83 32 282 -471
6821 -471 -152 103 236 -46 -252 -113 154 282 -243 -59 293 477 -179 -101 190 109 436 -299 -305 505 442 -78
6843 -78 -574 -236 317 245 -26 -259 -142 -29 45 -61 -95 184 200 -180 -38 -259 201 -133 -381 -24 156 201
6865 201 -349 -120 177 143 -220 -283 187 298 -28 -215 -161 188 57 29 -89 -98 -17 45 -83 238 34 180 186
6888 186 23 -90 137 99 -267 -112 -20 201 -90 -251 -105 185 184 -47 -417 304 265 -64 -142 -35 123 195
6910 195 26 226 85 -30 -302 -249 -83 245 317 -297 -98 -170 6 48 59 161 26 -150 -72 -26 129 123 76
6933 76 -36 116 28 23 -186 -99 0 163 -63 -222 216 198 136 -463 54 263 217 -245 -201 130 142 107 -25 0
6957 0 406 366 -10 -331 -173 209 -37 -346 -114 95 -15 -80 -11 104 -17 28 145 -162 -241 88 195 -380
6979 -380 190 395 75 -124 -75 61 -28 -31 57 164 66 34 -183 -345 162 163 26 -244 50 234 -193 -11 -125
7002 -125 148 89 -174 -28 169 182 50 -151 -136 115 -23 -19 121 54 297 -98 -395 26 20 -194 6 135 145
7025 145 139 -306 -138 -39 149 322 -41 -99 285 161 27 178 -210 5 226 -118 -231 162 110 -133 -120 -91
7047 -91 228 -31 -333 -197 167 162 158 -332 -11 230 123 -23 182 144 98 -49 184 223 10 -141 -187 -70 -159
7070 -159 148 -114 -230 -250 93 -23 -371 -12 20 270 190 -232 -127 111 -78 -154 89 113 -25 35 -315 146
7092 146 263 59 -20 -248 232 -50 -18 90 13 89 238 -179 -63 192 223 -39 227 100 142 63 7 -95 132
7115 132 169 -458 -150 119 140 -47 -114 19 180 109 44 -294 11 79 220 119 131 125 220 248 -238 -121 284 5
7139 5 -103 -185 12 124 261 -205 134 -62 -178 -108 -257 41 303 177 -82 -66 239 192 -54 -88 190 400
7161 400 -312 -327 -143 -10 -13 -356 -129 -151 -105 15 -210 88 288 -158 58 263 244 185 -15 -9 232 142 -35
7184 -35 -99 -88 82 345 -166 128 138 235 -180 -212 -404 170 192 -213 -307 78 358 18 -53 -153 248 -323 -342
7207 -342 -36 0 99 191 24 -114 22 125 -320 -39 157 218 -199 -207 -117 67 145 -17 171 104 152 -41 -209
7230 -209 -122 468 294 -245 -151 -49 340 287 -302 -80 408 -11 -12 52 -153 90 -44 -49 -195 -67 31 70 4 -251
7254 -251 -20 82 192 -432 343 -163 -161 -129 -3 111 -192 -155 105 205 203 -195 -222 296 270 189 -187 -9 174
7277 174 -14 -139 -63 -61 291 -15 -226 -100 40 151 -301 74 175 128 47 59 -158 383 22 -206 121 184
7299 184 25 -41 -167 70 248 -56 111 -78 229 109 4 21 81 259 -75 123 30 428 112 -106 -320
7320 -320 -288 214 9 -16 -390 55 40 7 -290 -283 413 -59 -266 13 39 216 293 -198 94 154 149 -79 -201 -171
7344 -171 317 -115 69 136 -239 192 102 31 207 391 86 -117 91 103 -263 49 -154 138 -68 147 -258
7365 -258 190 79 96 -4 20 18 171 -133 40 -95 70 110 100 -198 -224 404 -20 -102 -153 281 -52 -357 -78
7388 -78 -151 -115 -174 13 -154 315 -29 -185 -4 -76 131 -126 -273 267 200 96 -5 -13 104 115 -34 -76 116
7411 116 300 -93 -251 -278 40 136 17 -196 110 -21 46 -246 144 300 287 115 -86 -140 -11 76 -122 -96
7433 -96 179 181 -327 -439 147 -64 -205 -20 -187 258 100 -101 15 32 337 -252 -256 -154 94 -2 -184 -52
7455 -52 556 -145 96 -166 14 230 -68 -71 -65 77 89 -126 23 -259 202 126 -375 11 132 45 94 113 -115
7478 -115 315 -47 -68 29 -328 296 215 -186 70 -74 84 -94 -165 37 285 -87 59 -239 219 -31 -81 111
7500 111 325 186 57 -251 -220 323 0 -172 -223 -34 -40 -197 -74 45 171 -69 -169 -248 -158 308 270 -32
7522 -32 -43 346 -35 -111 -126 174 191 60 -106 -147 176 147 -117 -170 44 -62 32 36 -88 -4 86 124 -119 176 187
7547 187 85 -334 -166 156 62 -38 133 -46 257 -188 -222 38 358 -104 -380 -101 65 19 170 -67 90
7568 90 -76 -107 24 -39 295 -211 42 69 65 -64 -131 -37 -146 -32 -26 -323 14 119 166 349 -126 107 -206 167
7592 167 -207 -278 -35 23 92 -30 -170 164 136 -42 51 155 290 28 -111 -339 -150 31 -92 -128 232 382
7614 382 181 -301 -258 217 112 53 -263 217 182 -201 -289 -392 287 -7 -89 -117 14 429 -17 -163 -57 135
7636 135 435 -67 -111 99 304 96 56 0 140 -192 -42 -176 -8 204 -134 139 -444 312 70 15 -115
7657 -115 121 113 -233 -238 -159 78 52 -20 -444 -72 109 -282 16 -46 -240 407 66 -316 -85 187 365 -271 63
7680 63 400 162 -159 -55 -257 205 309 -137 -63 15 159 -309 120 61 477 -82 -185 -53 5 98 6 -117
7702 -117 265 122 43 93 -292 -43 382 -155 -176 -91 18 -131 132 108 117 311 24 -187 291 -65 -5 -192 12
7725 12 330 235 -115 70 -51 272 -91 -70 151 22 42 101 -470 -36 127 -41 61 -8 221 41 -65 -352
7747 -352 100 184 145 -372 -196 258 170 -337 -72 -21 120 -49 -211 -3 160 54 -133 -132 162 31 76 -85
7769 -85 185 112 -308 -339 -78 -193 -273 -92 62 -179 229 19 69 81 130 298 237 -309 80 20 108 -77 246
7792 246 125 426 248 -259 16 308 -33 -337 -370 152 148 -122 -240 94 -91 59 14 150 313 -13 31 -139
7814 -139 -143 -93 -58 -161 106 44 334 -213 -27 31 91 -83 -237 -147 3 71 -131 -71 -109 144 178 169 118 -109 229
7839 229 -91 -193 -69 59 -2 -103 -12 -194 173 -49 -213 33 65 -120 -282 -22 177 -46 -93 -243 122
7860 122 -75 -57 -340 -26 310 190 307 81 -45 -6 20 49 -188 236 116 -41 -22 115 198 33 23 -291
7882 -291 -65 20 -131 -39 -14 235 93 -118 -74 120 208 60 -118 -337 -125 323 -58 -292 24 26 191 148 -28
7905 -28 -158 -81 134 84 65 18 106 122 26 186 -61 165 -66 195 -251 -19 -73 -203 -10 -103 77 -240 24
7928 24 56 -191 -125 -13 234 53 -122 132 -235 47 -136 -48 203 4 67 -119 242 93 -52 17 -215 -165
7950 -165 315 -134 -55 -118 177 222 -67 99 -163 25 219 -41 -6 -92 86 238 -250 139 -29 102 -106 -54
7972 -54 139 -15 75 -185 -121 272 104 -147 167 -180 192 -19 -190 119 136 286 -102 -172 23 147 9 -128
7994 -128 -30 88 107 -73 -55 35 21 -281 -11 -204 49 84 -183 -64 73 181 101 231 245 272 30 -112 260
8017 260 -127 80 143 -152 -39 155 -103 -96 -137 251 -251 214 2 -21 187 -1 -289 15 -47 -43 -21 291 377
8040 377 175 232 57 76 -132 -130 -25 -169 36 221 -3 62 27 -110 -134 198 126 38 -83 -55 -172 105 153 -105
8064 -105 94 -65 310 20 -47 50 -51 -58 81 -128 24 -20 179 -169 -176 -102 202 234 -288 -58 6 -225 110
8087 110 70 -5 68 69 -156 54 236 145 74 -269 -29 -9 55 -24 -67 -104 135 23 53 282 367 34 -192 -150 -173
8112 -173 148 16 -108 -135 84 347 55 -167 -69 90 -32 60 7 -255 -91 170 -232 -256 153 62 -118 41
8134 41 196 -82 -120 -278 330 11 -179 -67 77 -160 -231 99 -162 58 108 -14 -136 -55 235 49 209 -135
8156 -135 -121 128 4 -54 -141 350 -18 49 12 150 -86 -299 -46 -22 95 203 -131 72 316 -20 9 27 -211
8179 -211 -92 18 -20 -71 151 80 -288 -89 248 129 31 170
8191A70
$$ Imaginary data points
##PAGE= N=2
##DATA TABLE= (X++(I..I)), XYDATA
0 0 0 0 0 0 0 0 0 4 -8 8 -8 8 -8 16 -16 17 -24 25 -32 40 -43 49 -58 67 -78 89 -99 114 -130 146 -164 184
32 184 -206 230 -256 286 -318 352 -391 433 -480 531 -589 651 -724 802 -893 995 -1114 1251
50 1251 -1419 1620 -1867 2187 -2612 3204 -4096 5582 -8516 16483 -82609 -240292 -6442 149968
64 149968 21371 -137378 -54664 55259 4292 -77063 -23076 31169 -23185 -74807 -14450
75 -14450 42762 5571 -49513 -41432 -16454 -4468 10353 10936 -27097 -42031 6207 35703 -17500
88 -17500 -60337 -5423 61126 22283 -54265 -34870 41081 36798 -28584 -29570 31031 38491 -14402
101 -14402 -23919 27590 42770 -12670 -44797 6827 66582 43376 -27475 -48140 -1097 47872
113 47872 41460 -6492 -35551 -8203 35673 31483 -12171 -26506 3466 20078 -737 -10795
125 -10795 14510 21891 -19506 -42488 1729 43383 12513 -34646 -20480 18124 10170 -20856
137 -20856 -15369 12302 10238 -13935 -15060 4397 9067 -2540 -10710 -14086 -8882 14198 27265
150 27265 -4909 -40337 -14933 33721 21558 -28024 -21728 29365 29763 -24342 -35871 17723 40419
163 40419 -5525 -34047 3022 33963 7245 -23669 -9126 14922 8847 -7788 -2994 11996
175 11996 9245 -7337 -15192 -6231 9180 16829 6279 -16421 -20909 3936 21572 1625 -23123
188 -23123 -13093 11652 9208 -11587 -9815 7625 28 -26009 -17078 25526 29841 -22616 -50763
201 -50763 -6546 40115 17074 -34379 -33979 12266 28516 -4499 -29872 -12522 12718 8578 -9349
214 -9349 -11425 1318 6796 -3844 -14541 -5866 10348 6123 -12056 -10214 10710 11654 -14591 -22405
228 -22405 6424 26779 4321 -26196 -14689 18121 18316 -8577 -17669 -926 12379 8346 -2192
241 -2192 -6028 -1319 4069 532 -3498 4283 13873 3705 -15755 -11476 16716 25011 -4995 -26262
255 -26262 -1167 29877 15610 -18391 -17364 11483 20627 760 -12093 -483 12981 5227 -8803
268 -8803 -5982 8212 10008 -1941 -8405 113 8525 2373 -9550 -5853 8749 8709 -7082 -12542
282 -12542 1066 10876 1076 -13659 -9958 7398 11443 -5175 -16516 -5257 10125 3719 -11964
295 -11964 -10266 6175 8971 -7276 -15890 -242 13126 1602 -14967 -8291 8633 9813 -4835
308 -4835 -13028 -3769 9418 7694 -6520 -10043 2528 11621 1170 -12133 -4757 12972 10642 -9985
322 -9985 -13052 8505 16838 -4230 -16431 468 16431 4858 -12741 -7816 9004 9860 -5461
335 -5461 -11772 1143 11977 3599 -10980 -9469 5818 11638 -3310 -15388 -3482 13752 5537
348 5537 -15013 -11989 9486 11691 -8447 -16263 1264 13577 802 -15450 -7903 10133 8273
361 8273 -7953 -11548 2076 10065 505 -10592 -5319 8299 8202 -5855 -10139 2383 10418 1148
375 1148 -9485 -4424 8301 8799 -4312 -10531 721 11883 4130 -10608 -7576 8726 11785 -4624
389 -4624 -14262 -12 14728 3891 -13660 -8022 10499 9524 -8112 -12219 2247 9829 -47 -10877
403 -10877 -5794 6291 6157 -5881 -10204 -45 8682 2380 -9711 -7896 6641 9188 -5721 -12284
417 -12284 2231 12727 192 -12336 -3100 11521 6377 -8112 -7220 6837 9880 -1783 -7806
430 -7806 461 8499 5315 -3108 -4825 2268 8995 3771 -6387 -3994 8065 9551 -3324 -8350
444 -8350 2568 11011 2720 -8281 -3869 8762 7808 -5679 -8435 2481 9295 1412 -8194 -5642
458 -5642 5533 7698 -4172 -10916 -649 9543 2265 -10111 -6463 5742 6496 -5475 -10152 628
472 628 8111 -72 -10006 -4842 6549 5137 -6086 -8994 549 8821 1111 -11127 -6799 8493
486 8493 9035 -7104 -12412 2461 11517 -328 -12309 -4906 8808 5407 -8206 -8621 3501 6462
500 6462 -2911 -8180 -2026 4364 2127 -6252 -8099 833 6432 -1722 -11678 -6171 6960 5577 -9546
515 -9546 -13636 1163 10473 -1838 -15011 -6912 6996 3541 -8899 -9856 -247 4536 -2482 -8905
529 -8905 -4835 3019 1870 -6764 -8036 1259 6077 -2623 -11450 -4604 9040 6140 -10123 -12459 4118
544 4118 11935 -1122 -12818 -4843 8600 7013 -4762 -7741 1320 6966 499 -5824 -1167 5754
558 5754 2586 -5125 -2881 6260 7110 -3572 -8757 2081 11868 3758 -8605 -5768 7094 10932
572 10932 202 -8133 -2787 8538 8624 -2047 -6526 1624 8657 4121 -3860 -2156 6484 6142 -3129
587 -3129 -3897 6746 9590 -2320 -8129 2283 12281 5555 -7356 -7145 6108 12166 1983 -8927
601 -8927 -4274 7718 9060 -2209 -8341 159 8337 2901 -7512 -3757 6515 3805 -7507 -6652
615 -6652 4663 6282 -5184 -10685 -508 8318 142 -11916 -7988 5423 6550 -6321 -13290 -3546
629 -3546 7573 2933 -10661 -11955 1672 7859 -3461 -12632 -5164 6031 2080 -9066 -8023 2229
643 2229 5085 -5205 -10553 -1678 6748 1112 -9492 -7499 3882 6355 -4234 -11099 -1895 8894
657 8894 2644 -10580 -8642 5388 7989 -4648 -12370 -2787 7930 3615 -8241 -8359 1649 4209
671 4209 -3795 -7349 -1036 2996 -2382 -9211 -4294 6088 3310 -10275 -12846 1568 11266 -548
685 -548 -15869 -10626 6899 9600 -5598 -14103 -3400 7905 3212 -8294 -6606 2681 4406 -3033
699 -3033 -5821 771 5486 -539 -6552 -601 8242 4274 -6594 -5424 7292 11277 -526 -9750
713 -9750 -1103 12603 9980 -3980 -7638 3023 11042 6163 -2444 -2571 4129 6575 1571 -525 3598
728 3598 4900 -636 -4083 2437 9581 4765 -7347 -7426 5554 12369 1521 -10855 -6085 7067
742 7067 8971 -2388 -9383 -2598 6349 3182 -5861 -5547 2443 3379 -3872 -5876 438 3789 -2033
757 -2033 -7098 -1395 5267 892 -7872 -5913 5082 6337 -3970 -10235 -2245 7448 5260 -6526
771 -6526 -9224 1242 7962 1604 -7172 -3895 3838 3287 -3886 -4588 2162 5043 -2495 -7432 -1152
786 -1152 6386 2885 -5929 -6785 1277 6255 400 -7270 -4745 3179 3629 -4223 -6756 540 4769 -1534
802 -1534 -7897 -3586 5046 3213 -6340 -7561 897 4798 -1491 -6078 -2747 2183 783 -4759 -3834
817 -3834 2424 2921 -3831 -7048 143 6621 2237 -7188 -6821 3409 7436 -1047 -8064 -2001 6713
832 6713 4232 -4917 -5665 2262 6362 546 -5848 -2845 4668 4537 -2434 -4498 952 4629 357 -4038
848 -4038 -256 4644 1375 -5233 -2882 5693 5528 -3506 -6721 586 6531 3145 -3989 -4755 1141 4630
864 4630 1327 -3219 -1877 2209 2028 -1718 -1891 2552 3742 -1826 -5270 711 7087 2895 -6042 -4602
880 -4602 4234 6993 -522 -6267 -1571 5825 4380 -3389 -4768 2032 5746 846 -5016 -2310 3977
895 3977 3631 -2282 -4004 1684 3844 -1136 -4479 92 4568 306 -5281 -3284 3766 4630 -3040 -7009
911 -7009 -1125 5014 2687 -4117 -5132 955 3845 -399 -5088 -1825 3877 1725 -4456 -3726 3371
926 3371 4391 -2626 -6174 -404 5766 2700 -4470 -4528 2518 4778 38 -4509 -1092 4200 3108 -3144
942 -3144 -3860 2624 5358 -301 -5025 -586 5180 2682 -3883 -3250 2998 4777 -1594 -4533 284 4816
958 4816 1090 -4494 -2794 3437 4328 -2031 -5563 -504 4931 1868 -4967 -3938 3291 4174 -2542 -5776
974 -5776 86 4932 1014 -5645 -3702 4122 4351 -2306 -5452 -217 4720 1903 -4058 -3658 2612 4348
990 4348 -1257 -4674 206 4647 1223 -4135 -2234 3383 4023 -2118 -3689 1134 4776 1193 -3637
1005 -3637 -1686 2778 3605 -1353 -3638 306 4188 1446 -4042 -3000 3429 4377 -2102 -4956 478
1020 478 5028 1226 -4283 -3086 3814 3517 -2552 -4517 697 4428 437 -4192 -2451 2847 3664 -1560
1036 -1560 -4483 386 4814 1418 -3790 -2464 3211 3733 -1619 -3955 1133 4810 847 -3668 -1279
1051 -1279 4053 2998 -1403 -2531 1380 3952 1334 -3030 -1257 3544 3786 -1855 -3706 979 4545
1066 4545 1219 -4148 -1860 3687 3616 -2723 -4017 1404 4216 81 -3925 -1640 2988 2671 -2158 -3922
1082 -3922 663 3773 676 -4167 -2574 2627 3161 -2352 -4483 233 4858 692 -4703 -1690 3428
1097 3428 2648 -2761 -3502 1515 3992 -287 -3795 -802 3940 2583 -2790 -3379 1520 4268 612 -3965
1113 -3965 -1903 3656 3468 -2389 -3588 1283 4615 154 -3546 -1113 3020 2070 -2455 -2876 1543 3324
1129 3324 -764 -3680 -922 3356 1798 -2815 -3135 875 3408 -519 -4400 -1453 3340 2440 -2893
1144 -2893 -3544 600 3248 67 -3464 -1325 2957 2108 -2417 -2533 1966 3336 -566 -3068 -270 3611
1160 3611 2527 -2556 -2816 2774 4524 -97 -3869 -264 4457 3035 -2197 -2726 2075 4258 510
1175 510 -3199 -449 3462 2270 -1667 -1711 2157 3058 -304 -2833 436 3822 1375 -2958 -1981 2369
1191 2369 2931 -1023 -3654 -344 3618 2168 -3044 -3036 1443 3699 203 -2949 -1112 2755 2021 -2077
1207 -2077 -2575 1312 2663 -788 -2533 322 3056 865 -2835 -1364 2414 3377 -1018 -3825 -3
1222 -3 4147 2178 -2994 -3015 1680 4082 35 -4094 -1377 3124 2162 -2184 -2413 1097 2258 -1282 -3036
1239 -3036 188 2749 -141 -3549 -1945 2560 2066 -2725 -4335 -122 3070 691 -3850 -3739 1728
1254 1728 3335 -1118 -4187 -1010 2644 772 -2750 -2162 912 1944 -1668 -2354 341 2486 -195
1269 -195 -3095 -1279 2665 2215 -1649 -2605 551 3887 1114 -3271 -2163 2830 3524 -1084 -3326 272
1285 272 3540 1144 -2533 -1286 2269 2203 -1076 -2174 733 2634 272 -2479 -1138 2342 2405 -1646
1301 -1646 -3084 776 3669 299 -3445 -1670 2957 2778 -1911 -3473 542 4178 707 -3336 -1340
1316 -1340 2492 2268 -1212 -2564 331 2567 1039 -1995 -938 2396 1711 -1110 -1559 1696 3099 -5
1332 -5 -2724 221 3899 2109 -2136 -1785 2093 3840 356 -2927 -1073 2665 3141 -681 -2782 432
1348 432 2929 1145 -1851 -1027 1634 1446 -1596 -1756 1168 2482 -1165 -3312 25 2988 1039 -3323
1364 -3323 -2965 1259 3322 -540 -3985 -2505 2340 2276 -1722 -3368 -593 2000 751 -1994 -1330 921
1380 921 607 -1664 -1267 1325 1607 -1827 -2506 596 3050 418 -3072 -2649 1803 3571 -541 -3798
1396 -3798 -1155 2956 2415 -1468 -2774 250 2731 625 -1961 -461 1871 421 -1783 -909 1306
1411 1306 1652 -1467 -2619 34 2899 726 -2798 -2428 1206 2592 -442 -3305 -1378 2432 2035 -1719
1427 -1719 -2416 494 1995 -303 -1814 -214 1368 430 -1534 -1000 1520 1828 -1088 -2170 455 2495
1443 2495 771 -1979 -2017 1888 2785 -90 -2779 -296 2849 1379 -1799 -1400 1506 2344 -607 -1853
1459 -1853 21 2033 798 -1687 -1398 1620 2021 -463 -1915 -267 1935 937 -1611 -1511 1156 1980
1475 1980 -908 -1991 526 1877 255 -2245 -1347 1306 1477 -874 -2012 -71 2113 704 -1894
1490 -1894 -1409 1218 2207 -229 -2168 -259 2455 1155 -1641 -1337 1528 1962 -604 -1944 375 2345
1506 2345 684 -2151 -1178 1997 2114 -761 -2044 -14 2464 1285 -1651 -2078 979 2243 -189 -2188
1522 -2188 97 1560 419 -1414 -667 1088 960 -1364 -1725 640 1878 -383 -2336 -903 1412 1641
1538 1641 -1041 -2444 -130 1940 991 -1905 -1512 1457 1523 -877 -2036 217 1481 569 -1815 -1017
1554 -1017 1640 1329 -1080 -1602 447 1994 357 -1653 -1034 1536 1847 -913 -2025 341 2391 1208
1570 1208 -1787 -1205 1269 1779 -811 -1834 484 1821 272 -1864 -470 1643 878 -1370 -1949 637
1586 637 1930 6 -2277 -1243 1574 1350 -1347 -2146 376 1811 188 -1871 -994 1708 1160 -1264
1602 -1264 -1476 628 1536 -97 -1724 -536 1815 1459 -1198 -1499 623 1928 276 -1580 -560 1962
1618 1962 1361 -1110 -1734 682 1862 20 -1711 -211 1504 1134 -1163 -1442 718 1496 148 -1804
1634 -1804 -469 1644 897 -1323 -1633 665 2118 -168 -1940 -593 1572 1066 -1123 -1701 738 1571
1650 1571 -386 -1911 -420 1705 937 -1197 -1584 925 1877 19 -1603 -303 1576 1237 -1111 -1165
1666 -1165 862 2013 -92 -1360 175 1840 886 -1079 -869 954 1858 241 -1570 148 2157 887
1682 887 -1402 -933 986 1459 -290 -1766 -45 1772 700 -1503 -1346 1174 1477 -736 -1799 -583
1698 -583 1360 430 -1353 -1569 729 1741 -678 -1678 60 1413 892 -1528 -1382 838 1458 -371
1714 -371 -1704 -30 1693 653 -1324 -888 868 1192 -559 -1537 -29 1537 628 -1146 -845 1347
1730 1347 1494 -275 -1238 316 1597 693 -1301 -1087 1274 1355 -985 -1420 418 1720 580 -1357 -860
1747 -860 836 1376 -582 -1556 85 1049 65 -1284 -882 692 1261 -597 -1712 10 1415 11 -1590
1764 -1590 -1163 1028 988 -837 -1353 80 1226 420 -1402 -587 1213 1216 -579 -1197 146 1400 550 -1338
1782 -1338 -752 1536 1165 -872 -1489 714 1662 151 -1378 -575 1147 1175 -523 -1268 555 1277 378
1799 378 -1256 -430 806 960 -703 -1358 90 1409 -27 -1370 -357 1107 627 -1181 -1228 566 1298
1816 1298 -437 -1408 -289 1236 944 -817 -1198 163 1239 374 -1208 -727 1068 1200 -711 -1181 644
1833 644 1461 1 -1352 -281 1169 727 -713 -794 748 1345 222 -1431 -321 1145 793 -598 -886
1850 -886 785 1718 99 -1339 -497 1131 928 -777 -1122 100 1214 -43 -1300 -178 1156 760
1866 760 -801 -1112 737 912 -335 -1298 -729 1367 740 -1333 -1303 445 1285 -188 -1290 -432 1302
1883 1302 503 -856 -849 565 1075 -291 -1175 -183 975 310 -1297 -612 477 961 -240 -1227 112 1323
1901 1323 510 -1133 -881 733 1173 -119 -1326 -279 1343 552 -1200 -1225 474 906 -412 -1099 -294
1918 -294 1010 83 -796 -821 540 685 -559 -1101 137 1216 288 -1321 -778 574 1237 -636 -1436 443
1936 443 1340 225 -963 -767 539 862 -486 -999 47 1106 663 -1185 -235 843 627 -459 -1324
1953 -1324 376 1238 134 -1045 -484 1120 1354 -392 -990 395 1352 201 -791 -576 984 894 -339
1970 -339 -1159 30 999 359 -824 -516 564 334 -646 -1030 356 775 -409 -1101 -498 844 934 -657
1988 -657 -1139 35 1404 127 -1076 -880 943 808 -484 -1084 244 1061 284 -758 -505 934 735
2005 735 -465 -848 559 1260 -108 -719 -36 917 638 -883 -854 426 1073 165 -1324 -481 1007 1090
2023 1090 -624 -1289 361 1120 80 -917 -310 620 225 -460 -758 233 604 -181 -844 -221 934 340
2041 340 -1075 -856 391 1068 -269 -1301 -573 892 732 -645 -1103 321 886 155 -739 -396 538 419
2059 419 -668 -163 567 804 -219 -535 68 951 404 -1024 -358 584 1054 -156 -1165 -389 1129 596
2077 596 -889 -832 235 856 -23 -802 -257 529 395 -425 -563 6 706 -300 -1150 -264 982 26 -599
2096 -599 -885 501 823 -361 -994 -275 876 304 -748 -697 565 617 -288 -549 90 752 491 -472 -537
2115 -537 489 1209 -243 -860 -200 958 193 -532 -598 726 867 -77 -787 33 618 438 -835 -588 716
2134 716 430 -238 -1186 63 954 225 -681 -424 471 875 -364 -895 26 885 160 -906 -833 834 377
2153 377 -660 -814 -282 517 362 -663 -437 820 508 -218 -947 206 1192 443 -810 -336 694 757
2171 757 -591 -753 -77 1005 210 -590 -187 461 772 -64 -884 114 899 313 -734 -371 899 883 -721
2190 -721 -972 49 1120 178 -707 -664 641 571 -738 -515 62 575 60 -609 -473 289 493 -558 -860
2209 -860 414 902 42 -1223 -706 1035 859 -618 -1136 207 1279 35 -972 -365 529 395 -326
2226 -326 -583 192 621 336 -570 -437 804 597 -405 -934 366 1069 198 -957 -365 705 352 -800
2244 -800 -838 75 669 95 -867 -118 492 700 -289 -767 328 708 -155 -714 -402 753 354 -822 -860 391
2264 391 940 -200 -1156 -190 766 318 -682 -742 209 827 -113 -848 -189 830 629 -694 -682 359 1192
2283 1192 84 -798 -381 688 678 -427 -635 486 1045 -337 -700 21 734 491 -591 -444 625 842
2301 842 -432 -595 -252 829 189 -732 -632 468 647 -551 -1173 -61 793 265 -998 -578 639 802
2319 802 -102 -930 -177 669 307 -788 -704 454 637 -174 -818 232 762 222 -834 -311 434 932 -287
2338 -287 -1073 66 775 483 -732 -429 677 581 -52 -861 222 1050 350 -504 -621 651 822 -224
2356 -224 -634 147 811 140 -984 -650 827 276 -280 -900 -89 885 68 -873 -490 416 810 -368 -897
2375 -897 -148 593 277 -921 -640 386 586 -506 -718 157 340 175 -652 -104 458 591 -441 -834 130
2394 130 695 82 -834 -274 502 499 -469 -745 244 873 338 -701 -374 735 757 -38 -695 428 802 41
2414 41 -933 -370 711 610 -452 -742 148 664 234 -636 -588 730 821 -405 -627 119 965 -41 -678
2433 -678 -129 708 293 -576 -496 348 400 -69 -721 83 853 409 -212 -483 283 1143 287 -840 24 888
2453 888 420 -354 -721 659 837 -29 -942 -267 846 164 -643 -208 609 691 -73 -783 -154 969 411
2472 411 -516 -893 202 683 -250 -396 -326 365 545 -569 -327 194 621 -411 -770 -155 453 170 -396
2491 -396 -499 370 710 -137 -400 -120 714 242 -623 -560 548 695 151 -535 71 598 399 -436 -535 375
2511 375 701 -298 -617 -100 691 348 -620 -468 519 823 -255 -570 -16 715 141 -524 -733 478 687
2530 687 -128 -724 -144 763 57 -738 -665 247 841 -145 -647 -196 758 21 -690 -401 553 442 -315 -883
2550 -883 -137 740 -60 -693 -365 862 959 -449 -594 -15 769 351 -680 -414 423 678 -74 -631 122
2569 122 731 258 -360 -295 624 645 -118 -411 117 973 196 -627 -167 578 363 -245 -924 75 618 -139 -1003
2590 -1003 -356 611 410 -382 -923 -184 901 355 -706 -393 382 381 -425 -672 241 1033 -193 -706 -142
2609 -142 507 271 -647 -656 393 538 105 -908 -227 472 398 -332 -857 267 702 36 -576 -6 503 292
2629 292 -630 -785 189 533 98 -518 -183 679 407 -789 -288 -175 482 -121 -732 -79 904 267 -355 -407
2649 -407 164 924 -36 -485 -65 341 387 -453 -553 28 351 -155 -571 -229 784 200 -318 -484 472 906
2669 906 -80 -735 -116 795 347 -741 -456 186 692 116 -706 -171 969 642 -554 -415 500 824 20
2688 20 -433 -54 770 100 -350 -454 482 683 -363 -755 104 469 79 -738 -320 336 548 -141 -747 -122
2708 -122 456 503 -648 -488 420 529 111 -904 219 428 295 -185 -418 431 352 -419 -652 271 812 408
2728 408 -317 -347 408 582 -66 -282 157 417 319 -485 -578 450 853 -306 -641 -317 430 449 -462 -367 316
2749 316 697 -317 -589 -10 453 164 -617 -627 323 796 -147 -684 -203 508 41 -711 -287 301 262 -459
2769 -459 -594 150 418 131 -593 -421 561 577 -770 -730 222 749 18 -568 -274 724 566 -134 -622 91
2789 91 865 53 -507 -178 406 382 75 -410 42 661 233 -493 -280 728 470 -295 -403 169 548 97
2809 97 -413 -320 944 327 -400 -806 -129 694 176 -794 -453 631 354 56 -541 167 642 -47 -494 -488 395
2830 395 178 -203 -667 -93 448 -120 -487 -81 887 255 -367 -429 183 984 -89 -669 -16 312 456 0
2850 0 -359 71 530 225 -661 -111 463 348 -396 -588 39 539 50 -881 -306 617 208 -454 -715 44 399
2871 399 -83 -516 51 656 425 -420 -812 127 312 61 -674 -111 635 342 -479 -842 293 865 -252
2890 -252 -868 -16 779 424 -121 -392 329 819 240 -590 -10 707 445 -444 -187 558 443 22 -363 -98
2910 -98 613 403 -709 -266 450 611 -288 -644 -99 428 176 -467 -619 302 222 -242 -734 -192 451 208
2930 208 -874 -602 348 553 -533 -799 -254 811 -12 -621 -384 255 487 -64 -613 -102 750 56 -522
2949 -522 -327 218 422 -463 -579 219 542 323 -557 -478 449 417 -423 -711 -41 714 313 -850 -412 169
2969 169 557 -168 -540 29 439 349 -496 -524 521 129 -214 -374 -45 353 97 -775 -459 667 169 -458
2989 -458 -494 -23 491 384 -682 -387 413 321 -265 -473 -22 746 62 -706 -608 735 635 -562 -309 210
3009 210 928 273 -457 -305 534 500 -319 -343 -68 593 254 -637 -228 664 580 -79 -482 162 1025 -162 -647
3030 -647 -254 437 651 -360 -492 81 664 59 -517 -564 402 241 -574 -784 201 322 18 -321 -240 449
3050 449 589 -230 -520 24 573 -23 -422 -6 694 489 -417 -637 466 588 -374 -322 -182 675 618 -538
3070 -538 -582 61 875 75 -558 29 298 448 -318 -406 194 676 31 -650 65 630 216 -329 -391 226 346
3091 346 -108 -625 -57 558 255 -291 -541 266 467 -109 -640 -123 662 193 -445 -723 228 715 -340 -398
3111 -398 -376 394 359 -312 -539 208 480 170 -403 -104 362 -106 -650 -1025 325 617 194 -720 -229 300
3131 300 478 -416 -432 495 148 169 -397 -317 290 567 -558 -620 380 402 -499 -524 -289 416 305 -167 -705
3152 -705 194 378 -326 -626 -160 251 461 -380 -518 284 390 -94 -414 23 528 156 -563 -235 403 427
3172 427 -241 -381 136 781 567 -435 -181 403 508 74 -402 284 523 632 -667 -553 218 622 -397
3191 -397 -633 -237 457 190 -469 -345 383 488 -345 -221 348 386 -87 -525 -302 350 501 -326 -623 -230
3211 -230 198 123 -652 -473 194 260 -261 -565 -63 600 227 -255 -387 120 282 -143 -961 -134 858 42 -586
3232 -586 -347 501 433 -625 -814 -76 606 191 -271 -486 353 602 -193 -624 -23 779 60 -523 -240 96
3252 96 553 -297 -443 251 370 1 -423 -98 26 211 -414 -207 77 420 -23 -637 -462 33 277 -341
3272 -341 -298 261 643 -45 -553 -233 457 653 -152 -350 41 734 -33 -438 -114 534 347 -272 -306 37 691
3293 691 -124 -714 -208 515 579 -69 -473 511 524 166 -423 -317 570 558 -30 -519 184 444 335 -535 -190
3314 -190 476 388 -219 -661 299 658 6 -729 -184 323 305 -492 -392 289 277 -217 -365 -101 223 304 -93
3335 -93 -113 292 140 -196 -511 -90 579 340 -197 -404 18 568 90 -541 4 477 626 -726 -539 218
3355 218 457 298 -448 -145 361 279 -456 -159 435 552 -290 -546 -227 562 268 -289 -433 396 376 -96 -292
3376 -292 -320 453 307 -553 -384 226 213 -234 -506 -128 104 320 -588 -445 267 763 -29 -680 -460 502 348
3397 348 -480 -320 456 563 -325 -637 55 467 142 -464 -404 566 465 -34 -715 30 875 307 -347 -251 86
3418 86 584 -386 -277 123 544 368 -632 -295 120 488 -35 -435 -26 607 64 -819 -545 280 470 -366
3438 -366 -591 101 309 -91 -396 -136 513 375 -86 -668 232 510 222 -353 -154 297 586 -52 -577 -45
3458 -45 506 380 -219 -152 605 723 -317 -496 120 217 -93 -266 -311 404 434 -376 -502 237 597 151 -659
3479 -659 -451 -74 348 -254 -453 -59 283 136 -159 -215 249 101 -325 -600 -144 317 286 -567 -311 301 243
3500 243 -191 -435 -123 520 38 -363 -267 560 136 -509 -315 277 327 -200 -545 -366 330 374 -164 -438 -175
3521 -175 556 -39 -367 -134 292 509 -594 -743 153 701 123 -474 -419 503 243 -185 -413 191 234 -104
3541 -104 -434 -232 25 78 -240 -706 168 107 -55 -670 -317 365 219 -331 -574 -82 521 -119 -507 -109 404
3562 404 138 -506 -430 159 388 -333 53 -74 407 493 -11 -237 284 633 1 -633 -384 759 478 -379
3582 -379 -244 244 539 137 -396 -39 557 402 -458 -195 297 275 134 -485 -16 523 438 -323 -294 -48 513
3603 513 75 -552 84 399 165 -351 -520 169 438 -204 -474 -415 466 206 -580 -362 235 537 47 -435
3623 -435 -111 473 273 -443 -202 421 555 -329 -543 -127 446 28 -369 -362 452 244 -177 -611 57 583 10
3644 10 -90 -279 15 348 -274 -683 -227 205 49 -338 -309 8 394 -574 -295 -119 357 72 -646 -320 281
3665 281 133 65 -522 -331 630 20 -362 -366 109 491 -79 -292 111 378 117 -411 -429 636 530 54 -477
3686 -477 -168 605 214 -259 -523 361 524 -242 -362 -105 380 261 -224 -377 229 323 26 -977 296 556
3706 556 97 -450 -57 239 119 -477 -541 25 552 -160 -400 -184 304 518 -204 -432 -162 450 117 -607
3726 -607 -104 256 453 -301 -416 148 591 -81 -356 -255 346 411 -170 -192 256 712 105 -281 -315 303 358
3747 358 26 -347 183 467 192 -377 -338 415 376 -300 -486 134 455 -167 -320 -300 440 226 -561 -629 -86
3768 -86 498 188 -689 -302 191 222 -479 9 -10 209 70 -624 -208 362 454 -264 -298 251 406 -87 -601 -253
3790 -253 174 542 -397 -292 289 790 -142 -435 109 534 405 -417 -467 451 484 149 -337 -240 224 149 -351
3811 -351 -398 164 464 -44 -464 -204 542 135 -351 -494 -117 240 -115 -523 -51 606 136 -325 -569 242
3831 242 278 -163 -585 -206 307 101 -223 -248 163 647 -53 -484 -161 352 221 -293 -448 202 156 -71 -475
3852 -475 -43 418 336 -313 -222 112 188 46 -411 171 322 145 -519 -443 294 588 128 -298 150 379 -45
3873 -45 -253 -543 311 546 -166 -148 -112 424 82 -384 -498 108 320 -299 -312 172 77 291 -283 -468 237 419
3895 419 -246 -658 98 196 -71 -41 -280 366 426 -21 -211 -136 525 147 -165 -465 255 698 -183 -536 -328
3916 -328 578 48 -453 -449 229 561 -177 -468 98 496 -83 -669 -279 385 341 -112 -487 -273 413 -60 -309
3937 -309 -444 403 229 -208 -541 156 622 -18 -617 -326 576 250 -275 -539 -74 665 129 -504 -290 389
3957 389 330 -450 -396 19 584 -86 -500 -408 312 313 -286 -446 238 339 -153 -363 -312 335 739 -213 -285 -43
3979 -43 291 166 -617 -381 548 537 -416 -224 153 370 37 -602 -107 456 304 -78 -277 252 578 83 -411
4000 -411 -106 426 326 -165 -266 81 437 -172 -220 130 347 264 -294 -639 219 529 -215 -595 -234 470 280
4021 280 -539 -535 285 600 363 -298 -27 413 492 -306 -445 272 286 186 -321 -74 598 52 -164 -195 256 537
4043 537 21 -370 -497 430 106 -189 -201 175 336 -432 -638 42 218 262 -445 -441 22 205 -352 -440 -91 514
4065 514 360 -206 -352 245 495 -161 -575 -73 408 145 -137 -232 292 471 -112 -640 -123 292 384 -302 162
4086 162 256 544 -148 -213 -194 454 -3 -443 -500 324 274 -236 -247 -17 500 127 -337 -233 -65 115 -212 -655
4108 -655 -13 388 50 -315 -409 46 319 -321 -437 -225 425 -92 -399 -217 199 639 203 -784 55 663
4128 663 190 -340 -240 223 567 -133 -674 110 632 115 -354 -11 134 337 -39 -347 -3 326 117 -406
4148 -406 -411 286 131 -146 -270 9 270 368 -350 -380 370 522 -108 -425 36 371 334 -177 -283 433 236 41
4170 41 -610 336 297 76 -147 -293 547 12 -95 -270 152 368 366 -437 -362 32 492 138 52 136 451 144
4192 144 -71 60 431 228 -77 -503 129 515 -153 -278 -44 501 575 108 -385 279 244 101 -383 -434 198
4213 198 411 -122 -454 -207 536 0 -486 9 350 280 -314 -420 -314 342 -47 -269 -42 199 310 20
4233 20 -394 213 423 34 -257 -156 265 318 -154 31 51 561 254 -701 -428 330 303 -554 -358 315 321 250
4255 250 -435 -244 53 104 -298 -181 215 375 16 -437 -91 220 -53 -204 -209 -97 249 -31 -525 -425 456
4276 456 54 -249 -516 265 343 65 -190 -321 370 192 -154 -598 71 298 66 -261 95 474 82 -189
4296 -189 -63 154 358 100 -441 254 354 390 -555 -248 212 72 -157 -221 263 84 159 -329 -195 289 203
4317 203 -54 -614 -65 251 340 -343 -445 188 403 -215 -393 -271 197 -8 -320 -183 82 246 -111 -163 310
4338 310 305 369 -167 -310 37 94 143 -461 -6 621 112 -63 -404 153 261 -238 -522 -164 283 356 7 -107
4360 -107 206 130 -121 -400 258 411 74 -422 -283 314 285 -571 -425 109 127 -92 -326 -191 109 93 -95
4381 -95 -435 303 233 120 -297 -122 144 264 -200 -566 224 319 83 -417 -388 -31 421 1 -384 -210 416
4402 416 110 -367 11 138 405 -150 -684 -283 55 264 -218 -56 222 93 -157 -356 176 475 -153 -205
4422 -205 -191 66 433 -277 -357 -196 445 321 -290 -282 9 172 -253 -129 80 495 -27 -525 -235 158 468
4443 468 -50 -323 151 344 10 -458 -334 38 414 -187 -208 44 469 139 -218 -198 343 356 -225 -443 123
4464 123 331 -170 -290 -207 522 451 15 -230 202 556 381 -322 -48 282 232 -96 -262 31 234 -28 -409
4485 -409 82 489 175 -135 -202 -196 245 -203 -590 -108 282 167 -340 -249 -89 291 -167 -487 -256 368 261
4506 261 -274 -210 35 246 81 -119 6 247 325 -196 -159 138 488 166 -199 -237 -10 262 -11 -254 -20
4527 -20 216 251 -229 -107 188 217 -6 -117 24 232 74 -312 -184 386 141 -289 -278 183 347 87 -452
4548 -452 -90 392 13 -319 -365 -106 442 -12 -274 -125 168 171 -338 -488 354 -84 -64 -465 -242 350 -304
4569 -304 -208 -311 163 152 97 -462 -171 288 -265 -166 -303 88 256 27 -429 52 134 -152 -386 -383 105 353
4591 353 -1 -69 -316 185 154 -215 -325 219 390 83 -356 -91 253 62 -56 -226 243 299 -238 -399 -161
4612 -161 334 67 -273 -169 23 374 -116 -311 179 274 154 -305 -179 34 318 -134 -156 112 -19 116 -95
4633 -95 -372 -90 491 -45 -247 -73 229 197 -286 -80 403 136 -237 -309 186 6 91 -476 -181 71 54 -62
4655 -62 -261 417 357 248 -368 -283 -1 216 172 -252 333 399 56 -439 -164 128 104 -158 -390 -72 273 -93
4677 -93 -265 8 213 -34 -186 -320 -282 225 70 -490 -84 274 156 -28 -193 127 297 57 -124 -126 336
4698 336 352 37 -362 -27 150 25 -598 -143 121 236 93 7 225 429 159 -330 -195 127 -109 -85 -146
4719 -146 244 183 -16 -140 -206 -2 53 -346 -177 44 312 16 -465 -175 144 256 -137 -180 -54 264 107
4740 107 -329 -110 327 -65 -129 -110 -43 164 158 -294 -96 468 -250 106 -43 213 447 78 -144 67 352 342
4762 342 -289 -79 231 256 138 -347 -244 242 189 -66 -487 -45 523 -28 -562 -270 206 -109 26 -161 255
4783 255 315 37 -588 -243 316 120 -371 -168 133 316 -130 -497 -199 466 226 -125 -129 214 521 -110 -163
4804 -163 87 182 180 -92 -6 207 120 -21 -300 -149 240 -107 -31 -168 187 429 146 -332 34 147 65 -271
4826 -271 -52 382 331 -134 -374 115 294 29 -290 -139 178 162 -8 -191 -358 227 225 -167 -308 -15 170
4847 170 183 -411 206 486 156 52 -114 529 315 -102 -579 172 438 61 -143 -172 190 153 -70 -116 219
4868 219 351 152 -54 -234 120 273 -8 -296 -54 88 34 -154 -54 417 239 -172 -78 270 176 189 -39
4889 -39 -22 286 125 -122 -141 -239 252 120 -424 -117 147 299 -50 -219 -356 408 90 -173 34 185 295
4910 295 -238 -206 308 233 -162 -175 -7 446 453 131 -417 -45 425 -43 -460 20 144 178 39 -197 261 -192
4932 -192 182 -217 -59 301 393 34 -331 -48 146 -113 -361 -279 105 151 -64 -100 -261 240 205 -499 -357 147
4954 147 126 -90 -92 90 339 198 -92 -223 -81 53 -41 -259 124 248 121 -60 198 243 122 -202 -140 37
4976 37 187 -51 -171 2 225 154 -397 -413 50 260 168 -37 -136 536 282 -273 -217 -22 173 -359 -283 82
4998 82 129 197 38 -83 -111 80 74 -325 -131 9 204 -157 -245 17 253 -11 -453 -103 348 231 -145 -356
5020 -356 108 495 -60 -200 85 529 244 -169 -283 268 424 -145 -239 235 583 -70 -221 30 94 296 -289
5041 -289 -422 -163 374 110 -88 52 66 103 -184 -466 306 292 -148 -332 -18 175 264 26 -251 -8 250
5062 250 -222 -454 -187 164 252 205 -61 -87 211 -49 -299 -219 262 125 -256 -224 -11 514 -141 -429 -73 246
5084 246 433 -99 -203 75 301 129 -533 -65 168 31 77 -339 53 318 -310 -111 22 207 121 30 -354
5105 -354 -211 444 343 -311 -393 153 361 -266 -179 299 141 -39 -515 -149 -99 140 -289 -54 309 236 97
5126 97 -329 63 200 209 -149 -278 -138 283 -192 -163 -146 71 391 3 -207 164 222 201 -294 -355 203 61 -231
5149 -231 -441 16 210 169 -467 -181 434 335 -209 -393 28 362 352 -260 -100 223 0 -238 -52 116 352
5170 352 -21 -297 58 228 299 -28 -243 170 190 -31 -738 -516 42 51 -277 -279 134 314 113 -466 36 437
5192 437 -16 -200 -413 -196 326 -223 -394 -228 185 226 -104 -211 -96 321 -146 -362 212 583 25 -129
5212 -129 -267 230 323 -163 -166 -64 219 -46 88 -141 278 196 52 -349 13 124 0 -234 -144 54 403 -122
5234 -122 -507 146 252 196 -209 -148 369 130 -122 -102 -84 516 447 -357 -254 -69 314 41 -48 115 255 -46
5256 -46 -120 5 87 221 66 -299 49 485 71 -21 -184 252 16 -36 -182 -19 331 308 -380 -157 83 411
5278 411 -204 -80 124 100 204 -294 -265 267 75 -4 -31 -16 445 -5 -331 -284 221 235 -88 -264 171 25
5300 25 -33 -101 -162 200 -25 -187 -182 212 275 116 -306 -23 174 209 -110 -259 276 76 165 -314 -140 218 155
5323 155 -97 -184 121 158 0 -414 -52 236 193 -124 -212 -182 286 -116 -70 -361 258 323 -283 -232 303 188 -64
5346 -64 -273 129 312 53 -237 -376 46 464 102 -136 -264 233 14 -7 -20 98 -11 -97 -100 -365 340 422
5368 422 -230 33 296 275 81 -189 -17 220 363 -197 -260 246 344 89 -142 -70 453 127 -65 -341 -126
5389 -126 259 -290 -232 -137 24 237 -310 -182 74 441 -224 24 -49 181 170 -364 -202 2 383 69 -331
5410 -331 -115 424 98 -112 -95 33 507 -167 -425 113 86 145 -410 -256 149 85 -90 -255 -77 502 50
5431 50 -261 -24 46 235 -299 -155 137 558 -188 -51 44 -12 146 -61 -445 34 284 -198 -191 -411 63 214
5453 214 224 -287 -42 142 12 -434 -182 -98 172 -259 -395 113 337 333 -111 -103 107 198 -215 -214 -54 204 339
5476 339 -640 -172 149 163 -53 -141 82 627 -174 -294 -5 52 -138 -155 -393 184 417 55 -26 -132 248 52
5498 52 -252 -107 -15 237 108 -151 -40 69 299 -429 -91 -297 317 -35 -348 -137 250 75 -114 -220 177
5519 177 157 42 -370 -120 110 412 195 -112 70 349 -71 -158 -155 21 217 -302 -197 6 35 -85 -4 -179
5541 -179 319 469 -91 107 205 323 -259 -100 -259 157 -34 -220 14 21 113 448 -237 -461 60 217 -171
5562 -171 -194 -152 504 -46 -120 -113 352 509 -150 -87 157 280 -88 -564 -172 175 163 -125 -236 247 443 -72
5584 -72 -381 -35 273 166 -66 -258 326 217 113 -61 -345 375 94 -71 -2 350 276 15 -190 -197 134 112
5606 112 -190 -476 196 213 208 -313 -32 156 74 -103 -210 -127 357 95 -442 114 97 161 102 -147 -41 301 -120
5629 -120 -221 -141 190 147 -127 -367 209 372 -59 -367 -3 469 -63 -189 -227 115 175 220 -349 108 300 411
5651 411 -28 -17 89 472 65 -408 -103 234 256 -307 -436 99 -63 3 -154 99 122 149 -352 -387 295 189
5673 189 207 -360 -70 360 125 -172 -174 203 0 -31 -304 34 155 96 -39 -179 -43 166 13 -432 21 445
5695 445 113 -299 -237 -7 -68 -41 -273 -19 174 118 -290 -28 49 144 -69 -441 -127 247 32 54 25 111 174
5718 174 -9 -105 71 322 245 -209 -248 276 242 -239 -352 52 361 7 -151 -258 141 283 -3 -151 -186 64
5740 64 46 -215 -292 199 25 -78 -184 -90 176 119 22 -246 409 217 102 -168 145 136 19 -203 -242 421 190
5763 190 -265 -247 -59 331 9 -435 12 18 176 33 -325 32 239 184 -598 -93 -7 -100 -58 -60 -6 172 -96
5786 -96 -219 -208 471 63 -353 -268 -43 298 62 -255 -76 461 -48 -128 -209 -128 502 73 -444 -130 310 299
5808 299 67 -101 -70 266 122 -350 -65 295 61 -319 -425 126 584 342 -61 -140 309 241 -177 -147 56
5829 56 257 59 -492 -146 189 222 -151 40 81 282 -36 -292 -273 14 -27 -59 -326 -33 344 -29 -154 -256
5851 -256 212 273 -165 -148 -46 333 316 -145 -384 11 88 -383 -166 -194 127 -6 -134 34 269 495 1 -227
5873 -227 197 344 -106 85 -45 218 264 55 -120 20 391 -159 -445 4 45 263 -276 -113 241 287 344
5894 344 2 -12 504 257 -317 -349 110 167 -174 -207 -251 339 438 -293 62 -50 57 258 101 -34 151 355
5916 355 -74 -218 235 97 -188 34 58 435 384 -253 -362 303 128 68 -176 -42 192 173 -95 31 155
5937 155 354 65 28 262 252 300 -306 -37 78 21 -93 -424 -48 271 202 -186 -297 71 7 275 -279 -88
5959 -88 281 -10 24 -48 41 -68 -27 -528 -116 267 -49 -88 -276 229 363 125 -78 -67 103 226 -200 -98
5981 -98 302 111 -63 -247 -2 204 306 244 1 196 427 -27 -366 147 141 190 -480 -101 251 127 234 -160
6003 -160 -222 348 41 -151 -110 -74 126 -202 -432 61 137 -263 -288 -316 442 38 13 -325 -277 211 8 -302 -156
6026 -156 143 330 -73 -485 -28 155 290 -78 -117 149 234 13 -85 -67 310 183 -73 -3 113 208 149 -238
6048 -238 172 161 185 5 -216 142 218 8 -251 347 346 65 -218 -43 -42 153 72 -36 -227 -262 103 -295 -68
6071 -68 -100 330 -364 -649 -91 85 -31 -143 -152 453 76 -125 -228 -59 466 -230 -145 20 361 207 -288 -134
6093 -134 -216 320 -198 -334 -32 419 257 -238 -40 -14 61 43 -340 77 312 373 -354 -448 88 261 -239 -205
6115 -205 -65 475 233 -155 -396 226 246 -365 -9 -211 331 183 73 -133 281 -109 -30 -613 49 162 104
6136 104 -35 52 308 231 130 -175 -343 283 155 -206 -286 218 94 151 -297 -121 263 40 -159 28 230
6157 230 207 -7 -256 31 239 10 167 -345 266 392 -75 -207 -290 189 -29 -148 -113 250 67 9 -172
6178 -172 -94 380 164 -147 -446 99 106 -28 -379 52 277 -51 -321 -174 129 -143 40 -174 48 428 96
6199 96 159 -117 111 367 -247 -340 196 358 247 -75 -217 176 272 -22 -237 14 391 43 -43 -247 106 545
6221 545 -161 -216 -25 142 -84 -45 -171 110 343 -20 -284 -203 131 106 -399 -375 -189 215 -309 -255 -116 68
6243 68 223 -148 -276 162 221 -82 45 -299 330 120 -292 -389 319 594 -95 -62 -145 678 72 -352 -301 19
6265 19 169 111 -170 -183 399 -170 -139 -130 311 382 -313 -198 -112 190 175 -328 -421 186 288 -104 172 99 54 127
6289 127 -222 -194 80 368 15 -336 176 231 -58 -370 -135 58 -135 -240 -210 100 303 304 -246 91 118 -155
6311 -155 -37 -328 293 300 230 18 -75 120 307 -15 -246 176 25 51 -61 -31 85 442 -30 -499 -99 335
6333 335 -95 -191 132 -102 173 -132 -163 100 78 12 -189 -9 284 165 -411 -309 19 337 209 -51 -136 132
6355 132 144 -148 49 252 27 152 -57 67 399 -35 -105 -294 329 356 86 19 -285 417 144 -258 -170 153
6377 153 517 -96 -472 -209 -13 130 -261 -188 13 348 25 -316 -1 293 294 12 291 -67 131 -106 -195
6398 -195 -178 260 102 -80 -205 105 -117 -39 -171 -167 323 83 -53 -196 -25 512 73 -332 126 251 187 -27
6420 -27 -560 -62 385 -227 -307 -58 579 361 -205 80 81 371 38 173 -36 235 -13 -177 -108 360 220 -29
6442 -29 -65 61 171 246 -112 -10 115 98 -129 -177 -60 -71 -133 -250 -118 69 421 -38 -265 164 78 186 -152
6465 -152 -389 229 232 13 -250 -81 236 -51 -186 65 39 180 -50 -152 188 186 18 -260 -407 180 543 -242
6487 -242 -133 -127 211 130 88 -196 64 293 -21 -313 139 376 34 -398 -60 292 218 -128 -251 64 262 -43
6509 -43 -268 -246 266 359 -129 -243 -195 223 259 57 -202 117 106 -81 -116 -185 95 -12 -80 11 277 112 -36
6532 -36 42 66 195 22 -216 90 142 75 -86 -70 133 -92 158 -53 -307 161 63 -78 -255 180 85 382 -439
6555 -439 -474 -71 260 -241 -294 375 268 108 55 -83 32 -256 -283 69 -73 199 -311 -213 -2 353 28 -135
6577 -135 -238 -224 161 -67 -266 -66 121 69 301 -416 -67 148 -42 -63 13 464 309 -372 -295 127 485 -35
6599 -35 -111 -31 241 159 -144 -306 -182 62 94 -88 -41 184 201 132 -128 55 315 35 8 95 330 -78 -133 -248
6623 -248 210 262 -147 -244 -87 205 282 -434 -414 -145 185 169 -254 -11 109 232 187 -176 301 175 -150 -164
6645 -164 -268 122 317 48 -75 243 303 -126 -256 65 89 -23 -148 107 171 87 20 -366 -207 409 455 -139
6667 -139 -193 55 175 -5 -204 -150 65 130 -268 -99 -10 208 2 -130 119 166 351 -226 -274 112 415 129
6689 129 -383 -204 200 150 -269 -127 437 118 19 -85 -95 163 32 -226 -21 368 232 -25 -373 -82 124
6710 124 -65 -126 -327 186 62 24 -57 14 202 -20 -104 -244 -5 431 -313 -183 167 277 282 -337 -191 -120 -7
6733 -7 17 9 -220 330 -21 -302 -356 21 291 -148 -63 92 180 98 -406 -16 233 308 -72 115 -238 55 231
6756 231 25 -45 -86 210 -145 -101 -25 160 -255 -277 -152 247 370 -61 -371 83 115 216 -313 -97 184 30
6778 30 -250 -120 123 8 -64 -198 -203 352 346 48 -244 -40 579 60 -290 -145 14 80 21 -135 -37 136 -26
6801 -26 -198 -164 210 154 -135 -361 188 -29 -36 -61 213 211 -107 -87 -202 305 -41 -68 -195 88 -19 317 -201
6824 -201 -45 275 275 -6 -194 240 170 212 -282 -119 108 266 -233 -402 -102 210 -59 85 -297 53 -14 269
6846 269 -581 -315 -68 234 -131 -161 -82 78 -115 -245 183 160 153 -68 -27 76 64 126 98 240 373 461 -38
6869 -38 -255 139 63 68 -417 -191 327 107 -251 36 -200 143 -95 64 323 140 73 -37 -1 161 56 131
6891 131 -23 59 250 319 -55 -103 -309 285 50 -463 56 -138 -46 -172 -184 -11 185 -119 -158 -119 154 148 -51
6914 -51 -15 244 304 319 -155 -174 307 213 -134 -232 26 -132 134 -203 -205 377 138 -227 -297 536 456 -158 -120 2
6938 2 392 30 -354 -67 234 311 64 -245 17 -7 116 -394 -242 44 186 -101 -118 262 401 -141 5 -199
6960 -199 173 139 -255 -317 55 196 -198 -47 -204 -5 424 -238 -54 -88 380 268 -145 -154 -129 268 -317 -378
6982 -378 -156 304 47 0 -344 159 364 -196 -68 1 219 197 17 -114 24 -48 346 -65 -96 -113 83 -262
7004 -262 -268 321 -141 111 -94 -62 291 107 -351 -229 208 -302 -85 -285 65 279 -147 -294 -248 -89 188
7025 188 -240 -286 63 -67 -93 -40 18 -17 188 -259 -38 22 -23 3 -246 -87 -29 329 11 -135 44 375 136
7048 136 -363 -41 186 -35 116 -130 -205 207 187 -166 70 223 -97 -60 -266 82 42 32 -233 -69 339 43
7070 43 0 50 -13 51 170 -248 -188 275 -128 -178 -229 0 -262 -92 28 105 81 99 42 -177 -116 194 -4 -17 -29
7095 -29 140 -119 -254 -197 226 540 43 96 -74 40 135 6 -188 -70 271 132 -162 -100 50 164 88 38
7117 38 -141 -57 10 -175 -8 110 129 2 -185 4 277 94 -177 -8 159 -125 -272 -289 -93 289 74 -297
7139 -297 -264 196 337 -144 -423 -308 -45 -176 -125 137 88 -7 3 106 78 66 266 -148 -71 92 237 -22 -138
7162 -138 81 79 221 -109 49 112 85 191 -15 41 205 36 -257 -206 59 224 -434 -61 107 380 148 -128
7184 -128 -129 229 183 -41 -296 -89 334 65 -67 34 132 -205 13 -225 0 136 6 -331 224 137 214 -103
7206 -103 -174 144 427 52 -143 -40 -119 189 -477 -171 143 387 -48 1 -231 198 133 -155 -177 -83 282 -11
7228 -11 -283 149 96 -156 6 -163 -63 -114 92 -265 -111 463 150 -280 -285 -192 -83 -74 -182 -133 253 57 37
7251 37 124 35 41 44 -196 -130 -284 -80 -80 43 117 250 -123 -369 -23 42 -158 -351 -306 48 57 -156 124 143 111 -216
7277 -216 -143 -49 184 48 -268 -231 158 149 203 -105 -163 84 285 -75 -125 -77 30 312 -242 -187 171 198 79 -274
7301 -274 -237 -19 -23 -258 -153 367 285 -334 -169 2 232 -108 -306 -114 242 174 -13 -190 -46 398 456 -172
7323 -172 -390 119 127 72 34 -85 314 106 -70 -339 214 -13 227 -49 -47 244 153 -33 157 322 449 101
7345 101 -255 -153 169 155 2 168 135 116 -137 -239 350 187 50 -134 -26 188 -50 -64 -214 208 195 112
7367 112 -318 -96 478 -176 15 -24 -24 257 222 -207 -185 154 -72 -162 -144 -30 270 -66 84 -73 185 124 32
7390 32 -183 -114 -77 -107 -38 -74 233 8 -159 -206 87 102 -126 -188 21 274 197 -50 -114 -31 14 275 -50 -40 297
7415 297 105 -61 54 387 41 -14 185 234 1 132 29 -51 17 223 158 -374 37 43 284 -78 -234 -89
7437 -89 -1 19 20 -190 70 256 -106 -164 88 -241 -101 26 -194 -27 98 -137 19 94 171 76 -439 27 457
7460 457 60 -310 156 25 -29 -62 44 -11 4 57 -182 -75 -179 109 89 196 127 64 28 -111 -26 -25 242 177
7484 177 10 -1 270 230 -32 -427 -126 317 -59 78 73 168 219 210 -103 -104 35 -155 -136 162 94 28 -95 -3 198
7509 198 103 -181 18 -102 -50 -9 -178 -105 337 -197 246 101 -76 156 241 2 38 152 428 -131 -159 35
7531 35 -73 234 -179 -177 -141 167 -162 -38 -139 44 28 -25 -65 -129 126 155 -89 -289 156 267 1 14 -191
7554 -191 170 8 99 -36 359 1 -71 355 145 36 -205 17 -20 356 -1 5 -77 191 -2 100 -77 250
7576 250 402 99 -72 -176 -303 60 38 22 -57 -134 -129 -88 -73 12 93 -341 131 52 241 -287 -17 -126 -191 287
7600 287 133 27 -147 407 74 -243 310 100 -112 -168 12 -6 130 237 -120 -35 233 122 -74 -43 -59 267
7622 267 -112 -238 -44 78 205 -5 -60 -110 95 -26 -58 200 222 196 -238 -193 -99 405 395 -423 -293 -69 24
7645 24 -298 -68 254 -170 189 -138 -22 145 -81 -182 -47 41 -85 118 -186 -213 433 61 -114 30 -59
7666 -59 241 -131 94 103 -148 226 218 -42 178 256 30 -156 279 360 -80 127 52 -270 174 74 -236 -37 225
7689 225 -202 60 -225 31 -2 246 -19 -131 8 160 -285 0 158 -87 -163 44 -155 144 -200 -169 110
7710 110 100 133 -128 96 -165 202 1 28 -281 187 220 -95 184 -103 250 -138 -70 285 258 28 82 25 -105
7733 -105 14 128 -138 -217 80 144 279 -59 -245 87 -97 52 245 88 46 -243 -269 259 8 87 73 -218
7755 -218 113 229 -307 -17 -77 190 -171 -274 -60 11 94 -143 94 17 150 -61 -326 75 147 -54 117 -199
7777 -199 50 271 -49 -79 -41 205 237 -1 -166 -283 167 -82 -71 54 -19 -69 -118 -174 214 210 -154 -223 -38 -33
7801 -33 372 -27 -201 -309 200 59 -107 -93 -350 120 66 -160 71 -18 -47 -345 -15 219 -20 -21 -164 7
7823 7 377 138 -122 72 130 155 167 -136 -215 147 40 -82 70 78 -6 -207 -185 319 -264 83 -30 -148 211
7846 211 153 -98 -96 15 44 -135 -113 -219 53 110 337 44 -220 60 141 93 -179 -357 -33 -226 16 120 120
7869 120 -2 -260 -64 79 154 -232 -63 10 242 138 28 158 -131 -148 -34 -365 -214 -53 406 168 105
7890 105 443 165 -52 -403 50 -163 30 -144 -190 -34 47 119 -34 16 -3 26 -238 -237 7 -2 6 -5 84 305 -116
7915 -116 -169 19 370 116 -420 -161 -67 31 100 4 -607 95 -106 -101 23 124 302 -95 -46 -38 -50 113 16 -56
7939 -56 151 219 -143 -90 -20 -85 105 -42 40 -74 -138 11 -123 82 87 35 31 -50 59 288 38 112 154 145 -9 26
7965 26 -262 341 71 108 148 -88 128 286 -441 -212 -93 -61 99 -209 263 104 72 -129 -227 283 -128 79
7987 79 -100 -72 384 133 -62 -166 148 156 0 -330 -193 124 124 -229 -74 -285 106 257 -59 -15 111 -25
8009 -25 -160 87 227 66 283 -51 -32 261 63 -307 -51 -1 -40 43 -240 53 187 82 -160 -109 315 -1
8031 -1 45 -131 -49 -114 117 -75 99 130 231 -228 -37 246 303 148 -112 -52 196 293 -33 175 -74 -97 301
8054 301 -391 43 403 -104 -189 -300 -21 34 -8 -171 -70 90 68 -11 -66 120 305 112 -154 -21 118 -2
8076 -2 -29 183 158 277 110 -102 -170 88 209 107 -100 -222 194 -156 13 -118 109 -68 -51 117 -186 213
8098 213 -18 -197 258 -16 132 117 -53 93 -332 -1 -13 -280 260 254 -12 -51 -32 405 272 64 -252 -1
8120 -1 -134 -35 325 35 121 9 106 212 51 274 -369 -33 -85 160 198 15 209 174 -26 -286 -340 153 12
8143 12 -97 -18 57 178 -26 98 -245 121 209 -69 -231 -457 73 119 61 -264 52 293 237 -199 -249 120 37
8166 37 10 -108 -22 277 225 -241 -35 51 219 -243 -12 101 20 -89 15 60 218 301 -234 44 -4 108 19
8189 19 -77 -294
8191b94
##END NTUPLES=NMR FID
##END=
