##TITLE=1H_Pr 5-6
 CDCl3, 8 sc, 
 3.7.2019
##JCAMPDX= 6.0         $$ Bruker NMR JCAMP-DX V2.0
##DATA TYPE= NMR FID
##DATA CLASS= NTUPLES
##ORIGIN= UXNMR, Bruker Analytische Messtechnik GmbH
##OWNER= root
$$ XWIN-NMR		Version 3.5
$$ Wed Jul  3 14:53:05 2019 Russian Standard Time (UT+4h)  she@DPX200
##.OBSERVE FREQUENCY= 200.13155
##.OBSERVE NUCLEUS= ^1H
##.DELAY= (6, 6)
##.ACQUISITION MODE= SIMULTANEOUS
##.ACQUISITION SCHEME= undefined
##.AVERAGES= 8
##.DIGITISER RES= 18
##SPECTROMETER/DATA SYSTEM= spect
##.PULSE SEQUENCE= zg30
##.SOLVENT NAME= THF
##.SHIFT REFERENCE= (INTERNAL, THF, 0, 15.7039)
##AUDIT TRAIL= $$ (NUMBER, WHEN, WHO, WHERE, WHAT)
$$ ##TITLE= Audit trail, XWIN-NMR		Version 3.5
$$ ##JCAMPDX= 5.01
$$ ##ORIGIN= Bruker BioSpin GmbH
$$ ##OWNER= she
$$ F:/spectra/data/she/nmr/H-F/1/audita.txt
$$ ##AUDIT TRAIL=  $$ (NUMBER, WHEN, WHO, WHERE, WHAT)
(   1,<2019-07-03 14:52:06.26 +0400>,<she>,<DPX200>,
      <created by zg, POWCHK disabled, PULCHK disabled
       configuration hash MD5:
       00 E9 B6 7A A2 85 ED C7 34 08 36 98 17 FE 4E 26
       data hash MD5: 16K
       11 9D BB 23 CC C9 A4 21 BE F1 FC B6 72 D5 94 73>)
$$ ##END=
$$ 
$$ hash MD5
$$ 6F 0E 06 3B 37 1B 18 90 80 21 E6 CD 5A 38 58 9B
##$RELAX= 
##$RELAX= 
##$RELAX= 
##$RELAX= 
##$RELAX= 
##$RELAX= 
$$ Bruker specific parameters
$$ --------------------------
##$DU= <F:/spectra>
##$EXPNO= 1
##$NAME= <H-F>
##$PROCNO= 1
##$TYPE= <nmr>
##$USER= <she>
##$AMP= (0..31)
100 100 100 100 100 100 100 100 100 100 100 100 100 100 100 100 100 100 
100 100 100 100 100 100 100 100 100 100 100 100 100 100 
##$AQSEQ= 0
##$AQ_mod= 1
##$AUNM= <au_zg>
##$AUTOPOS= <>
##$BF1= 200.13
##$BF2= 200.13
##$BF3= 200.13
##$BF4= 200.13
##$BF5= 200.13
##$BF6= 200.13
##$BF7= 200.13
##$BF8= 200.13
##$BYTORDA= 1
##$CFDGTYP= 0
##$CFRGTYP= 5
##$CHEMSTR= <none>
##$CNST= (0..31)
1 1 145 1 1 1 1 1 1 1 1 1 1 1 1 1 1 1 1 1 1 1 1 1 1 1 1 1 1 1 1 1 
##$CPDPRG= <>
##$CPDPRG1= <>
##$CPDPRG2= <>
##$CPDPRG3= <>
##$CPDPRG4= <mlev>
##$CPDPRG5= <mlev>
##$CPDPRG6= <mlev>
##$CPDPRG7= <mlev>
##$CPDPRG8= <mlev>
##$CPDPRGB= <>
##$CPDPRGT= <>
##$D= (0..31)
0 1.2 0 0 0 0 0 0 0 0 0 0.03 0 0 0 0 0 0 0 0 0 0 0 0 0 0 0 0 0 0 0 0 
##$DATE= 1562151125
##$DBL= (0..7)
120 120 120 120 120 120 120 120 
##$DBP= (0..7)
150 150 150 150 150 150 150 150 
##$DBP07= 0
##$DBPNAM0= <>
##$DBPNAM1= <>
##$DBPNAM2= <>
##$DBPNAM3= <>
##$DBPNAM4= <>
##$DBPNAM5= <>
##$DBPNAM6= <>
##$DBPNAM7= <>
##$DBPOAL= (0..7)
0.5 0.5 0.5 0.5 0.5 0.5 0.5 0.5 
##$DBPOFFS= (0..7)
0 0 0 0 0 0 0 0 
##$DE= 6
##$DECBNUC= <off>
##$DECIM= 24
##$DECNUC= <off>
##$DECSTAT= 4
##$DIGMOD= 1
##$DIGTYP= 9
##$DL= (0..7)
0 120 120 120 120 120 120 120 
##$DP= (0..7)
150 150 150 150 150 150 150 150 
##$DP07= 0
##$DPNAME0= <>
##$DPNAME1= <>
##$DPNAME2= <>
##$DPNAME3= <>
##$DPNAME4= <>
##$DPNAME5= <>
##$DPNAME6= <>
##$DPNAME7= <>
##$DPOAL= (0..7)
0.5 0.5 0.5 0.5 0.5 0.5 0.5 0.5 
##$DPOFFS= (0..7)
0 0 0 0 0 0 0 0 
##$DQDMODE= 0
##$DR= 18
##$DS= 0
##$DSLIST= <SSSSSSSSSSSSSSS>
##$DSPFIRM= 0
$$ [...]
##$SUBNAM2= <"">
##$SUBNAM3= <"">
##$SUBNAM4= <"">
##$SUBNAM5= <"">
##$SUBNAM6= <"">
##$SUBNAM7= <"">
##$SUBNAM8= <"">
##$SUBNAM9= <"">
##$SW= 24.9336996594482
##$SWIBOX= (0..15)
0 0 2 0 0 0 0 0 0 0 0 0 0 0 0 0 
##$SW_h= 4990.01996007984
##$TD= 16384
##$TD0= 1
##$TE= 0
##$TE2= 300
##$TE3= 300
##$TEG= 300
##$TL= (0..7)
0 120 120 120 120 120 120 120 
##$TP= (0..7)
150 150 150 150 150 150 150 150 
##$TP07= 0
##$TPNAME0= <>
##$TPNAME1= <>
##$TPNAME2= <>
##$TPNAME3= <>
##$TPNAME4= <>
##$TPNAME5= <>
##$TPNAME6= <>
##$TPNAME7= <>
##$TPOAL= (0..7)
0.5 0.5 0.5 0.5 0.5 0.5 0.5 0.5 
##$TPOFFS= (0..7)
0 0 0 0 0 0 0 0 
##$TUNHIN= 0
##$TUNHOUT= 0
##$TUNXOUT= 0
##$USERA1= <user>
##$USERA2= <user>
##$USERA3= <user>
##$USERA4= <user>
##$USERA5= <user>
##$V9= 5
##$VALIST= <valist>
##$VCLIST= <CCCCCCCCCCCCCCC>
##$VD= 0
##$VDLIST= <DDDDDDDDDDDDDDD>
##$VPLIST= <PPPPPPPPPPPPPPP>
##$VTLIST= <TTTTTTTTTTTTTTT>
##$WBST= 1024
##$WBSW= 4
##$XGAIN= (0..3)
0 0 0 0 
##$XL= 0
##$YL= 0
##$YMAX_a= 132003
##$YMIN_a= -216861
##$ZGOPTNS= <>
##$ZL1= 120
##$ZL2= 120
##$ZL3= 120
##$ZL4= 120
##$ABSF1= 10
##$ABSF2= 0
##$ABSG= 5
##$ABSL= 3
##$ALPHA= 0
##$AQORDER= 0
##$ASSFAC= 0
##$ASSFACI= 0
##$ASSFACX= 0
##$ASSWID= 0
##$AUNMP= <proc_1d>
##$AZFE= 0.1
##$AZFW= 0.1
##$BCFW= 1
##$BC_mod= 2
##$BYTORDP= 1
##$COROFFS= 0
##$CY= 11.3945322036743
##$DATMOD= 1
##$DC= 2
##$DFILT= <>
##$DTYPP= 0
##$F1P= 18.9103706918063
##$F2P= -1.10871071338519
##$FCOR= 0.5
##$FTSIZE= 0
##$FT_mod= 4
##$GAMMA= 1
##$GB= 0.15
##$INTBC= 1
##$INTSCL= 1
##$ISEN= 128
##$LB= 0.24
##$LEV0= 0
##$LPBIN= 0
##$MAXI= 10000
##$MC2= 0
##$MEAN= 0
##$ME_mod= 0
##$MI= 1.114404
##$NCOEF= 0
##$NC_proc= 0
##$NLEV= 6
##$NOISF1= 3.799351
##$NOISF2= 2.8
##$NSP= 1
##$NTH_PI= 0
##$NZP= 0
##$OFFSET= 15.70392
##$PC= 1
##$PHC0= -8503.542
##$PHC1= 16.60097
##$PH_mod= 1
##$PKNL= yes
##$PPARMOD= 0
##$PSCAL= 0
##$PSIGN= 0
##$REVERSE= no
##$SF= 200.130013532006
##$SI= 16384
##$SIGF1= 3
##$SIGF2= 2
##$SINO= 400
##$SIOLD= 16384
##$SREGLST= <1H.CDCl3>
##$SSB= 0
##$STSI= 0
##$STSR= 0
##$SW_p= 3612.71676300578
##$SYMM= 0
##$S_DEV= 0
##$TDeff= 0
##$TDoff= 0
##$TI= <>
##$TILT= no
##$TM1= 0
##$TM2= 0
##$TOPLEV= 0
##$USERP1= <user>
##$USERP2= <user>
##$USERP3= <user>
##$USERP4= <user>
##$USERP5= <user>
##$WDW= 1
##$XDIM= 8192
##$YMAX_p= 0
##$YMIN_p= 0
$$ End of Bruker specific parameters
$$ ---------------------------------
##NTUPLES= NMR FID
##VAR_NAME=  TIME,          FID/REAL,        FID/IMAG
##SYMBOL=    X,             R,               I
##VAR_TYPE=  INDEPENDENT,   DEPENDENT,       DEPENDENT
##VAR_FORM=  AFFN,          ASDF,            ASDF
##VAR_DIM=   8192,          8192,            8192
##UNITS=     SECONDS,       ARBITRARY UNITS, ARBITRARY UNITS
##FACTOR=    0.0002004,     1,               1
##FIRST=     0,             0,               0
##LAST=      1.6414764,     0,               0
##MIN=       0,             -216861,         0
##MAX=       1.6414764,     132003,          0
$$ Real data points
##PAGE= N=1
##DATA TABLE= (X++(R..R)), XYDATA
$$ [...]
1994G69q99J5n6p45K28R05j685j39K521N44k000J17M93m72l9J8l98O00O79l74
2014H2N33Q77j888j112J735L34j429K1J055L49M47J11j148m67P78n4m59K28o90
2033f97K96K259K74k771k44J309k45q60Q09k72m03Q13O81k10l81j320j019K067
2051H6J479k226p95J878J62j78L76j077j140O47R05j49j72q5j92J098R17j693
2069a59r64J137n42k4J684l4j937L78K005l15j064j175l65J619J603j571q87J514
2087I03J45j029Q08j15j895O8J765K88p8m92q61M95P76m78j332L64j30P6J711
2106I89L06k241K2J466k46j375R9M8K63J066j27j44O66j160q98P90J227j491o94
2125a434K016K34l94J82k11q04M07J1l75L23J09m32J195Q74j875o98J320m03j058
$$ plain form
1994 769 -130 -115 -171 -916 -688 217 -1468 -1607 914 1458 -542 -425 68 -404 -443 -425 -823 -223 456 82
2014 82 615 1492 -396 -1508 227 561 -868 -847 208 557 1004 1115 -33 -500 278 224 -235 -7 -697
2033 -697 -401 1858 2132 -639 -883 426 181 -679 130 -142 -545 268 949 739 358 -962 -1981 86
2051 86 1565 -661 -1456 422 584 406 782 -295 -1435 -788 117 -32 -204 -289 -481 617 1534 -159
2069 -159 -1123 14 -528 -552 1132 1098 -839 -461 1544 1229 165 -1010 -1375 244 1847 276 -611 903
2087 903 1048 19 827 712 -1183 -1115 650 938 860 368 -493 2 778 300 -1032 -668 -798 -722 989
2106 989 1295 -946 -924 542 296 -1079 -980 -932 -669 397 270 126 792 -368 -1266 -476 751 -740 -1434
2125 -1434 582 816 422 604 393 -411 -4 7 -368 -45 64 -368 827 1701 -174 -872 448 45 -1013
2144a013J302M96r69J85P76p2l80n49r18R48Q67j068l75J759J61j585K60N20o91
2163c46m51L34M3K43R84o79k71M24m93o85J029m29j284J173J783j038o33O18k02
2182A20o60N35j81l91N22J31J7J169k32j733L25J095q43q77J072M27n74J014O0
2201I96j004j55J51m70K74L73o54J59J547q26o19N81j08j875Q02J371o57m76O86
2220I6k03O13j58j264j29J060l27o29J439J59j231K77J290r61q71K13N52m8O42
2239E20m96j67R47P3j052M22R0j448J110J088m38p41R08K00p09Km38j44P65k03
2259B89l43R88N63j686j77J104n93j105J118K08n69K85Q44m39q5m27j013P30O94
2278C86j102j36J329j84p70O83K69j194J19P24l31j03O29j21L78J35o36q34J197
$$ plain form
2144 -1013 289 785 -184 1 777 705 325 -224 -1142 -194 673 -395 -770 989 1150 -435 -175 345 -346
2163 -346 -797 -463 -420 -177 807 128 -143 281 -212 -897 132 -297 -1581 -408 1375 337 -296 322 120
2182 120 -540 -5 -186 -577 -55 76 93 1262 1030 -703 -378 717 -126 -1003 69 496 -78 936 996
2201 996 -8 -163 -12 -482 -208 165 -489 -330 1217 391 -228 353 245 -1630 -828 543 -114 -590 96
2220 96 -107 506 348 -916 -1045 15 -312 -941 498 657 -574 -297 993 32 -839 -626 -74 -122 520
2239 520 24 -143 804 877 -175 247 337 -1111 -1 1087 649 -92 816 1016 307 309 -129 -273 492 289
2259 289 -54 934 1497 -189 -366 738 145 -960 158 366 -203 82 926 487 402 -25 -1038 -308 386
2278 386 -716 -852 477 293 -477 206 475 -719 -600 124 -207 -310 319 198 576 711 75 -759 438
2297D38l51j022J028J229r68L8O45n97o48J89L3l1L75m9m7O56L40j474L55O26
2317G65j316n59J390K10o10P56j58o92L49mp67J83J21k18O89J076j374o43R90
2336A88m70o51J41M72o70Q53M83p30N29J24r45J63K43o40k37J397J85j230O18
2355a77J087j114j54n8j15J72N72k09L43O76q42n31O01J55j234N17J248m40n82
2374h5R99l70n41M96o36j52N88k68l39J063K11j208N86M62j042o57R16K77n77
2393b77N92K88m97L67k26j014O42K47o13J02J230k15o71N96o8j108K27P20m23
2412a01R3L28k73P53M10j136m56R59n58q90J115N47l77l9Q75r86l06M96o84K64
2432C4J53k51J93J046m37j090P52K92j212k84J100l78k70J074j31j55n63j45k90
$$ plain form
2297 438 87 -935 93 1322 354 392 1037 440 -208 -19 14 -17 358 309 262 918 1258 -216 139 765
2317 765 -551 -1110 280 490 -120 636 478 -214 135 131 -636 -453 -332 -550 139 1215 -159 -802 188
2336 188 -282 -933 -792 -320 -990 -137 346 -384 145 269 -676 -513 -270 -910 -1147 250 435 -795 -177
2355 -177 910 -204 -358 -416 -531 -359 213 4 347 1023 181 -350 251 406 -828 -311 937 497 -85
2374 -85 914 544 3 499 -137 -289 299 31 -308 755 966 -242 344 806 -236 -893 23 300 -277
2393 -277 315 603 106 473 247 -767 -125 122 -491 -389 841 626 -45 551 483 -625 -398 322 -101
2412 -101 -8 320 47 800 1210 74 -382 577 19 -871 244 791 414 375 1250 264 -42 454 -230 34
2432 34 187 -64 129 1175 738 -352 400 692 -520 -804 296 -82 -352 722 591 436 -127 -272 -562
2451e62P04j59j077Q84J237q19n16Q03l31j099O58J74m16K67O03j72M11j75o48
2470b33j58P11q35n8J179k84r12J137M03r29l83O2m46N96L26m08K89Q73o51n45
2490b66Q74p50j001P53P87p33L2M81l7Q0N5o25l80L89J1j06R22J0j079R29M17
2511G63j057q03P95j48J41O80j81m08O23j36n09N53m5j203O41J453n02n26N87
2530G18l63l54L99l93n00N81L96j91N02r4p88K29P25j025o39N67M27m16P01K73
2550G55n36l62J82r8O0m2r04O13J237l25j112M72J96p71N49J68n25m9Q62r5J06
2571C81K25j000q3Q21l11q06R73N66p69L98O17q54p79P00P3n48N06k44N79P67
2591A212l89j203L85O95j091q8O96n0m50J116K2o95n17J1OM53J19p48M63N63m43
$$ plain form
2451 -562 142 -17 -1094 -210 1027 208 -308 495 164 -935 -277 -103 -519 -252 351 179 590 415 -233
2470 -233 -391 320 -515 -573 606 322 -590 547 950 21 -362 -300 -746 -150 176 -232 57 930 279 -266
2490 -266 608 -142 -1143 -390 397 -336 -304 177 140 220 275 -350 -730 -341 -330 -436 486 496 -583 346 763
2511 763 -294 -1097 -302 -450 -309 371 190 -218 405 269 -240 313 268 -935 -294 1159 657 131 718
2530 718 355 1 400 7 -493 88 484 293 795 701 -87 142 867 -158 -797 -230 197 -219 482 755
2550 755 219 -143 39 -59 1 -41 -945 -332 905 580 -532 -60 136 -635 -86 82 -443 -492 370 275 381
2571 381 606 -394 -477 344 33 -773 200 766 -3 395 1012 158 -621 79 152 -396 110 -134 445 1212
2591 1212 823 -380 5 700 -391 -479 217 167 -283 833 855 160 -357 -346 -340 113 232 -516 -53 510 67
2612F7k03R01q32j360J004O64o69QL61J00J81j4p48j22O34m02j24P71k7p87R27
2633C30O03j126m73K41K47j65P31k51k55N38k27l78M74l52r96J024R50r52j63
2652b00J142k67o06j12jl67N18J00m10P05l2p82M24J84p76m58Q89K69p18Q77n7
2673C22n02J78J10l61%j6n59N86J247j311k06J031j03r45J20L89n43L52O82k91
2693A80M8R7o44PJ007p12q11R01L54k12L03L71j065j72Q97n71m12k1M57L16O61
2714I79m45q63M88J03o14j78J139r63k99J428j69q45K88p28K1Q79m32n07M31Q49
2734E62n47l0O24j120m10Q01J08l55R7L96OK43J78r57J30L66o75M26Q81n18o58
2755d52J128L70q71n03K33j39L61L44o30N67M31o82n8K12m03o59N41R35q84L43
$$ plain form
2612 67 -136 765 -67 -1427 -423 241 -428 -420 -59 41 222 208 -540 -662 -28 -430 -554 217 190 -597 330
2633 330 933 -193 -666 -425 -178 -343 388 137 -118 420 193 -185 289 -63 -1059 -35 915 -37 -200
2652 -200 942 675 69 -43 -44 -411 107 207 -203 502 470 -312 112 296 -480 -938 -49 220 -498 379 322
2673 322 -180 -2 108 -253 -253 -269 -828 -242 1005 -306 -512 519 416 -529 -409 -20 -563 -211 471 180
2693 180 228 325 -319 -312 695 -17 -828 73 427 215 518 889 -176 -348 549 -22 -434 -455 2 318 979
2714 979 534 -329 159 262 -352 -530 609 -354 -653 775 606 -239 49 -679 -658 221 -211 -718 -287 562
2734 562 15 -15 609 -511 -921 -120 -12 -367 -270 126 132 375 553 -404 -274 92 -583 -157 724 206 -452
2755 -452 676 1046 175 -328 -95 -234 127 471 -159 408 839 157 99 311 -92 -751 -210 725 -159 184
2775A84M09p69J63K18l20m37J95lJ62O14j24o92P27J99j102j12Q36l44k24M84
2795F4J72l0K62k89q41N37J13o53M59R43q44J62P90p98l84L84q4m07M05N83n06
2816C8O23K4p62J88J45n03k94J089k09p08O10O67o85j1k08l97K70M82o19j9Q55
2837E76m38l27P56k75j025M39L43n61N97M70n64k94N28l21k66L66m49j59Q00L19
2857E15n49J9Q44r99l57Q46n2r25N92L85j9M32o65n23O27L58j217K9J144m66n
2878A4O06l11p22O43m4p39K00J9q4M30Q00q02k56L76n34n82Q75J44n86M31M95
2899C73k73k41J02l99J06J14k86P1R16k42o52P90L77r71j99N65m67K81M69l34
2919A00Q4L27k06k04m6j84m35O69N26n53o2O90j90m30J17j98k37l9L87l3N12n4
$$ plain form
2775 184 593 -176 -13 205 -115 -552 -357 -360 -198 416 292 -400 327 526 -576 -688 148 -196 -420 64
2795 64 236 206 468 179 -662 -125 -12 -665 -206 737 -107 55 845 47 -337 47 -37 -444 -39 544 38
2816 38 661 685 -77 111 256 -247 -541 548 339 -369 241 908 223 212 4 -393 -123 359 -260 -279 576
2837 576 138 -189 567 292 -733 -294 49 -512 85 555 -9 -303 225 -96 -362 4 -445 -604 196 515
2857 515 -34 -15 829 -170 -527 319 267 -658 -66 319 300 732 67 -456 171 529 -688 -659 485 19 14
2878 14 620 309 -413 230 186 -553 -353 -334 -418 12 812 10 -246 130 -404 -986 -111 33 -553 -122 373
2899 373 100 -141 -39 -438 -332 -218 -504 -433 483 241 -411 379 756 -215 -414 151 -316 -35 434 100
2919 100 184 511 305 101 55 -129 -564 105 631 78 16 706 516 86 203 5 -232 -271 116 83 595 541
2941E41o61M75K45j022k88R52l4n87O81K13o04M91j44o45L7L73k77J34L05j16
2961F9P3L75l52q50N05N35k68j92N85O5j55M71r01J22J06j69j88R65k03n87M00
2982D06N41o58o00N88j72k90M91kk48O78k36l71N36k73j129N55N80o53N6Q12o66
3003e5k58N16l58k32K72k94j57N81L95j048K19J034j082l95O40j09j95L06M20
3022B00k67J32k84k53M35j11n17M22N88l36KN18j76p14L38k1m02p8O64K06J29
3043D75J49p17K79K81q11l95Q40N41p12O2N70l37k86L50l64m27N55k92L34O65
3063G60m84n58N78J77j103R3N17k04m4N96k47k65L09n9n06K93Pk89O05L80p87
3084b31K80Q66p92m96O31j64j47O1M36k90M55r6n51L82J29p12mQ48l94j66Q61
$$ plain form
2941 541 -120 355 600 -422 -710 242 208 -379 302 515 -89 402 258 -387 -350 23 -254 -120 185 69
2961 69 142 517 165 -685 -180 355 87 -105 480 545 390 861 -40 82 188 19 -169 796 593 6 406
2982 406 947 289 -311 277 105 -185 306 304 56 734 498 127 663 390 -739 -184 396 -257 -201 611 -55
3003 -55 -313 203 -155 -387 -115 -409 -566 15 410 -638 -419 615 -467 -862 -222 -331 -526 -220 200
3022 200 -67 65 -219 -472 -37 -148 -665 -243 345 9 11 529 353 -361 -23 -44 -446 -524 140 346 475
3043 475 624 -93 186 467 -344 -739 101 642 -70 -8 562 225 -61 289 -75 -502 53 -239 95 760
3063 760 276 -282 296 473 -630 -537 -20 -224 -268 328 81 -184 125 66 -440 -147 -140 -429 176 556 -231
3084 -231 49 915 123 -373 258 94 -53 8 444 154 609 513 -38 344 473 -239 -243 605 211 45 906
3105I06k2p39J55J47n31j9K82k53L51K43k08k02L78n20o33O70L11m90K59O52l47
3126C90m78N4k55L7K43k80j93N96N4k63L16J54n92k46N74m76l54P26L22l49L50
3147C30M0p29L63K62q79M68L52l57Q8N38Op55J32J37j72o0P4q9M02K85l79j50
3169i3N90j171o0Q35K16o80K25L33l22Q9J07m77k17M71l78M67K66l88k35P50Q7
3190D15j003J11K54j58K87O57k60j79L62k78l15K97m86j45O57O35j004J15P17
3209F79l93m42M39j84l99L14N02l34J50n9m50M64R7j017K68O22k43l87Q76k13
3229B90o46L69M20p17j65K69l12L96Q72r24l24Q82l82q84P63J77p09L67N46j36
3249A52j26K25l16j06K71l44j47O08O4k85N97P0r34J29K98K4m75L59J64P6j15
$$ plain form
3105 906 884 145 300 447 -84 -103 179 -74 277 520 312 110 488 -32 -665 5 316 -174 85 737 390
3126 390 -88 -34 -289 -252 -9 -289 -482 114 168 -95 221 375 -217 -463 111 -365 -719 7 329 -20 330
3147 330 370 -359 4 266 -613 -145 207 -150 -62 476 482 -273 -141 -4 -176 -236 -162 -251 151 436 57 -93
3169 -93 497 -674 -734 101 317 -363 -138 195 -127 -38 69 -408 -625 -154 -532 -65 201 -187 -422 328 415
3190 415 -588 -477 -223 -381 -94 563 303 124 486 208 -107 190 -296 -441 216 851 -153 -38 679
3209 679 286 -156 283 99 -300 14 516 182 332 273 -177 287 384 -633 -365 257 14 -373 503 290
3229 290 -356 13 433 -284 -449 -180 -492 -96 776 -148 -472 410 28 -856 -93 84 -625 -258 288 152
3249 152 26 251 -65 -171 100 -244 -391 217 281 -4 593 663 -271 -142 156 180 -295 64 228 304 189
3270A89J5l95L70k17l43J40M97n93K89O51m23n36K98j32j86L56J9l30N84O1m63
3291a49K78J31o95k63Q41k26k56L93J31l22K66J33o29K44k2m40N11N69n81J61
3311G5L32or48L28K52m01L01L80k9J27J5l41j31Lk08j11P09k8o60J99P77n64q0
3334iK00j61m33L25j9q1M07j64m1J37J99r19K35L05l85OO25K8l63L70k90l16K9
3357c15K51k29M00K94m08j7M28m31n41O86k96k84L55L92p2j16K58l41J04J0m76
3378c48L5P40j12k35L95M9o14J19K95m62j90L28k4m5M88j37m63M98n30k76K86
3399b03L46o28K66O31k40j80j60J20l15K21k25J15M73k5m41M86o4p49L59J92n7
3420g8n37J023j71j95L68m66K1J13j45j35K91J1l00K30P13l35o60K93J8l80M14
$$ plain form
3270 189 204 -191 179 -38 -381 -241 256 -337 -48 603 180 -356 -58 -190 -376 -20 -1 -331 253 314 -149
3291 -149 129 260 -435 -698 143 -83 -339 54 185 -137 129 262 -367 -123 -145 -585 -74 495 -86 75
3311 75 407 401 -547 -219 33 -368 -67 313 284 411 426 85 -46 -43 -251 -362 347 319 -341 -142 635 71 -9
3334 -9 191 30 -403 -78 -97 -178 229 65 24 161 360 -559 -324 -19 -404 -398 227 255 -108 262 -28 -344 -315
3357 -315 -64 -293 107 401 -7 -24 404 -27 -568 118 -178 -462 -107 285 213 97 355 14 118 128 -348
3378 -348 -313 427 315 80 475 524 -90 29 324 -138 -328 0 -24 -69 419 282 -181 317 -213 -489 -203
3399 -203 143 -485 -219 412 172 -8 -168 -48 -363 -142 -367 -252 221 196 -245 241 177 -572 -213 -21 -78
3420 -78 -615 408 237 42 410 -56 -35 78 -67 -202 89 100 -200 30 743 408 -252 41 59 -321 93
3441I3Q9j19J15J1l78M94Q3q26K9P41l80m43O44L38p55L3M09m00k82K51nR0M54
3464B86l77O6N00m82o29L14K01l66j3P91j74j80K24k41j89Q6q6rJ99L67k74J63
3486A77K26n48j29N85k84l31M00J43J0j33J36m24K68r0j60l9N54l79l53Q70j04
3507C95m26M3j4k70K04R6N9KJ96n5j64L30n57m72M95k2k21N22M5r2J67J81n67
3530a25p0j21K2M33L7k27j17M14R8o62K53K64k15k87N54p8o0J90j60j81K61l36
3552a13l00O45Q3l54K73J99l82j92K58l01j09jJ94j94M31r3J15j87J71k90l16
3573d63L40k01m2M40L11n94J69J04j67j06J34j98J42L82m29K63M55m47n39L12
3593a34j84o0K05P55k17l30K19j10k25j16j63j92O94j57k99M32R6k58m3Q2k28
$$ plain form
3441 93 182 63 178 189 -189 305 388 -438 -409 332 -48 -491 153 491 -264 -231 178 -222 -504 -253 -258 -168 286
3464 286 -91 -25 475 -7 -636 -322 -121 -487 -500 291 117 -63 161 -80 -269 -183 -269 -278 -79 288 14 177
3486 177 403 -145 -274 311 27 -304 96 239 249 116 252 -172 96 6 -154 -193 361 -18 -371 499 395
3507 395 -31 12 -2 -272 -68 28 87 89 285 230 66 396 -161 -633 -138 -160 -381 141 186 94 261 442 -125
3530 -125 -195 -316 -294 139 176 -51 -168 246 344 -318 -65 199 -16 -303 251 173 113 303 143 -38 223 -113
3552 -113 -413 232 315 -39 234 433 51 -141 117 -184 -293 -294 -100 -294 137 44 159 -28 143 -147 -463
3573 -463 -123 -324 -366 74 385 -209 -40 64 -103 -209 -75 -273 -131 251 -178 85 540 93 -446 -134
3593 -134 -318 -378 -173 582 365 35 254 144 -81 -197 -360 -552 142 -15 -314 118 214 -44 -87 -5 -233
3614b33j18L22J37k80L17j61k30L22K4o97K13K51r1N8N62j98l92L43K3m44J34
3635a38j42J73K11J16j21m2K85o16j00N34ln11M70J42J8NK64l55j66J94m32L96
3657A82K36l10j2L49o6m02J16J14m89K18J47n4P7K17o6o4J80o17R4J26N9j55R5
3680b5O96o83k94N62m63j78J29K33j86J92J45j02J50l5n49L64K25l92j19N45l5
3701A80Nk4j22l35%L06j92K98J0k15K98J79k84k37L78j43k15K69K33j61J7L2k57
3724B0o2j10jl3K05j02o0M90l33m69M39J34m24k29J63J09JK74j24OO9O4n39R3
3748d19J32l36N98L23k00k18J64j68k28n0Q2j48O80l85J54L28l3l84l3K57n02
3769c86J68N46N0n69L27K36j43n3j53j29J65J31m4j00O09j96m85K51k57m9l2M02
$$ plain form
3614 -233 -351 -29 108 -172 145 -16 -246 76 100 -597 -384 -133 -224 -166 396 198 -194 149 172 -272 -138
3635 -138 -280 -107 104 220 99 57 342 -274 -374 160 157 -354 116 258 276 281 545 190 24 218 -214 182
3657 182 418 108 96 445 379 -23 93 207 -282 -64 83 29 106 323 257 193 373 -244 -150 -24 35 -120 -25
3680 -25 671 -12 -306 256 -207 -385 -256 -23 -209 -17 128 26 176 141 -408 -44 181 -211 -330 215 180
3701 180 185 161 39 -296 -296 10 -182 116 126 -89 209 388 104 -133 245 102 -113 156 389 228 245 277 20
3724 20 -42 -152 -153 -186 19 -83 -143 347 14 -455 -16 118 -306 -535 -372 -263 -262 12 -112 -106 -37 27 -512 -419
3748 -419 -287 -623 -25 298 98 -120 44 -124 -352 -402 -320 -468 212 -173 -19 309 276 -108 -141 116 -386
3769 -386 -218 328 378 -191 136 372 229 176 23 -106 59 190 146 46 655 459 -26 225 -32 -81 -113 289
3791B89n0m10M09l2M2j03n30n1L65j9l28M81J29l83K13J87j40m34L13l32K86P6
3813b2K29j06J47j08l24M9N40p69P0N13p2o6J24j11k36M24k20j88J15J27l94M60
3835A82L71l78n13O35j1m01J40l6o9M43J1l87o1P7j66n4N7J43k50O11r9m77QM69
3859B45n04q6J93J30r7K42m14N23k6l16j82L2L50m37N15K88m08j72K78m0l00L0
3881a56j1J1M97j81j05K45J6o10L72K29o40p7N71k40K43L0p2O8j35k95m59L93
3903c06N39p19L72N45n35j67L46l1n41L59Q2O3j6L60o65M63j49j86j76M07k07
3924a62l73O79J5k61J90R8k30k17K35j26j33M58r2J93N0k18k20M78k58m79M05
3945C2J59j85l10N45ll76L90m00J14J89r4j94K33L12p66K14j56J12j53J42k7J06
$$ plain form
3791 289 239 -171 238 206 248 145 -385 -436 -71 -90 -418 63 192 -191 22 209 69 -365 -52 -384 -98 -22
3813 -22 207 101 248 140 -184 -135 405 -364 -294 219 147 81 205 94 -142 282 62 -126 -11 116 -278 182
3835 182 553 175 -338 297 286 -115 25 -11 -80 363 374 -13 -74 3 -163 -217 -160 -17 -267 344 245 -232 -224 245
3859 245 -259 -345 -152 -22 -119 123 -291 232 206 -110 -292 -260 90 -347 168 456 48 -124 154 114 -186 -156
3881 -156 -167 -156 341 160 55 300 316 -294 78 307 -333 -410 161 -79 164 194 122 190 55 -240 -699 -306
3903 -306 233 -486 -114 431 -104 -271 75 44 -497 -138 -56 7 -9 351 -314 149 0 -186 -362 45 -162
3924 -162 -535 144 159 -102 88 186 -44 -261 -26 -152 -285 173 81 274 324 106 -114 364 106 -373 32
3945 32 191 6 -304 241 238 -138 252 -148 -34 155 61 -133 100 412 -354 -140 -296 -184 -337 -195 -222 -116
3967a16J89l3j60L57k01m39M88j20l59J75K79J88l42J02J04n43L00j08N2L26k28
3988h9R9J25K67m97j49N69k16n39O10P3m17K94K31j49k02k6j87J31L30k47n7M36
4010C90N0n11K30J19n09j28L99oj08K34K18n08K25j57q5J66M2l28J47L74j47M9
4032A56q9n0k96N0J15K19j99J59J30r0J60o06J84M78o29k8N61O8m05L85P0k29
4054A14lk7n13K62M72m72K24K15k50j49K75o7n00L97kj98L37J89j76k92J83nj56
4077a42k1j69J68M13L0l21k67L58l64L08l19L18j49L36L9j85K07k55j05o3N28
4098C45o36O4M99j22l08J99Rk39N9M5j34K43K40l23K56M24m27k68K73k37k27L22
4120E7N1k29J50J07j8j92j28j0m3J86k23M21K11k80k43L29j05k72p8L24k10R5
$$ plain form
3967 -116 73 40 -120 237 36 -403 85 -35 -394 -219 60 248 -94 8 112 -431 -131 -239 -187 139 -89
3988 -89 10 135 402 -95 -244 325 109 -430 180 253 -164 130 361 212 10 -16 -203 -72 258 11 -46 390
4010 390 440 -71 159 278 -231 -359 40 34 -74 160 378 -130 95 -62 -147 19 61 -267 -120 254 107 156
4032 156 67 17 -279 -229 -114 105 -94 65 195 105 265 -341 -157 321 -308 -336 225 293 -112 273 343 114
4054 114 111 84 -429 -167 305 -167 57 272 22 -127 148 81 -419 -22 -24 -222 115 304 128 -164 19 14 -142
4077 -142 -163 -332 -164 249 279 -42 -309 49 -315 -7 -326 -8 -157 179 218 33 240 -15 -120 -183 345
4098 345 -291 -227 272 150 -158 41 50 -189 -130 -85 -219 24 264 -59 197 621 194 -74 199 -38 -265 57
4120 57 108 -121 29 136 118 -74 -202 -212 -255 -69 -292 129 340 60 -183 146 41 -231 -309 15 -195 -100
4142a00J36O6k6L19l60k04RJ36n80M75L64k43K9L38m00k15K13l9p0J23M58k89
4164A40J4L19o84L09Q8l92l6M17j6j52N79l66l08K8P5k10K32L9k09K68K99l61
4186G3m9R2P6m83L10L7k75J14M9R7j21J95m81J95L43l87LL27p0k29L45M9m67j06
4210c63J39j12J04L79Q1m34M77Jn58K64P8m53M76K10k14Q7J84k8r0k20K15l36
4232a13L48j29j33L46P4m11K00J85o56o4N95j42k50M07o2k75L23k99j61J11K95
4253A89m39J85K91k38k72K12O8l34L46r7p0J82m3k12K31J69k68k12K56q8k73N61
4275A44L5m36M99K00n48J78r9j8l7K85l13mK66j2l74M01j19l93J89J5j9j4N83
4298D09l22p5J7j73l90M11p2J8Q2N70l13k64J81j24m14J24Q1k10L61L09k7j48
$$ plain form
4142 -100 36 102 76 395 35 -169 -160 -24 -604 -129 235 -8 21 359 -41 -256 -43 -82 -152 -29 429 140
4164 140 154 473 -211 98 186 -206 -242 175 159 7 586 220 -88 -60 15 -195 37 76 -133 135 434 73
4186 73 24 116 192 -291 19 56 -219 -105 -56 41 -80 115 -366 -171 172 -215 -212 115 45 -184 161 210 -257 -363
4210 -363 -224 -336 -232 147 228 -206 271 272 -286 -22 56 -397 79 289 75 162 346 318 228 8 223 -113
4232 -113 235 106 -27 319 393 -18 182 367 -289 -353 242 100 -150 257 195 -80 243 -56 -217 -106 189
4253 189 -250 -65 226 -12 -284 -72 -4 -338 8 -89 -159 23 -20 -232 -1 168 -100 -312 -56 -144 -417 144
4275 144 179 -257 242 442 -106 72 -27 -45 -82 203 -110 -114 152 140 -234 167 48 -345 -156 -141 -160 -174 409
4298 409 87 12 29 -144 -534 -123 -195 -177 -95 475 162 -102 79 -45 -459 -335 -254 -464 -103 206 179 31
4320C1J15l76j14N55m18KM07j49j65M21o0k08j46J64j86j21L55m7L6M64k02l69
4342a1K29l34j45K91L27m44K72Q0j38j27K31j20j10j35M4j82K32K93k17p2O2j66
4364a40r9K16O5k77L15K72l72L89m43q2J36J10l46K83L78l43J36K70m00k42K01
4385B7j01k95M48q5q1M3M64n60Q3L08l67k78L61K72m38J12N51m12J60q9m43o5
4407c85K51jL6J06k80K9J90J07l40M4J88n2j09K19j97J81L36n44K27j24j6j80
4429c14L85Q1l17J91R6k42qK27k52J68K9j8m9K05k11K0l8L53n00J28K49ql3J20
4453B62k3l74Q5O3l10L43K8j83L36r0j93r3M70m17l07L95J29l24J66R7j88J47
4475A9O3j86N3J41l86J54J50J74k2j05Ok42Q8J28j85M09j24k41J64O4r8O9n6J42
$$ plain form
4320 31 146 -230 -344 211 -207 -205 202 53 -112 309 249 41 -105 59 -127 -248 107 60 96 560 358 -11
4342 -11 218 -116 -261 30 357 -87 185 265 127 0 231 111 1 -134 -90 -272 -40 253 36 -36 26 -140
4364 -140 -239 -23 42 -235 80 352 -20 369 -74 -156 -20 90 -256 27 405 62 198 468 68 -174 27
4385 27 -74 -369 79 -6 -87 -44 420 -140 -57 251 -116 -394 -33 239 -199 -87 464 52 212 123 -320 -385
4407 -385 -134 -135 -99 7 -273 -244 -54 53 -287 -243 -55 -107 -216 3 -194 -13 323 -221 6 -118 -134 -314
4429 -314 71 152 -165 26 122 -120 -128 99 -153 15 44 26 -23 182 -29 -9 -47 306 -194 -66 183 175 142 262
4453 262 239 -135 -50 13 -297 46 74 -109 227 137 -56 -149 321 -96 -403 -8 121 -203 -37 60 -128 19
4475 19 82 -104 -51 90 -296 -142 8 182 160 55 61 -181 -93 35 -150 259 135 -106 58 122 24 93 37 179
4499A79m06K07L15n08K29K76l00O8j9q9p8J20j61N1M75j76j91l0O7l99K82k6R5
4522a9j4N6o0k7Q1Q7p8k59K79k13O4L48k53k13M59j71o22O44j93J34j03K30p3
4545H4j38K23l50K17J64m80N1M69J21l52Q5K33l47j8j54J48j69J09J81j96M14
4566B95k0n49M68m07k6o0M06j79P7J33R1k17K10l36m2n4J26O3J59M8j92k2K09
4589A81l54k36K41K63j76n6R5j06L00jj36k05K33k46pK61q2k33M74P6l48l1j29
4612b22L40j95J53j77J38J49j05j64L99l98j26L22r1K21o7J49m47N8K88m08k3
4633b06K81M7m7k2j54j13M7K03l35J05J04j32r7L15j71j73N55l28n9L36m40P4
4655b10L66L01k50r8L8N8m13K39m1k92J37K80M7k4J69l82n2L47l09j06P63n64
$$ plain form
4499 179 -227 -20 295 -213 16 292 -8 60 41 -48 -126 -6 -167 -116 359 183 -8 -38 29 -370 -88 -114 -19
4522 -19 -33 23 -37 -64 17 104 26 -233 46 -167 -103 245 -8 -221 238 67 -555 89 -104 30 -73 157 84
4545 84 -54 169 -181 36 200 -280 -229 240 361 9 94 327 -20 -38 -192 -44 -213 -104 77 -119 295
4566 295 275 -274 194 -213 -239 -299 107 -72 5 138 229 12 222 -114 -156 -210 -84 -21 138 186 -6 -28 181
4589 181 -173 -409 -168 95 -81 -137 -42 -148 152 151 15 -190 43 -203 -210 51 -31 -264 210 286 -62 -93 -222
4612 -222 118 -77 76 -101 37 186 81 -83 316 -82 -208 114 23 244 177 326 -121 -63 225 -183 -206
4633 -206 75 122 75 53 -101 -214 -167 36 -299 -194 -90 -222 -319 -4 -175 -348 207 -121 -180 156 -284 -210
4655 -210 156 457 207 109 147 205 -208 31 -10 -302 -165 115 162 138 307 -75 -127 220 -89 -195 568 4
4677DJ38k20K43r2q2K82k85J44k26MJ55K31k94j47M03q2l79J50P7j65M62l08J6
4700B9j0K77k69j07J43k06Q6J60rk29K75kl80N3J12J43l29L49J28o3R3k67N5j17
4724h5J86l74L69nj16j59K21K85n79K45k6l73K78M4J26j23L8N8j34O61o55j07
4746b25K60l5n4L23k30p0L8L36n23n1J45J70j01J10k13J96P8j99k74K46K36m29
4768b66R0K48J12j09L21j75m09O3M7k86O21k51j26M6K47R5l72J17k3Qj45L10k20
4791e7K66j05j4k34J73k80J74P7k6J60m6r6J03r4J48k61Q6K4k00P4M84n24J03
4814f5L72m07n3O6J13O6J43j11j13J62k0l04j2J72N2k57M53q5l13L18q1o7j02
4837g3J09j27p4L6O8j36L75M6j39lj11n0J67O9l68L47J57l16o5Q8J74l52L28J2
$$ plain form
4677 4 142 -78 165 73 -9 273 -12 132 -94 -90 65 296 2 -145 258 176 -203 -53 24 -141 321 13 29
4700 29 19 296 27 -80 63 -143 -57 103 94 -135 140 138 -242 -189 -77 66 -263 86 214 151 244 -23 32 -85
4724 -85 101 -273 96 91 -25 -184 37 322 -257 -12 -38 -411 -133 -89 37 -86 -48 10 -124 537 -118 -225
4746 -225 35 0 -54 269 39 -31 7 343 -180 -231 -86 84 -17 93 -120 76 154 -45 -319 -73 163 -266
4768 -266 -176 72 184 75 396 221 -188 -125 -78 -364 257 6 -120 -74 173 268 -104 13 -10 -2 -147 163 -57
4791 -57 209 104 90 -144 29 -251 -77 0 -26 134 88 -8 95 1 149 -112 -26 -2 -202 -128 356 -168 -65
4814 -65 307 -100 -153 -87 26 92 235 124 11 173 153 -151 -163 9 61 -196 257 172 -141 177 96 29 -73
4837 -73 36 -91 -165 -129 -61 -197 178 224 85 82 -29 -79 88 157 -211 136 293 -23 -88 0 174 -178 150 162
4861A62l00N18k32j86J74r4m0n08L48J51j4j60L14p7N0j2m60K97J4j76N1N51l21
4884E0K2J06j56k86L49j90j47K43L1Q1k24J89o4kP6O1k66K13Q8m33J79L21l14
4907g3L08n7l19K2J90j77J51J82m5k45n1J3j88N2K59N1k35L11J6j98Jp2m7O8J83
4932A00n48M09K51k40J01j60Q1k16J84j43M9J53J78n32O11j50l41K55O1n25K59
4953a63L88k36k09L81Pk56L0J77j85mR1o2J02j1k99J82L47m30p8J50r2lK75l7
4977F5j12p1L68l82M2K81j83k5J57j50j85R4K76l76NL89m20K29J97j23Jk19M3
5000i9J23J5j43p2J98K49l83m3N02j62j10k34J23m1J4K95j07jJ12j53P6j06k63
5023b10K82J43j43j00l9J59j76K31j50j38J5k4Pn2K3K04J33l8q9k13L6K76l97
$$ plain form
4861 162 -138 380 148 -38 136 42 2 -506 -158 -7 -21 -181 133 56 106 94 -366 -69 -55 -231 -180 371 50
4884 50 72 178 22 -264 85 -105 -252 -9 22 103 -121 68 4 2 78 139 -127 86 174 -259 -80 241 -73
4907 -73 235 178 -141 -119 71 -106 45 227 182 -63 -114 -101 -289 -237 22 73 -162 149 165 -33 -32 -104 -151 -83 100
4932 100 -448 -39 212 -28 73 -87 -6 -222 -38 -181 -132 21 199 -333 278 128 -213 42 103 -422 -163
4953 -163 225 -11 -220 161 168 -88 -58 119 -66 -70 21 -41 61 50 -249 -67 280 -150 -228 -78 -170 -173 102 65
4977 65 -47 -118 250 -132 -90 191 8 -17 140 -10 -195 -101 175 -201 -196 193 -227 2 199 76 77 -142 -99
5000 -99 24 39 -104 -176 22 271 -112 -155 347 185 75 -159 -36 -77 -63 232 125 124 236 83 159 53 -210
5023 -210 72 215 72 -28 -67 92 -84 147 -3 -141 -126 -150 -143 -195 -172 32 165 127 38 -175 -139 137 -260
5046b60L14J20j94k2J46J51m60J20R8r7P8R8k00L42j49j32j4J26j02j17K53N4
5068A53l19K64k60j08M03j02j74J37Q6l6l6J09J43m20M10j92l45jK99j93R3R8
5090Ij82K07K15m61O3J37j30j20J00L94l21K87k69M5j71p1Q6l3K20n9N3L3K00
5113B32l43p2L86l66J93O6L0k31J34J47k01J02O6k47J15K59j70o2J90r5k01J78
5135A10M0l05k9L4L09k62L66p2j13Qk14J30P9M7m09O16q8l48l5J32j18O8M6k69
5159b77M16P4j21O1q6J5k77J95j52R4j32K87j43P7K4J80k59M3Kl21L58J36k09
5182a5L9L39k65l95L78j34j64K34L2Kj42Q2r4O3M2j09J86J2l05J05M17o7m75K54
5206B0j12r3J51j14N4R0J55m3r4N7k18p0K05j55K39k1K23j52m24J90n1Q1r0k0
$$ plain form
5046 -260 54 174 -20 -42 104 255 -205 -85 13 -84 -6 92 -108 234 85 -47 -61 65 -37 -154 99 153
5068 153 -166 98 -162 -270 133 31 -143 -6 80 44 8 117 260 -160 250 58 -287 -288 11 -182 -89 9
5090 9 -173 34 249 -212 -149 -12 -142 -262 -162 232 -89 198 -71 -26 -197 -268 -182 -215 5 -54 -1 32 232
5113 232 -111 -183 203 -163 30 96 126 -105 29 176 -25 77 143 -104 11 270 100 38 228 133 -68 110
5135 110 150 -155 -184 -150 159 -103 263 191 78 86 -128 2 81 128 -281 335 247 -101 -136 -4 -122 -54 -8 -277
5159 -277 139 213 92 153 67 82 -195 0 -152 -58 -190 97 -46 31 55 235 -24 19 21 -300 58 194 -15
5182 -15 24 363 98 -297 81 -53 -217 17 49 51 -91 -9 -103 -40 2 -107 79 91 -214 -109 308 241 -234 20
5206 20 -92 -185 -34 -148 -94 -4 151 108 14 71 -147 -217 -12 -167 72 51 274 122 -302 -112 -163 -82 -172 -192
5230a92K45l1o2L1L37j97j13k1k3j89L16j37J12m7J11j26j30J94k14J83l8J45
5252A54m67L60R9k64p6L97k62L3J66l50P6K15m4j21k5L22l17O1P6r5j89J63K05
5275A17l38K12j28LM9K11m14M49Nk92J75J52k7k21Q8j30O2k4L75j71m6j20J42
5298A29k94J93n6j71K14J85j78M0K82l91Q3k2k14nK08l2J22jj21m4K28m77K6J20
5322a76L21l01J86K2R5p4j79J21k92L26l49M24nk5r1M9k19J18j30K54q4M1J11
5345A43j94J3m7J53R0j48J29r8j45Q6j7K6J88j01j22J8J00k36J00L59m09J60k07
5368a59%J51J02k53J9M2J02l08J51K21j52J16J40l01J26p9J76j57J63k32J36J09
5390A13k10j7L6R5R2J75m7j81o1J00j35J42j67j43l8M67l74p5N7K42k26K1J71
$$ plain form
5230 -192 53 22 -40 -9 328 131 18 -3 -26 -215 101 -36 76 29 140 14 -116 78 -136 47 9 154
5252 154 -313 47 146 -118 -194 203 -59 -26 140 -210 -134 81 37 -84 -109 213 -104 -43 33 -62 -251 -88 117
5275 117 -221 -9 -137 -134 -85 126 -288 161 166 -126 49 201 174 -47 41 -89 -27 -51 324 153 107 -13 129
5298 129 -165 28 -28 -199 15 200 22 62 344 -47 36 14 -200 -205 3 -29 93 92 -29 -73 155 -322 -296 -176
5322 -176 145 -156 30 52 147 73 -106 15 -277 49 -300 124 119 94 3 52 -167 -49 -179 75 -9 32 143
5345 143 -51 -38 -85 68 158 10 139 41 -104 -18 -35 -9 179 78 -44 -26 74 -162 -62 297 -112 48 -159
5368 -159 -159 -8 94 -159 -140 -98 4 -304 -153 68 -84 32 172 -129 -3 -82 94 -63 100 -132 4 113
5390 113 -97 -114 -78 17 109 284 237 56 -5 95 -40 102 -65 -208 -246 221 -153 -228 -171 71 -155 -134 37
5413C7j81J87j9K41l21K12p6j83J8Q4n4k03J92K6k2J98J79j88k47J24l8j06J03
5436c7r1L9K50j17j88K77qk33n9K44J30Oj68L69m29K98L7k43p4p7j96J26J02l2
5460g4K56k7m38J96J89k32l8K78n1m8N2J88l08kj8k9J04p4m5J57J45j00O6k7k64
5485a44k3J41L8j75J26J48no2j42J3P3j47K72k76M08p7j35J08kj81P2j81l8P9
5509a10K76l27J1L31j06j63P2K3j10K20k34L10p6P6l48L69j36k11N6K50k79K33
5531A27n0K78j87M5Kj98k22N4J14j49J48j29L4K06o8j82L7Q6R9k89M80j05O5j70
5555B6N4J45j39j90J83M3op1j63L28j62k48K42j06j23J74j16n4P0Q2m1O1J05j76
5579h2q0K00J80n03L69L3l0r4p2j83K18Q7K96m73J0J23j10J06k92K67K01k81J20
$$ plain form
5413 37 -144 43 24 265 -56 156 80 -103 -85 -1 -55 -258 -66 -40 -62 136 315 127 -120 4 -34 -140 -37
5436 -37 -128 -89 161 44 -144 133 125 -108 -167 77 207 213 45 414 -15 283 320 77 3 -74 -270 -144 -42 -74
5460 -74 182 155 -283 -87 102 -130 -168 110 59 11 63 251 -57 -59 -77 -106 -2 -76 -121 36 181 81 147 120 -144
5485 -144 -167 -26 12 -163 -37 111 106 44 -98 -85 -12 -159 113 -163 245 168 33 141 139 -42 30 -151 -189 -110
5509 -110 166 -161 -150 181 75 -88 -16 7 -103 117 -117 193 117 193 -155 214 78 -133 -77 173 -106 127
5531 127 77 355 168 213 215 17 -205 -151 -37 -186 -38 -167 -133 73 5 -177 -140 -54 45 -244 236 131 196 26
5555 26 80 225 86 -104 79 122 116 45 -118 210 48 -200 42 -64 -187 -13 -129 -183 -113 -31 -72 -11 94 -82
5579 -82 -162 38 218 -285 84 117 87 -7 -79 -262 -44 43 339 -134 -124 -1 -111 -5 -297 -30 171 -110 10
5602A0m3K63j54j23L7k1J41k60K8k51N34k66J53J13J35j08j94o3J7KJ38o4j24
5625a00K27J13k23j66K31J97m97M8N1L90j36j64J52k77O8R2o8pj4k2P0p3L52l04
5649f0J10l45L94j12J33mN8j16ML3j71J22k34K07p4Q8J8L7j60J70k9j57K40k13
5673f1J82j01L17m12K15mj93J59p3j07n1M06k89kJ75l89Q7J44J22m72N62J26l36
5696EJ1k33K49K21k51Jj25J61l8j60K21R7q1k74L45k83J48n3j15R8K4P3n5R7l5
5721D8m35N85k76J0O8N2q3J26j66rj08J60j40K04j82L03j42N5o7j16k6P9Pp2J22
5746cJ35L3l58K75q1j9j35Q4J14j67L7K41n5j80j04K48j02j87L41o6p8P1j13L7
5770c2j75P6n3P9r9K79m3n0J44j67J54k32K19j43k0N1q5k9J18j81M00o2l26K96
$$ plain form
5602 10 -33 230 76 -47 -10 -31 110 -150 -122 -373 161 -105 48 161 296 188 -6 -69 -52 -50 88 24 -100
5625 -100 127 240 17 -149 82 279 -218 -170 -119 271 135 -29 123 -154 -86 6 -62 -69 -83 -105 -35 -108 244 -60
5649 -60 50 -295 99 -13 120 116 174 58 62 95 -76 46 -188 19 -55 33 51 88 -72 98 69 -88 152 -61
5673 -61 121 20 337 -75 140 136 -57 102 29 -78 -129 277 -12 -14 161 -228 -141 3 125 -347 215 341 5
5696 5 16 -217 32 253 2 3 -122 39 1 -159 62 159 78 -196 149 -134 14 -39 -154 -56 -32 41 -14 83 48
5721 48 -387 198 -78 -68 0 52 -31 95 -71 -80 -188 -28 -168 36 -146 157 15 70 3 -113 -139 -60 -53 -125 -3
5746 -3 132 165 -193 82 1 -18 -153 -69 45 -122 -85 156 101 -79 -183 65 -37 -224 117 51 -27 44 -69 -32
5770 -32 -207 -131 -184 -105 -204 75 32 -18 126 -41 113 -119 100 -43 -63 -12 -97 -126 -8 -189 211 149 -177 119
5794A19j61q9K39r3J38j64j16L15j22j86M3J21L6j08J07J02p9k7k4J75k9k84K3
5817f4j33J08K71j88k30K66P4l71L13K3j49n8Nl2j27L58KO6j34J04Q4j68j96K49
5841G3JM6o4k59L26k10k2K20J3K9k25M35m15r8K06L8j33J78j15P6R7j54m4J1J11
5866A21k84K75K0l50JL64q6R4r7l40l5K59n0P6J40m6n9N2K45j25k64J84J6q7N7
5891H1j84J68K7l0j02j53J66k5R9P4K8k72K39l0r3j87Q2r8qK36j50L77j81n5Q
5916A7J83j93j72O0K18P5j29n4j6J15m7j50L6J38k32K36J27m48J71J13J4r2l09
5939c39M34r3j7k1J75N0k4R7m58J21o3N4J01l6J36n7q4K20k90M2j29K08k73M36
5963A90j53J01l39k02O12j17j22p1J29j08J60k4J9j07J90k77J75L1j01O3KK13
$$ plain form
5794 119 -42 -131 108 15 153 -11 -127 188 66 -120 -77 44 80 -28 79 181 102 75 51 226 197 -87 -64
5817 -64 -197 -89 182 -6 -236 30 104 -267 46 69 -80 -138 -133 -165 -292 66 68 134 0 104 188 20 -176 73
5841 73 74 120 56 -203 123 -87 -109 111 124 153 -72 363 -52 -150 56 94 -39 139 24 100 197 43 -1 10 121
5866 121 -163 112 132 -218 -217 147 61 155 58 -282 -317 -58 -108 -32 108 62 3 55 300 175 -89 95 111 24 81
5891 81 -103 65 92 62 -40 -193 -27 -52 47 121 149 -123 116 86 -7 -194 -112 -210 -218 18 -132 245 64 9 17
5916 17 200 7 -165 -105 113 188 59 5 -11 104 57 -93 -57 81 -151 85 212 -236 -65 48 62 -30 -339
5939 -339 95 2 -15 -36 139 189 165 262 -196 -75 -138 -84 17 -19 117 60 -24 196 -94 -52 -181 27 -246 190
5963 190 37 138 -201 -403 209 92 -30 -101 28 -80 80 56 75 -32 158 -119 56 87 -14 49 51 264
5985B64j91r8K2J78m42K34P4j70K03N8j01k13K58R6l8j08LR9j02L75m06p3O1p7
6009i4n6P9L88k96q4J65j1nm0k03R0J54k35R2K67j14j95J79k96L70k09N0k5J37
6033A08P2k25M5M1J90l84R8Q0kL9Rk99L96k60J29K69n19K17r3o5O1O5kJ91l79
6058b18K68J58k24J32Pj60o6J00K6P1j1j01j43L37k57mJ21N7J4k77K52k37K32
6081G7J52l78j21K24J48k90J92J62j09j2K0m5j14l15M26M5m8K73l52j68p3K85
6103b1Q6N0k13qJ27J90k99P9P4j82pq2N5K06m5%J12ol39K27j63R5nl7J97j77M36
6130C50j06l05L05r9j99P7nj50J5K12J0k79K68l23J75K15r2P7l6R3j00o3l8K12
6154B14j13k03K06r1o5R3k19j8K74j05Rk45L06k01J90q0m0J43R3j84j08K88k35
$$ plain form
5985 264 73 -25 -3 175 -267 -33 41 -129 74 132 31 -182 76 172 134 26 29 128 26 401 -5 -78 -17 -94
6009 -94 -150 -71 317 21 -63 102 91 86 46 -157 -67 87 -148 -56 211 97 -98 81 -215 155 -54 -4 -29 108
6033 108 180 -45 0 41 231 -153 -55 25 23 62 71 -228 168 -92 37 306 -213 4 -89 -154 -93 -28 -30 161 -218
6058 -218 50 208 -16 116 123 -37 -103 -3 23 94 83 -18 -161 176 -81 -85 36 93 107 -170 82 -155 77
6081 77 229 -149 -270 -46 102 -188 4 166 57 45 65 20 -94 -409 17 62 14 287 -65 -233 -306 -21
6103 -21 65 115 -98 -106 21 211 -88 -9 65 -117 -124 -206 -151 55 10 10 122 116 -223 4 -159 -64 -69 -106 91 -86 350
6130 350 244 -61 244 145 -54 23 18 -132 -117 95 105 -174 94 -229 -54 161 69 146 110 203 103 40 2 214
6154 214 101 -102 104 13 -52 41 -178 -196 78 -27 -18 -263 43 -158 32 -48 -88 55 148 -36 -144 144 -91
6177i1K27J32j90k74K24K52m88R3J88j54l8P6J80j29r7J22k2J40j45oO8L0j37
6200c9J85pk16l7J1K11k07K97j28j12L64j79m1j10Mj57J20K27j95j78K51mP6l73
6224b37K28N7n9p7Q7Q4Jj56J24J44q5j12N2j47lP4q4K39j79J53j9q6J82j42qj55
6250a24R5o9nN8m8K27k02pM1Oj4K5J37j17q8lRN7J01K4j86pJ7J13k2n3R2l47L56
6279F6l6k22J89J08l10L5L10N7k38k1J98j59j07K09k38jRK38N2j81L5j40nJ04
6303d8N9NJ20j25j16K5K56l47J89Q8j59J11p9K1K22k12n2J6P3p2n7J57J11k22
6327c6M5J34j69M13m18O4k1Rl2J98j37l72M09K1q2K9M3k9k17L17k79K4J15j19
6351i0J89j69J01o8R6J5j53J36K43l82n4M07l37R8J49j27l3j05J67k00K02p0K06
$$ plain form
6177 -91 136 268 78 -196 28 280 -208 -115 73 -81 -119 -43 137 8 -89 33 11 151 6 0 68 98 -39
6200 -39 146 139 -77 -114 -103 108 -99 198 70 -42 322 143 102 -8 -4 -161 -41 186 -9 -187 64 60 136 -237
6224 -237 -9 48 -11 -88 -1 83 84 -72 52 196 111 -1 51 -96 -99 -25 -109 130 -49 104 85 -1 181 39 31 -124
6250 -124 -29 -98 -103 -45 -93 134 -68 -75 -34 -28 -42 -17 120 3 -85 -88 -79 -22 79 103 -83 -90 -73 40 18 -35 57 -290 66
6279 66 30 -192 -3 105 -205 -170 140 197 -41 -62 136 -23 -130 79 -159 -160 -151 87 139 -42 -7 -147 -152 -48
6303 -48 11 16 136 11 -105 -80 176 -171 18 106 -53 58 -21 0 222 10 -42 -26 47 -25 -82 75 186 -36
6327 -36 9 143 -26 387 -31 33 12 21 -11 187 50 -322 87 108 26 55 98 69 -148 169 -110 -86 29 -90
6351 -90 99 -70 31 -37 59 74 -79 57 300 -82 -136 271 -66 32 181 54 21 -84 83 -117 85 15 221
6374B21k48p3M16m32r2K43o4O5j23J28J69j13P0l19K71o1m1K52l57NNK07n5j8
6398E6j63J34j66J67m4J41j34n2j8R2Q2k30L3l9J19o4Q2K16q3n6j42R4K77m70
6422a68K02L5j72L17j60j25k3N9J8l9J92j13k04K0R4K12j62j57J25J89j66j17
6444a43N8J11J1k49j8K77J3j44J64j9j80M9M5J44l10M17k31j15L44j62j07M1R8
6467I4o4m8M6K81k36q4o5Q0L99j92k51j80J73K96n40M17m1j35j1M8n0N3L34r2
6491B32l63K37J9k43J12q7L27j5l19J72k46J19m6J40n7r2j7J05J64p0M7j56K5
6514a2K34j36k21L42Pk85J81j83m7L25j89Kk87K67J41k35J51J40M5k86J01r5l0
6537g0K4J26k79K53L4n9J4j71K64j84j60J23J37j18p5J37J79k65K0l1p0K76o9
$$ plain form
6374 221 -27 -100 316 -116 -208 35 -29 36 -87 41 210 97 167 -152 119 58 17 269 -88 -83 -78 129 74 56
6398 56 -107 27 -139 28 -16 125 -9 -61 -79 13 95 -135 -102 -141 -22 -86 -4 212 129 73 -69 25 302 -168
6422 -168 34 69 -103 214 54 -71 -94 -35 -17 -56 136 23 -181 -161 -67 145 -17 -174 -49 140 -26 -143
6444 -143 -85 26 37 -212 -230 47 60 -84 80 61 -119 -70 -25 119 -191 226 -5 -120 224 62 -45 -4 94
6467 94 30 -18 28 309 73 -11 -76 4 403 211 -40 -220 -47 249 -291 126 85 -50 -61 -13 -63 -10 324 232
6491 232 -131 106 125 -118 -6 -93 234 219 -100 72 -174 -55 -101 39 -18 -110 -127 -22 142 72 119 -37 -12
6514 -12 222 86 -135 207 214 -71 110 -73 -120 205 16 18 -269 -2 139 -96 55 195 240 -46 55 -40 -70
6537 -70 -46 80 -199 54 88 29 43 -128 136 -48 -208 -85 52 -66 -141 -4 175 -90 -70 -101 -171 105 36
6560C6k48J50K75j47l4Q2o4j61m6O6Q8q3J89n7j4k60L37l6k82L31l45L97M0j94
6584B0O3n5k8j17o3kLJ09J89j79R6j5j10j34J75j2K31J4k7m1j92J55l30L68j90
6609g2j35Q5J31K1P2J61k43J29k59J20j55L10K0k20J4O7J27l43J67j41J4J05n9
6632h4K51j59j29k7J83j85J02j28L35J00k46K36k55N8k9q5j37P1M17k65k75K83
6654C2N7j16K0j24l9J99j21Q9OR7r6m6k1Q7l9n4K80l06r2R4K11j37J31k16P1m
6680c7O4M7k71J05j53J88M5M6M6J40m57K65P8J32l49K36J99m18P7L5j72J17l2
6703f9L08j84k2j51K0J05K71l91L6J35k02J69J73k23k34M25m50n4K82j55L03O
6725I8k1k07l1L5K08p7k28L70j12J48k91M0J46j92Q6J42k95P3o5L08J31k72K1
$$ plain form
6560 36 -212 -62 213 66 32 114 50 -111 -157 -91 -3 -86 103 46 32 -228 109 73 -209 122 -223 174 214 20
6584 20 83 28 0 -117 -180 -182 -179 -70 119 -60 36 21 -89 -223 -48 -60 171 185 158 117 -75 80 -250 118 -72
6609 -72 -207 -122 9 30 102 263 20 149 -110 10 -145 165 185 -35 -21 46 173 -170 -3 -144 -130 -25 -84
6632 -84 167 8 -121 -148 35 -150 -48 -176 159 259 13 249 -6 52 23 -62 -199 -128 289 24 -251 32
6654 32 89 -27 -7 -131 -170 29 -92 -3 3 100 4 -42 -63 24 -15 -69 211 -95 -187 -93 118 -19 112 -104 -33 -37
6680 -37 27 74 -197 -92 -245 -57 -12 34 80 220 -237 28 106 238 -111 125 324 -94 -17 18 -154 -37 -69
6703 -69 239 55 33 -118 -98 7 278 -113 -77 58 -144 25 198 -25 -259 166 -284 -338 -56 -211 92 98
6725 98 77 -130 -161 -126 82 5 -223 147 35 183 -108 -68 78 -114 -28 114 -181 -108 -173 135 266 -6 15
6748A5J09k02o0L7K6P7O2m0j67K05j55L0J49k73J28M0O4M8l3lj15L1j40QK71N7
6774A69m26K70J99k37r2j02K72J55k82j11N40j30j68k85p7M65j34k05R5N7k3L16
6796B66k57J34l5l18J26L33l47K63j35Q4k53p7K77J3r7K5J38l47J8L69n8j52O9
6819C9j59J40M2l04J10J20K6J76k51J05j58K53k38J67J29k11o1L5J24p7k50K47
6841Dj35J84k27L88l01q1J87nJ42M1k15O3P6r9L4m0J5N1j43K51j79l0j03J28p2
6866f6j09M51j72k50K30k05N1L5K24k28K39k07m6K17J02m73K66J33k35K7j62K26
6888D8J36j04j82j04r1J77M8j39L91k67J22J19o1j6O2k13J05q9j8K14k2J09j06
6911A19k27J42mM4R9j30j44J53M2M6j94J40j3m5j43J44L8L5j12j7K26N4m71J03
$$ plain form
6748 15 124 -78 -138 -101 -75 2 64 24 -143 62 -93 -63 86 -187 -59 -19 45 93 60 57 -58 -27 -167 -159 112 169
6774 169 -257 13 212 -25 -117 -219 53 208 -74 -185 355 225 57 -228 -305 160 26 -179 -84 -27 -50 266
6796 266 9 143 108 -210 -84 249 -98 165 30 114 -139 -216 61 74 -23 2 140 -207 -189 180 122 -30 39
6819 39 -120 20 62 -242 -132 -12 14 190 -61 44 -114 139 -99 68 197 -14 -75 -40 84 7 -243 4
6841 4 -131 53 -174 214 -87 -168 19 14 156 197 -18 45 121 22 56 16 31 82 -61 190 11 -19 -122 6 -66
6866 -66 -175 276 104 -146 84 -121 -70 -35 189 -39 200 -7 -53 164 266 -207 59 192 -43 -16 -178 48
6888 48 184 80 -102 -206 -297 -120 -72 -211 180 -87 35 154 93 77 139 -74 31 -58 -76 138 116 225 119
6911 119 -108 34 30 74 173 43 -101 52 94 140 -54 86 73 28 -115 29 67 102 -10 -27 199 253 -218 -115
6935a15K80j16r1J11k72J97n7Q5j49J00n8j28K83j54o1L04k04P3O7j47O4j73j9
6958a80L46k88J82Kk00J06J5L5k14M34l06J96k35O7K10k45O2j85L28k23l7K79
6980A49j71k26L68j36J23m45M20m9M4q0j53L20j91K59j92j11J30m4m2O5k08k3
7002a93K23q7m5J34j03j34L37rk46J69mj77K69j86j35Q3J06J7j27P8M7J7j02J
7026f7K09k11K25o7k0J0m6j79K17k52K62j2j91J09Q4j89R9PL1n8j17L8R6k36N74
7051C16p1l15Q4p2m6j68K40N3J49k6j15J08J22m03J20n4K5L9j43L84k12k13K04
7074FP7o5j38M0lJ85j21k25J61j6K47j2j61l5J19J36k41R1j70M74j73m7M1k29
7098e9J73k33K31j29J34j08r6K09j8j6m6q0Q1r1P2Q8M2J5j18k85J43QL8J8j76
$$ plain form
6935 -115 165 49 -42 69 -203 -6 -63 22 -127 -27 -85 -213 70 -84 -145 159 -45 28 95 -52 12 -161 -180
6958 -180 166 -122 60 62 -138 -32 -17 18 -196 238 -68 128 -107 -40 170 -75 -13 -198 130 -93 -130 149
6980 149 -22 -248 120 -16 107 -338 82 33 77 -3 -156 164 -27 232 40 -71 59 15 -27 38 -170 -193
7002 -193 30 -57 -102 32 -71 -205 132 123 -123 46 42 -135 134 -52 -187 -104 2 19 -108 -30 17 34 -68 -67
7026 -67 142 -69 156 89 69 79 33 -146 71 -181 81 69 -122 -13 71 -118 -19 -12 19 -39 -156 -118 -22 -258 316
7051 316 245 -70 14 -58 -104 -272 -32 21 170 144 29 137 259 -144 -24 -78 -53 -14 -157 227 15 -198 6
7074 6 83 18 -120 -80 -83 102 -19 -244 -83 -99 148 136 -25 -60 59 195 -46 45 -125 349 176 129 170 -59
7098 -59 114 -119 112 -17 117 9 -87 122 104 88 42 -38 43 -48 24 112 154 169 51 -234 -91 -83 -45 -27 -203
7123b03PoK16m4j73K4J78k50L10o3j40K25j31K9k0j08J76k07K14j17J77j4Q2j26
7147C6q4M4J07l55J59j06K08j81K98l36K71O9j94J17k01J67j7q1j33L93O8j88
7169F1O9N8l16J92k77K97l02n5K69o4J64J01k03k36K78Q3j02o3J73j8N6j84k2
7192d1LJ44k78o3J45J5PJ97k2j08q5R9o7O9k6q8P1q2O7J76j74pj02O2J00P3j25
7219d0J23j19L55k38l2J32k49K55k97K12k52K76j19j54J13j59J26J05n0p6J95
7240A07J24M9l94J82PK7j99N3m6J05K19n11K11M8k5K14k27j98J13NK85k06L9j14
7264a32P8J29j64O1L5L3k9m3j06K09K3j68O4K04l18L26l28J58o1j20L61m29K37
7287B0j72K52n1n4K18k94Q5K3r5J63J09k06J13j38K68m72J86M6j29nQ4j13L47
$$ plain form
7123 -203 -196 -202 14 -30 -203 -179 -1 -251 59 -4 -144 81 -50 -21 -41 -149 27 -180 34 -83 94 80 162 36
7147 36 -48 -4 103 -252 -93 -199 9 -172 126 -210 61 130 -64 53 -148 19 2 -79 -212 181 249 61
7169 61 130 188 -128 64 -213 84 -218 -273 -4 -68 96 197 -6 -242 36 119 17 -46 127 109 165 -19 -41
7192 -41 -38 106 -172 -235 -90 -75 -68 129 107 -1 -86 13 -54 15 -11 -99 -28 -110 -43 133 -41 -48 -150 -88 12 85 -40
7219 -40 83 -36 319 81 49 181 -68 187 -110 102 -150 126 7 -147 -34 -193 -67 38 -12 -88 107
7240 107 231 280 -114 68 75 102 -97 -44 -90 15 234 -277 -66 -18 -43 171 -56 -254 -141 -136 149 -57 -18 -132
7264 -132 -54 75 -89 -28 7 40 11 -32 -138 71 94 -74 -10 194 -124 202 -126 32 -29 -149 212 -217 20
7287 20 -152 100 49 -5 213 -81 4 27 -68 95 204 -2 111 -27 241 -231 -45 1 -128 -133 -49 -162 185
7310A85j28K18k12j97K04j34Q4K41k15K42k12k57K93k5p0l44N18l07K42j80pj32
7332a93K22j02j89J76J05j61K65j03p7J2P4N1O6k16R8R5j85P8P7o9k91K50l6L4
7356a9M2k26k6L12r2L6qo1J7j4K74m00p8K50q3K98l59Kl1j8J21k4j4r9L05k57
7382a52L0l4J60j17j17L44k57K76Jr2j08P0j07Q4j34Q9j94J48J61k5k5K5J01k27
7406a00K49j50j1j1j6N4j40K78k87J73J59m14K24j4j89K42K7p6Q4J28k02j5J08
7429A01j45l9j27R8J34l5J18j6j65M2l9J23Q1j27j13J46j7K5J94j91K0%j16J8
7453c0L8P8O6k67K21k5l02J86M0J42o6j49n1J75J91M6l19j33K45j56j68K61J48
7476A71O1k67k8J12o0k23q1O20l39O4l8K47n5m70L23K4J64j84%k05OJ08R0Q0J28
$$ plain form
7310 185 57 275 63 -134 70 -64 20 261 46 288 76 -181 112 87 17 -327 191 -116 126 -54 -61 -193
7332 -193 29 -73 -262 -86 19 -142 123 20 -57 -45 29 80 146 -70 28 123 -62 16 93 24 -267 -17 -53 -19
7356 -19 23 -203 -229 83 -9 27 19 -42 -25 -39 235 -165 -243 7 -76 222 -137 -135 -166 -184 -63 -87 -101 -200 105 -152
7382 -152 -122 -156 4 -113 -230 114 -143 133 134 42 -66 4 -103 -19 -153 -64 -258 -110 51 26 1 26 127 -100
7406 -100 149 -1 -12 -23 -39 15 -125 153 -134 39 198 -216 8 -6 -195 47 74 -2 82 210 8 -7 101
7429 101 -44 -83 -210 -112 22 -13 105 89 -76 -34 -73 50 131 4 -109 37 20 45 239 48 68 68 -48 -30
7453 -30 8 86 152 -115 106 81 -221 -35 5 147 81 -68 -119 56 247 293 -26 -159 86 -70 -238 23 171
7476 171 232 -35 -63 49 -11 -234 -315 305 -34 30 -8 239 184 -286 37 61 225 41 41 -164 -158 -50 40 120 248
7501B48j66j61n2J27N3j16o5J6J02p7M6q1J33k4L5m2j08K64j58m9j70K29L1j46
7525a31K07j00J89k98Q7J75j31ok55K16O5j86N7J05P1j42p0J78j25K24l27Q0M2
7548g5J04k18o7J55J2K67j85j75K02j22Q3J31k29J32P4j98MK51k58m3jJ18K38
7571B00k93j0J54J21o3Q2N7j98M7k9Q6q9k26L16k92J91L9J24o4M7r7K6L2o3J8
7596A16j18P1L3j32J0J57k42L17k06l56K21RO7k5k3l2J64R6j1Q2l35K2L2R4j06
7621i5K2J9k8r8K40Nk39Q8J01Q0q7M33n54m1J77j32Q2L4n9K52k85K24k04K28k21
7646e8j9J95J46k62j15J4J3P6j2q8J19l8J4K9Ll1J41j77J19Q0j52J6k17J79o7
7671i2P1j6p4K7K52l2q6ol3j61J15O1J6r3J39k12O0k9K55p1j10K1J5N3J69k00
$$ plain form
7501 248 82 -79 -131 -4 49 -67 -132 -116 -14 -91 -45 -126 7 -17 18 -24 -132 132 -26 -75 -245 -16 15 -131
7525 -131 76 -24 165 -133 -46 129 -2 -8 -263 -47 18 -168 -111 -6 65 -77 -147 31 -94 130 -197 -117 -75
7548 -75 29 -189 -256 -101 -89 178 -7 -182 20 -102 -19 112 -117 15 89 -109 -105 146 -112 -155 -156 -38 200
7571 200 -93 -103 51 172 109 191 248 50 97 68 154 65 -161 155 -137 54 93 217 153 200 103 129 161 98 116
7596 116 -2 69 102 -30 -20 137 -105 212 6 -350 -129 -120 -53 -78 -101 -133 31 127 116 198 -137 -115 -83 11 -95
7621 -95 -73 -54 -82 -180 60 65 -174 -86 15 95 8 441 -113 -154 23 -109 -27 7 -52 200 -85 139 -65 163 -58
7646 -58 -77 118 264 2 -113 -99 -86 -10 -22 -110 9 -29 -15 14 17 -14 127 -50 69 149 -3 13 -204 -25 -92
7671 -92 -21 -37 -111 -84 168 136 50 44 11 -150 -35 26 42 -51 88 -124 -64 -93 162 91 -19 2 17 70 239 39
7697C9p3k28K02J37j74QJ57j02J85k29K28l70K91p2J4p8J82o0KJ40j93K0KR1N7
7722A76j2n4n0j0K8L1j31J8M01l48p3L94m39L7j30K52R7j95K1J38k63M4L3j70
7746b05L13j58qJ90k80J72J52n9j56L4k47K19L28l54K23l9J7j73J02Q4j84L3o4
7769f0J42j65R1n8M7P5j11J42j46K0K53j45p2M4J43k10k36J26J42J44m40K38j11
7792a47K3J29k5J7M5M5m5p9Q7k50K31k13O9J87j32m8J83n5j7k7J42J3j01J00P
7817A39p3j83K09j37K6K5N6Km8J29J39pk55j41N6k5J03j56L07j94j1R9J45k92
7841h7j43J88R9l6q9R8j0J84j73r6k1P5p3j8J48n6k05L16l5o6P2k1j49Q9J0O6
7867F7j26J65o9J66l53K83l04L68K3j62J54j16K4Nk30Q7R2p9P6J1k36L09j67M3
$$ plain form
7697 39 -34 -262 -60 77 -97 -89 68 -34 151 -78 150 -220 71 -1 13 -65 117 57 59 199 6 26 28 119 176
7722 176 164 110 60 50 78 109 -22 -4 397 49 -24 370 -69 -32 -162 90 187 -8 13 151 -112 -68 -35 -205
7746 -205 108 -50 -58 132 -148 24 176 117 -39 -5 -252 -33 295 -59 164 125 142 -31 71 155 -29 4 -60
7769 -60 82 -83 8 -50 -3 72 -39 103 -43 -23 230 85 13 57 200 -10 -246 -120 22 166 -274 -36 -147
7792 -147 -124 5 -20 -3 42 87 42 -37 50 -200 31 -182 -113 74 -58 -106 77 22 5 -22 120 133 32 132 139
7817 139 66 -117 92 -45 -19 6 62 64 16 145 284 277 22 -119 -63 -88 15 -141 166 -28 -39 60 205 -87
7841 -87 -230 -42 57 21 -68 30 20 204 31 -65 -86 -11 -84 -102 46 -10 -215 101 66 0 72 51 -98 -9 1 67
7867 67 -59 106 37 203 -150 133 -171 197 220 58 212 96 120 125 -105 -18 74 -5 71 82 -154 155 -12 31
7891C1p7j14N15m76K8nL26k01r6O3M8Q4n8J65o23M36j18L16m9j11j15l2O1n0j40
7916a92J66N1N0l2J19N8k30R5p2l39K23r4K64j87J78J5J55m55Q0L46k39J14k5
7939D9J02l20L52k94J22J8J6J57m29Q0J15o6J02M3n0j02K29l26K28l40J84M8J58
7962G6J16n4k28r5R2K17k28K65k54J53K7L1j16K4j37J28J26m14M70l88K35K6j70
7985i8L28k27K0r3K22q2k41M36k39J6r7p0J76k2L2k3j68P2j47K21q2J53j51K23
8009A59l47K26Mj32O4J66k00J49N2j69K2O2l16M37l27O5o4K5K11N6k10P3pM1J2
8034E2lM3K6j52k1j07Q7J50k05K1O2J01m0%q3J24K63k77k03L13j22j52J53pK06
8059B29k31J23n4r3J4lp9R0K38j48k8J43r9P9j27J7j78R8j4J81k95J2L49k96j0
$$ plain form
7891 31 -46 -160 355 -121 -93 -98 228 27 -69 -6 42 126 68 233 -390 46 -72 244 195 84 -31 -63 -2 -52 -192
7916 -192 -26 25 75 43 162 220 -10 85 13 -326 -103 -197 67 -120 58 73 228 -227 -147 199 -40 74 49
7939 49 151 -169 183 -111 11 29 45 202 -227 -147 -32 -98 4 47 -3 -105 124 -202 26 -314 -130 -82 76
7962 76 192 138 -90 -185 -93 124 -104 161 -93 60 87 118 2 26 -111 17 143 -271 199 -189 46 72 -98
7985 -98 230 3 23 -70 152 70 -171 265 26 42 -55 -125 51 29 61 38 -130 -58 -205 16 -66 87 -64 159
8009 159 -188 38 42 -90 -26 140 -60 89 141 -28 -6 56 -260 177 -150 -85 -149 -124 87 143 -67 6 -1 40 52
8034 52 49 92 118 -34 -55 -162 -75 75 -130 -109 -47 54 14 14 -69 55 318 41 -162 151 29 -123 30 23 229
8059 229 -2 121 67 -26 -12 -15 -94 -4 234 86 58 201 102 181 54 71 -107 -9 -23 158 -137 -125 224 -72 -82
8084h2K32j48o5Q9L5j51ll2J16K89l33j10J48J47l84K53o1N1L3l4q2K07k53J71
8108C3P8L2j14k04K48o8J70j98q5M06k16l17M71l52N2K04l20M16j96P5j76j73
8130b34Q2M9L15j38m5j64J94k96N9L18l91M27r0m1J8pk51L37p7jl7M7j09k8K25
8155A62k15k97L15o7K00k1J1j14j98L56j7qj86R5l41L13Q2k98J53J42k55J68j60
8178a80R1J73l00K52j90L08j70j51J80J10k65j82K57
$$ plain form
8084 -82 150 2 -63 26 61 -90 -93 -125 -9 280 -53 -163 -15 132 -252 1 -60 -9 24 -10 -92 115 -138 33
8108 33 111 143 29 -175 73 5 175 -23 -108 298 82 -235 236 -116 -64 140 -180 236 40 115 -61 -234
8130 -234 -152 -103 212 74 29 -135 59 -237 -178 140 -251 176 86 45 63 56 -195 142 65 64 27 74 -35 -63 162
8155 162 -53 -350 -35 -102 98 77 88 -26 -224 132 115 107 -79 16 -325 -12 70 -228 -75 67 -188 -20 -180
8178 -180 -89 84 -216 36 -154 154 -16 -167 13 123 -142 -324 -67
8191f7
$$ Imaginary data points
##PAGE= N=2
##DATA TABLE= (X++(I..I)), XYDATA
0@%%%%%%%%kJ0j6J6j6J6k4L2m0M8n5O3p2Q8j03J18j35J52j70J94k23K50k82L20
32A69l55L95m42M94n50O11o77P50q32R20j019J130j252J388j541J717j920K156
50A142k434K767l177L694m372N298o648Q812j2833K2742r0111j41741K07697J25577
64A16413j11696j15202P2760O6766n1085m4104O5678K7281q6618m0079J13056
75A3170O3342j02145p2753Q2683N7001n9298l0618N4518J4703n2016j4837N1226
87D976K0425m2824j3945N6655J2532p2417k1490P3606K3721n7124n406N3302k777
100B9234m7667L425M1973j790m7992j0833N7144M0699m0481n3757M048K6589J8813
113A9405J8591j7866n9304m123O9046K6904n3317l6398K7095K9635j2212k2634
$$ plain form
0 0 0 0 0 0 0 0 0 0 -2 8 -8 8 -8 8 -16 16 -24 24 -31 32 -40 48 -55 63 -72 80 -90 104 -119 131 -151 169
32 169 -186 209 -233 261 -289 322 -355 395 -437 483 -536 594 -658 730 -811 906 -1014 1142
50 1142 -1292 1475 -1702 1992 -2380 2918 -3730 5082 -7751 14991 -75120 -216861 -9164 116413
64 116413 4717 -110485 -37725 29041 -22044 -66148 -470 26811 -59807 -99886 13170
75 13170 76512 -25633 -98386 -15703 41298 -18000 -48618 5900 20603 -31413 -46250 4976
87 4976 25401 -17423 -31368 25287 37819 -34598 -56088 17518 41239 -15885 -21291 32011 29234
100 29234 -18433 -15008 26965 25175 -22817 -33650 23494 64193 23712 -30045 -25997 592 19405
113 19405 37996 20130 -39174 -43297 25749 52653 -664 -37062 -9967 19668 7456 -15178
125a5178R519J3667k5069j4355M8674K9292n4309l8129M2643K3883m1188j2804
137c3354M7904K2941m0462l7062K4517M1555j5351m1780J0078L2134j0360j0652
149i892K4327m973m0803P479M8627l70m4163q549L6552J5154l2716j7176M1919
162A5416K6908m8099l7409M0183L1035l3179j6969L2771J1061k8954j0987K2321
174D098J0356k6387k2520K6036L3331j7066k8777J5196J2877k6236p052L1409
186E265Q004k6824j2441J2084J2990K698m578n466p444j0810J0191L0747o821
199G595m7227k536N2128J8481l5065k5318P009J3312P033R7l671Q9j158J409J1101
214C279l235k3277J022K7211K371j9013J632J1593k993k014K475n528m680O320
$$ plain form
125 -15178 -5659 8008 -17061 -31416 17258 46550 -7759 -45888 -3245 20638 -20550 -33354
137 -33354 14550 37491 -2971 -40033 -15516 26039 10688 -31092 -21014 11120 760 -9892
149 -9892 14435 9462 -31341 -23862 24765 24395 -19768 -28317 8235 23389 -9327 -26503 15416
162 15416 42324 -5775 -43184 -3001 28034 -5145 -22114 10657 21718 -7236 -18223 4098
174 4098 14454 -11933 -34453 -8417 24914 7848 -20929 -5733 7144 -19092 -26144 5265
186 5265 13269 -13555 -25996 -13912 -922 1776 -2802 -8268 -15712 -26522 -16331 14416 7595
199 7595 -39632 -42168 9960 28441 -6624 -31942 -24933 -11621 -4588 -4491 -8162 -8073 -9231 -7822 3279
214 3279 44 -23233 -22211 5000 7371 -11642 -10010 1583 -1410 -3424 -949 -6477 -11157 -4837
228d837P803J287r386j1023J2138K1449r613k2325O717J0689j1728j514J9146
241H803L342j5181n986Q504R475k758j5988m472J4498O819k153N692m399k0944
255a4748K346K5739N44k2414m276J3702Q566k389q175k359O729j807o134O634
269A958L082j4099J350K0623j453j8908J534J3153k905j1499l442O838J0943k42
283F933r389J512M585r157k834J1512k332j2412P884J2724o791q075M058K744
297I62k644l922j498P259N324r142m071J2664K263j2037K112O523r816l833J2522
312B666M684p104k621L262L517o59r369l493J1017K243r418N443R949q738p527
327f148P870Q30q575J337O559K26k024k213J812O770m053j1934L960J0739p058
$$ plain form
228 -4837 2966 4253 -5133 -16156 -4018 17431 7818 -14507 -7790 2899 -8829 -10343 8803
241 8803 12145 -3036 -9022 -518 8957 6199 -9789 -14261 237 7056 4903 10595 6196 -14748
255 -14748 -12402 13337 13881 -8533 -12809 893 9459 7070 -1105 -3464 3265 1458 -4676 1958
269 1958 5040 -9059 -7709 12914 11461 -7447 -5913 7240 4335 -7164 -10606 -3768 7175 6933
283 6933 -2456 -944 3641 -5516 -8350 3162 830 -11582 -3698 9026 2235 -5840 -1782 962
297 962 -1682 -5604 -7102 157 5481 -3661 -7732 4932 7195 -4842 -2730 3793 -6023 -9856 2666
312 2666 7350 246 -2375 887 4404 3745 -5624 -9117 1900 4143 -5275 168 10117 1379 -6148
327 -6148 1722 2552 -6023 -4686 1873 2099 75 -2138 -326 6444 2391 -9543 -5583 5156 -1902
342a902o780J0315L541q622J824N115n083n679J957L108K855j296m326O368P146
357H541j0121q453R598L509r868J994R494l014l637M096J223l389k556j622M152
372e3M578o083l458J1444K521j1967M61P868n091o425N967L070k844J297J990
387C275J79l45n398l472P340J053q961L348J1187m826p578N391J868o965m93L359
403a038j79Q72M33p86L998J97q295Q13P423n100o585Q782N175o578O22M459l253
420I60k493M03n65J702J901k677K190P089m382p729O043L441q246p00P285m86
436C736j938L086M79j920n43l235m40M801k015m868P030M918p175k196N940l014
452B646n954L235K293j492J543M11o6L136j869p125K753M366n849o41Q231j259
$$ plain form
342 -1902 -8682 1633 5174 -3448 -1624 3491 -1592 -7271 -5314 -2206 649 -647 -4973 1395 8541
357 8541 -1580 -10033 -435 3074 -6794 -4800 4694 1680 -1957 2139 3362 -27 -2583 -4205 -53
372 -53 4525 -1558 -5016 6428 8949 -3018 -2557 5311 220 -6205 -238 2832 -12 1285 3275
387 3275 3454 3109 -2289 -5761 1579 2632 -6329 -2981 8206 3380 -4198 1193 3061 -3904 -4397 -1038
403 -1038 -1217 -345 88 -698 3300 3497 -4798 -3985 3438 -1662 -8247 535 5710 -868 -246 4213 960
420 960 -1533 -1130 -1695 7 1908 -769 1421 8510 4128 -3601 2442 5883 -2363 -3063 4222 3736
436 3736 1798 4884 5363 3443 2900 -335 -775 4026 2011 -2857 4173 9091 1916 -280 5660 2646
452 2646 -3308 -73 2220 728 2271 2682 2616 5752 3883 -3242 -489 3877 -1972 -2613 5618 4359
468D359n090M080K678m986k586J035l55L335Q95l433K776M724n111k954N096k817
484A646o248N926O058m849j891L627N09o46j632m932R65N068j802k597N198l85
500D015n539L707K803p996l332N805J687j505O72q27p6K765k803m626K462k15
516c003l719M916N335o321l384O062O51m969j073l42l93M313J636k465J421N26
532h09m076K320L832o365l856P186L816k618J471k47m127K134L800k753k643k26
548c161P37O010N774p594p230O055M706m145j797J78j762M233N871l025l919m87
564D44j355J972M476m489n825N358O590j772j595j688m456K060O117k692n498
579b353J805L890K509K042m976o656L810M946l386j503K885j770o51N729R06m707
$$ plain form
468 4359 -731 3349 6027 1041 -1545 -510 -865 2470 3365 -68 2708 7432 2321 -633 4463 1646
484 1646 -4602 1324 7382 2533 642 4269 4778 4132 2500 -2432 -1467 3601 1799 -798 4400 4015
500 4015 -1524 2183 4986 -3010 -6342 -537 1150 -355 317 -510 -586 2179 -624 -5250 -2788 -3003
516 -3003 -6722 -1806 3529 -2792 -6176 -114 537 -4432 -5505 -5847 -6240 -1927 -291 -2756 -1335 -809
532 -809 -4885 -2565 1267 -5098 -8954 -1768 2048 -570 901 654 -3473 -1339 2461 -292 -2935 -3161
548 -3161 -2424 3586 9360 1766 -5464 591 5297 1152 -645 -467 -2229 2004 7875 4850 931 444
564 444 -911 1061 5537 1048 -4777 581 7171 5399 3804 2116 -2340 -280 5837 3145 -2353
579 -2353 -548 3342 5851 7893 2917 -3739 71 5017 1631 128 3013 1243 592 6321 7227 2520
595B520l406j969J969P897Rr216m01Q481K137l423k772n230N00P486J168n242
611E08K94K598l02J623k18o263j130M256p1L04K762l163k803N903J948q369l537
628e660M279L774J855k988n802L155Q819l085q829m98L245M98K597n53m467K305
644a355M165l509k936K224j633k750K157J999N58K261k909m242L967K851p272
659f424k881P622K696l829j557J274K242K306m963n894M015M929k187K03L410
674I62l651l232M611K731k450l098l951J85R757N997p170p502N49N639O472j041
690D808j2842m375J4279R274o465p548l8L306L804j141n367Q9M025k59J682M696
706G928m840p474M518P601l275o357j398L896P890J964r335n777N930M914j581
$$ plain form
595 2520 -886 -2855 -886 7011 7020 -2196 -2597 5884 8021 4598 1826 -3404 -2904 4582 5750 508
611 508 802 3400 3098 4721 4503 -1760 -2890 1366 1295 1599 4361 1198 -1605 4298 6246 -2123 -5660
628 -5660 -1381 2393 4248 1260 -4542 -1387 7432 4347 -4482 -4980 -1735 -1237 1360 807 -3660 -1355
644 -1355 2810 -699 -3635 -1411 -3044 -5794 -3637 -1638 -1080 1181 -1728 -5970 -2003 848 -6424
659 -6424 -9305 -1683 1013 -2816 -4373 -3099 -857 1449 -3514 -9408 -5393 -464 -2651 -2448 962
674 962 -2689 -5921 -1310 1421 -1029 -4127 -8078 -7893 1864 7861 691 -6811 -6262 -623 5849 4808
690 4808 -8034 -12409 1870 11144 4679 -2869 -2907 399 4203 3062 -2305 -2216 1809 1550 3232 7928
706 7928 3088 -4386 132 7733 4458 -1899 -3297 599 8489 10453 1118 -4659 1271 6185 4604
721D604k381m271j553P317O093m502m313j070l365J361P262P10o813m015J852
736c084P241P557p222j5318P48J3367M423n516n344k018M499Q435j456r042j966
751d696L125J858L147J42n012N2N359J74k295j358m444K56Q627K036r406k544
767d979Q236M607l544p622m502O536Q046m104n665L204K130l013J591K192m634
782a521l323J522J378K361K302l071m103J122J363N67J920m517o005N010Q456
797C461k832m796J385J28k742J029J671J60N38k093p5N934R46p243p25N401k201
814b054m395M127N182j327k584k631Q00N780O19p328k078M445K889J873R30n092
830h44l123O530K417o161k264L034K027J418o56k587J020K865l372k802J784l72
$$ plain form
721 4604 2223 -2048 -3601 3716 9809 5307 994 -76 -3441 -2080 5182 5892 -921 -4936 -3084
736 -3084 4157 11714 4492 -10826 -10078 3289 7712 2196 -3148 -5166 -667 7768 6312 -2730 -4696
751 -4696 -1571 287 3434 3576 -1436 -1384 3975 4149 1854 496 -3948 -3692 4935 6971 -2435 -4979
767 -4979 3257 7864 4320 -3302 -7804 -1268 6778 2674 -2991 213 2343 -670 921 3113 -1521
782 -1521 -4844 -3322 -1944 417 2719 -352 -4455 -3333 -1970 -1403 517 -4000 -10005 -4995 3461
797 3461 629 -4167 -2782 -2654 -5396 -4367 -2696 -2536 -1998 -4091 -4166 1768 2714 -4529 -5254 147 -2054
814 -2054 -6449 -2322 2860 1533 -1051 -3682 -2882 2898 3517 -3811 -5889 -1444 1445 3318 4248 -844
830 -844 -3967 2563 4980 -1181 -3445 -411 1616 3034 2378 -209 811 3676 304 -2498 -714 -1086
846a086p39N298J490o470j985M332J711j223k609m206J859O932J085l996r72r29
862a508q13L567J782n363j426L472M34K32M139j482n523j349J946K787K828l603
878A20n373M815O426k118m760J1j276rM812P99l924n71K943J638j14l298m268
895d147L485M736l155l676L112J712n57J793j633o306N38N533R69k443k526m21
911b986M360L641n115m730K894J186k023K531L137k827k132K449L82j154M1k000
927b346n16K638K17K27L289k024n157K128M731k615l670J777J176N91K323m67
943B302k579J87r8o39J194k84k825K920M639l273l765K651J035k839l67L28n35
960a948K670J468k063p53P11k098O85K409l229k126M656K113l407J72J914j374
$$ plain form
846 -1086 -1825 3473 4963 -1507 -3492 840 2551 1328 -1281 -5487 -3628 3304 4389 393 -579 -1508
862 -1508 -2321 1246 3028 -2335 -3761 -289 145 377 4516 3034 -2489 -3838 -1892 895 3723 120
878 120 -5253 -438 5988 3870 -890 -879 -2155 -2164 2648 3447 -477 -1048 1895 3533 3419 121 -4147
895 -4147 -662 4074 919 -2757 355 2067 1510 3303 1670 -4636 -4098 1435 2404 -39 -2565 -2986
911 -2986 1374 5015 -100 -4830 -1936 -750 -2773 -242 2895 68 -2064 385 767 -387 -346 -2346
927 -2346 -2862 -224 -7 220 3509 1485 -3672 -1544 3187 572 -3098 -1321 -145 446 2769 2302
943 2302 -277 -90 -188 -827 367 83 -2742 178 4817 1544 -2221 430 1465 -1374 -1741 -1413 -1948
960 -1948 722 2190 127 -626 85 -2013 -1328 1081 -2148 -4274 382 2495 -912 -740 1174 -200
976b00j308K43j350J444K415j746m63K919q13k152J892p33m164J605M944p39k079
993b85Q67K83J72L35k288j501K889L52j342K177J358l867O21K605k487k858K527
1010d42J386p48L52k88n2J956j090m063J278K057k335K48L574j177k123K629O14
1027A776l709o50J213J87J168j12j105K302J791l535j848L273q45k537K499K008
1043A876k220P36K270j212j624N5o58R70J266k207J62M544o06l916J201J867l074
1060e70p81K797p90n91K061N85r69l10j864q04K913n79l227K660L440k831j582
1077d42K407r57k203P72N60o36J211L89m89J646q59k969J660K172l771j407M615
1094A699Q83k521J231J009j790l60M45j384Q23J257j041J719J869k976j881L642
$$ plain form
976 -200 -1508 -1265 -2615 -1171 1244 -502 -965 1954 1141 -1011 881 148 -4016 -2411 2533 1794 -285
993 -285 582 865 1037 1372 -916 -2417 472 824 -518 1659 3017 -850 -229 2376 -111 -2969 -442
1010 -442 944 196 548 260 208 2164 1074 -2989 -1711 346 -1989 -1741 1833 656 -1467 1162 1776
1027 1776 -1933 -2583 -1370 -1183 -15 -127 -1232 1070 2861 -674 -2522 751 -94 -2631 -132 1876
1043 1876 -344 392 2662 1450 -174 -119 -777 193 1459 -748 -586 3958 3352 -564 637 2504 -570
1060 -570 -1351 1446 656 65 2126 2711 1742 1432 -432 -1236 1677 1098 -2129 531 3971 1140 -442
1077 -442 1965 1008 -1195 -423 137 -499 712 1101 612 2258 1399 -1570 90 2262 -1509 -2916 1699
1094 1699 2582 61 1292 2301 511 151 596 -788 35 1292 251 1970 3839 863 -1018 2624
1110B624k11m358R87L085m78m42J102r82m39M74j349j83J419k079o74M078R65
1127C539l667K49K051k384j422J919k29r40J196Q81m8R04j891k492K613P23l224
1144b222N18L335r72j242K914o66l052K83R32l92R95l73j141K829J488l016j182
1161i64K324j769j522K956P06k598J226K656q89j166j542j429J794K043k266l59
1177g99K496r4j912K340o86m229K61L363K0j288L72k71J407J392k928k082K169
1194d69p09q35L178P40l617N44L580q16l367m11M86J301J794p61j216J609N15
1211A546j596J414P1l891J37N081Nk599P35J068m87R40q42k398M22Q94L67K363
1229C230P56m367p85M935m60m012n38J664L22J874P43k183j064O34r7Q59K02l870
$$ plain form
1110 2624 2413 -1945 -958 2127 1649 1207 2309 1327 888 1362 13 -170 1249 -830 -1504 2574 3539
1127 3539 -128 121 2172 -212 -1634 285 56 -884 312 1193 1145 2049 158 -2334 279 1002 -2222
1144 -2222 -1704 1631 659 -583 2331 1665 -1387 -1104 -172 -564 431 58 -1083 1746 3234 218 -964
1161 -964 1360 -409 -1931 1025 1731 -867 359 3015 2126 960 -582 -2011 -217 1826 -440 -799
1177 -799 1697 1603 -309 2031 1345 -2884 -2623 740 760 -528 -156 -427 980 2372 -556 -2638 -469
1194 -469 -1178 -2013 1165 1905 -1712 -1168 2412 1596 -1771 -2182 -1696 -395 1399 638 -578 1031 1546
1211 1546 -50 1364 1435 -2456 -2319 2762 2767 168 903 1971 1484 2424 1582 -816 -394 500 867 3230
1229 3230 3986 -381 -1166 3769 3309 -703 -1241 423 745 2619 3362 1179 115 749 652 1511 1713 -2157
1247b157k76N262J559l578p58P12j210J057J580k412k105J934K354J187o68l772
1263a291r03M497L06l950j9K579n62P39K299j923k702O45J101M44K40j883j230
1280a613M056J730k832j314P46j814K79L141j374k830K147K473n90o49k039j554
1296b037J871J409k036N82K011j979o34L333m58m303o64K733P10l81p68j142K515
1313G62J779k800k173J052J17m26K345o71k201J941K530k192j854N07K02M5J246
1330B09p70l81K067o48j146J750o14l759J072L944o93k378O86J330M56K78k518
1347a115j953K642J148j240L94P17j272J232J995k529k612J541Q33n56J766M43
1363A434k020l5J076p3O64j460l333J887N302p96m164R49J909l95J61j029k486
$$ plain form
1247 -2157 -2433 2829 4388 810 52 764 -446 611 2191 -221 -2326 -392 1962 3149 2481 -1291
1263 -1291 -2194 2303 2609 -1341 -1360 1219 657 1396 3695 1772 -930 -285 816 1260 1500 -383 -1613
1280 -1613 2443 4173 1341 27 773 -1041 -762 2379 1005 -1825 322 2795 2205 1556 -483 -2037
1296 -2037 -166 1243 -793 -211 1800 -179 -813 2520 2062 -2241 -2905 -172 538 157 -611 -1753 762
1313 762 2541 -259 -2432 -1380 -1263 -1689 656 -15 -2216 -275 2255 63 -1791 -1284 -1082 -1037 209
1330 209 -561 -942 1125 477 -669 1081 467 -3292 -2220 1724 1031 -1347 -661 669 1125 1403 -1115
1347 -1115 -3068 -426 722 -518 -124 593 -679 553 2548 19 -2593 -1052 -219 -775 991 1434
1363 1434 -586 -621 455 382 1046 -414 -3747 -1860 3442 2646 -1518 -569 1340 945 1106 77 -2409
1380b409J059K563O27j38k64k409K80L842r02m004l7J964P05K507Qm157j317L529
1398A447J245j698k062j833K087M904m52m814L2K101j022j5R72j655j195K395
1414D37J477j26p77k356j309K668J703k894o73J775L8J009J430k570k733K060
1430h41J801j062m88p4l71K249J429k435p98K06j069N06L376j149l500J325L539
1447B644l7j815j819j587K271K482j829j226J395K21k57J394j462k897J124J866
1463D68j138l6J651q88p15J143r82q31P72q78n52K395K99k344J283K192k667j868
1481b696J588P29o11N39j95Q7J732k70k191P52O12k052O11K380p67n05J911p01
1499I53k118J132R16j746J69N79Q5J292P63k205K83J773k079k087K175J362j435
$$ plain form
1380 -2409 -1350 1213 1840 1702 1438 -971 -691 3151 2249 -1755 -1792 172 877 3384 3392 -765 -2082 1447
1398 1447 2692 994 -1068 -2901 -814 4090 3638 -1176 -1144 957 -65 -80 892 -763 -1958 437
1414 437 1914 1788 1011 -1345 -2654 14 1717 -1177 -1850 -75 -37 972 2402 -168 -2901 -841
1430 -841 960 -102 -590 -664 -1035 1214 2643 208 -590 -384 -1453 -947 2429 1280 -2220 -895 2644
1447 2644 2607 792 -1027 -2614 -343 2139 310 -916 479 700 443 1837 375 -2522 -1398 468
1463 468 -670 -706 945 57 -658 485 -497 -1328 -556 -1434 -1986 409 708 -1636 -353 1839 -828 -2696
1481 -2696 -1108 -379 -990 -451 -646 -559 1173 903 -1288 -536 76 -1976 -1365 1015 248 -257 1654 953
1499 953 -1165 -33 883 -863 -694 -115 -30 1262 2025 -180 103 1876 -203 -2290 -115 1247 -188
1516a88L82J117j196J62Q90j437p85L81r61J238K707j020l231J497J409r28o98
1533f61q9j703N53L210J48j579m37m95O67J562j518k370J789K463j504Q8J153
1550A277j089j396J176Rr91P46K85qJ434J56k198Q46J201k258m79K024m94j057
1568h16J992P26j426N3m78j040Q09P98j491K52J628p16k40K009j955k809J457
1585a247K295j105n61M09k78J349P32j952j053N89m68N4K320K8k210J388J655
1602A945j963q20J105p48k26P80j19O50J265r59j412J302j76j760Q82J086j139
1619c07K4K298j99j813K17l9o20P24l44j025K037J071k058k17J053j341q27J544
1637A78m93j494J682J392n65m95p26o48R39O22j750j86K171l67o27J618n09k178
$$ plain form
1516 -188 194 1311 115 277 1167 -270 -1055 -674 -1635 -397 2310 1290 -1941 -444 965 37 -661
1533 -661 -750 -2453 -1900 1310 1458 -121 -558 -1053 -386 1176 -342 -2712 -923 1540 36 124 1277
1550 1277 188 -1208 -32 -23 -1014 -268 17 9 1443 1599 -599 247 1448 -810 -1289 735 241 -816
1568 -816 1176 1902 476 529 51 -989 -180 618 -873 -621 1007 291 51 2060 105 -2704 -1247
1585 -1247 1048 -57 -618 -209 -487 862 1594 -358 -1411 -822 -1290 -1236 1084 1112 -1098 290 1945
1602 1945 -18 -838 267 -481 -707 73 -46 604 1869 910 -502 800 624 -1136 -254 832 -307
1619 -307 -283 2015 1816 3 220 181 -439 285 -59 -1084 953 2024 -34 -251 802 -539 -1366 178
1637 178 -315 -1809 -127 1265 700 205 -521 -1169 -230 392 -1358 -1544 627 260 -367 1251 742 -1436
1655a436M72J128j351L79J368l94K9Q80j206r3J361j632j654K017J385j542N71
1672B82J203j206m21P82p45j064Q43L15o6J598q03j228J424J02k301j73J846m98
1690a10m14J280k84p23N90j7j315J73J71j099J744J185j929R4J682p21j957R30
1708g20K99o80P60O34p62Q17N90j163L4L39j306j56K464p34r66J617P85j568l91
1727a07P80p64j78J007o56L95J128q27r45J738j004j974J451Q12j295J59J769
1744A489m01o19J3p31m56J086o11p38J638M55j683R47R31k068p20J713m92r35
1762a182J236N72n20P27m58j054N71M2j359O89J525p76j83J430k44j722Q14J37
1780B45r91M6J034j92R16J42j259L05J118j387j561J521N41p69J274O73j745n1
$$ plain form
1655 -1436 -964 164 -1187 -808 560 166 195 1075 -131 -224 1137 -495 -2149 -132 1253 -289 282
1672 282 1485 279 -142 640 -105 -1169 -326 -11 -77 1521 718 -510 914 1016 -1285 -1458 388 -110
1690 -110 -524 756 472 -251 339 322 -993 -820 -649 -1748 -4 1181 -748 -654 1028 307 -1650 -720
1708 -720 -421 -1101 -341 293 -469 348 938 -225 -191 148 -1158 -1314 1150 416 -550 1067 1852 284 -107
1727 -107 673 -91 -269 738 82 477 1605 778 -167 1571 567 -1407 44 856 -439 -280 1489
1744 1489 1088 469 482 -249 -705 381 -230 -968 670 1125 -558 389 1320 -748 -1468 245 -247 -1182
1762 -1182 54 626 106 833 375 -679 -108 -66 -1425 -736 789 13 -170 1260 1016 -706 108 245
1780 245 -746 -700 334 142 1058 1200 -59 246 1364 -23 -1584 -63 478 -291 983 1656 -89 -140
1798a40J003q71n27P4p56J202J474p77j345J153K38k023P50P45j736J61K226k02
1816F49r94M12n51k48R87j251r05J578J104j171M89J120j386j085J491K94j603
1833a070L44L91L76J149r9j589M90K74j216N06J258r10j031K228R18j438q01K09
1851a1p23N74L22r63O01J024m21k19J108j562j819J833J249j725nJ147Q7p9J82
1870F00j408l91Q65m72j4J367p21j145J905J352k654j017J267J10R7P03l35m18
1888c09J156k7m17K88r24j586J665J935j796p10J662L21r21M13o23j181N08P09
1906A63L13O49n49j393J355J188k035j554J624L84p63J321L28j373J66Q87m02
1923C09r75l59q86J643J909j544j066J394q5j401J000L97j887r7K258N57p37n35
$$ plain form
1798 -140 863 -8 -535 -461 -1217 -15 1459 682 -663 490 728 -1295 -545 200 -1536 -1375 851 649
1816 649 -345 67 -484 -732 255 -996 -1901 -323 781 -390 99 1219 -167 -1252 239 533 -1070
1833 -1070 -726 -335 41 1190 1091 -498 -8 266 -950 -444 814 -96 -1127 1101 2019 581 -220 -11
1851 -11 -734 -160 162 -801 -200 824 403 184 1292 -270 -2089 -256 993 -732 -737 410 497 418 600
1870 600 -808 -1199 -334 -806 -820 547 -174 -1319 586 1938 -716 -1733 -466 -356 -259 444 109 -309
1888 -309 847 820 403 691 -233 -1819 -154 1781 -15 -725 937 1258 337 750 127 -1054 -546 163
1906 163 476 1125 576 -817 538 1726 -309 -1863 -239 145 -618 703 1031 -342 -176 711 309
1923 309 -666 -1025 -1911 -268 1641 97 -969 425 340 -1061 -61 336 -1551 -1648 610 1167 430 -105
1941a05p39Q63J074j470j342J400J043r18J010O30j747o77J374K91j275K8K31
1958c29K65J584m96j354O58j54j359J046Q99j641l57K177M97j470m98L18j51K47
1976a18m01p21J096Q70j053K30J343j481j532J648K27q44Q0P60r3M60J17q28n47
1995g87L06k65N58N67q23k46K163K55k431l60J411k99l75K99P3L50N32l81k12
2014C35N79j344j162J874R47j680j04J638O4p10j65q40l58R51M19p67K65j04m9
2033b11J678m01k693j97K140L6j258Q25J80p21O37N66m21p74q80l75K324J211
2051A666k028p90K012K34p90l26o52p33J122J282l47l63K4l65R74L11j884m69
2069a122J319K97n83J327j01j881K31J534m20j282n92N25J283J290j654j577J697
$$ plain form
1941 -105 -844 19 1093 -377 -1719 -319 724 -194 816 1446 -301 -978 396 687 -588 -560 -329
1958 -329 -64 1520 1024 -330 328 174 -1185 -139 760 -881 -1238 939 1436 -34 -532 -214 -365 -118
1976 -118 -519 -1240 -144 726 -327 -97 1246 -235 -1767 -119 108 -736 -656 104 11 471 588 -240 -787
1995 -787 -481 -746 -188 379 -444 -690 1473 1728 -703 -1063 348 49 -326 -27 46 396 928 547 335
2014 335 914 -430 -1592 282 1229 -451 -555 1083 1147 437 272 -568 -926 25 444 -323 -58 -162 -211
2033 -211 1467 1066 -1627 -1824 316 352 -906 -81 99 -622 15 581 160 -614 -1494 -1869 455 1666
2051 1666 -362 -1152 860 1094 304 -22 -674 -1407 -285 997 650 287 311 -54 920 1231 -653 -1122
2069 -1122 197 494 -89 1238 1137 -744 -513 1021 601 -681 -1273 -748 535 1825 171 -1406 291
2086B91N46j372M78qj271K42K190k07r77k71l91N6Q42m16j109O10R48k25J044
2105A000l8k065n51K121p7j586M38R16K45L53l27m84K60n56n81N82J419j362o21
2124i14J673R34j519j90J4o26M02Q35m84M8L61l31M84L20j450j140J808r5r74
2143h44R43Q48j141k83J111k29r72k29q0P10P78o23p26J304N42j908R2R22o03
2162c88p46R67N96k56N65l30r07N13j8q74R87P7q93Q10J557r99j184N22K77q65
2182e89L72M49k88L86N31n38K37l2j667N82J406p24q43Q97J031j018P7Q6q88l62
2202h95L95O4K10O62p32k51J549o74j530P41J47j010P10J462m94n18M8K16Mj2
2222I2q52o9J319J90p45P76N60j659M08J006j172r97J292M67j77M41l57o21Q22
$$ plain form
2086 291 837 -535 -57 -65 -1336 -1094 1096 889 -88 -359 -750 -694 148 -268 -1377 -767 181 -44 1000
2105 1000 962 -1103 -1654 467 390 -1196 -758 158 403 756 429 -55 205 -351 -932 -350 1069 -293 -914
2124 -914 759 1693 174 -16 -2 -628 -226 609 125 173 534 203 687 1007 -443 -1583 225 130 -844
2143 -844 99 947 -194 -477 634 405 -567 -796 -876 -166 612 -11 -737 567 1109 -799 -707 215 -388
2162 -388 -1134 -167 429 173 738 408 -499 14 -4 -878 109 186 -707 103 1660 661 -523 -1 276 -589
2182 -589 -217 232 -56 330 861 323 560 528 -1139 -557 849 125 -718 179 1210 192 269 355 -533 -895
2202 -895 -500 -436 -226 436 -296 -547 1002 328 -1202 -461 -314 -1324 -614 848 354 -164 -116 100 104 92
2222 92 -760 -829 490 680 -65 711 1271 -388 20 1026 -146 -1143 149 616 439 880 523 -98 724
2241G24o9j268O27L51q95N57J478p98j200O18L15q94k08K42m4O71Q9n76M33N91
2261G44j532m28J358l69q19P53M47l63K76N28o57m11k55k92O83P71n54j67J033
2280G46l64r71L02L51o19J38Q82K4k90L78J27k81jq17m51J346j06p15L52J441
2300A472j113m38P45m53o75K09J91j01N71K4p20Q35m36j136N90O24r07j60J350
2319D72L46r46J86j01n55Q3K82m21L66J45l18N67J233j532j018J137L91j142R6
2338g29J084k62J08K74l00R0O9p22k18Q61j92l73J312J93j192n2Q02o37n44M94
2358F6j52L02N94l50rR1j15j080O38L43q83K35J399p27n57O84j75o31k70Q2J17
2379c98K44N27n24L31O28j194j85O50o06p16J147O09r15N91K65n04j20k00o64
$$ plain form
2241 724 655 -613 14 365 -530 27 1505 707 -493 125 440 -454 -662 -420 -464 207 296 -280 153 744
2261 744 -788 -1216 142 -227 -1046 -293 154 -209 67 595 -62 -473 -728 -1020 -337 434 -120 -287 746
2280 746 382 -589 -287 64 -555 -417 465 489 199 577 704 423 422 -395 -846 500 394 -321 31 1472
2300 1472 359 -79 666 213 -462 -253 -62 -163 408 432 -288 547 111 -1025 -435 189 -718 -878 472
2319 472 818 -128 58 -43 -598 -515 -233 -654 -288 -143 -461 106 1339 -193 -1211 -74 317 -825 -729
2338 -729 355 93 201 475 175 265 334 -388 -606 255 63 -310 1002 1195 3 -49 753 116 -428 66
2358 66 -86 216 810 460 451 542 427 -653 -15 328 -555 -320 1079 352 -205 479 304 -327 -597 -515 -398
2379 -398 -154 373 -151 180 808 -386 -571 79 -527 -1243 -96 513 -402 189 454 -50 -170 -370 -1034
2398a034O53O29l68k34J364n45r06M01O7r55K55J033j01k06M19j51N4K71j280
2417f34k25J104j03j161J217Q08j040J55N10p33p02N14p2J85J99ok64P25M9j715
2437a189R63M24j193q5J408Lo37P49m5p01k40P4j89O09K13n80P67O84r49o61O15
2458D0K2q18O37L14l23L32N03m71J8J40p50k93Q90k44l82J229k49q35M21P12j162
2479b69l79N65j48J22N79o07K05N23p26n09N79m6r48M85J236n98m93O14j5k65
2499i5J53o49m25J010J82l94N89J36j243O75R01j237p48R94M80J62j6J17p08J02
2519a4P3p28Q52L2q88O30J309o90j081O77p5n82K34nl09M92P61n23j36L63r91
2540e99O7O89n44m90P26O73o68J06O25j217j59N49K8m51O77q90L43J513l38j595
$$ plain form
2398 -1034 -381 248 -120 -354 1010 465 -441 -40 27 -928 -673 360 259 53 472 321 375 646 -634
2417 -634 -859 245 142 -1019 198 1006 -34 121 631 -102 -804 -290 -362 -177 22 16 -248 477 526 -1189
2437 -1189 -226 198 -995 -1080 328 331 -306 443 398 -303 -543 -469 -658 -49 164 -416 351 1035 86 -575 40
2458 40 62 -756 -119 195 -128 204 707 236 254 394 -356 -649 241 -3 -385 844 595 -240 181 893 -269
2479 -269 -648 -83 -231 -109 470 -137 68 591 -135 -644 -65 -111 -1059 -574 662 64 -429 185 170 -95
2499 -95 58 -591 -1016 -6 176 -218 371 507 -736 -61 840 -397 -1145 -151 329 491 475 592 -116 -14
2519 -14 59 -669 183 215 -673 -43 1266 576 -505 172 97 -485 -251 -256 -565 -73 688 165 29 392 -599
2540 -599 -532 157 -387 -877 -151 522 -146 -40 585 -632 -791 -242 -214 -665 12 -878 -535 978 640 -955
2560i55N14M85o17J41N30l14J39P35n56Q4p7k36o32J075o0p22M73R55o04k39N99
2581G18r57o13O87M68m78K85J22N4N27n73j058L54R05q54K29P86m06p77J015J60
2601E94j085k76M96k49O60L01p44L7P98o06k70O89n50j079J152Q87o29m03M90
2620B13L0k41O2q62K51P48o9j42R36k40r67L26O26r85l92P38J33j39O91m25l48
2641e6L13R6o25K95r7q39R83J150j168m43O36rj161L42K92m77O82L55l35K70J81
2662C85r20J55N89m72j022J118O34m36L05J01q71L5L26k01j30N1K31Q1J218r05
2682B72r05Q60j00r13M80O26n71N7J161m66l13r2l94n5Q33l55r28J076N55p44
2702H4n9M20q52l63R99j87m13J37M42J63M55o90q93M21P48r07J5Q32n09j33P51
$$ plain form
2560 -955 -441 44 -573 -432 98 -216 -77 658 102 186 109 -127 -759 316 256 -466 7 962 358 119 718
2581 718 -239 -852 -165 303 -175 110 232 286 813 240 -818 -464 441 -413 -184 602 196 -581 434 594
2601 594 -491 -767 -271 -520 140 441 -303 -266 532 -74 -344 345 -205 -1284 -132 755 126 -277 213
2620 213 243 2 64 -798 -547 201 132 -10 926 686 -281 45 671 -314 -706 32 165 26 717 292 -56
2641 -56 257 353 -272 23 -74 -913 70 1220 52 -391 245 236 -925 -583 -291 -768 -86 269 -66 204 385
2662 385 -535 -380 209 -263 -1285 -167 467 31 336 437 -434 -399 -73 -274 -404 -353 -122 -41 1177 272
2682 272 -633 227 127 -786 -306 320 -251 -194 967 501 188 96 -298 -353 480 125 -803 273 828 84
2702 84 25 445 -407 -770 229 42 -371 -234 208 371 826 136 -757 -336 412 -495 -480 352 -157 -290 461
2723D61N4o93k81j77K86N36K64q61M92Q85p08j23Jn70m33J122M62q71M45N89n76
2744C04L3K5p70r6O90k42J43P31m22n40O40L20j000o62O74L2N15M6k73j93L12
2765B67j20p43O57k99p54Q80Q39n33k59K43j94l06L48j48o10M20O11j99M45k02
2785C43q83M78O28q87k86J206k61o80P24J26l85j0k8l79L82L87p33K77J023l76
2805F66p18N28j11j076N96L17n08M92O14k22k14np53J98K33m07J21Q25k20q22
2825d66N36P39p86p05K26J08J09O00j51k98N77k38q41R51m75p31K92O27op5L21
2846C14j96m87L33J3o55N09k4k70O50P23j186M68K69o17k81L02K26k43M01L39
2866E88n52J10l16m88L71M98p09o2R13m9o63O90K7j226J93N52m20K43K08j62N73
$$ plain form
2723 461 515 -178 -459 -636 -350 186 450 -411 81 966 258 135 136 -434 -867 255 717 -154 291 880 304
2744 304 337 362 -408 -504 186 -56 87 818 396 -144 496 816 -184 -846 -172 -140 375 421 148 -45 267
2765 267 147 -596 61 -238 -992 -112 727 194 -65 178 -16 -322 26 -122 -732 -312 299 100 545 343
2785 343 -540 -62 566 -321 -607 599 338 -342 382 508 123 113 85 -294 88 475 -258 19 1042 666
2805 666 -52 476 365 -711 -115 202 -306 186 800 578 364 359 -394 -196 37 -370 -249 576 356 -466
2825 -466 70 809 23 -682 -456 -348 -239 361 210 -88 489 251 -590 361 -114 -845 -553 74 68 -7 314
2846 314 118 -369 -36 -23 -678 -169 -193 -463 187 910 -276 192 461 -156 -437 -135 91 -152 249 588
2866 588 36 146 -170 -658 -287 211 -498 -560 353 304 -359 331 358 -868 -675 -123 -543 -300 -92 -254 319
2887C19K62r35k59P82o96l81J090K55p29K93O05n68l66K34o5j23M24k40J32P99
2907H33k24j102Q97K45q11k27P94l81k3P71j09o30L67k8n98N41k80l37M15Q41
2927I54q61l36P17l00o50N3L77k89J88L26J07J33r3p70J43O34p00m40J554j62
2947E85r48O77N42r19j6J16l66M51N4l1O8O52l66n29N28n30m05M71Q54o92m31
2968b35J015k54j79J13o34m85J018k37m87J024k26m87O2M15p98m05O39K59l05
2987a87N10j70k71K20l81m81J88K99o70N84L89j48n02R42k47j126M48K89n42L60
3007d96J68J5K59M16j125J50P14o15k09N94J45m42M91M06m08j26j2m19J11M48
3027F5l98K49Q16l73n71N48j21o74n9N69j02q0N39o0l38M45m69l98O12n24n03
$$ plain form
2887 319 581 -354 -613 169 -527 -908 182 437 -292 1 606 38 -328 -94 -159 -282 142 -98 34 833
2907 833 609 -493 404 649 -162 -389 405 24 1 772 663 33 400 372 -226 315 35 -302 113 954
2927 954 93 -243 474 174 -476 -423 -46 -335 -147 179 286 419 326 -444 -301 333 -367 -807 747 585
2947 585 -363 314 856 -63 -79 37 -329 122 176 145 213 865 499 -30 498 -32 -437 34 888 196 -235
2968 -235 780 526 347 460 -174 -659 359 122 -365 659 433 -54 8 423 -375 -780 -141 118 -187
2987 -187 323 153 -118 102 -279 -760 -572 -273 -943 -359 30 -118 -620 322 75 -1051 -603 -314 -856 -496
3007 -496 -328 -313 -54 362 -763 -613 101 -514 -723 -129 16 -426 65 471 63 -63 -75 -494 -383 65
3027 65 -333 -84 732 359 -212 336 215 -459 -518 51 -51 -131 408 348 10 455 -14 -412 200 -324 -827
3048h27Q88L42q68L19N23k50p32L52j75Q0P7L24k22L33n1n34L05J89o21j38J139
3069D53k32l70M96J18o52L66K4m17K86L48m90M55K79l33l64Q32p62m26L84M85
3089D80k72J22N11o44J28R8o06k38O40m65J1Q40j91o13N49L64p53k27M46m67Q4
3110b03K65J56r9K41l31n53P72m08o23N54N18l73n1O77l30n72J96mk44L80N2j90
3132a70Q20j51m92j79M88r02j56R18L1p99P21L53m32K73m94l13K34K00k48j7Q18
3153E03m66j63M31J6q56J39N98l66j56M52j31K00K8n29j85L47j47j78N66L95p45
3174b47m2O13l74k36K85m82K1N69j18K2J28O3m03M56j53p79J88O29j10J49L16
3195D95j51o16M17k9l35M16l2l11N99K50j038M10N52o09o49M09J84o13P43K84
$$ plain form
3048 -827 61 403 -465 -146 377 127 -605 -253 -428 -348 -271 53 -169 164 113 -421 -116 73 -548 -686 453
3069 453 221 -149 347 465 -187 179 203 -214 72 420 -70 385 664 331 -33 799 37 -389 -5 480
3089 480 208 330 841 197 325 423 -183 -421 219 -246 -235 605 414 -199 350 714 -39 -266 180 -287 -203
3110 -203 62 218 119 360 29 -524 248 -160 -783 -229 289 -84 -135 542 212 -360 -164 -168 -412 -32 20 -170
3132 -170 650 499 7 -172 316 -586 -742 176 207 -592 129 482 50 323 -171 -484 -250 -50 -298 -315 503
3153 503 37 -126 305 321 -535 -396 202 -164 -320 132 1 201 229 -300 -485 -138 -285 -463 103 498 -247
3174 -247 -289 324 -50 -286 -1 -483 -462 107 -11 11 139 202 -201 255 102 -677 -489 140 30 179 495
3195 495 344 -272 145 116 -219 197 165 -146 453 703 -335 75 627 18 -631 -222 -38 -651 92 376
3215C76n0k89K97o91J75L52l88m07J067j76l77N42q7o03j63Q91n36m54O30L8j57
3236a0M06m95j68N40k91n90N77M72o08K3Q27l12o06P3q2M6L54j30k40O40Nk86
3258A45J31J40q62J98N60k46n21P34P3k54K48n99m17O10J07m70L23K49k13J30
3278F6L41j89o20J79Q9j19J87K86n8j55K57l49k72L43n02k05J060lr17R80J40
3299E39m55k82L22n39O0K70j69M54J65k7n01N19p3r55L74N73l18R4K79j15j06
3320A09J61k45k86J83m79K89P50m2o16K34M51o08l10L02%l26M59J29j38K22j25
3341A14m29K17K31q33J59R19l10k74N79J71p53K17J84m57J78L05m39O62P2n78
3361f5j24O30n07l90M54L08n97M82K55k77m1Q1l25m1L93n08j66P84j11n14M43
$$ plain form
3215 376 326 37 334 -357 -182 170 -218 -625 442 266 -111 431 344 -259 -422 469 -67 -521 109 147 -10
3236 -10 396 -99 -267 273 -18 -608 -31 441 -167 -144 683 371 -235 -162 -244 -198 156 26 -214 426 431 145
3258 145 276 416 -446 -248 312 66 -455 279 352 98 346 -253 -670 -60 47 -423 -100 149 -64 66
3278 66 407 218 -402 -223 -134 -253 -66 220 162 7 264 -85 -357 -14 -516 -721 339 336 -581 399 539
3299 539 84 -198 124 -415 -355 -85 -254 200 365 338 -163 356 283 -672 -298 275 -43 51 330 215 109
3320 109 270 25 -261 -78 -557 -268 482 440 -176 58 509 -99 -409 -107 -107 -433 26 155 17 239 114
3341 114 -315 -98 133 -700 -541 378 68 -206 373 544 -209 8 192 -265 -87 218 -221 441 513 -65
3361 -65 -189 441 -66 -456 -2 306 -291 191 446 169 128 209 -116 -157 236 -272 -438 346 235 -279 164
3382A64Q9p23R2N08m09j63L81J55K00j54l55o9K49l52k56P86K40p06J84O41n37
3403c5k20J58P5k21N8J05j9O31O5p00j76L71l56k11O33k24P6L21%k55P7L16o53
3426a84K72M1l95M29L92n00k44O34q0j082N72K87m32J93M85k89M6p7j87j21M1
3447a99k03j52O15K65n88J07N10n12k39N69m82r1M85l9p6K58l16j11K16k1o72
3468f76M86N08m30J28K67L7l64K27k4k16K41O5j34M79j57j26q1L63o13k64M62
3489A78k30m4J93M15o52L13q1j28j06K27n93N61O77o55k87O41k74l82l6K52m77
3510d88L38L39L8p0j0kk74J06l55j29M57K85j42l33Q04o58j37K34j04j07J17K08
3532A17k02O79l00k71J87j7n99J00M74l79j2K83L25m37q0L32o95N37k08O1J0M99
$$ plain form
3382 164 253 -470 -378 130 -279 -442 -61 94 294 140 -215 -284 -35 -387 -643 143 383 -323 -139 502 -35
3403 -35 -255 -97 -22 -243 -185 -80 -99 532 597 -103 -279 92 -264 -475 158 -66 10 331 331 76 153 469 -184
3426 -184 88 129 -266 163 555 55 -189 445 365 -717 -145 142 -290 -97 388 99 145 68 -119 -240 -199
3447 -199 -402 -554 61 326 -262 -155 355 -157 -396 173 -309 -400 85 46 -30 228 -88 -199 17 -4 -676
3468 -676 -190 318 -112 16 283 320 -44 183 159 -57 184 249 115 594 437 311 230 593 -20 -284 178
3489 178 -52 -96 97 512 -140 173 92 -36 -142 85 -508 53 730 75 -212 429 155 -227 -263 -11 -488
3510 -488 -150 189 227 157 147 145 -129 -23 -378 -507 -50 235 93 -240 564 -94 -231 3 -101 -208 -91 117
3532 117 -85 594 294 23 210 193 -406 -306 168 -211 -223 60 385 -52 -132 200 -495 42 -166 -105 -95 404
3554D04o32K50J62j78l81J63L16m78J28L59j54M6ml29K54j79j85J58N30l91r4
3575b35O63K99p27k43M55m41j2M29l80L85K55l95j73L83o5o72M13L59n87L02M52
3596D65mm28Q6j32k84L50j04j52N25l24o1Q3K00m14o6L09j45lK78K92k81J5j65
3619D0k73K42J52l24K88M41n82L9O59l49l46N1K14k90K50j58j9L36J85l90j3K20
3641C73m03l81P91J03l83K75K16m33QK22o3o22L56j12k8N31l40l84L67J24n05
3662b88J4N84o50J32N04N4o48J69J06j23j64j63o0L28L26m90p1O25l80m66L34
3683c27J46J23M1J33j51L41j16k71r0J89n05K46L74j19o0O58k46l94r6K38l42
3704b28k6K15n7J18L96l36j85N54m74m25K04K46m32M92K55n07J20J34m08o0L67
$$ plain form
3554 404 -228 22 184 6 -375 -212 104 -374 -246 113 -41 5 1 -328 -74 -253 -438 -280 250 -141 -235
3575 -235 428 727 0 -243 212 -229 -241 188 -192 193 448 53 -120 263 198 -474 -61 298 -289 13 465
3596 465 461 33 119 -13 -297 53 -51 -203 322 -2 -63 20 220 -194 -260 49 -96 -99 179 471 190 205 40
3619 40 -233 9 161 -163 125 566 -16 23 682 333 -13 38 252 -38 212 54 35 371 556 166 153 373
3641 373 -30 -411 380 483 100 375 591 158 166 388 325 -297 59 -53 -81 450 110 -274 93 217 -288
3662 -288 -274 310 -340 -208 296 350 -298 -129 -23 -146 -310 -473 -533 -205 121 -369 -440 185 -195 -661 -327
3683 -327 -181 -58 -17 116 -35 306 190 -81 -171 18 -487 -241 133 14 -46 612 366 -28 -124 114 -228
3704 -228 -254 -39 -96 22 418 82 -103 451 -23 -448 -244 2 -430 62 317 -190 -70 64 -344 -404 -37
3725c7l95J03L53ll43L56K9l76K3J26l2r9M11J61j91j6r1k85L08kk73J46L01m20
3749b46K95O93m23m04K90J88o84M61P0J42K50j96n65N10L0m32j75O32k39m35P22
3770D84K08m79r8n6j52p3K61j4j90M70r9l35N37m45l13N54m13j71K60K52mr2J35
3793B27j65l75J52q4k39N54O7j10n8K50m17q8M26l70j46K13J41N0J61o2k54J93
3815F6o2j57J92J11l72J23N32j0n75M55k27j20j77N8J82r0J40j32J70J21o65j5
3837d52L07J81k78K82K6n8K53p9m54J79j29On1K85qk41L13K66m10K5J95m22L4
3860b30J81K29k99K77n1K1L99m73m90L81M10n00L44K79j60m35n8O0p6J82n7J42
3882G6K29r9k58K43Q8l33n4J76l11J04M34j76j80R3J70k51J72k26l59K58N61m51
$$ plain form
3725 -37 -432 -329 24 21 -322 34 63 -313 -290 -164 -196 -295 116 277 86 70 -21 -306 2 0 -273 -127 174 -246
3749 -246 49 742 319 -85 205 393 -291 170 240 382 632 436 -129 381 411 -21 -196 436 197 -238 484
3770 484 692 213 115 59 -93 -166 95 81 -109 361 262 -73 464 19 -294 260 -153 -324 -64 188 184 92 227
3793 227 62 -313 -161 -245 -484 70 137 27 -31 219 -198 -286 140 -230 -376 -163 -22 28 189 127 -127 66
3815 66 4 -153 39 150 -222 -99 433 423 -152 303 76 -44 -221 -163 19 -71 69 -63 107 228 -437 -452
3837 -452 -145 36 -242 40 66 8 261 182 -272 -93 -222 -216 -267 18 10 -231 82 348 -62 -37 158 -264 -230
3860 -230 -49 180 -119 158 107 128 527 54 -436 -55 355 -145 199 478 318 -117 -175 -115 -191 -9 -66 76
3882 76 305 206 -52 191 279 -54 -108 68 -243 -139 295 119 -61 32 202 -49 123 -103 -462 -204 357 -94
3904i4M5L71j90n73P02k60l73K93L65k22K06K34n57o7K66l93l7N64k32j59M22
3925C11K16m68o1K42l82l1K02R5j14J32lJ72k6j76o69K37N12m61K05J60o4J01
3947A30j59n3j6R3j95jK7J26j52L17L49o87j0M53l12l68L29K71p5K11k01l51N07
3970B33m92OL13jl0n5L23r4m65K81K95n71J94Q7l14M92K42k48j70L7j21j90N35
3993B87k60k22K64J98k25L3Q6j53k73O5N9J14j2P5j32J23K05n65oM18m33J05N68
4016C19j4n98L57q8m4n0j96k13N72K39l60J8L90k95q8RN1l60J34N47l53j06L89
4039B60k94Q0J72j82l40M44j09l53O16J74m68K4M0j82j97K52j5M6L37k66J18P8
4061B35k87n76P28p8m38K34L01j64J18J58k92j31k67M14j34J72j01j4K54J79m22
$$ plain form
3904 -94 -49 322 132 -441 261 1 -372 -79 286 64 270 504 -53 -120 146 -247 -284 280 48 -111 311
3925 311 527 59 -2 240 -142 -173 29 124 10 142 139 311 285 109 -560 -323 189 -272 -67 93 29 130
3947 130 -29 -82 -98 -5 -200 -201 -174 -48 -200 117 466 -221 -231 222 -90 -458 -129 142 67 278 77 -274 233
3970 233 -259 -253 60 59 29 -26 297 203 -262 19 314 -257 -63 24 -290 202 444 196 26 63 -58 -248 287
3993 287 27 -195 69 267 42 75 161 8 -265 -200 -141 -27 -39 36 -96 27 232 -333 -339 79 -354 -249 319
4016 319 305 -293 64 -24 -68 -118 -314 -527 45 284 -76 -58 332 37 -51 -42 9 -351 -217 330 -23 -129 260
4039 260 -34 46 218 36 -304 140 31 -322 294 468 0 24 64 -118 -315 -63 -78 -32 305 39 157 235
4061 235 -52 -628 100 22 -416 -182 119 -45 73 231 -61 -192 -459 -45 -179 -7 -108 -122 132 311 -111
4082a11k77M10o3l57M54M2m3J40K27k91j29k37n6L71no8J20L65j21n18K86j07
4104C2j62J53j3J8L8J5k98L69J04m39o9L08l16j93L74L60l07J00R4j93j02j76
4126c03n0P8N85k33l35O75k05m93J60k9k40Q0L11N0j7Q6P4l70J57k7q3M18k23
4149F6RQ2J48j80k84M40k23K2l38N31k85L7J62q5K07k68j99K18K8l28k4N13K2
4172B71k96L46l08k25j90N9j45M29L7j20P8J48O1o89O05p5j70P6L61m03K63m1
4194G2j74N7J86l28M6M70j44m66N00J59n12N0M47m12k46M52lkj18K11j30n0K37
4217C02m38K00Q8l42J37N28m31QK56k71k68M3J31k08M17r3j92J25K29m82k8L49
4239F0l76j57L75p5J05m2L49m64m9J70r7mL39j72j34M58j77m75L47R3l87J00L78
$$ plain form
4082 -111 -388 22 -41 -398 56 98 55 195 422 131 2 -235 -291 80 75 7 127 492 371 -147 139 32
4104 32 -130 23 10 28 66 81 -217 152 256 -183 -252 56 -260 -453 -79 281 -26 74 168 -25 -127 -303
4126 -303 -353 -275 310 77 -258 417 212 -281 -121 -150 -390 -310 1 51 34 120 194 -176 -19 -46 -129 289 66
4149 66 75 157 305 125 -159 281 58 80 -258 273 -12 25 187 102 309 41 -158 60 88 -240 -264 249 271
4172 271 -25 321 13 -212 -402 -343 -488 -59 -22 -142 -64 84 145 -544 61 -14 -184 -108 253 -150 113 72
4194 72 -102 -45 141 -187 -141 329 185 -281 219 378 -134 -84 363 -49 -295 157 154 152 34 245 115 65 302
4217 302 -136 64 152 -190 -53 475 44 52 308 37 -231 -188 -57 -265 152 59 -133 -8 221 -261 -289 60
4239 60 -316 -473 -98 -173 -68 -110 239 -225 -274 -104 -201 -205 134 -38 -172 286 109 -366 -19 74 -313 -213 165
4262A65j04j08L4J43k8r7o4k55M20j81j02K17J62k03j07M83l21k37K30j09q8K35
4284H5K16j6l36j3k05j6N11p00R2O77j73q0J03q2l9N1j88k7K33K3j24j02M57n40
4308a93P7M19o22N5J42J83R8L2O1k49k0K40k98j34J57L20k03J43L26q13L83Q2
4330A86j29l74O75k74O9Oqj38J20l20P6K08P4k33J8N12p57M58l4j77O1L33n61
4353b09o7K26M2M3L38k77l30K79l8L0k00M23j00l13K64K17m15M3P0k52j8J84J07
4376D7j40N51m50m4J96k4l93J52K42k56K38N1p1nj21k48j09M34j89k96N45K65
4398C75m22l8Pp5j55J24l5j20L55j40J55K01j19o12M18Q3m48L89J44Mk17K15r2
4421cl2J97k40r5K68O3O3Qj8k94J31K46k78l14K77J94o8J50R8l42Lp2k03M26j44
$$ plain form
4262 165 61 -47 -13 130 102 5 -59 -314 106 -75 -177 40 202 -1 -108 375 54 -183 47 -62 -150 85
4284 85 301 285 -51 -64 -269 -285 226 -474 -382 295 122 42 145 63 24 75 -113 -140 93 116 -8 -110 347 -193
4308 -193 -116 303 -319 -264 -122 61 159 191 252 3 -17 223 -75 -209 -52 268 65 208 534 -279 104 186
4330 186 57 -317 358 84 153 159 151 13 133 -187 -111 97 171 -62 -44 468 -289 169 135 -42 19 352 -209
4353 -209 -276 -50 -8 35 373 96 -234 45 7 37 -163 260 160 -153 111 328 -87 -44 26 -226 -244 -60 47
4376 47 -93 458 8 -36 160 136 -257 -105 137 -119 119 170 99 94 -27 -275 -384 50 -139 -435 110 375
4398 375 -47 -85 -78 -153 -308 -184 -219 -339 16 -124 31 232 113 -499 -81 2 -446 -57 87 91 -126 89 -3
4421 -3 -35 162 -78 -173 95 158 221 229 211 -83 48 294 16 -298 -21 173 105 255 353 11 14 -58 -261 165 21
4446B1q1J02M32j67l46J61J21m14J3J68r8l4M30l95J43j5o1J53M7k36k48K55L88
4469C39m24j10M75l56j6M0J9OM3J66k28L91pn69L52J87l93k35M07J59k66L80l62
4492bK08N1r5l19J23J43k34K55K34l33L7K28l44M2L1K21p04N25K49n05L03L1l59
4515b14o9L35k78J16R2N0K74j06j29j70j15K96j44K53J40o06J17N83m09q4j02
4536a70R6k38K44J83N6j25J16%l38K24j84p9K69K17m47M18j5j24J02O5m78l26
4558e34K53L61j40O5K2Q8j10L4r5J24R8o00K45N18l42j04K78m04J73K3k21p3K54
4581h7J0o9K91m6j96r5J44l6k17K3M69l62K62L22p02L10Q1m17L99j00J08M9m4
4604I7j5j61L57K9k91m6j12J47j8K5pl9N4J03l56Q1O2j9K18J43k05m7K40l13k40
$$ plain form
4446 21 -60 42 474 307 -39 122 243 -171 -158 10 -88 -122 308 -87 56 41 -20 133 180 -56 -304 -49 339
4469 339 -85 -195 280 -76 -92 -52 -33 -27 16 182 -46 345 338 -231 121 308 -85 -320 87 246 -20 360 -2
4492 -2 206 257 162 -157 -34 109 -125 130 364 31 68 296 -48 -6 25 246 -458 67 316 -189 114 145 -214
4515 -214 -283 52 -226 -110 -18 32 306 200 71 -99 -214 82 -62 191 331 -275 -158 425 16 -68 -170
4536 -170 -74 -312 -68 115 171 46 162 162 -176 48 -136 -215 54 271 -176 242 227 103 205 270 -208 -534
4558 -534 -281 80 -60 5 27 115 5 39 -56 68 166 -434 -189 329 -13 -117 161 -243 -70 -47 -268 -341 -87
4581 -87 -77 -146 145 99 -97 -192 -48 -84 -301 -278 191 -171 91 413 -289 21 102 -315 84 -16 92 141 97
4604 97 82 -79 278 307 16 -30 -142 5 -13 12 5 -34 20 123 -233 -152 -90 -109 109 252 47 0 240 -73 -313
4629c13J32M2m0J50nP1J09Jl06K59k6p9j10K18Pn9NJ62k50n7k0J60l93L91j19
4654g0K28L33l95k27K39J77m50M10k06j11M23N6j35j78j57j50J94k3J1m1J95J19
4676B42m22K25n2l4J3j9j28J5K35qj10J47k59k5L83k39k99k42N37q7R3J72k31
4699i3j21J26j65R7P0LJ8K55j06Qj70L33l33m92Q04j82j7R1R5ml50K39m65K07
4723a52L38k64J46J58l48j24L58o9m18L38M0k69k1O17k45N6K41n03R7o0j0l37
4745d31N02R7Ok54J27j24q2K26j38n9J58O7j9R1o2k66L20l36K35l28K82l4m4J01
4769C5J41K0q6k12k5L09J6q1o0K92l28j3J57j2k07J45l4k11O7K74k53K67j36j67
4793a02k16L60j13o4L45L4l72L28j20k22J15k33J02M8K07l26L18q2J35l89K15
$$ plain form
4629 -313 -181 -139 -179 -29 -34 37 146 147 -159 100 74 -5 -115 103 110 51 56 218 -32 -89 -109 51 -342 49 -70
4654 -70 158 491 96 -131 108 285 -165 245 39 -72 351 407 272 94 -63 -213 -19 -42 -31 -72 123 242
4676 242 -180 45 -7 -41 -28 -47 -175 -160 75 67 -43 104 -155 -180 203 -36 -335 -577 -40 -127 -34 138 -93
4699 -93 -214 -88 -253 -156 -86 -83 -65 190 84 92 -78 255 -78 -570 234 52 35 126 221 217 -133 106 -359 -152
4723 -152 186 -78 68 226 -122 -246 112 43 -375 -37 3 -266 -287 330 85 141 382 -121 -24 -84 -94 -431
4745 -431 71 168 174 -80 47 -77 -159 67 -71 -130 28 95 76 167 105 -161 159 -177 58 -270 12 -22 -66 35
4769 35 176 196 110 -102 -127 182 198 117 57 349 21 8 165 153 -54 91 57 -154 -87 187 -66 201 65 -102
4793 -102 -318 42 -71 -135 210 244 -128 200 80 -142 -27 -260 -158 -110 97 -229 89 7 142 -247 -32
4814c2K9l05L12J34j76J14n7R4K5M5k94o8K69j1l20L67J31l51P0L8k09J2K48n5
4838A0J4N1%N9P0k15m06K61J05j80N1L52j75o1K52p8n42J68J58R0P4q8J99R7j12
4863A54j84k23K72l47J55K83m2k13L29j75Pr1r7R8L5L0J08j46L31m73ON16m60
4886a27o7L35K3j95j19J05L41j49k9J77k69m1R7l72L49P5j10j95N05m01j76L70
4908A27j39p3o5J04M9P9K8l67K18R0j34j69K00R4L2J46j87J2r3j48R9J99jl5q9
4933b3K48j65p5L30n90m8L97r8J32j88M11l51J15k6k19J12J49j99J2K56m14k7
4955b61P7K69p7q1K01k79M32k38J5k38K07l7l53L99j23k89J88K43j21j4K31M8
4977A99l01q2J34P0J23l53J59J18J18k49J64J58m27J1M75j66k38J73J73l75M2
$$ plain form
4814 -32 -3 -308 4 138 -38 76 19 113 138 183 -111 -179 90 79 -241 126 257 -94 -24 14 -195 -183 65 10
4838 10 24 75 75 134 204 -11 -417 -156 -51 -231 -180 172 -3 -64 188 110 -432 -264 -106 -16 58 -30 169 266 154
4863 154 -30 -253 19 -328 -173 110 68 -145 184 9 16 -75 -172 -74 -39 -9 99 -47 284 -189 -183 333 -127
4886 -127 -194 141 164 -31 -150 -45 296 147 118 295 26 -15 82 -290 59 134 24 -171 334 -67 -243 127
4908 127 -12 -85 -150 -46 3 82 110 -257 -39 51 -83 -252 -52 42 74 220 33 45 -48 -196 -97 102 101 66 -23
4933 -23 225 60 -15 315 -275 -323 74 -24 108 -80 331 -20 95 69 -150 -38 111 -88 -76 180 -234 -261
4955 -261 -184 85 8 -73 128 -151 281 43 58 -180 27 -10 -363 36 -87 -376 -188 55 -66 -80 151 199
4977 199 -102 -184 -50 20 143 -210 -51 67 185 -64 100 258 -169 -158 317 151 -87 86 259 -116 -74
4998g4K39j37Q6p7o3OJ48j47qJ45j89k24K97M4k83L70N0r1q7N8l81L11m0p0k10
5023c27N07j95J1o3K79k94j87N04j12l06J17K71m70L40L6k68R4p3j8k4L78k49
5045d9L8J37j73Q1j40J89l70M43o9r7M8J14l1%k11j6o1P5P9r4J42J11j51M0J7
5070E2k43J84j24j2k1J9K66j32J26J74m85P8k58J97J52L11o5j81mk64K85j06m0
5093i1j2J79j54j30J22M58k95k69K29j12q9L01j92J23J71j76r8l5M75n34J79q
5115D2m0PJ83j09J03l25N0J80k49K34j09J4J2J31p5K54k32k61J52q1OO1j03l0
5139a85K29M2k53k8K02l05K19K01k40K2K44P9j74qq3l0k4n5K14j68J37L16n19
5162a67L96m23K8K03J96m3k80M11j6l74J50Pj84O1q1M6K50O3l45J75N4k99J65
$$ plain form
4998 -74 165 28 114 37 -26 -20 128 -19 -27 118 -71 -295 2 46 -237 133 183 92 5 63 -318 -7 -47 -117 -327
5023 -327 180 -15 -4 -67 212 -82 -269 235 123 -183 -66 205 -265 75 111 -157 -63 -136 -154 -178 200 -49
5045 -49 -11 126 -47 34 -106 83 -287 156 87 -10 38 152 121 121 -90 -106 -167 -92 -13 -107 35 146 -5 35 52
5070 52 -191 -7 -131 -143 -164 -145 121 -11 115 289 -196 -118 -376 -179 -27 284 219 38 34 -230 55 -51 -91
5093 -91 -103 76 -78 -208 -86 372 77 -192 37 -75 -164 137 -55 68 239 63 -35 -70 405 -129 50 42
5115 42 2 9 192 83 186 -139 -89 91 -158 76 -33 -19 -7 124 49 303 71 -190 -38 -119 -113 -52 -155 -185
5139 -185 44 86 -167 -195 7 -298 -79 122 -118 -96 148 227 53 45 -38 -68 -92 -147 67 -101 36 352 -167
5162 -167 229 -194 -166 37 233 190 -90 321 305 -69 81 88 -96 -35 -116 -70 180 243 -102 73 127 -172 -7
5185gj12r9K71j30K63r8Q5j46j31o3K88k59P4K26k45M9K66k84m3K01k48K00j10
5208e2K13m36L51J58j70J82o2Nk54O7J08j26K16n4nl17K20N0k08J40l7L0Q0m21
5232c22N90r9k56o1K21n5j57m4K18M0o0K02k13L3m6m1k42L67j16K49k0Qm09N8
5256a55J21N1l3l7m9Q2K38j14n4P4q2j75j50L58m5j78J27J03J50j76M0p1J05j10
5280B0j26K80j37J0N6K03k67K06k74K18k82k53O17j49j5m0j07j73J79M4M0KJ55
5303B07k86L60j47l32J35P1k37J22O2K22k43j77J41K38j65K39l91J99m6j22N7
5324i3Q3J20j75m6j6M7K33k10J29P6J33k92j21L42j73k84M68l26J7K41PO6l22
5347i6J29j65J23Pj72J46K89j22m21M10k16q5j05m4K59j9J73k83J56j06K53k51
$$ plain form
5185 -7 -119 -218 53 -77 186 88 173 27 -104 -167 121 -138 -64 162 -83 -34 232 -52 -95 106 -142 58 -52
5208 -52 161 -275 76 234 64 246 184 189 -65 2 110 -16 200 146 141 -176 44 94 -114 26 -11 19 99 -322
5232 -322 268 169 -87 -148 73 18 -139 -183 35 75 15 217 4 37 -9 -50 -292 75 -41 208 188 196 -213 -155
5256 -155 -34 17 -16 -53 -102 -20 218 104 50 124 42 -133 -283 75 30 -148 -21 82 232 56 96 25 130 20
5280 20 -106 174 37 47 103 306 39 245 -29 189 -93 -346 271 122 107 67 -40 -213 -34 10 50 52 207
5303 207 -79 281 134 -198 -63 8 -229 -107 -45 177 -66 -243 -102 136 -29 210 -181 18 -28 -150 -93
5324 -93 -10 110 -65 -111 -127 -80 153 -57 72 148 281 -11 -132 210 37 -247 221 -105 -88 153 160 226 -96
5347 -96 33 -132 -9 -2 -174 -28 261 139 -282 128 -88 -173 -278 -322 -63 -82 91 -192 -36 -142 111 -140
5369a40K67l06p3L44J57m63M11j20j25k03K62l3k4K24l20J67n0J10J11j31J75
5390B40l78M9N3J58j46P0K40k49j36L12k19j96M11j47L8j29K01k22K37k74j9J72
5412F6L7k82K37J19k63L5R5M4j97K2j30N0L36j85J16l6m5j36N5K98k45N1J15j47
5436A0k35K76M5k34L39k93N1j37M42j16M4J30j85j79Q8n5Oj24R3K0P3J0Oj3J06
5461A68l96K58lk2k18L32p3O3k02K00r5o2k26N7L10j9j14K62PL1l67R6p1j59L97
5486A54k65L40k43J8J70j65j15K6j56N06j46l49K85l9q8O0J7j59R6K86k02m5P8
5509F4j38o0R4K69l57oK77k95J09K74j46k69K96j25q6j5J41j71J79qNq2J49l05
5533b06R7r9Ll1K0J67n9k7O9q2k5L14l94J47Q8K25k87M37o0k43r9R1Rj31K86n86
$$ plain form
5369 -140 127 -179 -252 92 249 -214 197 77 -48 -251 11 -22 -46 178 -142 25 -25 85 196 65 240
5390 240 -138 -89 -36 122 -24 46 286 37 -99 213 -6 -202 209 62 100 -29 172 -50 187 -87 -106 66
5412 66 103 -179 58 177 -86 -51 44 88 -109 -87 -217 -167 169 -16 100 64 19 -117 -62 236 -9 42 157 10
5436 10 -225 51 96 -138 201 -92 -41 -178 264 148 192 322 137 -42 46 -9 -3 -127 -34 -14 59 69 75 62 168
5461 168 -228 30 27 5 -213 119 46 109 -93 107 12 -50 -276 -219 91 72 -42 220 227 258 -109 -13 -84 -243 154
5486 154 -111 229 -14 4 174 9 -106 -80 -236 270 124 -225 60 21 -67 -7 10 -149 -53 233 31 -14 64
5509 64 -74 -134 -40 229 -128 -134 143 -152 -43 231 85 -184 112 -13 -99 -114 27 -144 35 27 32 -50 99 -206
5533 -206 -109 -208 -205 -236 -216 -49 -108 -135 -66 -148 -173 141 -253 -106 -18 207 -80 357 297 54 -45 46 55 -76 210 -376
5559c76M39j90J33J46j43M3j25K51r3k02K96l60l2J51J60k92K3l9L85j10L2P1
$$ plain form
5559 -376 63 -127 6 152 9 52 -73 178 85 -117 179 -181 -213 -62 98 -194 -171 -210 175 65 97 168
$$ [...]
8191a00
##END NTUPLES=NMR FID
##END=
