##TITLE=1H_Pr 5-6-1
 CDCl3, 8 sc, 
 23.7.2019
##JCAMPDX= 6.0         $$ Bruker NMR JCAMP-DX V2.0
##DATA TYPE= NMR FID
##DATA CLASS= NTUPLES
##ORIGIN= UXNMR, Bruker Analytische Messtechnik GmbH
##OWNER= root
$$ XWIN-NMR		Version 3.5
$$ Tue Jul 23 15:54:51 2019 Russian Standard Time (UT+4h)  she@DPX200
##.OBSERVE FREQUENCY= 200.13155
##.OBSERVE NUCLEUS= ^1H
##.DELAY= (6, 6)
##.ACQUISITION MODE= SIMULTANEOUS
##.ACQUISITION SCHEME= undefined
##.AVERAGES= 8
##.DIGITISER RES= 18
##SPECTROMETER/DATA SYSTEM= spect
##.PULSE SEQUENCE= zg30
##.SOLVENT NAME= CDCl3
##.SHIFT REFERENCE= (INTERNAL, CDCl3, 0, 15.7039)
##AUDIT TRAIL= $$ (NUMBER, WHEN, WHO, WHERE, WHAT)
$$ ##TITLE= Audit trail, XWIN-NMR		Version 3.5
$$ ##JCAMPDX= 5.01
$$ ##ORIGIN= Bruker BioSpin GmbH
$$ ##OWNER= she
$$ F:/spectra/data/she/nmr/H-F/1/audita.txt
$$ ##AUDIT TRAIL=  $$ (NUMBER, WHEN, WHO, WHERE, WHAT)
(   1,<2019-07-23 15:53:49.29 +0400>,<she>,<DPX200>,
      <created by zg, POWCHK disabled, PULCHK disabled
       configuration hash MD5:
       00 E9 B6 7A A2 85 ED C7 34 08 36 98 17 FE 4E 26
       data hash MD5: 16K
       2E 78 FA CA 93 6E 8C 14 49 50 43 5A D9 C1 41 81>)
$$ ##END=
$$ 
$$ hash MD5
$$ 73 B5 92 FA D3 59 AA E2 41 CE B3 9C DD B3 4E 51
##$RELAX= 
##$RELAX= 
##$RELAX= 
##$RELAX= 
##$RELAX= 
##$RELAX= 
$$ Bruker specific parameters
$$ --------------------------
##$DU= <F:/spectra>
##$EXPNO= 1
##$NAME= <H-F>
##$PROCNO= 1
##$TYPE= <nmr>
##$USER= <she>
##$AMP= (0..31)
100 100 100 100 100 100 100 100 100 100 100 100 100 100 100 100 100 100 
100 100 100 100 100 100 100 100 100 100 100 100 100 100 
##$AQSEQ= 0
##$AQ_mod= 1
##$AUNM= <au_zg>
##$AUTOPOS= <>
##$BF1= 200.13
##$BF2= 200.13
##$BF3= 200.13
##$BF4= 200.13
##$BF5= 200.13
##$BF6= 200.13
##$BF7= 200.13
##$BF8= 200.13
##$BYTORDA= 1
##$CFDGTYP= 0
##$CFRGTYP= 5
##$CHEMSTR= <none>
##$CNST= (0..31)
1 1 145 1 1 1 1 1 1 1 1 1 1 1 1 1 1 1 1 1 1 1 1 1 1 1 1 1 1 1 1 1 
##$CPDPRG= <>
##$CPDPRG1= <>
##$CPDPRG2= <>
##$CPDPRG3= <>
##$CPDPRG4= <mlev>
##$CPDPRG5= <mlev>
##$CPDPRG6= <mlev>
##$CPDPRG7= <mlev>
##$CPDPRG8= <mlev>
##$CPDPRGB= <>
##$CPDPRGT= <>
##$D= (0..31)
0 1.2 0 0 0 0 0 0 0 0 0 0.03 0 0 0 0 0 0 0 0 0 0 0 0 0 0 0 0 0 0 0 0 
##$DATE= 1563882828
##$DBL= (0..7)
120 120 120 120 120 120 120 120 
##$DBP= (0..7)
150 150 150 150 150 150 150 150 
##$DBP07= 0
##$DBPNAM0= <>
##$DBPNAM1= <>
##$DBPNAM2= <>
##$DBPNAM3= <>
##$DBPNAM4= <>
##$DBPNAM5= <>
##$DBPNAM6= <>
##$DBPNAM7= <>
##$DBPOAL= (0..7)
0.5 0.5 0.5 0.5 0.5 0.5 0.5 0.5 
##$DBPOFFS= (0..7)
0 0 0 0 0 0 0 0 
##$DE= 6
##$DECBNUC= <off>
##$DECIM= 24
##$DECNUC= <off>
##$DECSTAT= 4
##$DIGMOD= 1
##$DIGTYP= 9
##$DL= (0..7)
0 120 120 120 120 120 120 120 
##$DP= (0..7)
150 150 150 150 150 150 150 150 
##$DP07= 0
##$DPNAME0= <>
##$DPNAME1= <>
##$DPNAME2= <>
##$DPNAME3= <>
##$DPNAME4= <>
##$DPNAME5= <>
##$DPNAME6= <>
##$DPNAME7= <>
##$DPOAL= (0..7)
0.5 0.5 0.5 0.5 0.5 0.5 0.5 0.5 
##$DPOFFS= (0..7)
0 0 0 0 0 0 0 0 
##$DQDMODE= 0
##$DR= 18
##$DS= 0
##$DSLIST= <SSSSSSSSSSSSSSS>
##$DSPFIRM= 0
$$ [...]
##$SUBNAM2= <"">
##$SUBNAM3= <"">
##$SUBNAM4= <"">
##$SUBNAM5= <"">
##$SUBNAM6= <"">
##$SUBNAM7= <"">
##$SUBNAM8= <"">
##$SUBNAM9= <"">
##$SW= 24.9336996594482
##$SWIBOX= (0..15)
0 0 2 0 0 0 0 0 0 0 0 0 0 0 0 0 
##$SW_h= 4990.01996007984
##$TD= 16384
##$TD0= 1
##$TE= 0
##$TE2= 300
##$TE3= 300
##$TEG= 300
##$TL= (0..7)
0 120 120 120 120 120 120 120 
##$TP= (0..7)
150 150 150 150 150 150 150 150 
##$TP07= 0
##$TPNAME0= <>
##$TPNAME1= <>
##$TPNAME2= <>
##$TPNAME3= <>
##$TPNAME4= <>
##$TPNAME5= <>
##$TPNAME6= <>
##$TPNAME7= <>
##$TPOAL= (0..7)
0.5 0.5 0.5 0.5 0.5 0.5 0.5 0.5 
##$TPOFFS= (0..7)
0 0 0 0 0 0 0 0 
##$TUNHIN= 0
##$TUNHOUT= 0
##$TUNXOUT= 0
##$USERA1= <user>
##$USERA2= <user>
##$USERA3= <user>
##$USERA4= <user>
##$USERA5= <user>
##$V9= 5
##$VALIST= <valist>
##$VCLIST= <CCCCCCCCCCCCCCC>
##$VD= 0
##$VDLIST= <DDDDDDDDDDDDDDD>
##$VPLIST= <PPPPPPPPPPPPPPP>
##$VTLIST= <TTTTTTTTTTTTTTT>
##$WBST= 1024
##$WBSW= 4
##$XGAIN= (0..3)
0 0 0 0 
##$XL= 0
##$YL= 0
##$YMAX_a= 68778
##$YMIN_a= -114622
##$ZGOPTNS= <>
##$ZL1= 120
##$ZL2= 120
##$ZL3= 120
##$ZL4= 120
##$ABSF1= 10
##$ABSF2= 0
##$ABSG= 5
##$ABSL= 3
##$ALPHA= 0
##$AQORDER= 0
##$ASSFAC= 0
##$ASSFACI= 0
##$ASSFACX= 0
##$ASSWID= 0
##$AUNMP= <proc_1d>
##$AZFE= 0.1
##$AZFW= 0.1
##$BCFW= 1
##$BC_mod= 2
##$BYTORDP= 1
##$COROFFS= 0
##$CY= 11.3945322036743
##$DATMOD= 1
##$DC= 2
##$DFILT= <>
##$DTYPP= 0
##$F1P= 18.9103706918063
##$F2P= -1.10871071338519
##$FCOR= 0.5
##$FTSIZE= 0
##$FT_mod= 4
##$GAMMA= 1
##$GB= 0.15
##$INTBC= 1
##$INTSCL= 1
##$ISEN= 128
##$LB= 0.24
##$LEV0= 0
##$LPBIN= 0
##$MAXI= 10000
##$MC2= 0
##$MEAN= 0
##$ME_mod= 0
##$MI= 1.114404
##$NCOEF= 0
##$NC_proc= 0
##$NLEV= 6
##$NOISF1= 3.799351
##$NOISF2= 2.8
##$NSP= 1
##$NTH_PI= 0
##$NZP= 0
##$OFFSET= 15.70392
##$PC= 1
##$PHC0= -8865.223
##$PHC1= 19.60096
##$PH_mod= 1
##$PKNL= yes
##$PPARMOD= 0
##$PSCAL= 0
##$PSIGN= 0
##$REVERSE= no
##$SF= 200.130013532006
##$SI= 16384
##$SIGF1= 3
##$SIGF2= 2
##$SINO= 400
##$SIOLD= 16384
##$SREGLST= <1H.CDCl3>
##$SSB= 0
##$STSI= 0
##$STSR= 0
##$SW_p= 3612.71676300578
##$SYMM= 0
##$S_DEV= 0
##$TDeff= 0
##$TDoff= 0
##$TI= <>
##$TILT= no
##$TM1= 0
##$TM2= 0
##$TOPLEV= 0
##$USERP1= <user>
##$USERP2= <user>
##$USERP3= <user>
##$USERP4= <user>
##$USERP5= <user>
##$WDW= 1
##$XDIM= 8192
##$YMAX_p= 0
##$YMIN_p= 0
$$ End of Bruker specific parameters
$$ ---------------------------------
##NTUPLES= NMR FID
##VAR_NAME=  TIME,          FID/REAL,        FID/IMAG
##SYMBOL=    X,             R,               I
##VAR_TYPE=  INDEPENDENT,   DEPENDENT,       DEPENDENT
##VAR_FORM=  AFFN,          ASDF,            ASDF
##VAR_DIM=   8192,          8192,            8192
##UNITS=     SECONDS,       ARBITRARY UNITS, ARBITRARY UNITS
##FACTOR=    0.0002004,     1,               1
##FIRST=     0,             0,               0
##LAST=      1.6414764,     0,               0
##MIN=       0,             -114622,         0
##MAX=       1.6414764,     68778,           0
$$ Real data points
##PAGE= N=1
##DATA TABLE= (X++(R..R)), XYDATA
0 0 0 0 0 0 0 0 0 0 3 -8 8 -8 8 -10 16 -16 24 -24 32 -32 40 -48 56 -64 72 -83 95 -109 122 -138 157 -176
32 -176 198 -221 247 -274 304 -339 376 -419 462 -513 567 -628 696 -771 858 -956 1065 -1194
50 -1194 1347 -1529 1753 -2032 2394 -2888 3601 -4725 6782 -11787 52711 15926 -68944 19849
64 19849 68778 33457 -15656 8710 29745 19638 1790 18837 21386 -7661 -20204 18596
76 18596 29801 -4762 -11575 18670 6677 -22033 -3987 23810 875 -24606 -3846 27324
88 27324 13412 -24082 -23002 21542 28436 -14365 -23077 17759 26598 -1054 -4373 9532 4392
101 4392 2949 19738 23817 6652 -5958 4029 27646 28467 2665 -3171 19856 22894 6499 11200
115 11200 20350 7965 3168 14794 15317 8482 11386 10135 1004 -71 7509 15908 13568 -8014
129 -8014 -16918 9527 24460 -4429 -22035 860 14214 561 -8723 -5414 -146 1025 -6233
142 -6233 -10094 2697 9400 -3425 -9657 -3910 -2470 2580 9474 -3432 -13119 6904 19968 1501
156 1501 -11402 1855 15072 10899 -2170 -4361 14796 26302 4736 -11568 6793 21206 10835
169 10835 4651 8053 6982 10180 15420 8592 1868 6499 9252 9330 11082 4805 1722 11461 9547
184 9547 -4672 137 14806 8140 -4490 -1687 4153 5760 6298 -1113 -6246 1528 5404 898 2050
199 2050 2149 -6273 -3471 7289 2413 -4337 3521 5785 -2285 -1512 4396 5369 5123 307 -4383 7523
215 7523 17906 4058 -8147 3379 12900 8401 4741 956 1116 11740 14633 1754 -1916 6835
229 6835 9391 8028 6427 -1421 -307 13701 10891 -4966 -2784 8744 6847 1483 1099 24 2066
244 2066 4297 -2344 -1791 7911 3735 -7849 -2516 5897 1743 -157 -453 -4599 -128 9702 4735
259 4735 -6177 -4094 2390 6116 7111 -1777 -7253 5861 14181 761 -6120 4417 7502 3172
273 3172 4045 3743 2346 6494 5886 521 3738 5718 2032 4526 6610 -691 556 9971 4463 -5587
289 -5587 2460 9901 1993 -3474 -148 3147 5430 1361 -6301 -1381 8494 1964 -5760 -781 1316
304 1316 -2931 2299 3466 -5809 -4139 6003 3278 -5026 -4130 -165 3752 3480 -4813 -4534 7636
319 7636 6290 -7386 -3673 7200 3300 -2211 1995 1620 46 4347 3831 -1075 12 2785 3262
334 3262 5029 586 -4224 4805 10833 -1805 -7612 6739 10066 -2297 -4708 2018 4755 3221
348 3221 -975 -3745 2478 5273 -1672 -3589 1834 -989 -2697 4369 1010 -7851 -909 7510 -706
363 -706 -7992 -2637 3302 2855 -2581 -7326 -738 7731 -529 -9533 -543 5402 -2340 -3148 1739 -1210
379 -1210 -2340 3431 1223 -4205 -1220 2574 1773 678 -3584 -2538 6556 5391 -7142 -4511 8791
394 8791 4509 -6426 -2205 3540 2278 1054 -1401 -2622 2751 3908 -2845 -2029 1363 -1685 -134
409 -134 4271 -2669 -6736 3360 6365 -4380 -6662 803 3074 604 -3323 -5602 1246 5753 -3589
424 -3589 -7953 1758 3293 -3785 -2403 607 -2891 -1449 2924 -1790 -5589 -468 1852 -289 -2316
439 -2316 -4667 -1155 6530 380 -9810 -1901 8802 63 -7986 -1647 3422 1477 -808 -3007 -1799
454 -1799 3755 2306 -3072 -835 1384 -1485 1814 4451 -4004 -5032 6594 5820 -5310 -4529 3674
469 3674 4087 -69 -3473 -2191 4585 4395 -4520 -3690 4686 1340 -4426 414 1768 -2897 -46 3491
485 3491 -2413 -4169 1139 2036 -1368 -3588 -3700 1917 5187 -4244 -9297 2367 7390 -4088 -7230
500 -7230 803 2159 -454 -281 -2166 -2661 1362 752 -2128 -1152 -1419 -2464 2831 2032 -6324 -2769 6452
517 6452 996 -7167 -1181 4020 313 -3085 -3110 -475 3329 652 -6015 -2669 3721 -773 -3787 -2
533 -2 -1699 -3564 2256 1853 -5999 -5037 2131 1671 -2204 -4690 -4106 1808 3445 -5299 -7185 2943 2947
550 2947 -5856 -4294 1311 -604 -1633 -321 -2570 -2068 1945 -299 -2875 -1058 -1093 -979 2547 -946
566 -946 -6193 1036 6703 -2183 -6887 282 4048 252 -2120 -2691 -86 4507 279 -5103 -652 3532
582 3532 -782 -1534 1045 -2467 -2337 3675 868 -5580 -2194 2288 -101 -2317 -3090 -2483 2342 1503
598 1503 -5954 -4138 3978 249 -6182 -1665 1794 -2447 -2282 -94 -1208 -785 -60 -2416 -1858 454
614 454 -1429 -577 2681 -1690 -4954 3506 6181 -3539 -5725 2605 4983 1656 -1419 -2594 770 5867
630 5867 2444 -1989 -29 783 -354 4429 3964 -4207 -2306 6168 3282 -4027 -714 3122 557 -1598
646 -1598 -1851 -40 3278 -1339 -6479 261 6184 -2728 -8166 -728 2823 -521 -1973 -2804 -4526 -13
662 -13 3169 -1345 -4521 -3799 -933 3672 2860 -6378 -6457 5437 5700 -3770 -3139 2092 909 -119 2390
679 2390 2438 1196 204 -1138 2611 6872 1173 -3458 2332 4660 344 1968 4978 -743 -2771 3949
695 3949 5383 147 -2481 -1226 3068 5436 -602 -5238 409 3900 -1664 -2145 1265 -2228 -3619
710 -3619 2421 1789 -4900 -3910 109 -44 -1788 -3871 -3811 1246 1713 -5647 -3900 3445 -894 -7637 -1222
727 -1222 4004 -608 -4240 -3229 -1203 2613 2399 -3631 -4097 943 1218 462 1387 -2115 -3501 3513
743 3513 4479 -3436 -3322 3760 2553 -1856 -943 871 1803 1735 -2271 -2227 4307 2632 -4701 -2409 2944
760 2944 48 -1568 891 -1512 -2976 856 375 -2623 -1522 -632 -1370 -257 -1538 -3969 -225 3487
776 3487 -2899 -5890 574 1846 -2320 -1842 -320 -1629 -410 176 -1935 -540 940 -1617 -217 2519
792 2519 -1146 -2436 3749 3394 -2691 -943 3962 1686 -734 69 1457 3178 3065 -663 -660 4232 1938
809 1938 -1982 2413 3757 -599 -122 2679 689 692 3761 1036 -2608 -207 2170 3106 2273 -2443 -4104
826 -4104 3666 5590 -3234 -4329 2769 2589 -1355 -328 398 -353 1064 105 -1127 1446 1143 -2467
842 -2467 194 3368 -553 -1355 2834 546 -2378 1809 3187 -1193 -1709 1434 2695 1549 -1239 -2527
858 -2527 2303 5558 -1313 -4693 1704 3368 -643 487 1155 -1974 -1489 2753 1543 -1476 -1966 -856
874 -856 1290 2208 -2559 -2969 2941 1431 -4573 -990 3830 -779 -4194 538 2004 -203 -540 -1179
890 -1179 -1194 1627 823 -1317 644 847 -1797 1496 4068 -1919 -3415 3528 3184 -2892 -1724 2101
906 2101 2057 975 -1071 -1630 2161 2605 -1596 -1476 2353 179 -1996 1859 1585 -2283 99 2542 -1277
923 -1277 -2394 432 646 232 -924 -2883 423 3752 -1079 -5363 743 3405 -1735 -2487 1010 -224
939 -224 -977 990 -170 -1175 423 -127 -1133 1352 57 -1662 1785 2433 -2857 -1686 4202 928
955 928 -3030 1 2594 1344 490 -549 -481 2804 1781 -2303 -384 2886 56 -909 2003 -374
971 -374 -2466 1576 2257 -2216 -2462 1016 1254 208 -1475 -2619 1105 3050 -2375 -3933 2009 1823
987 1823 -3131 -1714 1221 -721 -1114 320 -1097 -1202 920 -423 -1033 514 -1061 -1087 2909 1139
1003 1139 -3833 -239 3970 -30 -3310 713 2442 725 106 -1161 64 2616 266 -2534 1089
1018 1089 2391 -1141 317 2545 -1248 -1976 2853 1964 -2755 -1431 1598 1157 54 -1882 -1620 2247
1034 2247 1779 -3605 -2797 2871 482 -3012 -58 937 -1539 -580 929 -1597 -1475 355 93 -24 -498
1051 -498 -1868 15 3171 -788 -4385 1184 3941 -2000 -2768 1483 1761 -301 -210 -795 329 2389
1067 2389 -84 -1721 1003 497 -1451 1273 1942 -2618 -1026 3506 206 -3573 -505 1981 427
1082 427 -946 -1731 -937 2374 133 -4412 -1124 2444 -1315 -3192 337 17 -2024 62 286 -2347
1098 -2347 -1604 123 -474 -663 -856 -1990 805 2471 -2702 -3682 2385 2092 -3197 -1623 1798 294
1114 294 -571 321 -707 373 1097 -1183 -1058 1430 -158 -1458 1866 621 -2875 175 3233 -1363
1130 -1363 -2854 517 1622 -119 -1236 -1635 -294 1996 -1147 -3732 262 2018 -2309 -2290 883 -1329
1146 -1329 -2438 822 -500 -3325 -1532 -104 -1066 -1197 -1881 -2410 852 629 -4035 -2671 2692 19
1162 19 -4234 -587 1669 -416 -1329 -311 -1005 600 457 -1813 -746 1353 -812 -401 1944 -496
1178 -496 -2432 1429 2745 -2189 -2257 2161 1350 -546 -528 -532 718 1708 -1324 -2286 1412 761 -3118 -274
1196 -274 1839 -1804 -1987 1248 -268 -2718 -364 -145 -927 -788 -1358 -1324 935 -724 -3604 -490 2623
1213 2623 -2159 -3611 1058 1307 -1489 -841 -112 -713 46 341 -1231 -239 470 -1142 685 2239 -1394
1230 -1394 -2422 2752 2035 -2416 -1092 2272 619 -409 130 -99 873 1150 -1374 -623 2037 -368
1246 -368 -2606 871 1679 -1840 -1117 1058 -1184 -1816 905 184 -1729 -1283 -579 293 1304 -2051 -3711
1263 -3711 1075 1982 -3502 -3232 1426 238 -2141 -315 -324 -1800 -869 -572 -778 553 -837 -2272 167
1280 167 1884 -1878 -1739 1697 -458 -2491 907 1809 -1855 -1537 615 702 458 -704 -2341 446 1969
1297 1969 -1457 -1923 1648 164 -2508 687 1758 -2281 -2557 856 844 -1176 -1277 -1396 222 1091 -1915
1314 -1915 -2347 1054 214 -3366 -234 1636 -2056 -2358 911 364 -1186 -366 -510 -1366 125 -393 -802
1331 -802 773 -591 -2344 513 2629 -1980 -3128 1975 2107 -1337 -1144 578 425 759 -163 -1138 589
1348 589 1060 -1615 -150 1982 -213 -1845 1045 728 -2119 297 1583 -1184 -977 383 130 20
1364 20 -70 -1677 -156 2123 -1454 -3255 789 2155 -2242 -1550 1006 -476 -1488 -90 -612 -822 -218
1381 -218 -1043 -966 891 -720 -1879 905 1331 -2344 -1683 2030 305 -1587 718 207 -231 350 58
1398 58 -657 930 447 -1131 567 1192 -1070 -789 2291 39 -2129 763 1367 -1115 -652 832 228
1415 228 353 -323 -2178 -41 2105 -1437 -2905 1057 1470 -1580 -748 222 -792 -332 287 -1622 -1289
1432 -1289 312 -438 -251 599 -1944 -1940 1408 632 -3092 -1018 1976 -843 -1956 248 927 -270 -485
1449 -485 -1203 -81 1637 -533 -1986 1032 1846 -1008 -521 1542 -910 -1404 2268 1289 -1452 -694 751
1466 751 1221 930 -904 -1453 1630 1900 -1846 -1483 1948 -24 -1608 1103 676 -1917 -702 641 -396
1483 -396 -437 -491 -1088 -345 259 -1743 -898 1770 -1034 -3399 708 2191 -1929 -2186 642 420 -554 -626
1501 -626 -1280 -516 1135 -457 -945 633 -88 -1516 1170 1709 -2093 -1227 2371 697 -1539 253 1349
1518 1349 743 230 -641 -62 1735 546 -1976 723 2328 -554 -1286 1639 713 -1433 703 505 -1272
1535 -1272 -695 846 362 151 -691 -1551 760 1516 -2020 -2443 1450 866 -2237 -734 857 -939 -1029
1552 -1029 194 -538 -282 182 -1029 -550 790 -289 -1326 1093 -25 -2267 319 2182 -1045 -1625
1568 -1625 880 1057 72 73 -267 130 1836 -109 -1727 1152 1644 -1033 -74 1608 -322 -629 1389
1585 1389 637 -1092 365 958 -89 261 -296 -916 1377 750 -2179 -845 2368 -185 -1890 236
1601 236 659 -679 -307 -36 -1031 55 302 -932 -248 443 -1091 -718 1310 -313 -2459 658 1582
1618 1582 -1576 -1235 1171 625 105 -190 -231 611 1232 -515 -920 1556 821 -1399 681 1628 -742 -267
1636 -267 1923 389 -986 702 1309 529 383 -658 -159 1790 180 -1993 466 2232 -756 -1297
1652 -1297 1101 547 -643 96 107 -715 -8 203 -740 275 480 -1120 56 1111 -1279 -1652 1569
1669 1569 816 -1805 -270 1361 -56 -331 57 -208 502 511 -1194 9 1740 -93 -864 1444 1288
1686 1288 -1324 179 1594 -340 -321 1063 741 256 363 -69 606 1458 -432 -1204 1397 1716 -1614
1703 -1614 -378 1880 174 -1493 583 337 -810 250 -87 -817 392 -497 -1229 478 710 -1875
1719 -1875 -1059 1623 -337 -2077 -104 812 -888 -632 -213 -693 535 -1 -1079 135 1265 -766
1735 -766 -455 1604 317 -1357 1071 1513 -1011 -175 1540 773 51 247 -74 1042 1330 -648 -343
1752 -343 1945 1009 -1261 670 2104 -123 -360 1045 160 -336 629 272 -190 695 -234 -674 893 436
1770 436 -1865 2 1472 -1291 -1489 985 611 -949 -389 2 -303 334 -238 -877 801 913 -1115
1787 -1115 -182 1156 -507 -1033 1679 942 -878 306 1324 503 33 545 440 879 951 -740 412
1804 412 2519 210 -686 1306 1818 -321 149 1269 228 32 633 247 320 834 94 -17 1221 -542
1822 -542 -1505 830 1299 -1479 -842 1526 -8 -914 -117 -136 -410 -22 -736 -869 602 40 -1326 468
1840 468 1106 -1342 -652 1404 -95 -1296 1026 980 -542 -357 406 134 546 -137 -719 712 1705 -449
1858 -449 -720 1772 1042 -625 671 1104 -389 526 1106 414 99 479 -163 800 978 -791 -432 1701
1876 1701 189 -1486 370 1277 -576 -932 199 -36 -554 -43 -544 -320 998 -615 -1263 183 253
1893 253 -1661 -12 802 -1068 -876 1114 425 -814 -288 268 603 774 -580 -817 1193 1321 -597
1910 -597 282 1499 -16 -715 1385 703 -545 462 1163 301 537 628 -29 537 747 -861 -177 1842
1928 1842 -332 -1543 979 1632 -1161 -861 817 32 -80 -220 -888 -418 577 -358 -535 623 -486
1945 -486 -1392 708 758 -1666 -1150 1420 86 -1124 -364 -173 141 3 -555 -466 1114 196 -1281 731
1963 731 1544 -568 -533 1184 351 -493 956 934 -253 388 788 65 359 130 -499 879 1330 -1083 -894
1982 -894 1494 1008 -1212 146 498 -912 -279 438 -469 -51 176 -331 -167 131 -802 -1268 542 103
2000 103 -1520 -122 956 -886 -825 172 -97 -294 -113 -658 43 928 -271 -949 635 929 -904 -217
2018 -217 978 -164 -477 930 319 -428 352 563 588 628 -322 -499 993 1175 -1039 -246 1640 235
2036 235 -566 552 667 -411 185 426 -30 119 136 -481 75 832 -1077 -624 406 -623 -1221 626
2054 626 597 -1400 -779 71 28 -87 -296 -1066 -244 874 -503 -925 851 127 -1048 419 886 -1017
2072 -1017 -447 1453 481 -463 -77 356 528 533 -429 12 1028 482 -857 816 1427 -544 -886 1112
2090 1112 631 -298 90 6 224 587 -82 -338 343 240 -819 471 1324 -1079 -1156 1320 652 -1050 -495
2109 -495 360 -96 -390 -232 -644 312 109 -1042 -46 534 -1076 -968 911 620 -1151 -256 745 -218
2127 -218 -671 372 244 -116 -315 -482 246 1372 -492 -752 1010 1191 -832 -288 1289 147 -34 1046
2145 1046 497 -353 500 406 424 649 -264 -898 923 602 -864 -255 1110 -236 -1325 315 624 -625
2163 -625 -515 74 -361 361 116 -623 -136 523 -598 -826 696 -451 -990 476 748 -545 -736 172
2181 172 243 -155 112 -476 235 616 -740 -42 1086 437 -891 388 1105 -549 6 781 275 164 457
2200 457 565 -188 625 165 -38 1005 369 -849 483 1151 -333 -460 1026 367 -936 260 -53 -122
2218 -122 302 -348 -662 308 294 -1179 -297 870 -460 -906 995 -33 -875 -147 460 -131 -198 -203 -534 670
2238 670 745 -447 119 949 -38 -807 800 657 -760 190 1000 -135 14 659 286 386 418 -551 67
2257 67 1266 -73 -384 1091 877 -602 -76 1308 338 -16 54 7 174 665 82 -239 410 23 -941
2276 -941 549 460 -914 -358 1205 -190 -997 146 280 -235 -164 -131 -236 497 144 -780 353 1123 -459
2295 -459 -449 1205 -159 -444 330 503 -442 14 879 311 144 477 -129 614 1081 -584 -103 1461 733
2314 733 -667 711 1092 -307 -183 399 249 452 641 -6 -51 906 45 -145 864 35 -898 487 956
2333 956 -633 -684 625 297 -490 -270 -228 264 250 -370 -85 716 434 -741 -149 702 -378 -619 416
2352 416 416 -451 311 721 -10 76 162 172 369 312 -864 516 1384 256 -570 985 1076 -369 137 464 -69
2373 -69 267 533 64 598 590 -63 95 660 -202 -393 656 737 -638 -13 894 -62 -557 124 164 134 219 -313
2395 -313 -170 587 -20 -891 597 320 -590 -283 1026 -36 -447 242 16 -314 143 -38 193 621 128
2414 128 -403 814 1436 -270 -275 1210 479 -357 383 652 -95 323 537 -43 585 427 -64 494 628 -423
2434 -423 -102 1299 551 -739 295 957 -275 -422 506 322 -13 -123 -215 433 790 -220 -698 538
2452 538 235 -509 12 815 -371 -469 746 353 -239 -375 -243 171 469 -307 -545 925 799 -627 62
2471 62 812 129 -381 667 495 -5 681 334 404 422 347 93 817 758 -565 451 1199 93 -382 1066
2491 1066 889 -446 -473 227 46 -11 136 -403 550 674 -383 -334 731 -82 -950 331 596 -1020 -464
2510 -464 513 -104 -609 -124 -45 28 29 -464 -451 567 142 -852 100 475 -678 153 824 116 -540 482 137
2531 137 122 -83 257 159 607 -109 -622 668 1094 -381 -255 1083 563 -345 280 465 297 45 308 -164
2551 -164 184 207 -72 220 718 -561 -313 704 208 -663 107 712 -230 -151 -151 -203 -43 -11 -510 75 807
2572 807 -472 -763 540 300 -658 -10 718 -90 -243 512 64 -77 464 102 76 569 -147 -547 1102
2591 1102 683 -652 73 1294 12 -169 782 605 64 327 612 165 351 370 -350 310 424 -239 217
2610 217 830 -40 -603 407 242 -324 -359 454 -225 80 -91 -581 202 708 -425 -547 660 -255 -702
2629 -702 344 481 -667 196 481 -4 -101 16 -101 231 428 138 -338 544 485 -242 637 850 -401 -362
2649 -362 657 237 -375 251 267 156 391 199 -193 537 456 -244 481 784 -472 -234 786 435 -615
2668 -615 -196 405 -94 172 -260 -359 118 194 -82 -277 399 -403 -724 319 251 -491 171 159 148 -28 -12 -535
2690 -535 -39 27 -449 345 802 -108 -366 818 683 -636 -38 897 288 -169 392 -35 25 490 -128 119
2710 119 701 67 -352 593 485 -575 -312 388 49 -248 252 -190 -292 149 -102 -183 252 -210 -720 243
2730 243 476 -867 -337 390 153 -525 230 122 -280 -45 -62 -198 -129 -260 -283 472 677 -487 -301 816
2750 816 -201 -773 398 541 -267 -16 360 259 55 108 -68 262 535 -90 -379 669 156 -787 554
2769 554 1004 -228 -721 516 389 -294 -119 -328 -129 369 -194 -422 165 -88 -632 98 468 -527 -250
2788 -250 411 -9 -675 52 110 -300 70 75 -406 153 48 -514 303 366 -312 -593 651 261 -489 229 448
2809 448 -55 25 24 -69 48 194 -331 306 821 -354 -456 858 772 -296 172 635 -77 -143 371 -112 484
2830 484 340 -233 -367 622 24 -593 429 385 -637 -104 701 -227 -547 220 -199 -244 -216 -241 -291 151 -222
2851 -222 -713 334 139 -585 -75 586 18 -415 273 159 -13 202 288 -65 320 421 -14 63 566 -139
2871 -139 -329 803 329 -143 95 259 -51 30 189 -165 57 391 -480 -108 384 -185 -584 364 -109 -833
2891 -833 -87 345 -169 -514 188 -189 -286 -57 -419 -224 87 -273 -614 230 255 -662 -261 381 -335 -55 168
2912 168 -18 -273 -74 89 -54 212 -224 -255 125 54 -518 -51 745 111 -653 355 85 -520 -339 279
2932 279 53 164 5 -427 342 438 -412 -66 544 -188 -530 327 264 -592 -390 391 -26 -360 -94 -332 -277
2953 -277 84 -491 -315 386 -341 -612 245 116 -650 -472 475 -168 -642 -50 24 -257 -41 -125 -307 486 -69
2974 -69 -245 208 733 -311 -311 536 22 -323 650 397 7 388 -30 -24 491 276 -679 192 626 -49 -186
2995 -186 435 277 -476 437 -119 -100 5 -2 -96 121 38 -515 -61 552 -327 -625 311 -92 -792 293 224 -376
3017 -376 -141 113 -347 -317 -63 -430 -170 60 -607 -228 250 174 -438 220 312 -10 -231 637 90 -215 190
3038 190 178 -59 265 89 -185 311 435 -288 41 831 -180 -493 708 14 -52 -125 -188 -201 -125 -54 -484 -53
3060 -53 306 -733 -364 76 -226 -663 -150 78 -633 -180 109 -168 -388 2 -403 -176 -69 -666 -635 405
3080 405 -249 -740 231 371 -318 -38 391 -91 -69 409 126 -93 562 -156 -194 381 171 -335 449 616 28
3101 28 -402 283 -3 -110 303 170 -213 -86 231 29 142 323 -355 379 430 -230 -215 110 120 -834 258
3122 258 80 -150 3 -195 -180 182 -259 -548 -255 327 -426 -471 302 176 -252 -59 168 -501 -14 173 29
3143 29 79 37 -95 -121 488 -93 -175 350 198 -394 76 527 140 -194 385 -32 26 243 -63 -129 448 195
3165 195 -240 141 494 -140 147 644 -55 -65 238 197 -459 -316 142 -295 -295 -194 -82 -61 256 -647 -257 97
3187 97 -123 -657 -352 41 -256 -327 -102 -214 167 46 52 24 245 -192 -385 137 227 -254 106 -3 -111 245
3209 245 366 274 49 359 -165 105 542 14 -522 270 240 -235 585 220 -113 -350 443 73 -364 253 -42
3230 -42 3 9 176 -208 135 219 -398 -70 157 -333 -439 280 158 -211 25 -50 -63 120 -116 -417 75 124 -384
3253 -384 18 281 -369 -291 430 248 -327 -109 71 -33 403 -35 85 75 320 -18 138 550 51 -267 367
3274 367 437 -123 130 556 261 47 235 107 -181 169 3 228 238 -327 -539 147 279 -457 -394 260 -333
3295 -333 -426 28 -181 -264 -343 88 -270 -30 -35 -271 -179 339 -229 -243 740 -40 -589 -38 343 -45 -194 115
3317 115 7 273 103 -194 -89 213 -41 -30 320 309 -453 151 490 -351 128 -94 -28 128 96 -264 -123
3338 -123 407 -273 -74 366 161 -333 -167 446 -235 -302 344 -56 -200 178 -285 -237 134 103 -277 201 261
3359 261 -286 -166 361 -395 -353 350 113 -165 340 110 -109 99 -65 148 246 110 -503 -62 -68 -58 -313 193
3381 193 229 -99 -77 314 -402 253 110 44 255 164 10 -169 349 -249 -452 340 331 -417 -291 -71 -86 -302
3403 -302 257 -172 -265 39 97 -203 204 -137 -308 112 306 -337 -329 56 -309 -324 9 -146 -87 101 -133 -417
3425 -417 149 -78 -151 254 335 -100 -260 213 147 -130 132 372 109 189 -39 -286 290 310 -488 97 234 -181
3447 -181 -285 476 141 -168 193 205 -355 -118 223 -158 -266 -394 -72 -228 116 36 -237 9 -315 -635 -80
3468 -80 544 -62 -371 225 30 -516 5 83 -10 -64 -94 -561 286 257 -213 71 383 -457 -326 483 354 -201
3490 -201 281 202 -360 169 7 -157 234 297 -43 -36 264 71 6 262 238 -232 -71 76 -186 36 66 -162
3512 -162 109 249 -271 -192 -6 -45 -388 244 -29 -296 312 288 -101 -227 -177 -251 183 333 -387 -347 -53 52
3534 52 -376 10 238 -282 -131 174 -364 45 182 -106 48 356 -95 39 29 322 -96 472 401 -228 37
3555 37 141 10 -116 -34 112 6 -144 -159 -222 339 174 -393 -232 72 -324 -82 106 -268 -416 189 44
3576 44 -202 -40 -455 -90 -46 -76 -471 -264 -148 -195 -67 -168 56 -348 -101 179 -181 -118 189 -80 -105 -143
3598 -143 220 110 430 -9 31 193 105 -216 233 533 -28 -238 124 29 -242 305 65 163 -36 156 -246
3619 -246 192 495 68 25 395 -95 -382 63 -62 18 -96 -482 -96 -65 101 -56 -62 14 -227 -158 362 89
3641 89 -273 110 363 -155 -107 18 -170 -27 146 193 -94 126 -20 36 571 277 -474 231 160 178 -54 126
3663 126 191 218 3 273 39 107 187 -78 -19 -89 -36 28 201 137 -232 -19 26 -61 -66 -211 -164 -161 -26 -220 90
3688 90 -164 -94 -58 96 -258 -536 107 -5 -457 -199 -151 -67 96 69 -147 -70 -226 -156 -19 185 -227 6 301
3711 301 -186 -129 -23 214 -163 74 437 88 54 124 -70 -85 157 185 -221 225 104 -292 332 318 -248 -61
3733 -61 109 386 148 82 -79 -261 156 114 -302 169 -14 -355 28 182 -287 -423 -127 10 38 -99 165
3754 165 -338 77 144 17 39 -178 -199 -227 360 46 -699 153 140 -123 -25 203 -113 249 385 -54 103 77
3776 77 -78 -259 318 198 -246 302 158 4 292 316 68 -198 150 108 121 105 -193 -344 50 190 -206 -120
3798 -120 54 -405 -130 -82 -52 -7 -231 -62 -7 27 -255 -230 346 29 -411 -42 180 116 -332 177 -117 264
3820 264 -59 227 -81 93 40 31 59 132 101 114 306 140 -22 313 0 -149 207 28 202 -185 278 -184
3842 -184 -93 62 -234 10 251 -115 -197 130 -55 -22 56 247 -39 -146 -69 -2 -336 -9 -220 72 -176 -107
3864 -107 -293 -10 174 -319 96 251 -4 -148 -170 -35 -192 106 -70 -172 -248 0 7 186 -9 155 -215
3885 -215 259 170 -234 125 312 -55 16 96 233 172 279 228 -154 203 -114 -186 289 -92 -156 478 69 -188
3907 -188 -293 -65 -62 46 -303 -234 -319 103 -88 -157 211 -8 -17 -108 2 -172 44 115 265 113 -42 -211 -189
3930 -189 -183 -113 -91 105 68 -18 154 130 -75 -171 215 282 -47 208 272 -41 366 -51 52 250 338 -253 -217 236
3954 236 -145 -143 67 -261 -306 -8 504 -18 -254 -173 -505 27 -49 -6 -95 -157 -258 -700 -237 -46 -172 -77 200
3977 200 -265 -126 -280 33 -34 -25 -128 -80 216 91 -375 405 194 -173 25 489 -162 7 286 166 94 -64
3999 -64 -389 -45 364 346 -168 120 5 -342 213 121 14 6 317 427 -97 -61 3 -191 182 -68 -336 207
4021 207 -31 -242 -18 288 -207 -353 -51 114 -104 -191 365 -199 119 -6 -247 4 286 177 34 109 -258
4042 -258 -90 -206 -33 -71 -580 66 171 -12 133 41 71 198 91 -15 73 226 57 261 134 -166 27
4063 27 394 -25 84 45 193 -56 -61 127 95 93 365 71 110 20 -222 -435 34 -252 -502 -119 211 115 -225
4086 -225 -112 -173 31 120 -259 9 121 -454 -235 29 -112 -251 -80 380 -148 -138 -49 106 330 95 -101
4107 -101 -565 424 -60 138 -57 207 160 156 10 -224 -97 117 98 -20 298 351 14 81 194 -247 -127 105
4129 105 -145 6 44 74 -53 167 -39 -79 46 -55 -215 13 -174 67 280 169 -60 -126 525 -86 -354
4150 -354 177 62 -345 -65 63 150 -109 -14 -295 39 -155 -158 191 -29 19 87 44 -20 -117 -309 362 98 -132
4173 -132 130 103 65 129 105 50 361 67 -20 186 335 38 -294 164 -9 131 56 -50 -431 -210 -69 -292
4195 -292 191 114 -42 -190 92 -276 -321 125 91 -172 -106 101 -244 -318 -65 -57 -209 58 -26 -67 92 364 -122
4218 -122 124 311 -185 289 158 415 150 97 -213 38 215 69 -123 133 79 54 -63 -1 120 -58 91
4239 91 -33 113 -45 -165 63 398 -130 -60 69 -8 -112 -66 0 -97 -46 -37 -294 -215 225 -14 -41 72 -24 20
4263 20 -287 56 -169 200 176 -58 -149 -41 -38 94 343 88 -193 278 -285 468 -108 213 178 -215 210 -227
4285 -227 2 197 -168 -57 -166 -124 -141 -81 150 173 90 -118 119 -196 -208 -179 -87 -61 285 75 35 141 68 -105
4309 -105 336 286 -392 -36 -217 -186 -22 -38 -121 8 13 -236 -21 -225 -119 -192 74 -118 53 178 148 139 -42
4332 -42 194 62 426 480 240 -234 -127 -59 -39 130 112 -485 -89 139 60 4 36 -273 34 47 117 301 125
4355 125 -96 -234 47 -130 -182 250 -167 -43 -132 -32 97 3 -14 -112 -177 218 141 12 -128 -114 -23 146 -194
4378 -194 -136 -218 258 -65 -175 55 -6 24 208 69 -118 30 148 48 273 -194 -67 -16 263 473 -10 86
4400 86 273 -210 423 142 -158 14 201 113 53 -99 54 -44 -259 -80 -176 -164 -127 -231 82 61 -33 -196 232
4423 232 -97 -151 -140 -6 -493 -151 -133 -416 -7 -289 356 114 74 62 -149 236 -130 196 44 -10 -241 -74
4445 -74 61 -180 127 -110 138 -70 91 98 25 -87 140 -26 288 200 -59 77 103 382 -108 46 228 82
4467 82 33 -117 -71 -59 -24 -140 -168 13 52 -331 -6 -6 309 271 -7 -38 59 -148 -79 328 3 -40 -81 -109 -120 -138
4493 -138 24 -31 -64 175 -111 289 -77 99 375 93 -58 -194 -144 -7 70 162 44 188 -322 -274 134 89
4515 89 29 267 6 262 -71 96 133 -27 247 87 -130 -25 14 -83 -452 -319 76 -377 101 -97 -75 -321
4537 -321 -67 -77 152 56 -45 288 -38 168 219 -304 -277 -295 -83 -201 -39 298 75 355 485 124 93 167
4559 167 77 56 251 -66 20 -164 115 293 95 188 -114 -69 40 32 13 122 125 -84 60 -52 40 168 -562 -3
4583 -3 -175 6 -154 -238 -4 148 33 -202 -170 -167 154 -38 145 -225 -98 277 -278 -222 -165 -299 123 -81 286
4606 286 -97 18 50 -70 -100 148 149 334 58 321 6 54 145 -54 177 221 322 50 362 -178 -4 -49 -77
4629 -77 285 268 -83 181 114 -18 90 92 -34 -144 -37 -8 -172 -130 70 -280 -306 -105 -49 43 75 -105 -168 -176 99
4654 99 64 -71 20 38 -103 -91 -63 -16 -45 -191 573 85 66 -92 160 272 121 185 -57 123 163 9 -43 46
4678 46 101 -119 107 -55 -16 162 -69 210 -81 -38 -57 -265 -137 68 125 -351 195 170 284 107 40 -276 -87
4701 -87 10 30 118 -22 -80 -349 -29 162 219 -355 -82 134 37 -251 -114 -111 207 -327 7 -78 -141 122 183 -65
4725 -65 258 -26 156 -173 -104 -203 172 167 -218 263 41 -165 -227 -72 337 32 18 87 -46 -51 -213 -121 31 -12
4749 -12 -106 109 -107 130 -7 29 52 -43 -27 -249 39 -190 -34 -26 -49 -79 143 -107 -236 27 290 -170 -144 -55
4773 -55 -422 -169 11 96 -352 266 -77 37 379 12 -21 28 122 -116 -289 58 -6 -239 -79 68 168 243
4795 243 98 72 206 -150 188 383 -248 7 -19 -2 220 169 -205 -160 102 -163 -300 -151 -22 -128 -49 -238
4817 -238 -362 -71 -344 -4 -181 -204 -83 51 -350 236 -102 -65 -18 -67 -232 249 -160 -103 -86 -4 -126 88
4839 88 336 8 -157 432 138 244 -399 100 209 213 -56 -110 -87 125 342 -253 -305 -58 -278 209 115 -49
4861 -49 -270 152 94 -26 -293 -107 -245 190 -156 74 34 12 -227 56 -54 -20 -26 -121 -7 -52 -297 -321 105
4884 105 171 263 -185 334 -135 -169 163 18 -29 -54 98 265 1 -72 -158 -63 79 20 -135 108 220 58 -292
4907 -292 276 67 -10 -75 415 157 184 118 162 138 -120 240 290 -63 -106 244 126 43 -182 -15 -17 7 -187 -162
4931 -162 -1 28 -321 -49 -147 2 -170 237 -49 74 -104 -183 21 -220 -33 -42 286 -187 61 100 23 322
4953 322 -241 2 -3 -61 -82 -148 36 94 -130 113 72 -58 20 43 26 -20 111 -60 -692 141 -117 81 -44 172
4977 172 -20 28 172 -53 -42 22 202 38 213 -162 -23 -159 19 -33 127 -91 -173 233 -205 142 -87 -122
4999 -122 -84 160 -153 195 172 43 -116 89 353 -145 -82 214 122 197 114 334 88 98 99 147 -191 10 190
5022 190 144 217 -30 -290 -6 10 -148 -66 59 193 -133 192 84 -147 -28 -74 -142 -30 -49 -10 108 215 -202
5045 -202 -94 -7 -148 -29 80 88 -43 -30 25 -21 208 64 1 -94 310 -127 124 -139 -73 -16 -307 -19 -314
5068 -314 18 100 -109 166 81 -4 164 50 -209 168 -28 20 168 -10 -105 70 43 -151 43 -76 9 75 144
5091 144 36 -132 -127 199 -83 -71 -82 111 -233 144 -9 -51 -105 -205 25 -51 -28 -41 -72 -185 -214 107 -4 -43
5115 -43 -172 -166 -123 -124 -35 223 279 -161 -74 -26 -11 354 115 -67 42 61 66 138 99 73 -101 83 -292 194 320 188
5141 188 209 32 -31 196 33 181 -111 -198 -39 -24 241 -131 47 -40 -43 171 50 -18 63 -223 214 -159 -261
5164 -261 -32 -56 -39 -115 -81 -181 -228 68 -170 23 -213 -78 8 87 -22 23 68 391 200 45 132 -14 -253
5187 -253 161 -160 -110 -194 35 82 -109 -142 139 -82 -95 -96 -338 -42 93 -203 162 19 -196 202 -267 -85
5209 -85 -225 -4 58 40 83 -175 -153 -199 29 173 133 271 93 -104 34 329 232 90 -23 -160 269 115 208
5232 208 -154 -124 38 221 -270 -50 -25 53 -29 -72 -208 186 -106 207 159 -92 -164 -213 -18 77 44 52 -22 -93 180
5257 180 81 162 -110 -20 -150 319 105 -142 129 -2 -376 38 173 193 -83 -149 -133 -227 52 45 371 16 -92
5280 -92 -97 251 217 -184 168 61 142 -59 121 64 183 122 285 -24 -151 -204 390 -4 204 18 -405 212 -297
5303 -297 -16 -140 10 35 21 -142 -139 253 13 -106 22 174 -39 -428 -34 -458 -384 -88 57 -159 -64 44
5325 44 59 -232 -100 2 -82 -332 -156 -78 193 68 303 -14 -17 32 155 -148 -35 -160 -74 85 19 -25 -213
5348 -213 23 -299 66 30 -95 -53 473 -102 93 -31 -178 144 224 132 236 49 -111 -311 40 -47 104 -178
5370 -178 135 172 -147 191 139 -87 84 -80 -119 292 -289 40 -250 99 -65 -84 53 18 -26 -216 -127 81
5392 81 257 173 103 124 326 197 -87 -198 98 202 -9 -24 74 154 -30 -99 175 287 -122 63 -25 115 51
5415 51 287 -199 230 72 -219 43 -97 -24 -191 297 -14 -198 -160 138 215 39 0 178 -36 143 334 154
5437 154 191 166 -89 -64 -30 -25 68 128 -389 130 48 -78 78 -306 177 251 -68 -161 -114 -51 118 -59 122 203 -117
5462 -117 -72 29 -163 104 -42 100 -97 -79 61 54 274 60 -286 32 112 146 -132 239 60 -364 -150 188
5484 188 -309 151 -74 12 3 108 89 -96 -172 340 9 105 130 -299 474 75 -32 372 225 296 -252 -127 271
5507 271 -105 81 -238 -213 211 120 -176 -97 278 71 118 13 -148 175 -91 -80 -57 250 187 -69 70 254
5529 254 22 -146 93 64 -178 -76 51 -374 -29 174 289 76 -119 -188 -35 -59 -335 -225 128 -302 -353
5550 -353 -11 -203 -207 34 -160 -226 -105 186 -215 50 -45 150 130 123 6 -116 -281 101 -28 -32 -68 -46 16 -106
5574 -106 -147 357 122 67 -164 -221 336 0 -108 -35 89 228 -173 -169 128 138 161 -9 149 274 -116 186 -95
5597 -95 -359 -113 223 28 -151 7 -154 -57 -284 202 192 -17 232 119 -88 99 -222 -63 -297 -60 -166
5618 -166 -86 344 321 117 132 -10 19 32 70 209 -51 -78 -27 -82 269 -95 -89 -78 -421 230 84 267 44 126
5642 126 27 53 180 -224 158 133 149 -184 57 -15 -56 -306 -76 156 -233 60 -207 -73 -18 265 -223 109
5664 109 -156 -47 57 -18 -7 28 -122 -69 -209 89 79 -106 254 141 98 -105 126 -1 296 -51 -19 -530
5686 -530 270 458 -59 206 -234 -9 208 -32 -97 170 189 135 24 -46 50 101 396 -247 -182 155 171 -47 -46
5709 -46 -87 97 -79 141 -47 -113 132 -222 157 183 351 79 -41 18 94 59 74 -117 -211 -20 7 -48 -334 -529
5733 -529 -332 -13 -118 14 -235 186 -109 -2 113 44 112 14 111 -200 141 117 -164 185 77 87 -132 132
5755 132 -174 -95 216 169 -72 -151 143 -145 -41 -100 52 -235 -179 -24 -228 67 149 -415 -32 -192 -335 173
5777 173 251 -354 -168 -68 -119 -36 88 -337 92 246 77 -55 -5 -142 -75 -95 61 -168 39 103 -94 52
5799 52 -169 73 157 -38 -146 -201 306 172 -192 -120 -25 -201 -172 -60 -164 49 11 -81 -47 76 -156 205 57
5822 57 -303 -176 180 -195 52 -233 -171 41 -77 -204 -13 -215 152 176 185 284 14 2 111 8 132 -108
5844 -108 58 131 186 -193 165 -35 -65 114 98 89 106 -36 187 142 59 -142 38 199 -183 84 161 45 69 -128
5868 -128 -303 64 -18 32 83 148 10 -24 -78 174 29 -106 8 182 -243 283 291 -8 184 63 27 -88 182
5891 182 -44 -91 145 163 154 -281 70 -39 146 279 153 -425 83 187 -137 239 -265 24 -290 178 -2
5912 -2 -79 -32 186 0 -109 -104 -484 108 140 -66 -68 -239 -155 192 167 -95 163 -52 -123 -145 -56 422 -105 353 26
5937 26 -115 37 -224 89 -107 -303 -136 69 -167 -98 -380 158 -226 -106 -136 36 -50 21 328 -141 -217 140
5959 140 11 -282 253 -225 -125 -35 220 -206 -249 162 121 28 107 -160 43 18 -145 -65 139 11 65 -52 73
5982 73 -87 177 -1 -90 -101 -24 93 -136 -132 -104 -51 -386 -86 37 -64 214 -44 33 92 -48 -146 -190 172 170 -125
6007 -125 208 -347 93 -35 -296 -155 -310 -96 13 -279 186 -245 1 -185 99 61 99 -1 -119 -133 173
6028 173 182 -125 251 -223 113 155 -77 217 118 187 31 -127 156 63 -79 142 -96 -44 -316 -186 -46 157
6050 157 -145 141 157 -60 -185 69 -43 94 -212 8 35 -117 -231 -177 226 28 -26 101 -277 -4 -2 8
6072 8 414 89 326 195 -40 -2 -80 162 208 9 70 -203 82 29 87 55 48 -211 389 127 -151 115 157 -3
6096 -3 -49 -67 -20 74 -73 -90 67 130 -139 -75 -178 -164 -39 -80 -38 164 90 171 -143 -127 -69 -99 -17 66 279 -93
6122 -93 13 -189 -321 -310 -4 204 -134 -18 129 57 90 19 -5 -2 -536 -325 36 -36 -91 88 58 -177 -196 -155
6146 -155 372 -57 -104 111 -249 290 262 -98 107 269 135 -142 78 42 187 85 -287 53 -219 96 114
6167 114 -54 76 270 -63 105 -50 83 90 264 -135 -207 -34 -102 -103 103 98 -271 -259 -91 216 129 50 -37 -189
6191 -189 222 -154 -372 -72 121 -107 17 119 165 101 -105 -436 86 -88 231 -121 -58 225 85 -9 482
6212 482 76 22 180 -21 -14 -32 -105 136 -46 -142 -248 24 5 -57 60 129 -119 -62 -284 43 -185 285 77
6235 77 83 -63 -99 91 310 -102 -85 -148 -32 252 247 216 100 -85 -152 292 143 36 57 3 -286 86 -20 -100
6259 -100 15 -126 -325 165 -47 -136 72 59 264 82 -91 -16 113 -146 -154 211 293 45 117 65 -44 -9 -338
6282 -338 131 144 -67 -73 163 -64 107 -89 -8 159 -94 129 132 139 103 -49 243 62 -205 158 103 -98 242
6305 242 -242 31 303 -189 -195 -134 115 -127 -255 264 113 -301 274 4 -247 128 77 -371 -43 43 -173 -147
6327 -147 128 -281 -251 -47 -205 -164 92 -55 -8 114 -27 35 -327 141 -89 -304 -80 27 -124 -100 -33 111
6349 111 231 -95 240 -233 -124 84 39 -21 1 127 281 -189 -193 50 180 -149 -158 63 -91 -180 56 -62 -195
6372 -195 -156 190 45 9 91 4 -26 -159 -121 -76 158 24 17 -50 -66 -16 -40 -63 -308 94 125 69 416 -48 -31 -12
6398 -12 193 -115 18 99 141 -6 -283 -183 -169 -94 -32 86 -8 -224 -113 41 -186 -121 -40 -170 171 -265 75
6421 75 276 -43 187 39 -78 112 -85 -25 263 -56 322 -149 49 123 -364 149 352 -332 -82 -133 -11
6442 -11 -161 -146 -165 -63 19 -80 44 119 144 -7 76 -113 7 -99 163 -233 36 -214 -42 42 73 67 142 99 -92
6467 -92 -209 -121 193 1 -73 -11 -84 10 -42 140 -172 43 -59 141 -59 -286 16 -97 9 -10 -7 184 274 -118
6491 -118 -243 -152 136 -73 -4 256 -212 -228 -49 24 -192 170 -146 305 -65 166 31 260 -120 -199 33 -196
6513 -196 -62 24 -257 171 315 161 -107 -64 15 -173 -47 27 11 -339 -15 220 84 -416 -27 -33 -236 -62
6535 -62 -22 80 -215 -116 285 203 -11 114 -339 414 -130 -298 99 -93 -279 408 -22 -161 18 367 -222
6556 -222 232 -71 -108 -14 34 -13 -75 -10 50 -35 260 60 -116 90 -101 -330 -63 15 -57 170 281 115 -67
6579 -67 159 154 -93 135 144 122 118 142 -91 -197 230 -196 -3 -82 -62 -6 -16 92 -129 -182 -97 -246 26 -9 139
6604 139 53 31 -137 27 54 -10 -140 255 -21 -142 -35 -53 -63 101 -387 179 -110 -222 62 -93 92 -114
6626 -114 113 38 318 -126 20 -267 -51 -178 44 180 40 292 -158 -82 117 -64 160 213 295 73 -44
6647 -44 -22 132 -157 -182 -138 -69 26 -97 -269 -94 280 5 -48 -12 202 -209 172 74 -198 -218 -83 35 -72
6670 -72 -58 86 47 12 5 23 3 77 55 -157 -3 -39 -195 126 -160 -84 -46 -68 119 294 -158 -8 198 -88 -79
6695 -79 -104 -65 68 -4 -136 -97 -110 97 133 -128 -194 -156 -59 -238 -259 233 28 36 -111 153 315 -62 -307 74
6719 74 195 -61 -298 -177 17 -135 -205 -187 216 -134 40 -30 138 -17 13 67 -12 74 -102 16 -213 -62 -207
6742 -207 -172 -137 -2 40 134 -401 -79 -95 -258 140 -221 48 249 -25 96 -90 -40 -202 -63 -19 -9 -125 182
6765 182 -289 -32 28 -325 19 153 229 -48 -13 18 -347 -194 -70 205 85 99 11 -167 30 8 -4 -191 160
6788 160 55 317 -255 163 215 -121 -121 225 -90 -238 178 210 -132 -80 287 280 86 205 -23 120 -212 34
6810 34 -215 -40 -35 -131 11 -76 165 -272 151 64 54 -56 97 -157 -71 47 -185 -115 86 -245 -53 -188 146
6833 146 -77 273 -104 -153 -144 -156 130 -44 -60 25 7 121 -19 52 147 -153 193 -103 -55 -24 110 112 182 -123 -15
6858 -15 124 41 -38 361 -179 -268 -69 289 -12 316 9 63 -355 -114 -20 220 6 -59 -169 8 198 -6
6880 -6 436 176 -198 -176 -25 -221 134 -62 -131 -38 205 226 297 -199 -120 -21 333 -71 -81 4 177 -162 -72 67
6904 67 -143 2 174 -44 63 35 68 -13 -58 -78 189 90 148 268 214 -43 41 157 -182 39 -103 -100 -183 194
6928 194 -16 282 146 -151 -160 -130 66 -146 113 -186 321 57 -324 92 -45 -164 -154 -16 -101 -276 27 171
6950 171 183 -125 141 -75 -246 -333 141 -61 -254 -419 -92 -125 279 -81 241 125 72 105 -194 64 -158 -21
6972 -21 23 123 23 -28 119 -123 322 25 78 447 -114 -133 104 194 -142 111 22 -366 43 -245 -101 -236
6994 -236 27 18 -138 113 152 84 -4 -12 -105 -78 -21 125 144 -70 -74 194 -81 -163 99 78 123 216 -69 -135 -126 132 22
7021 22 -133 93 143 -168 290 37 -281 80 -38 224 -143 252 247 207 116 180 -46 -269 -139 -253 -9 135
7043 135 -98 48 -26 -137 -111 94 -230 -182 -104 345 72 -338 -154 -133 -58 -147 201 -27 43 195 -397 93 262
7066 262 -28 -262 33 257 -10 53 241 67 107 84 87 2 119 -272 -52 -48 -90 168 109 -29 371 370 -52 -116
7090 -116 324 112 -60 -28 -134 -184 67 169 272 230 -132 60 -86 52 452 -35 194 -203 86 -178 -47
7111 -47 -24 38 331 0 -1 -55 -73 -61 102 148 56 -58 -33 -69 -116 57 -19 162 325 -56 15 -329 67 91 -116
7136 -116 -73 83 -30 90 -8 207 113 348 -168 143 -142 -423 -45 -185 -368 -99 137 -211 92 332 144
7157 144 -513 -28 35 -31 33 279 -104 183 74 4 139 49 1 -220 168 112 -50 -193 -40 -129 -69 69 48
7180 48 271 158 -362 -199 64 -234 -214 11 139 -164 179 82 152 58 -235 -164 -60 -39 -16 -39 -295 434 -80
7203 -80 8 443 -281 172 148 34 -212 -181 9 7 20 108 105 123 -264 79 52 251 -35 5 10 146 -146 45 -7
7228 -7 -207 229 75 -72 -26 -104 -123 54 170 308 -51 -18 177 -46 -206 28 31 240 -266 -158 203 -398 -309
7251 -309 41 10 102 -71 -125 -273 -60 -12 -138 48 -57 12 64 -118 -66 -111 73 -209 -53 -138 -71 -120 -116 -65 -7
7276 -7 21 13 -55 -155 1 195 -102 -99 -92 -137 -142 -92 -19 -67 -93 146 -164 -136 241 135 -39 -53 -190 -103 -124 93 -87
7303 -87 116 151 -248 -147 169 -211 -152 -150 -43 -257 -239 -24 -410 -21 174 -110 123 48 95 170 177 230 39 -233
7327 -233 37 -357 -238 288 -158 97 143 237 -114 -108 166 36 -62 68 -11 174 -122 -86 174 181 20 -366 -429
7350 -429 -54 -91 -99 -59 261 71 279 260 -301 179 -190 239 3 87 4 -229 219 -215 159 33 -121 60
7372 60 -103 141 165 -23 -125 332 16 303 39 60 58 13 -33 68 -44 133 138 93 -96 -78 156 122 -177 175
7396 175 251 31 82 -133 -112 -76 -101 -190 -182 282 -202 -245 105 -20 62 58 -151 -57 423 16 34 -11 67 -19 -65 91
7422 91 288 60 193 -51 -266 168 -168 -30 194 5 -111 59 63 -155 -338 -57 194 -356 -121 -135 -138 149
7444 149 187 43 225 231 -396 268 41 -73 98 168 -97 83 -159 152 256 164 -22 -268 232 2 -3 -86 -58
7467 -58 26 4 148 86 -154 -280 168 -257 56 188 -224 -162 16 208 210 407 26 21 -46 72 -284 61 262
7490 262 -133 -98 345 -82 -17 -363 184 -118 -3 22 -195 -90 120 105 69 168 -279 15 82 150 48 246 59
7513 59 -174 -155 -365 -34 -140 -57 4 115 131 -139 -67 -71 -227 39 19 -86 86 248 -78 -4 75 419 186 -305
7537 -305 -74 104 -161 -43 -43 -341 -125 155 2 -119 26 -64 -141 63 125 -18 58 -79 43 -51 73 -64
7559 -64 -152 -41 22 123 66 -1 262 28 -145 4 188 49 217 -9 296 -18 -284 152 -21 -73 -62 -75 -317
7582 -317 120 169 -45 42 -255 109 -40 -3 166 -15 -97 182 -94 204 -28 -109 -55 -192 -111 129 -71 -212
7604 -212 195 61 -192 -77 122 64 -114 -132 181 -394 171 -43 51 211 131 22 57 107 92 -100 -96 163 14
7627 14 66 37 172 -188 -76 -126 111 226 6 41 14 -133 -417 104 -199 -116 441 -245 -102 -329 153 -53
7649 -53 -245 151 -4 -84 132 -107 -248 130 -163 -355 -82 -62 -275 -114 383 19 -113 -129 156 216 358 166
7671 166 155 96 38 117 91 -146 27 -258 87 63 -21 33 128 160 80 -19 103 50 -174 77 -416 36 -62 -102 152
7696 152 52 227 -198 143 286 9 125 -298 -244 -209 252 265 17 -150 8 -282 146 32 242 70 31
7717 31 19 79 58 -164 -172 7 -136 -55 46 -146 -86 -186 -86 -240 520 117 -197 -24 -27 -188 -239 -126 43 -301
7741 -301 -28 -283 43 55 -285 -217 125 -214 -171 90 77 -265 49 -77 -94 -316 80 132 -565 199 212 -79
7763 -79 -46 298 -184 -65 -20 4 -122 233 -75 -172 -30 -57 -36 3 -134 -227 -110 378 159 -132 26 -160 -110
7786 -110 156 -1 130 114 185 84 126 84 -315 -8 -145 102 -339 -255 383 35 212 85 -110 5 -167 172
7808 172 81 -54 40 200 3 -190 145 -111 59 -105 66 4 202 -148 -121 -1 18 -184 -145 36 140 155
7830 155 -176 -34 -42 -484 -176 128 -144 -161 34 -104 -186 107 94 -124 218 8 -102 -14 -154 149 -256 -88
7852 -88 -86 60 13 67 -59 195 65 -37 -135 427 -154 35 7 -128 -99 92 -180 17 -2 -69 126 -237 226
7875 226 94 -54 -145 -58 202 214 220 -182 73 -150 3 -211 52 30 -235 -73 50 134 190 -195 -61 161 -79
7898 -79 100 96 -258 -491 69 66 -155 -264 -53 12 48 -97 129 -230 13 -6 262 -55 -82 -87 73 152 -127 99
7922 99 16 -166 234 52 -76 39 -10 42 22 84 84 207 56 334 -114 -187 -103 -241 -75 -190 506 47 108 183
7946 183 11 -316 288 -199 -97 -137 62 -7 -65 -33 10 -137 122 -47 -52 75 105 -164 -207 168 88 247 125
7969 125 -61 10 277 126 -52 -48 4 41 3 182 143 -57 3 -173 159 -87 225 108 128 -131 38 76 68 -392
7993 -392 95 -44 -150 192 64 218 -193 -22 84 -248 153 195 -37 359 3 -135 83 -201 -237 9 80
8014 80 11 77 -190 -80 162 0 54 -122 107 160 -117 -100 -24 27 -103 226 -95 -206 -26 265 122 27 120
8037 120 -3 -176 139 135 195 -18 -138 -344 -130 -230 171 13 390 -188 -297 200 41 -105 96 183 192 -94
8059 -94 -35 -30 -200 -61 -197 432 397 -35 325 80 17 198 -170 113 -43 112 -105 -87 -131 141 162 -218 -269
8082 -269 -191 -216 238 107 154 -61 -1 12 -104 -165 158 -6 -102 -17 -147 161 -199 -137 87 98 14 -76 8 80 -108
8107 -108 -3 92 -18 -10 5 123 117 -187 -162 -25 -117 -476 15 -59 188 -239 123 -247 165 14 -122 62 131
8130 131 -125 3 143 -191 -176 -61 5 -179 -210 -70 -86 -221 156 -120 238 -161 -151 44 -16 -11 -73 -191 176
8153 176 118 -31 22 20 -247 -333 144 12 47 139 -164 -168 -33 -37 -189 -139 -66 16 -98 197 -49 -20 -84 132 -5
8178 -5 42 -151 96 89 191 168 -167 139 -4 -29 58 52 -283
8191b83
$$ Imaginary data points
##PAGE= N=2
##DATA TABLE= (X++(I..I)), XYDATA
0 0 0 0 0 0 0 0 0 0 0 0 -1 8 -8 8 -8 8 -16 16 -16 24 -24 28 -32 40 -41 49 -56 64 -73 81 -90 104 -115 128
34 128 -144 160 -177 198 -219 243 -270 299 -330 366 -406 450 -500 559 -625 702 -794 906 -1043
53 -1043 1217 -1448 1772 -2256 3051 -4608 8776 -43220 -114622 -7490 49841 -4309 -59145
66 -59145 -27012 3969 -9337 -30551 -17067 -9511 -30332 -37326 227 12274 -24142 -34554 -837
79 -837 -3489 -30762 -14048 16008 -4581 -28328 -5122 23329 6020 -27048 -18575 24179 28292
92 28292 -14619 -22631 20717 30401 -4598 -11394 10116 9878 3452 15035 16131 -2544 -10705 2922
106 2922 21529 16730 -9428 -14593 10080 14764 -5687 -6189 6048 -3447 -10738 2081 3985 -6136
120 -6136 -5782 -4523 -10902 -9333 -422 3372 -2454 -17754 -21054 4422 17179 -11348 -27670 -744
134 -744 15527 -2432 -13677 -5152 2630 2793 -2167 -4422 6219 12516 -751 -7519 2940 7463
148 7463 7319 10803 1675 -6091 10568 22193 2230 -11312 5462 18254 9081 -3244 -2841 12819
162 12819 19144 -2071 -17573 2603 18747 3482 -7726 -1457 286 -45 2841 -3638 -10426 -4572
176 -4572 -246 -2723 -3444 -7045 -10487 -2974 -1931 -14037 -11103 4122 -2361 -16646 -10726 -1397 -2286
191 -2286 -4381 -8916 -11876 -3253 2124 -4405 -5721 -3055 -7882 -5912 5098 1135 -7852 -527 3983
206 3983 -4464 -4546 3139 3080 -196 -2247 -4390 3724 11703 -2281 -14020 -467 10702 2714 -4788
221 -4788 -4628 -2798 4066 5544 -7100 -10517 496 3676 -2206 -4306 -7819 -6422 4617 2416 -12737
236 -12737 -10405 4012 2105 -6917 -5601 -3748 -2071 -443 -4014 -4899 3159 1394 -9485 -4153 6851
251 6851 1949 -3471 -892 -1471 1600 8859 3630 -7228 -2955 6255 7283 4627 -1609 -5090 6377
266 6377 13620 -344 -8338 3921 9026 1286 299 2367 363 2759 2963 -2257 -555 3425 -587
281 -587 -1251 2254 -2810 -3821 4524 1170 -8872 -1694 6958 -1833 -8717 -2410 2155 1583 -2027 -7166
297 -7166 -2577 6924 859 -9013 -2228 3222 -1677 204 3343 -4054 -3765 6291 3665 -5281 -3027
312 -3027 3178 5164 2995 -2844 -2765 7812 6807 -6841 -3972 8981 4974 -3814 577 3162 -463
327 -463 2233 2535 -2263 -1327 2587 1661 1277 -949 -4590 2019 7470 -4105 -10416 3763 8025 -5685
343 -5685 -8723 1081 3412 -794 -4157 -4810 56 3598 -3643 -6375 563 24 -3455 1585 744 -7533
359 -7533 -1905 6983 -874 -8945 -1441 5329 2312 -2933 -5046 570 7706 409 -8842 173 8154
374 8154 -618 -4238 2657 1317 -1507 3217 2388 -3429 -733 4097 1390 -583 -2092 -1504 5039 4435
390 4435 -7235 -5300 8050 4240 -7955 -4289 4452 1843 -1868 -2603 -2869 1080 2174 -3956 -4331
405 -4331 754 -690 -1879 2157 -2386 -7206 1273 5368 -5639 -8374 1407 3789 -1616 -4633 -4407
420 -4407 1179 4344 -3625 -8534 1059 4345 -3760 -3660 1393 -1688 -2037 2116 -1541 -5498 -102 3042
436 3042 -1209 -2793 -3044 -148 4692 439 -9153 -2116 8550 96 -9477 -1429 4998 397 -2583
451 -2583 -3054 -1709 2428 1748 -4404 -2920 1836 -1105 -687 1681 -4381 -5604 4427 4104 -7466 -6430
467 -6430 3554 2874 -3113 -5027 -2949 2317 2096 -6329 -6040 3186 1179 -6046 -2095 1517 -3182 -2327
483 -2327 1903 -3018 -5053 917 1951 -2773 -3799 -1883 1504 3406 -4097 -8565 2752 7915 -3738
498 -3738 -8148 1663 4307 -997 -1025 -1540 -1503 1762 1681 -2400 -901 163 -1206 2167 2189 -4665 -3010
515 -3010 6086 1468 -7278 -1330 5516 58 -3824 -1775 625 2585 -140 -5776 -2340 4234 -227
530 -227 -4542 -52 622 -2512 1532 2296 -5572 -4579 4119 2855 -3330 -3953 -1250 2670 3488 -4312 -6192
547 -6192 3338 4604 -5193 -4238 3059 966 -2188 -221 -967 -1766 1344 -220 -3406 -982 153 -918
563 -918 953 -1012 -5960 -424 4956 -3154 -8829 -101 4014 -2149 -5064 -3536 -1171 1269 -1810
578 -1810 -7608 -3253 2037 -2681 -5531 -2034 -3440 -4749 41 -1280 -7803 -4877 909 -2102 -5780
593 -5780 -4657 -2870 -516 -1170 -6973 -5767 1992 -370 -7874 -3562 1388 -3096 -4478 -847 -1484 -2655
609 -2655 -1343 -2978 -2995 -143 -1386 -2270 629 -1987 -5466 1066 4022 -5678 -7713 1780 3979 -2313
625 -2313 -5104 -3975 -708 2485 -939 -5927 -3459 -924 -1803 -186 -343 -7050 -5885 3373 475 -7772
641 -7772 -4793 1083 -1624 -4335 -3400 -1637 -216 -2857 -6524 -1139 4523 -3584 -9140 -349 4681
656 4681 -959 -2987 -1896 -2401 792 3958 -805 -4282 -490 2440 4248 2498 -4387 -4087 7195
671 7195 7488 -3513 -3614 3963 3554 -229 2170 2448 148 -628 -386 1978 4564 -137 -5676 289
687 289 4106 -1419 -1975 1667 -2680 -4903 1344 2834 -4006 -5858 -2413 804 1332 -3962 -8174 -1870
703 -1870 2707 -3261 -5825 -888 -2753 -4920 323 433 -5874 -4664 378 -118 -3087 -3879 -2791 1074
719 1074 1246 -4565 -4223 3254 132 -6549 -870 5064 -690 -4983 -1945 1056 2269 1382 -4068 -4279
735 -4279 1348 2335 -1205 -692 -2282 -3669 1726 2844 -5065 -5539 1935 987 -4474 -3495 -720 -832 -2181
752 -2181 -4590 -4353 620 -361 -7160 -5705 1094 -1158 -4725 -2115 -3161 -5083 -1717 -860 -4654 -3367
768 -3367 -1302 -2346 -2067 -2021 -3963 -1020 1909 -3423 -6500 467 2320 -2514 -2648 -309 -1059 -541 302
785 302 -1286 -1074 919 -1447 -1147 2059 -773 -2739 2044 2459 -3877 -2438 3261 713 -2848 -1106
801 -1106 233 661 348 -2900 -3227 1574 351 -4168 -927 1936 -2620 -3564 392 -1050 -2588 52
817 52 -1509 -4844 -2139 1317 293 -1348 -4333 -4938 1698 3751 -4675 -6184 1626 2364 -2972 -2253
833 -2253 -90 -601 -257 -446 -1843 15 405 -2353 -1161 2673 -699 -2961 1262 310 -3426 -233
849 -233 2175 -2155 -3349 1095 1426 -847 -2347 -2754 750 3247 -2881 -6211 557 3427 -1807 -2621
865 -2621 -193 -2628 -2428 1687 451 -3567 -2653 -264 877 618 -2594 -3580 1956 1701 -4520 -1963
881 -1963 3808 -731 -4758 481 2748 -972 -1731 -960 -640 1171 747 -1604 -180 972 -1415 -160
897 -160 3057 -2065 -4167 2426 3014 -3902 -2767 2175 1232 -1079 -2149 -2010 499 1565 -2313 -2995
913 -2995 1830 444 -3628 -80 1077 -2889 -1611 1545 -1593 -3151 249 1160 -1055 -1304 -1880 -44
929 -44 2840 -1266 -5199 395 4535 -1124 -3101 1381 1165 -796 547 453 -1023 247 668 -487 967
946 967 1058 -1460 1046 2157 -2302 -1738 3431 1371 -3400 -533 2615 614 -1147 -1289 -665 1394 1170
963 1170 -2872 -1776 2110 -266 -2323 942 -272 -2883 645 1919 -2575 -3013 1025 1158 -1127 -1744
979 -1744 -2011 805 2437 -1986 -3895 1951 2946 -2671 -2047 2211 359 -1171 462 -142 -662 1286
995 1286 537 -523 932 300 -723 2100 1448 -3298 -584 4418 10 -3470 823 2572 65 -1207
1011 -1207 -972 -33 1651 137 -2762 -73 2172 -1141 -1463 1387 -1079 -3271 1382 1515 -3400 -2266
1027 -2266 1750 777 -1255 -1858 -1235 1079 1509 -3435 -2902 2966 1332 -3566 -629 2134 -1006 -729
1043 -729 1216 -730 -1200 1184 1035 -48 342 -284 231 2817 109 -3626 1635 4454 -1720 -2855
1059 -2855 2271 2617 -591 -424 -110 586 1725 -52 -2099 865 1608 -1289 210 1457 -1981 -1421
1075 -1421 2910 763 -3532 -450 2707 225 -1147 -802 -170 1632 789 -3096 -836 3591 -260 -2940
1091 -2940 991 2033 -1138 147 1545 -1040 -273 1900 877 -33 701 -36 1720 2927 -1061 -2328
1107 -2328 3315 3733 -2027 -912 3441 1724 -559 644 704 407 1625 141 -591 1777 1132 -994
1123 -994 1651 1001 -2515 -361 3257 -785 -3577 659 1943 -507 -1843 -1120 -68 1373 -892 -3576
1139 -3576 113 2981 -1560 -2485 1409 36 -1711 730 708 -2404 -693 2007 562 -604 -17 -114
1155 -114 1663 2062 -2242 -1462 3946 1701 -3010 306 3561 302 -1070 697 459 835 1187 -607
1171 -607 -314 1957 485 -676 1677 493 -2410 1116 2627 -2294 -2869 2064 1561 -1467 -1285 -314
1187 -314 166 617 -1943 -2315 1078 1029 -2691 -976 2133 -1481 -2583 1013 581 -2607 -437 933 -517
1204 -517 -510 133 -503 949 405 -2388 157 3316 -776 -2902 1872 2997 -1003 -436 1247 299 638
1221 638 1160 -424 -133 1416 49 633 2302 -814 -2072 2484 2837 -2337 -1357 2900 701 -1061
1237 -1061 -82 419 92 467 -1421 -1085 1744 355 -2886 516 2129 -1812 -1683 1413 -542 -1877
1253 -1877 1328 741 -1778 -1020 581 564 805 -1175 -2288 1830 3334 -2261 -2938 2929 2103 -1480 -52
1270 -52 1303 -370 -96 901 547 905 714 -1076 816 2975 -390 -1418 2414 926 -1641 1384 2515
1287 2515 -822 -1497 1575 1471 60 -488 -1014 782 2489 -639 -2473 1454 1276 -2336 122 1995
1303 1995 -1572 -2564 1596 1492 -1397 -965 -342 324 907 -1094 -2287 1306 1353 -2185 -233 2723 -463
1320 -463 -2214 1488 1527 -1049 -160 599 -446 653 723 -61 1020 531 -1524 1134 2609 -1278 -2603
1337 -2603 2253 2836 -1480 -1086 1095 734 496 -170 -1256 559 1111 -1303 -915 1778 68 -2062 620
1354 620 885 -2179 -841 1432 -449 -1555 278 382 -596 -347 -1291 -268 1559 -1122 -3340 899
1370 899 2852 -1861 -1999 1109 346 -1204 688 409 -286 591 216 -522 1061 627 -876 962 1879
1387 1879 -1341 -1094 2777 1242 -1673 680 1218 -330 -193 533 36 399 1165 -748 195 1360 -624
1404 -624 -965 1775 299 -2347 198 1644 -951 -1228 689 -59 -386 -277 -1469 44 1923 -839
1420 -839 -3043 1218 1954 -1418 -1362 947 -345 32 910 -804 -949 1062 995 50 587 -619 -1023 2089
1438 2089 1513 -1834 -333 2889 232 -1546 1031 1865 187 -66 101 209 1660 -29 -1477 1118
1454 1118 2677 -936 -1134 1320 183 -1363 1677 1365 -1513 -853 970 871 -237 -916 -1609 860 1364
1471 1364 -2116 -1819 1871 331 -1942 -130 1061 -1726 -966 869 -136 -854 -32 -785 46 564 -1125
1488 -1125 -633 1703 -353 -2678 1046 2741 -1580 -1944 1251 1419 -245 -10 -316 192 1582 254
1504 254 -547 1252 663 -963 1034 2218 -1446 -1358 2649 1087 -1839 40 1465 181 -349 -565 -122
1521 -122 1338 497 -2242 36 2356 -798 -2426 933 746 -1512 -107 673 -1331 -930 916 281
1537 281 -1043 -556 -1192 240 1481 -1374 -2412 1796 1452 -2081 -810 1627 -57 -754 518 -5
1553 -5 -102 872 -127 -401 1324 597 -849 1165 888 -1262 444 2664 -181 -1722 1462 1715 -389 -246
1571 -246 -17 208 1050 316 -1196 700 1607 -820 -697 1374 -134 -1727 622 496 -1558 -115 757
1588 757 -535 -504 -287 -817 370 477 -2032 -1300 1956 523 -2484 31 1162 -902 -805 278 -267
1605 -267 307 684 -234 -138 1053 -516 -396 1642 407 -1645 561 2262 -792 -673 1568 1264 -439
1622 -439 40 109 398 1600 20 -925 1878 1368 -1348 -129 1328 -618 -554 1602 246 -1424 268
1639 268 1308 -72 -605 -590 -690 964 104 -2104 -181 2045 -692 -2087 998 782 -1065 -504 555
1656 555 -391 -160 229 -354 160 357 -597 -462 1518 -548 -1021 2068 1405 -1619 -31 2194 678 -546
1674 -546 580 545 878 1292 -192 -220 2049 495 -1012 1093 1627 -1009 -428 1681 -99 -738 670
1691 670 784 -381 39 -283 -88 645 -380 -1760 701 979 -1628 -1187 1462 -8 -1614 119 162
1708 162 -766 -329 123 -408 150 141 -815 283 737 -1236 -753 1952 581 -1710 705 1847 -276 -380
1726 -380 529 571 650 561 -335 737 1759 -73 -621 1845 1100 -880 1024 1832 -623 -430 1558 882
1744 882 -268 53 152 108 929 -951 -765 1711 682 -1823 -128 1529 -608 -1498 572 178 -873
1761 -873 12 -77 -872 7 -606 -987 697 275 -1854 -48 1588 -816 -1552 1117 1167 -973 -647 854
1779 854 359 417 461 -255 942 1627 -333 -211 1535 34 -707 1379 1587 -802 404 1784 568 93
1797 93 592 226 543 687 -460 -221 1781 145 -1492 1061 1756 -700 -902 919 141 -780 157 -147
1815 -147 -447 439 -375 -607 416 -517 -1365 765 1091 -1572 -1182 1228 299 -1293 -235 690 -28 296
1833 296 105 -250 1003 484 -836 604 1560 -448 -698 1760 793 -863 1015 1781 196 300 893
1850 893 545 515 560 -235 1067 1697 27 -1183 1515 1273 -766 -125 915 33 -40 855 -122 -441 284
1869 284 128 5 323 -703 -988 1164 757 -1718 -10 1362 -463 -1377 559 556 -508 -6 51 507
1887 507 1197 365 -739 753 858 -703 246 1748 27 -443 2006 1576 -628 175 1521 824 755 -140
1905 -140 -262 1265 1683 -238 -160 1887 474 -566 1005 1116 -769 -306 1366 382 -4 363 -119 -88
1923 -88 118 -727 -258 1078 -302 -1701 671 1349 -1319 -1248 784 686 -415 -85 44 175 1082 283 -570
1942 -570 692 -87 -644 726 1362 -1053 -422 2215 805 -620 323 1166 493 629 585 -58 1715 896
1960 896 -277 650 1919 -189 -506 1273 1100 -473 530 1191 -131 57 710 574 107 25 -581 384
1978 384 1198 -705 -998 1237 790 -1169 -615 775 -351 -270 267 -46 -197 417 -594 -51 484 -404
1996 -404 -970 696 470 -1097 182 1567 20 -762 934 490 61 332 6 345 1277 244 -790
2013 -790 868 1262 -435 -128 1487 -22 -308 1223 699 -496 124 870 185 174 -332 -570 777 1126
2031 1126 -894 -750 1396 181 -1253 101 512 -514 -564 243 -188 -61 136 -488 -25 366 -920 -719
2049 -719 773 -121 -1202 336 927 -672 -484 977 289 -151 104 -131 587 1029 -51 -673 1051 1057
2067 1057 -595 389 989 -423 -152 1544 765 -575 37 787 601 452 202 -229 792 531 -769 431
2085 431 1608 -221 -1001 846 672 -823 -88 431 -221 279 -176 -894 -283 319 -500 -153 558 -785
2103 -785 -1361 1320 782 -1590 -854 534 152 -405 -14 -75 147 641 -677 -400 823 -462 -756 1150
2121 1150 1094 -635 -104 1276 316 -64 976 827 3 159 29 330 1281 -95 -705 835 1032 -1199
2139 -1199 -576 1087 -27 -620 361 344 -547 -149 400 -258 -119 -582 -882 398 503 -1148 -879 904
2157 904 85 -1354 184 432 -777 -688 213 -217 218 302 -529 197 715 -316 -620 703 216 -671 529
2176 529 1243 -732 -571 673 628 53 381 23 416 786 -479 -364 1080 898 -795 59 924 -301
2194 -301 -750 533 265 -410 296 193 -229 33 -299 -389 292 -238 -1343 -126 822 -792 -1205 461 156
2213 156 -1146 -33 296 -586 -214 -267 -532 -146 406 -1236 -219 689 -461 -853 591 336 -887 21
2231 21 549 -51 -516 99 -172 399 599 -254 -179 1374 -16 -624 575 801 -786 84 894 -147 -449
2250 -449 250 102 -210 209 -649 -480 504 -269 -834 201 753 -940 -947 815 144 -1407 -419 -69 -644
2269 -644 -92 -381 -576 157 -353 -977 -87 317 -788 -558 700 -449 -1269 -59 567 -716 -329 -79
2287 -79 22 207 123 -401 522 834 -537 -593 890 456 -942 234 994 -265 -167 695 -17 140 306 -29
2307 -29 52 497 -488 -764 1033 391 -1030 99 920 -438 -953 278 117 -230 -137 -492 -315 326 -424
2326 -424 -529 246 22 -1302 -38 946 -717 -1147 734 409 -509 -541 104 -123 251 -386 -817 475 14
2345 14 -483 -563 819 -45 -958 707 220 -390 324 708 -340 -409 -81 76 13 164 -686 159 1017 -188
2365 -188 -981 435 366 -835 -398 566 -84 -282 80 -553 25 -159 -665 -562 237 -180 -937 286 475
2384 475 -1081 -626 471 -68 -890 -231 54 -395 -178 -475 -362 221 45 -837 -181 418 -723 -818 1132
2403 1132 149 -1022 325 518 -299 -101 470 -136 132 263 -201 312 929 -552 -668 763 607 -545
2421 -545 -143 527 -40 211 410 -329 86 239 -278 -189 249 -568 -888 569 174 -1283 -465 647 -763
2440 -763 -340 54 50 -63 -30 -403 157 559 -557 -648 508 538 -690 -223 633 -59 -686 592 620 -507
2460 -507 -89 337 -189 399 213 -429 699 697 -492 -170 997 42 -340 552 610 -251 215 201 -240 -87
2480 -87 38 -865 -111 -50 -518 -177 637 -216 -995 261 777 -846 -693 337 -178 -547 102 -75 -389 433
2500 433 -286 -765 261 -209 -810 362 618 -544 -383 673 118 -355 30 389 -189 -40 -201 -183 602
2519 602 302 -695 223 826 -535 -557 760 315 -461 67 66 -207 295 242 -154 279 383 -493 50 729 -287
2540 -287 -589 481 23 -1000 -357 256 -471 -309 -24 -393 14 51 -736 -360 188 -223 -721 230 -15 -864
2560 -864 -104 295 -389 -574 206 129 -179 126 -138 0 788 -116 -525 257 856 -672 -414 646 286 -117
2580 -117 476 201 -297 18 288 22 597 23 -283 275 740 -666 -477 855 68 -682 415 394 -438
2599 -438 -79 -3 -223 91 -10 -621 283 295 -716 -727 323 -110 -831 182 541 -904 -674 398 136
2618 136 -295 -29 -171 232 591 -452 -573 416 219 -675 376 581 -383 110 609 383 -85 383 149
2637 149 38 271 65 -20 511 578 -610 -1 663 -230 -488 609 372 -646 173 95 145 3 -149 -271
2657 -271 184 -260 -530 -5 697 -641 -773 470 88 -744 -360 429 36 -8 -377 -395 148 396 -642 -63
2677 -63 628 -54 -430 680 480 -447 -61 728 -90 221 150 -392 -4 420 -13 352 467 42 -309 746
2697 746 424 -491 -163 626 146 84 323 -11 -184 171 -296 -300 212 -15 -510 184 432 -780 -541 690
2717 690 88 -720 23 52 -548 -101 5 -196 -28 -46 -783 -151 305 -448 -683 681 517 -587 46 815
2737 815 -586 148 538 178 -247 -89 -199 144 647 -259 -650 724 201 -219 383 500 103 43 315 187
2757 187 -195 192 8 -87 95 -18 -183 483 512 -722 3 587 -550 -855 330 -36 -541 -400 -259 -250
2777 -250 190 -102 -607 35 121 -681 -403 595 -474 -536 222 12 -562 -64 290 -205 -168 152 10 201 272
2798 272 -458 -13 856 25 -362 289 571 -439 400 536 -170 -79 190 -96 9 88 -382 -169 305 301 -628
2819 -628 433 605 -383 -502 190 -316 -391 335 52 -98 41 -420 -671 255 -212 -690 116 201 -621 -246
2839 -246 512 86 -676 -243 72 -297 6 -10 -155 185 115 -567 271 805 -267 -265 587 515 -390 400 390 -51
2861 -51 193 289 23 149 153 -69 19 353 5 -375 600 14 -788 36 593 -188 -270 18 -186 -444 54 -389
2883 -389 -155 441 -848 -653 240 426 -935 -140 645 -171 -479 236 254 -319 -81 -18 -185 -110 -110 -281 391
2904 391 252 -637 -630 188 87 -499 256 373 -228 109 205 -215 129 204 -178 306 305 -449 87 800 -132 -413
2926 -413 356 161 -715 -238 266 47 32 -210 -422 -2 -91 -388 -305 97 -126 -644 207 118 -1014 -461 55
2947 55 -132 -848 37 -59 114 136 -326 -454 383 -55 -878 49 708 -205 -251 637 98 -385 294 597 -348
2968 -348 -28 105 -32 228 369 -292 184 475 -325 -232 99 -116 -378 125 258 -261 -214 352 -240 39 109
2989 109 -702 -214 322 -268 -640 568 -111 -627 -258 162 -570 -434 -226 -349 -220 80 -551 -355 405 79
3009 79 -540 354 346 -682 -4 164 -299 -427 -119 -102 -262 170 101 -77 -48 248 -369 6 559 -495 -290
3030 -290 662 -27 -294 246 275 -283 63 61 -526 162 111 -364 134 2 -723 -545 312 -333 -577 -203 2
3051 2 -472 -152 26 -434 211 -96 -475 -207 445 -520 -389 304 -342 -806 -153 77 -609 -486 358 -191 -364
3072 -364 94 -103 -176 254 -102 21 535 70 -572 331 514 -137 -35 493 434 -362 288 196 -60 431 -83
3093 -83 -6 295 446 -232 225 570 -390 -231 112 -102 -394 256 176 -486 51 197 -130 -409 -9 -511 -100
3114 -100 316 -374 -404 349 89 -463 -36 269 -363 -323 31 -243 -36 242 -487 -223 295 -345 -330 189 410
3135 410 -670 39 253 37 -124 352 -22 -182 51 2 -352 247 13 -362 258 354 -217 -188 367 -253 -387
3156 -387 276 -23 -69 242 287 -518 -46 -76 -512 -380 129 -571 -160 726 -273 -552 77 164 -323 -383 1 -396
3178 -396 -90 20 -446 17 402 -276 -233 106 -116 -518 368 407 -307 -225 422 -52 -66 -168 63 -131 379
3199 379 109 -393 601 336 -175 229 320 -31 47 494 336 -315 264 26 -156 446 -202 26 508 -27 -288
3220 -288 125 147 -409 -165 430 138 -555 -242 -55 -239 293 -95 -428 -236 234 -628 -124 187 -311 -79
3240 -79 387 438 -167 7 368 -285 103 121 22 -29 345 58 1 765 -30 -322 544 112 -374 -143 514 7
3262 7 76 133 -46 -123 -159 -395 -258 55 170 -426 394 284 -450 -358 606 -159 -65 89 63 -346 141 -27 -276
3285 -276 71 28 -204 33 272 -460 -394 397 -94 -309 -178 109 50 -102 -6 -343 173 -197 -435 62 185
3306 185 -291 -69 311 452 -77 6 506 -90 167 157 -48 -168 261 42 -115 347 -211 -64 444 288 -383
3327 -383 10 525 -238 -267 123 -297 -145 156 -322 -311 26 -340 -581 -40 -136 -347 -85 -8 15 -488 33 373
3349 373 -334 173 256 -69 76 126 -235 374 251 -221 -116 124 -102 81 140 346 -292 112 51 275 143
3370 143 51 -68 129 375 -116 -17 274 217 -528 334 95 -184 -287 200 95 -89 -25 -139 -257 293 -213
3391 -213 53 11 -177 -295 -52 273 -528 -154 194 126 -579 -31 -31 -7 1 -87 61 275 -3 -293 -66 302 -353
3414 -353 -50 365 339 -241 171 340 55 -134 130 166 464 216 6 71 504 -226 -271 209 -16 -224 30
3435 30 160 140 73 193 -295 35 -11 -259 46 136 -44 34 205 252 -516 -9 503 -233 -162 -39 -84 25 126
3458 126 -97 -8 121 112 -182 390 342 -453 300 306 -428 -197 519 8 26 344 -169 -155 328 153 295 418 485
3481 485 -310 -195 373 -221 -10 -93 -40 -320 56 409 -180 -43 176 160 48 146 -52 -230 452 -206 -402
3502 -402 79 184 -533 -263 -203 -239 -82 36 -345 -277 96 -158 -367 241 -83 -494 -33 179 -13 -256 386
3523 386 -243 -51 -208 -10 -195 588 -42 -375 228 53 -133 275 243 60 40 395 331 188 176 79 34 232
3545 232 -35 -42 -67 164 -353 180 457 -267 -202 -194 -276 -302 105 -127 -142 105 -130 -236 135 -46 -122 -264 82
3568 82 -130 -153 -34 0 -356 -176 116 -224 -40 174 40 -101 -70 -27 174 339 -59 -159 361 289 -255 142
3590 142 467 -87 -176 484 136 10 124 -29 80 25 348 -91 494 372 299 300 351 -60 -187 269 -34 -418
3612 -418 -100 149 -285 -46 352 47 184 257 -62 -224 150 -298 -264 121 80 -275 -238 270 -475 -50 -65 73
3634 73 383 311 -126 -136 126 43 -175 184 221 -74 57 308 443 -75 -149 188 72 186 242 -42 218 324
3656 324 57 246 208 -80 -143 328 217 -250 96 -27 130 -109 277 -228 -212 -51 -478 -67 429 -128 -415
3677 -415 -124 33 -235 -132 20 -379 -353 -69 -259 -76 90 -30 -177 58 104 -460 52 292 159 -148 308
3698 308 78 234 -171 -35 153 -62 -159 89 137 184 -129 510 343 -236 -337 188 178 -85 406 -35 349
3719 349 62 233 -97 275 -15 -129 546 -94 -232 -211 263 -156 -16 19 -137 -324 125 -52 -123 -24 -186
3740 -186 34 -43 254 -226 -23 215 -328 -234 150 -38 -185 -11 312 7 56 257 -394 -204 90 -162 -20
3761 -20 349 40 -112 331 219 -145 42 58 160 244 -6 191 -72 298 87 95 434 -95 -106 -332 59 -34
3783 -34 -222 86 -176 -536 264 -175 -93 99 -95 -395 -87 -262 -260 -52 125 -175 -48 352 151 -95 -169 112
3805 112 -314 -186 56 380 264 220 -172 22 115 327 -470 202 350 -15 75 84 -62 306 14 39 -369 206
3827 206 0 -117 75 165 -48 55 290 -242 -526 -146 -164 -108 -74 178 -133 -143 -255 -311 250 -77 -242 -36
3849 -36 -70 -195 -51 148 -151 -235 24 2 70 72 174 -329 237 -49 -118 14 293 170 -21 143 107 -296 87
3872 87 142 70 25 104 49 -7 130 -31 -5 6 30 -134 571 193 -372 22 159 339 5 18 -14 144 170 -50
3896 -50 -563 -117 -213 -399 84 147 -89 148 118 -77 -200 -272 48 160 -291 47 -190 203 166 -89 -186 127
3918 127 179 -63 93 8 59 139 -74 6 131 -7 7 8 230 -52 56 220 56 -68 267 133 -8 189 -35
3941 -35 -8 -19 236 -96 -106 -1 -205 -159 -103 -133 -109 169 -187 -339 189 39 145 -78 -25 -13 -7 68 -253 -110
3965 -110 -120 -171 -12 -2 387 -99 70 168 -80 -261 89 -65 46 63 196 -110 -11 165 -219 129 117 -4
3987 -4 -38 59 -340 367 64 430 -26 338 209 85 -45 232 -168 163 222 -354 -182 150 -131 -235 195 -171
4009 -171 -263 17 -165 -264 -69 -198 -174 -169 -219 68 -213 -121 -324 -99 57 62 -202 -149 155 -66 -96 64 28 -125
4033 -125 -128 -19 -183 -9 -12 134 328 119 -48 258 286 -72 275 267 227 -108 292 25 -115 319 47 129 66
4056 66 8 89 38 -291 -392 -59 59 -141 120 68 -202 -145 -191 53 -218 -136 -75 -171 -103 44 -128 -107 80 -77
4080 -77 -257 74 -68 -411 8 51 108 175 157 -95 -60 78 67 -216 196 -245 -226 -21 205 -131 -217 -69 77
4103 77 -67 258 80 -50 3 108 -193 252 65 277 95 302 -172 30 68 -178 72 -109 -5 -47 -102 -118
4125 -118 -308 -183 -12 83 -2 36 60 -12 -15 190 -302 46 -183 -242 -54 215 -106 -154 -105 -304 -60 151 -56
4148 -56 -1 60 210 117 189 226 -103 344 42 -164 -251 230 114 114 81 234 -21 21 252 94 66 349 -213 34
4172 34 144 -58 50 150 210 -181 -475 263 202 -207 63 -6 -227 -120 -83 -395 162 -45 -214 -196 -35 -13
4194 -13 0 55 135 202 15 -16 -3 -58 107 -53 317 103 -25 171 87 14 -150 21 -60 135 153 116 157 340 62
4219 62 71 101 99 59 169 109 -44 93 276 -41 -81 104 179 228 -239 26 -57 -282 2 71 -295 151 -123 -177 -300
4244 -300 -78 -316 -78 23 -92 -11 -119 131 -143 223 237 -109 21 -34 106 120 -30 -297 82 106 135 -36
4266 -36 133 169 -327 -10 245 -127 39 119 -172 95 261 234 204 -66 27 -171 -206 -156 -101 198 50 -143 -275
4289 -275 98 -246 55 -71 -71 244 -181 212 -175 57 -326 -235 -90 -172 -102 -201 158 -55 -261 296 50 -365
4311 -365 -48 58 91 -84 94 188 153 60 39 -38 44 -175 60 -97 46 18 59 184 -2 92 -60 -21 167 251
4335 251 -284 -2 -141 60 -64 -80 -144 -66 69 -74 -85 183 71 -74 150 26 76 5 21 -140 -204 221 -233
4358 -233 -282 -11 64 -120 -222 19 17 -258 135 107 75 -120 -80 -137 50 160 517 -29 35 114 -57 207 196 147
4382 147 53 129 -106 -31 234 336 32 188 -1 -12 147 168 -131 26 -39 -61 438 254 -285 147 229 -434 -228
4405 -228 -19 5 -214 26 140 -290 -33 61 -639 -85 2 -105 -142 -159 254 -267 116 -62 -243 325 314 -77
4427 -77 104 41 -31 54 -17 -286 -53 108 -50 18 399 330 44 -8 359 127 -140 166 -105 -195 117 -205 264
4450 264 225 113 -138 -7 68 -31 -35 192 23 4 60 154 135 143 -75 -146 -114 121 116 66 -109 -58 -22 182 -20 -107
4476 -107 80 110 -176 264 470 -119 19 -154 -128 -4 -113 -235 -139 -83 66 317 23 81 -131 148 402 -6
4498 -6 73 -205 -267 -117 266 219 -249 55 -66 -107 -137 228 -67 -177 50 92 35 -56 -211 21 -74 166 -459 -12
4522 -12 201 -230 -5 -31 -35 -270 -100 -286 -162 97 -75 50 128 -71 150 154 67 -96 -149 -215 -57 -27 232 29
4546 29 -76 -184 276 8 207 34 216 -16 76 174 -50 77 -15 12 -136 131 69 64 34 -161 46 22 -162
4569 -162 -30 255 -166 -88 264 -365 -110 -168 69 -130 -59 150 -243 112 179 -49 -189 42 -72 -53 -383 -211
4591 -211 -139 -84 -174 -37 68 -6 271 387 -8 -17 138 63 151 81 125 -195 -16 268 -160 62 -55 74 -25 -56
4615 -56 -271 -29 -152 318 92 40 177 -239 45 -60 111 -65 -201 103 47 -168 -10 366 52 -280 -138
4636 -138 -205 -191 41 15 131 -185 -26 284 -113 -331 186 49 -46 -22 84 217 235 240 38 31 -158 -170 -139 48
4660 48 40 67 -142 16 162 -55 152 199 284 -288 287 176 -215 73 17 121 -166 -146 1 204 -40 25 -171
4683 -171 5 -175 -207 -72 170 -326 -133 -49 -171 -196 -174 99 -182 109 -121 43 99 92 -70 -283 -64 -35 -186
4706 -186 -14 229 -326 -48 230 -22 160 141 -84 236 130 75 -356 45 155 -148 113 135 -200 141 132 247
4728 247 89 -234 106 -56 -259 5 -210 -165 53 -88 54 -116 149 66 19 259 -20 -50 99 -19 387
4749 387 279 50 -55 151 -99 -71 126 -158 -129 42 -164 -445 238 -25 83 33 -75 168 -16 -111 60
4770 60 51 42 97 119 -105 0 367 111 27 15 -359 158 9 89 360 14 -35 -316 -249 68 163 -39 -154 117
4794 117 -37 -148 -139 52 62 16 217 35 -281 70 -76 -258 359 166 -251 -75 172 -397 -91 64 -56
4815 -56 -196 -210 -56 -34 361 -80 -13 14 -115 179 55 152 284 -8 213 -7 -30 235 -42 -3 63 195 117
4838 117 153 146 -314 -187 254 -154 87 -3 -170 29 49 42 109 103 33 278 335 -12 -163 -197 37 -95 -256 -72
4862 -72 316 -97 -141 -255 -265 -56 -162 -137 -309 -127 212 273 192 -163 -18 -14 157 -7 -34 290 211 85 -265
4885 -265 16 -288 182 -101 -143 157 -131 171 219 98 67 -147 -164 -134 -125 -66 56 101 24 68 54 -406 -287 183
4909 183 94 -48 -37 161 162 -22 -151 48 -282 -14 -21 26 -130 -43 -105 -56 -42 128 90 367 -272 -3 -89 28
4933 28 -149 107 -176 -59 -148 -102 -199 61 47 -50 64 -179 65 -30 384 61 116 -80 200 -137 79 -104 -91
4956 -91 151 -25 -102 -7 -102 32 -37 113 289 -212 62 -263 -188 39 140 183 38 -142 44 -9 126 24 71
4979 71 8 -238 -345 11 351 93 -135 81 -270 135 -65 277 -116 235 5 352 42 -114 -59 -61 174 -58
5001 -58 -70 -112 51 -197 -196 -138 213 -93 188 245 5 -62 201 134 260 -246 97 11 -79 181 -51 -108 -186 -63
5025 -63 -177 -134 -42 89 160 -56 -124 -85 -146 -160 9 154 -79 179 423 -110 158 -12 -335 138 -17 -58 181
5048 181 68 -81 48 50 120 86 101 -131 -150 183 49 128 282 -266 105 229 5 200 208 237 -95 4 52 11
5072 11 -109 -78 61 -87 -30 -35 157 -239 -74 -192 -127 1 -146 -112 131 -243 -34 73 -97 103 -104 -127 -137
5095 -137 -355 -263 208 15 -148 -24 10 50 229 -26 249 -279 -9 -27 -115 -47 123 134 33 -80 -163 41 14
5118 14 252 -177 -205 -85 -212 91 51 -153 -65 149 68 161 172 71 -79 78 174 -67 180 -109 -264 146 -131
5141 -131 18 -73 -298 278 -7 -13 -267 -218 -76 -83 176 -34 9 185 176 -124 -233 147 -141 50 -164 -52 -58 -104
5165 -104 -25 -41 -86 41 191 129 308 295 -132 -114 59 -205 -295 -58 -18 -27 -185 -140 150 31 -270 146 222 -44
5189 -44 294 -62 83 84 -56 -164 -222 -36 45 -60 38 -57 -125 -151 -198 -75 92 -190 -31 84 178 242 77 143
5213 143 288 291 143 -75 300 78 -200 167 67 -59 -5 76 170 99 17 -81 179 -68 -146 125 -138 -174 -2
5236 -2 -54 -17 58 -44 -59 -21 -33 -218 155 -249 -147 -191 -37 104 -403 28 33 -28 -217 18 -161 81 -222 -58
5260 -58 14 178 100 118 -36 -132 158 -90 141 -84 -138 233 6 -20 -204 -80 -125 209 -4 -59 -108 102 -69
5283 -69 -95 121 -84 -36 84 275 -61 -107 -100 121 -108 36 -7 80 135 -16 4 80 -149 141 208 56 -149 74
5307 74 -69 -147 131 186 -246 126 49 -214 62 257 -92 37 237 117 -150 58 -175 -140 1 -314 32 -319
5329 -319 -118 -173 -2 143 -200 186 -193 147 38 -71 -42 308 -99 -142 77 111 28 34 -127 145 29 -73
5351 -73 -131 48 -95 -91 -197 -65 -160 -182 10 -131 -265 -173 -165 -136 -49 -170 -45 -63 84 213 152 96 72 -88 115
5376 115 -253 -375 -258 9 -3 143 172 -165 -24 -8 46 167 -54 303 237 -102 -57 -469 304 -7 109 -192
5398 -192 -116 34 28 -157 170 135 135 -418 -311 154 181 -164 36 -26 -42 -61 -103 -94 -227 22 -90 -30 83 88 40 38
5424 38 99 244 -151 140 -45 135 -92 81 -97 -148 53 -90 14 82 -138 -335 155 192 73 -16 -12 222 173
5447 173 -148 145 64 135 115 -43 186 210 83 203 67 215 16 -39 -221 -192 144 90 73 119 -96 -101 10 -303
5471 -303 37 -26 -271 -168 -193 -143 -317 18 199 167 290 -413 -110 15 -147 52 71 70 -19 -98 -55 -119 -138 60
5495 60 97 85 332 -2 11 0 -185 36 11 69 95 9 -94 -84 98 -207 65 -42 43 -20 37 -5 -340 82 -78
5520 -78 -74 136 18 -127 26 176 81 -105 -137 1 -115 28 -211 -361 -52 57 -62 -118 35 -142 -19 -71
5542 -71 -86 134 -101 -5 -36 -330 -150 -184 155 -134 86 -7 -79 296 -41 18 35 130 174 -116 1 -165 44 80
5566 80 266 -51 120 -34 -225 59 106 -33 54 21 112 149 303 220 -334 -129 61 128 59 54 18 119 202 -136
5590 -136 183 -10 -222 -55 47 -274 -330 19 -178 121 111 117 -175 160 -31 -201 48 -88 -46 139 122 -134
5612 -134 -139 -149 -85 115 -31 204 -41 64 -112 -152 -201 -78 -98 -46 271 274 22 -173 142 -123 -289 -142 -52 -110
5636 -110 170 -130 7 -20 87 -40 123 -148 -88 73 -151 0 -38 162 122 -12 173 -81 396 -332 3
5657 3 -27 275 144 -24 -106 -40 273 102 -325 138 -54 -73 17 -67 -133 -21 79 4 -17 -182 -120 -31 -11 -26 -89
5682 -89 95 -84 -182 -17 -163 -120 79 -102 -38 54 -156 -125 -203 93 97 202 -27 -131 -64 -109 -32 -401 -177 289
5706 289 -127 -25 -78 -176 35 -229 -49 -201 130 175 -48 -112 -138 94 130 123 83 -38 -137 144 -74 3 243 -105
5730 -105 121 7 -134 324 120 50 227 12 -51 162 127 -245 -238 6 -75 109 -117 281 -90 -3 292 20
5752 20 -123 -134 -53 16 130 -156 -64 146 -89 -352 -33 -91 -116 -265 47 -149 -144 -30 -146 -200 -124 282 350 -110
5776 -110 99 -236 -233 241 28 97 -165 226 34 -40 203 -25 -108 116 -117 143 106 249 -54 -165 -105 -117 -106
5799 -106 185 -42 -368 139 -353 -159 83 128 -244 64 98 -168 238 -15 58 -163 -390 -33 -42 163 -365 -30
5821 -30 -52 257 -178 -176 17 39 -22 -59 -48 -180 -92 -25 -4 114 87 210 85 221 168 -84 130 -107 -21 367 -15
5846 -15 -142 169 190 141 -23 -74 200 112 1 -166 -76 45 -97 -206 -196 -3 -234 50 76 -200 -10 -15 -220
5869 -220 -94 -143 84 -161 98 169 30 -129 -22 -287 231 -37 -58 -53 -27 -130 -192 142 49 -6 180 -116 -115 -2
5893 -2 159 -195 233 208 166 69 -175 -58 29 -48 -547 46 100 43 -33 -208 82 54 -145 -11 156 -209 213 -106
5917 -106 -8 93 14 -124 -166 -200 -35 250 4 -66 89 -179 78 133 16 312 18 -156 -156 -152 -165 13 -69 -138
5941 -138 148 267 -181 -222 224 -107 99 23 180 39 61 -4 -5 -67 -141 256 7 60 36 67 357 -96 -229 133
5965 133 -35 -50 67 60 -270 113 34 62 197 -190 104 48 37 158 -41 345 -183 -123 232 -178 -30 71 17
5988 17 -170 2 -127 69 10 59 -26 71 -26 -184 -210 -172 -135 -152 113 -217 39 5 30 42 195 -36 -179 92
6012 92 144 247 -2 -128 -120 -209 11 125 -118 -57 -141 -77 147 -368 -312 37 -220 -247 43 36 238 -66 -18 -21 -61
6037 -61 -218 155 116 -43 -101 37 68 -247 92 -450 -46 24 81 63 147 124 -194 -20 -175 -339 69 -222 101
6060 101 84 46 190 33 245 206 -105 -172 19 -179 115 -64 -103 11 104 -2 268 24 81 -343 -281 -300 142
6083 142 -11 -272 136 -45 285 233 -218 218 18 73 -51 -82 82 8 -141 267 212 182 -99 -4 -70 -91 26
6106 26 171 173 -115 -140 -67 210 -3 173 23 -174 -56 -103 5 79 -161 63 195 58 -65 162 1 -34 43
6129 43 246 -92 71 -45 113 108 113 46 -139 118 386 35 -123 240 -100 -214 -106 -40 177 10 -227 -21
6151 -21 237 -178 -140 104 84 -57 55 151 167 345 170 37 0 -49 -10 -92 -74 -89 22 -138 -93 45 216 142
6175 142 -1 65 -79 122 -43 -216 -15 -86 -101 -72 -47 195 -322 46 -136 -41 41 -181 2 -142 -20 -12 79
6198 79 -26 234 -156 182 171 303 -236 81 291 50 286 3 -34 235 -85 20 37 18 78 231 -125 -36
6220 -36 0 -9 3 -89 -115 -295 332 -28 60 243 259 -140 117 179 169 -51 -50 -90 412 -22 -198 317 122 139 9
6245 9 -49 11 -321 43 -6 78 49 51 -186 -255 -117 -161 237 22 -34 -115 245 -256 -405 47 180 -98 -180 15 -100
6270 -100 -151 176 -167 -61 -115 -35 -98 119 -143 -51 1 62 -22 -178 360 254 235 38 345 59 277 117 11
6293 11 -54 57 -61 -110 292 11 -83 16 0 -35 -230 -1 -111 -142 45 -313 -121 24 90 -93 -87 -90 -293 232
6317 232 48 37 -233 204 93 -187 -129 -201 22 46 -84 -200 182 -203 129 -59 -230 -73 -345 -65 50
6338 50 176 -229 -211 121 -164 -89 76 -34 83 91 -115 107 79 389 340 324 45 9 -89 354 282 94 117 248
6362 248 282 -63 342 193 80 -13 45 -208 12 -116 -99 202 -185 -64 -204 301 135 -3 -38 77 348 -31
6384 -31 357 -71 -155 -253 138 -104 -339 33 61 -118 17 115 -187 181 294 330 199 147 71 -21 198 -59 -261
6407 -261 -115 85 28 99 -10 -59 98 -44 48 35 136 -47 -72 35 121 -383 -98 -82 43 -3 -196 -172 -235 -2
6431 -2 91 -223 95 -96 -65 36 187 36 -323 -53 61 -11 74 211 -210 -124 -183 -129 73 112 -255 41 57 -150
6455 -150 35 131 43 -91 210 -95 129 -124 149 226 -160 -128 -343 -65 -92 -237 -78 57 -212 -345 154 290
6477 290 7 3 18 -359 23 -43 187 162 -75 -470 198 -22 -131 0 73 -56 -314 -326 41 52 101 227 -162
6500 -162 92 -58 -69 3 257 -249 201 115 113 281 -101 211 -137 -39 173 -120 41 -238 302 383 137 178 -99
6523 -99 -56 171 99 95 -24 243 60 -65 -84 -76 -279 -179 29 -113 18 -144 -48 -3 -317 -369 465 -198 -19 -117
6547 -117 -16 64 112 149 -167 -37 -122 -72 227 2 -43 82 4 -186 88 -38 -58 172 220 294 78 133 108 59
6571 59 -219 279 250 176 11 122 37 254 -26 281 -24 142 -43 -140 -147 -34 41 -200 -445 123 53 -5 -319
6594 -319 128 -152 163 36 167 71 -59 -13 -245 152 -163 12 -288 -172 192 -10 -307 -150 52 -254 206
6615 206 58 29 -194 74 -76 69 -123 -112 170 59 -239 -72 -146 -88 -368 -181 13 36 -122 -32 154 -4
6637 -4 10 370 28 -44 -35 -28 -27 -192 99 25 115 -254 -43 16 -78 53 100 -456 144 -179 22 -270 134 -129 -77
6662 -77 95 -120 -286 260 177 -91 94 233 -46 117 -121 96 12 82 55 -188 -160 -106 -55 74 32 -70 -105
6685 -105 -280 -115 30 -87 59 272 -209 4 8 169 240 150 -335 55 -461 51 -127 -152 95 -11 28 74
6707 74 -248 68 97 -7 245 78 -446 179 289 -237 -192 -234 -121 -64 268 78 -44 -29 204 -177 101 -235
6729 -235 -95 23 -78 -233 197 201 -212 -49 21 217 -44 -42 -249 -57 339 -16 -12 89 69 -57 20 311 -21
6752 -21 -189 48 -97 5 152 -59 -129 -160 118 -24 119 2 -339 -120 182 285 -294 104 26 156 129 302
6774 302 -25 -13 227 -179 21 -141 -83 -24 73 -145 -44 236 141 265 -18 98 -26 -207 -26 18 128 -44
6796 -44 -127 -131 62 -142 49 -55 195 8 -78 128 -16 -269 -60 176 45 246 17 301 -73 -197 -190 147
6818 147 154 -160 -71 -127 -40 -19 248 -174 0 -211 67 -19 48 -94 -94 90 -65 -140 -107 -99 98 -61 85 109 -50
6843 -50 -109 192 2 -48 156 38 -301 -2 -18 -229 -251 44 -79 203 146 37 -269 -86 18 -185 -42 268
6865 268 136 15 -241 -77 -81 -128 177 -110 -126 -68 78 -280 66 -107 -58 15 177 -17 -24 -289 -123 69 383
6888 383 -328 -94 248 40 106 -52 -114 -112 189 -85 60 -184 -1 76 -80 -107 -229 81 39 -61 -199 225
6910 225 -208 -241 -116 74 -72 -109 133 -68 -11 -25 7 390 -198 -36 60 298 -147 -39 20 -122 -198 -158 -53
6933 -53 15 -44 52 -102 -139 39 -74 175 -145 246 -122 46 311 -93 -121 -20 -92 104 93 -145 -476 70 -99
6956 -99 65 -83 154 10 12 246 -146 -59 -6 -96 74 -50 300 9 -48 -207 -253 73 123 -417 -196 207 112
6979 112 89 271 -88 -8 -51 -21 44 6 109 -129 140 -64 -61 -1 -225 -27 -31 18 60 -231 -9 61 -194 52 -378
7004 -378 70 39 -273 -144 -125 -35 -2 -265 84 -113 80 97 7 -45 -71 -95 51 33 -135 112 -124 39 45 -71
7028 -71 57 -290 -105 -84 -382 0 16 301 -323 -29 -2 30 -121 91 -21 -225 -25 -306 304 116 -55 -49
7050 -49 -59 245 202 14 148 -24 61 99 49 -85 52 -78 16 -208 10 -38 -123 167 73 -83 91 229 -307
7073 -307 -14 -164 -84 99 32 -69 -118 -36 3 -306 60 -176 -115 -85 -95 -63 -123 -88 -144 58 -203 -271 120 194 -39
7098 -39 -58 142 212 -73 164 178 93 34 186 202 270 85 58 172 133 -48 18 -35 98 99 58 49 195 -36 250 171
7124 171 211 103 302 163 9 6 36 -316 -174 -340 -50 93 109 41 -107 -25 135 -120 161 -181 141 201 6
7147 6 135 247 -64 -63 8 -126 43 -1 -78 -12 161 101 -279 -122 99 -73 61 326 -54 -122 227 21 -241
7170 -241 -106 -87 -130 8 -88 128 278 -5 -91 -50 188 -26 -107 238 -170 203 29 -154 94 -27 102 336
7192 336 214 -6 80 -209 170 85 -67 215 -225 -489 -205 56 -240 120 11 14 -16 -142 265 162 -156 -443
7214 -443 -268 57 37 173 -163 215 146 -165 -48 69 279 -249 -160 -12 63 29 -169 214 81 -306 -17 -20
7236 -20 -6 -188 141 373 170 80 38 -173 -202 3 19 77 -33 235 -225 308 2 -88 -158 30 180 64 204
7259 204 -275 -318 315 179 -223 101 166 -66 164 -3 154 209 -231 216 120 141 -55 145 206 -58 -34 163
7281 163 162 -113 -60 48 -60 99 71 13 -253 254 -172 -120 69 174 -291 -32 -299 77 106 -1 88 147 57
7304 57 5 309 179 184 41 -84 -26 -81 -65 332 -28 -103 123 96 -75 -215 116 -28 130 246 157 -17 24 137
7328 137 -35 -185 -216 -103 36 82 36 96 -3 -191 -85 -109 -126 -31 -124 -12 -197 98 -37 -6 96 92 -34 341
7352 341 -72 -39 30 19 -189 -149 208 -165 121 -113 -141 -288 315 106 -236 -253 -10 11 -307 -132 -30 58 -158
7375 -158 17 -187 -52 146 2 80 18 111 26 -29 138 34 -35 255 125 65 24 404 -72 100 -7 -19 -8
7398 -8 124 -51 -129 93 16 44 12 -112 -59 116 -79 -286 544 384 -216 -164 18 -92 18 28 -26 20 -223 188
7422 188 -110 -361 -106 112 -94 190 -70 -30 74 89 -122 302 299 -139 178 165 121 106 -179 -229 426 -99 -219
7445 -219 277 319 75 -87 109 85 -77 167 193 168 -162 -91 24 -146 25 -11 103 141 10 -64 41 141 60
7468 60 202 -26 -206 -155 -166 192 -143 132 264 -19 -62 51 -65 82 -146 72 207 -246 190 -137 57
7489 57 201 61 -208 101 -256 -270 -5 70 136 298 -94 122 240 135 -352 45 -187 -253 53 73 -335 299
7511 299 161 -248 112 -194 -190 -33 -37 -154 197 166 -296 -199 6 174 -15 -6 -40 33 -64 43 70 131 76 -147 -12
7536 -12 -3 280 -331 60 -146 42 -116 -33 -279 72 259 -44 -77 -23 -44 -129 -24 -188 -140 122 260 63 -77
7559 -77 107 195 150 -128 130 -63 98 175 -60 37 -8 401 -293 164 -32 25 -24 66 -82 199 41 -277 129
7582 129 133 -111 37 170 162 142 -252 -220 22 368 -203 -2 79 -114 -14 -344 138 -119 -4 36 -164 39 201
7605 201 -309 -129 251 -120 -69 -123 -173 224 -151 199 -142 -162 266 -267 3 62 -147 -110 -141 79 256 -101
7627 -101 -23 -147 -156 15 -122 -235 0 137 156 -186 271 46 -391 45 94 32 -6 -232 -225 -67 130 -86 57
7650 57 105 126 -90 100 -103 112 245 4 -11 136 13 -191 163 25 -85 166 73 -45 86 -213 -243 -68
7672 -68 -150 23 -158 -154 123 -11 113 180 -131 276 211 -45 -241 -141 91 -40 115 57 -186 -57 -113 -19 28
7695 28 52 10 -123 -140 3 -50 185 36 -235 -70 224 -90 -156 344 21 153 123 -122 -79 76 237 -157 220
7718 220 -77 -164 -106 134 6 -53 -123 257 -205 108 -120 24 211 44 -40 73 334 -56 -75 -57 -187 -223 78
7741 78 -195 -23 319 -189 -138 -115 -252 -181 5 -66 -203 -281 36 20 -143 -204 236 -60 288 -15 -38 85 8
7764 8 -263 -110 -120 182 -203 25 -100 -289 56 -290 -284 -58 55 -65 17 -45 -148 452 75 -35 -238 -105
7786 -105 278 -119 47 -211 -415 -67 -173 -128 -53 110 37 -193 69 66 -80 -91 -191 -57 18 33 -70 -160 25
7809 25 18 -228 43 -229 21 63 91 -66 145 18 -68 272 31 222 -361 -299 -96 -218 -1 192 -170 -34
7831 -34 -257 35 -59 233 -61 -207 302 32 5 151 243 -64 91 -148 -60 -48 73 -91 280 -221 -5 66
7853 66 -142 256 -172 -31 56 -99 330 -217 45 2 189 -369 -165 -213 27 72 -243 -28 -45 -155 91 -68
7875 -68 -239 174 -133 25 19 159 -5 2 174 -120 73 -43 51 130 74 -71 -83 122 -41 34 -174 10 -184
7898 -184 4 184 81 14 -121 195 -37 101 102 -166 144 70 -217 -31 -35 -268 -218 329 86 -3 17 203 -36
7921 -36 233 -98 -98 171 -58 -95 24 265 -43 -214 152 188 122 340 253 -140 -95 -123 146 25 131 -28 -75
7944 -75 -218 81 -137 88 -129 -62 -31 -22 -71 -9 304 -303 65 157 111 -192 14 -33 65 -183 237 -216 -138 216
7968 216 -37 200 -53 72 -326 -16 -98 -84 -131 55 64 105 -113 -17 -142 -52 -220 -235 -49 -79 -88 -62 70 8 41
7993 41 -227 -239 175 -51 297 -25 34 41 -269 71 -178 -62 152 294 -120 37 288 165 48 -31 476 7
8015 7 -16 214 -398 18 84 36 169 407 -56 128 278 16 -32 49 -108 -78 -21 -144 200 217 -123 -124 0 8 57
8040 57 -231 171 145 16 -77 105 -44 -83 80 86 -84 116 169 21 -36 -193 -70 258 318 -86 -10 -164 283
8063 283 44 10 -167 -47 -57 218 16 -82 -8 -1 161 -171 294 90 65 -176 132 174 -30 9 184 56 -442
8086 -442 -81 -68 -77 10 89 -238 162 9 -120 -42 211 19 -53 -17 158 -225 60 -156 -19 -205 -78 -138 -380
8109 -380 -53 -101 -62 115 333 80 -33 -151 241 -276 135 -181 -220 25 74 26 162 127 54 254 168 -46 287
8132 287 8 -230 -89 369 162 -485 14 93 139 249 201 -156 -59 171 337 -211 275 -107 64 280 -87
8153 -87 -15 -9 -215 113 74 264 158 -401 -8 -112 31 -107 69 108 271 237 -21 -52 -98 -208 -110 156 -1
8176 -1 -450 -173 136 -82 -38 35 -183 -365 181 -101 22 -77 66 389 34
8191C4
##END NTUPLES=NMR FID
##END=
