##TITLE=1H_Pr 5-5-a
 CDCl3, 8 sc, 
 26.6.2019
##JCAMPDX= 6.0         $$ Bruker NMR JCAMP-DX V2.0
##DATA TYPE= NMR FID
##DATA CLASS= NTUPLES
##ORIGIN= UXNMR, Bruker Analytische Messtechnik GmbH
##OWNER= root
$$ XWIN-NMR		Version 3.5
$$ Wed Jun 26 16:10:05 2019 Russian Standard Time (UT+4h)  she@DPX200
##.OBSERVE FREQUENCY= 200.13155
##.OBSERVE NUCLEUS= ^1H
##.DELAY= (6, 6)
##.ACQUISITION MODE= SIMULTANEOUS
##.ACQUISITION SCHEME= undefined
##.AVERAGES= 8
##.DIGITISER RES= 18
##SPECTROMETER/DATA SYSTEM= spect
##.PULSE SEQUENCE= zg30
##.SOLVENT NAME= CDCl3
##.SHIFT REFERENCE= (INTERNAL, CDCl3, 0, 15.7039)
##AUDIT TRAIL= $$ (NUMBER, WHEN, WHO, WHERE, WHAT)
$$ ##TITLE= Audit trail, XWIN-NMR		Version 3.5
$$ ##JCAMPDX= 5.01
$$ ##ORIGIN= Bruker BioSpin GmbH
$$ ##OWNER= she
$$ F:/spectra/data/she/nmr/H-F/1/audita.txt
$$ ##AUDIT TRAIL=  $$ (NUMBER, WHEN, WHO, WHERE, WHAT)
(   1,<2019-06-26 16:08:59.78 +0400>,<she>,<DPX200>,
      <created by zg, POWCHK disabled, PULCHK disabled
       configuration hash MD5:
       00 E9 B6 7A A2 85 ED C7 34 08 36 98 17 FE 4E 26
       data hash MD5: 16K
       09 38 08 96 8D 21 6B 9F E3 E1 87 59 78 05 6B B9>)
$$ ##END=
$$ 
$$ hash MD5
$$ 82 71 A7 ED 90 32 4A D9 6D 15 A8 A6 61 AD E7 07
##$RELAX= 
##$RELAX= 
##$RELAX= 
##$RELAX= 
##$RELAX= 
##$RELAX= 
$$ Bruker specific parameters
$$ --------------------------
##$DU= <F:/spectra>
##$EXPNO= 1
##$NAME= <H-F>
##$PROCNO= 1
##$TYPE= <nmr>
##$USER= <she>
##$AMP= (0..31)
100 100 100 100 100 100 100 100 100 100 100 100 100 100 100 100 100 100 
100 100 100 100 100 100 100 100 100 100 100 100 100 100 
##$AQSEQ= 0
##$AQ_mod= 1
##$AUNM= <au_zg>
##$AUTOPOS= <>
##$BF1= 200.13
##$BF2= 200.13
##$BF3= 200.13
##$BF4= 200.13
##$BF5= 200.13
##$BF6= 200.13
##$BF7= 200.13
##$BF8= 200.13
##$BYTORDA= 1
##$CFDGTYP= 0
##$CFRGTYP= 5
##$CHEMSTR= <none>
##$CNST= (0..31)
1 1 145 1 1 1 1 1 1 1 1 1 1 1 1 1 1 1 1 1 1 1 1 1 1 1 1 1 1 1 1 1 
##$CPDPRG= <>
##$CPDPRG1= <>
##$CPDPRG2= <>
##$CPDPRG3= <>
##$CPDPRG4= <mlev>
##$CPDPRG5= <mlev>
##$CPDPRG6= <mlev>
##$CPDPRG7= <mlev>
##$CPDPRG8= <mlev>
##$CPDPRGB= <>
##$CPDPRGT= <>
##$D= (0..31)
0 1.2 0 0 0 0 0 0 0 0 0 0.03 0 0 0 0 0 0 0 0 0 0 0 0 0 0 0 0 0 0 0 0 
##$DATE= 1561550939
##$DBL= (0..7)
120 120 120 120 120 120 120 120 
##$DBP= (0..7)
150 150 150 150 150 150 150 150 
##$DBP07= 0
##$DBPNAM0= <>
##$DBPNAM1= <>
##$DBPNAM2= <>
##$DBPNAM3= <>
##$DBPNAM4= <>
##$DBPNAM5= <>
##$DBPNAM6= <>
##$DBPNAM7= <>
##$DBPOAL= (0..7)
0.5 0.5 0.5 0.5 0.5 0.5 0.5 0.5 
##$DBPOFFS= (0..7)
0 0 0 0 0 0 0 0 
##$DE= 6
##$DECBNUC= <off>
##$DECIM= 24
##$DECNUC= <off>
##$DECSTAT= 4
##$DIGMOD= 1
##$DIGTYP= 9
##$DL= (0..7)
0 120 120 120 120 120 120 120 
##$DP= (0..7)
150 150 150 150 150 150 150 150 
##$DP07= 0
##$DPNAME0= <>
##$DPNAME1= <>
##$DPNAME2= <>
##$DPNAME3= <>
##$DPNAME4= <>
##$DPNAME5= <>
##$DPNAME6= <>
##$DPNAME7= <>
##$DPOAL= (0..7)
0.5 0.5 0.5 0.5 0.5 0.5 0.5 0.5 
##$DPOFFS= (0..7)
0 0 0 0 0 0 0 0 
##$DQDMODE= 0
##$DR= 18
##$DS= 0
##$DSLIST= <SSSSSSSSSSSSSSS>
##$DSPFIRM= 0
$$ [...]
##$SUBNAM2= <"">
##$SUBNAM3= <"">
##$SUBNAM4= <"">
##$SUBNAM5= <"">
##$SUBNAM6= <"">
##$SUBNAM7= <"">
##$SUBNAM8= <"">
##$SUBNAM9= <"">
##$SW= 24.9336996594482
##$SWIBOX= (0..15)
0 0 2 0 0 0 0 0 0 0 0 0 0 0 0 0 
##$SW_h= 4990.01996007984
##$TD= 16384
##$TD0= 1
##$TE= 0
##$TE2= 300
##$TE3= 300
##$TEG= 300
##$TL= (0..7)
0 120 120 120 120 120 120 120 
##$TP= (0..7)
150 150 150 150 150 150 150 150 
##$TP07= 0
##$TPNAME0= <>
##$TPNAME1= <>
##$TPNAME2= <>
##$TPNAME3= <>
##$TPNAME4= <>
##$TPNAME5= <>
##$TPNAME6= <>
##$TPNAME7= <>
##$TPOAL= (0..7)
0.5 0.5 0.5 0.5 0.5 0.5 0.5 0.5 
##$TPOFFS= (0..7)
0 0 0 0 0 0 0 0 
##$TUNHIN= 0
##$TUNHOUT= 0
##$TUNXOUT= 0
##$USERA1= <user>
##$USERA2= <user>
##$USERA3= <user>
##$USERA4= <user>
##$USERA5= <user>
##$V9= 5
##$VALIST= <valist>
##$VCLIST= <CCCCCCCCCCCCCCC>
##$VD= 0
##$VDLIST= <DDDDDDDDDDDDDDD>
##$VPLIST= <PPPPPPPPPPPPPPP>
##$VTLIST= <TTTTTTTTTTTTTTT>
##$WBST= 1024
##$WBSW= 4
##$XGAIN= (0..3)
0 0 0 0 
##$XL= 0
##$YL= 0
##$YMAX_a= 239138
##$YMIN_a= -507055
##$ZGOPTNS= <>
##$ZL1= 120
##$ZL2= 120
##$ZL3= 120
##$ZL4= 120
##$ABSF1= 10
##$ABSF2= 0
##$ABSG= 5
##$ABSL= 3
##$ALPHA= 0
##$AQORDER= 0
##$ASSFAC= 0
##$ASSFACI= 0
##$ASSFACX= 0
##$ASSWID= 0
##$AUNMP= <proc_1d>
##$AZFE= 0.1
##$AZFW= 0.1
##$BCFW= 1
##$BC_mod= 2
##$BYTORDP= 1
##$COROFFS= 0
##$CY= 11.3945322036743
##$DATMOD= 1
##$DC= 2
##$DFILT= <>
##$DTYPP= 0
##$F1P= 18.9103706918063
##$F2P= -1.10871071338519
##$FCOR= 0.5
##$FTSIZE= 0
##$FT_mod= 4
##$GAMMA= 1
##$GB= 0.15
##$INTBC= 1
##$INTSCL= 1
##$ISEN= 128
##$LB= 0.24
##$LEV0= 0
##$LPBIN= 0
##$MAXI= 10000
##$MC2= 0
##$MEAN= 0
##$ME_mod= 0
##$MI= 1.114404
##$NCOEF= 0
##$NC_proc= 0
##$NLEV= 6
##$NOISF1= 3.799351
##$NOISF2= 2.8
##$NSP= 1
##$NTH_PI= 0
##$NZP= 0
##$OFFSET= 15.70392
##$PC= 1
##$PHC0= -8501.561
##$PHC1= 18.80098
##$PH_mod= 1
##$PKNL= yes
##$PPARMOD= 0
##$PSCAL= 0
##$PSIGN= 0
##$REVERSE= no
##$SF= 200.130013532006
##$SI= 16384
##$SIGF1= 3
##$SIGF2= 2
##$SINO= 400
##$SIOLD= 16384
##$SREGLST= <1H.CDCl3>
##$SSB= 0
##$STSI= 0
##$STSR= 0
##$SW_p= 3612.71676300578
##$SYMM= 0
##$S_DEV= 0
##$TDeff= 0
##$TDoff= 0
##$TI= <>
##$TILT= no
##$TM1= 0
##$TM2= 0
##$TOPLEV= 0
##$USERP1= <user>
##$USERP2= <user>
##$USERP3= <user>
##$USERP4= <user>
##$USERP5= <user>
##$WDW= 1
##$XDIM= 8192
##$YMAX_p= 0
##$YMIN_p= 0
$$ End of Bruker specific parameters
$$ ---------------------------------
##NTUPLES= NMR FID
##VAR_NAME=  TIME,          FID/REAL,        FID/IMAG
##SYMBOL=    X,             R,               I
##VAR_TYPE=  INDEPENDENT,   DEPENDENT,       DEPENDENT
##VAR_FORM=  AFFN,          ASDF,            ASDF
##VAR_DIM=   8192,          8192,            8192
##UNITS=     SECONDS,       ARBITRARY UNITS, ARBITRARY UNITS
##FACTOR=    0.0002004,     1,               1
##FIRST=     0,             0,               0
##LAST=      1.6414764,     0,               0
##MIN=       0,             -507055,         0
##MAX=       1.6414764,     239138,          0
$$ Real data points
##PAGE= N=1
##DATA TABLE= (X++(R..R)), XYDATA
$$ [...]
3433b424P504q265j175R870m545n297Q807j294q843O590K645q855L852P207q107
$$ -2424 5080 -3185 -4360 5510 965 -4332 4475 3181 -5662 928 3573 -5282 -1430 5777 -2330
3448b330j85R064o453m685Q255k762p234Q215K012q743N103N956r257L85P539
$$ -2330 -2515 6549 96 -4589 3666 904 -6330 1885 3897 -4846 257 6213 -3044 -2659 4880
3463D880o975l414R319l214n546Q483O76r003N323L873r182K080P132o663j323
$$ 4880 -2095 -5509 3810 596 -4950 3533 4209 -4794 529 4402 -4780 -2700 4432 -2231 -3554
3478c554R266m717n296Q112q49q709O688K858q704M053P016p944k13Q163o389
$$ -3554 5712 995 -4301 3811 2962 -5747 941 3799 -4905 -852 6164 -1780 -1993 6170 -219
3493b19m970Q767k059p115P771K078q149M945N004r354O02P637p179k420R202
$$ -219 -5189 3578 1519 -5596 2175 4253 -3896 1049 6053 -3301 -2699 4938 -2241 -4661 4541
3508D541l221n572P846K58q569N486L552q946J923P505o795j225Q795m680n389
$$ 4541 1320 -4252 3594 3852 -4717 769 4321 -4625 -2702 4803 -1992 -3217 5578 898 -4491
3523d491P852j543p944O659L310q377L959O569p790o32P991o175m471Q442k210
$$ -4491 3361 1818 -6126 533 3843 -4534 -575 5994 -1796 -2428 5563 -612 -5083 3359 1149
3538A149o167P838J901q521M062N231q606K30P222o366k654R446l016n753P186
$$ 1149 -5018 2820 4721 -3800 262 5493 -3113 -2883 4339 -2027 -4681 4765 1749 -4004 3182
3553C182J52q540M653L938q188K418P249o798j282Q293m802n576P687j429p238
$$ 3182 3334 -5206 -553 3385 -4803 -2385 4864 -1934 -3216 5077 275 -5301 2386 957 -6281
3568f281O739K789p495L519N848p639r43P564n578m274Q434j677n975P250J614
$$ -6281 458 3247 -4248 -729 5119 -2520 -3463 4101 -1477 -5751 2683 1006 -4969 2281 3895
3583C895q027M047M143q286J071P310n710k099Q530k755n868P512p01q290N258
$$ 3895 -4132 -85 4058 -4228 -3157 4153 -1557 -3656 4874 2119 -3749 3763 3062 -5228 30
3598C0M214q032K925O688o750j073P588n131n200P629j004p059O934K880p756
$$ 30 4244 -3788 -863 5825 -925 -1998 5590 459 -4741 2888 1884 -5175 1759 4639 -3117
3613c117L294N199p681q65P012n001l761Q484j898n759P220J181q596L947M554
$$ -3117 177 5376 -2305 -3170 3842 -1159 -4920 3564 1666 -4093 3127 4308 -4288 -341 4213
3628D213q373J127P457n809k031Q097l111n690O594k43p838N419M123p932K743
$$ 4213 -4160 -3033 4424 -1385 -3416 4681 1570 -4120 2474 2231 -5607 -188 3935 -3997 -1254
3643a254P282o858j841P016m267n314P597l66o948O721L478q060K932N311p838
$$ -1254 6028 -830 -2671 4345 78 -5236 2361 1995 -4953 1768 5246 -2814 118 5429 -2409
3658b409n44P380n127l259Q425j597o345O548J458q535L799M333p773J469P213
$$ -2409 -2953 4427 -700 -3959 4466 2869 -3476 3072 4530 -4005 -206 4127 -3646 -2177 5036
3673E036n618k308P762l136o399O900k0p652N273M256p276K313O165p122j486
$$ 5036 -582 -2890 4872 1736 -4663 2237 2217 -5435 -162 4094 -3182 -869 5296 -1826 -3312
3688c312P498m992m957P763n51o348O149K603p661K568N148p463n44P404m487
$$ -3312 4186 -806 -5763 2000 1449 -4899 1250 3853 -3808 -1240 3908 -3555 -4099 3305 -1182
3703a182l046Q009j890o158O297J008p974L608N243p277J005P237n641k378P414
$$ -1182 -4228 3781 1891 -4267 2030 3038 -4936 -1328 3915 -3362 -2357 4880 -761 -3139 4275
3718D275l074o109O732J02o849N803M096p635J623O377o692j898P015m578m035
$$ 4275 1201 -4908 1824 1926 -4923 880 4976 -2659 -1036 5341 -1351 -3249 3766 -812 -4847
3733d847P833k13o720N618K723p490K286M708p189r7P383m308l528P975k009o317
$$ -4847 2986 2773 -3947 1671 4394 -3096 -810 3898 -3291 -3388 3995 -313 -3841 4134 2125 -4192
3749d192N639J075p244L731M794o669Q48P066n568k972P204l197n584O506P65
$$ -4192 1447 2522 -4722 -991 3803 -2866 -2018 5048 -520 -3492 3712 515 -5069 1437 2202
3764B202o596N161M102p285J371N685o284k095P121l663l898P289k55o478N426
$$ 2202 -4394 767 4869 -2416 -1045 4640 -1644 -3739 3382 -281 -4179 3110 2855 -3623 1803
3779A803K363p790K116N660o579p8O805m182l124P084j825o781N546J541o733
$$ 1803 4166 -3624 -1508 4152 -2427 -2505 4300 118 -3006 4078 2253 -4528 1018 2559 -4174
3794d174L506M759o304J067N910n069l131O789l365m960O804P38o120M527L859
$$ -4174 -668 4091 -2213 -1146 4764 -305 -3436 3353 -12 -4972 1832 2570 -3550 977 4836
3809D836p199J173N148o140j463P182l505l804O935P0o337M206K172p323K549
$$ 4836 -2363 -1190 3958 -2182 -3645 3537 32 -3772 3163 3233 -3104 1102 3274 -4049 -1500
3824a500N190n974k94P443m125l563O279k005n695N452R29o700M443M630o746
$$ -1500 3690 -2284 -2578 4865 740 -2823 3456 1451 -4244 1208 2137 -4563 -120 4510 -2236
3839b236P30O370n921k529O314k716m435O050Q37o046N160K655p254J336M837
$$ -2236 -1506 4864 -1057 -3586 2728 12 -4423 1627 2464 -3582 1578 4233 -3021 -1685 3152
3854C152n460j176O589l130l743O999r35o037M436K241o909K305M962n347R1O365
$$ 3152 -2308 -3484 3105 -25 -3768 3231 2296 -3741 695 2936 -3973 -1668 3294 -2053 -1962 4403
3870D403m599l204O857k434n875N457J948n960M030L920o644R90N668n472k946
$$ 4403 -196 -3400 3457 1023 -4852 605 2553 -3407 623 4543 -2101 -1111 4557 -915 -3861
3885c861O865k930l979O617L52o375M212L046p174J472N344n834r68P271l367
$$ -3861 3004 74 -3905 2712 3064 -3311 901 3947 -3227 -1755 3589 -2245 -3213 4058 691
3900F91l755O115p79o249M933J704o894L205N042n778p6O173m008l678O136k251
$$ 691 -3064 3051 2272 -3977 956 2660 -4234 -1029 4013 -1765 -1841 4332 324 -3354 2782 531
3916E31n402O179O87n571L869M111o715K44N462m946j986O690k683m292O584O00
$$ 531 -4871 1308 1995 -3576 293 4404 -2311 -2067 3395 -1551 -3537 3153 470 -3822 2762 3362
3932C362o760M004K654o521J646N219n365p16O793l361m020O382j450o126M959
$$ 3362 -3398 606 3260 -3261 -1615 3604 -1761 -2477 4316 955 -3065 3317 1867 -4259 700
3947G00J753n786K894M418n686L46N863n126l294O566j924n284O082J427o010
$$ 700 2453 -3333 -439 3979 -1707 -1361 4502 -624 -3918 2648 724 -4560 1522 2949 -3061
3962c061L849L681o922L01N886n412k025O811k133m048N997k90n998L524K893
$$ -3061 788 4469 -2453 -2152 3734 -1678 -3703 3108 975 -3073 2924 2634 -3364 160 3053
3977C053o696J498N778n314o62O334l317m126O076j277n968M971K389o141K853
$$ 3053 -3643 -2145 3633 -1681 -2343 3991 674 -3452 2624 1347 -4621 350 2739 -3402 -549
3992e49N223o279l70N906m331l314O373j458n112N870J494o087L192L565o791
$$ -549 4674 -1605 -1975 3931 -400 -3714 2659 1201 -3911 1959 3453 -2634 558 4123 -2668
4007b668M45N560m914k130P168j921m876N815K31o277L553K724o134J742N456
$$ -2668 -2223 3337 -1577 -3707 3461 1540 -3336 2479 2710 -3567 -14 2710 -3424 -1682 3774
4022C774n087j014O490l970m238O272r40n658M559K581o049K877M992o338m15
$$ 3774 -1313 -2327 4163 193 -4045 2227 1287 -4371 188 2769 -3280 -403 4589 -1749 -2164
4037b164N624m282l401O439j208m556N509J367o193K589L647o143L29N712m204
$$ -2164 3460 -822 -4223 2216 1008 -3548 1961 3328 -2865 -276 3371 -2772 -2443 3269 -935
4052i35j778O411k295m549N835k11o111L859K811n802J641N118m817j101N679
$$ -935 -2713 3698 1403 -3146 2689 2478 -3633 226 3037 -2765 -1124 3994 -823 -1924 3755
4067C755l689m161O007q24n349M738K978n898K274M169o105o57N986m170k712
$$ 3755 66 -4095 1912 1088 -4261 477 3455 -2443 -169 4000 -2105 -2762 3224 -946 -3658
4082c658O092j086m765N237J172n840K609L305o297Q22N728m164j898O339k523
$$ -3658 2434 1348 -3417 1820 2992 -2848 -239 3066 -3231 -2409 3319 -845 -2743 3596 1073
4097A073m400N290L9o020M044K721n411J744N056n065j285N482l225l545N224
$$ 1073 -3327 1963 2002 -4018 26 2747 -2664 -920 4136 -929 -2214 3268 43 -3502 1722
4112A722q7n099M697K187n602K166L934o113o99N583l452k846O610j373m533M433
$$ 1722 1635 -3464 1233 3420 -2182 -16 3918 -2195 -2894 2689 -763 -3609 3001 1628 -2905 1528
4128A528J156o072K570L430n548O86N579m022j664N662k648m367N095L06n785
$$ 1528 2684 -3388 -818 2612 -2936 -2250 3329 -693 -2357 3305 657 -3710 1385 1691 -4094
4143d094M043L477n756J889M476n015j494N423l492l293N804n08m599M472K109
$$ -4094 -51 3426 -2330 -441 4035 -980 -2474 2949 -543 -3836 1968 1460 -3139 1333 3442
4158C442o016K256L549n323q94N824l366k207N910j406m861N043N61o009K801
$$ 3442 -2574 -318 3231 -2092 -2986 2838 -528 -2735 3175 1769 -3092 1951 2512 -3497 -696
4173f96L457n044Q15N357m442j452N707k935m566N090J41n388M190K969n339J421
$$ -696 2761 -2283 -1468 3889 -553 -2005 3702 767 -3799 1291 1432 -3956 234 3203 -2136 -715
4189g15M264m913j285N239k994l457O085m45m765M489J761o069J886L746n112
$$ -715 3549 -1364 -2649 2590 -404 -3861 2224 1779 -2986 1503 3264 -2805 -919 2827 -2285
4204b285j82N419l148k249N575j361m754M613P10n917L052L445n066M52N481m055
$$ -2285 -2467 2952 -196 -2445 3130 1769 -2985 1628 2338 -3579 -527 2918 -2148 -1696 3785 -270
4220b70k214N799k863m075M972J64m654L995K867n838J740M259n295j335N471
$$ -270 -2484 3315 452 -3623 1349 1513 -3141 854 3721 -2117 -377 3882 -1413 -2748 2723
4235B723k974k977N799p32m621L847J705n583J765L977n238k83N867l323k284
$$ 2723 -251 -3228 2571 1839 -2782 1065 2770 -2813 -1048 2929 -2309 -2592 3275 -48 -2332
4250b332N150j519m870M396Q82o145M045L288m813P76M451m095j879N152k322
$$ -2332 2818 1299 -3571 825 1707 -4438 -393 2895 -1918 -1142 3309 -786 -2665 2487 165
4265A65l841N184M12m905L391L189n900J668L831m922j099N651k370l434N771
$$ 165 -3676 1508 1920 -2985 406 3595 -2305 -637 3194 -1728 -2827 2824 454 -2980 2791
4280B791r21m764M146J448n649J931L855n124L74N433l508k442N079j462n083
$$ 2791 1870 -2894 1252 2700 -2949 -1018 2837 -2287 -1913 3520 12 -2430 2649 1187 -3896
4295c896M935O78n226L259L434m851O29M654m679k212N308k053l944N236P02m857
$$ -3896 1039 1717 -3509 -250 3184 -1667 -1038 3616 -1063 -3275 2033 -20 -3964 1272 1974 -2883
4311b883L399K580n619Q50M327m638p28N585l092l007N987o22n570L956J580n360
$$ -2883 516 3096 -2523 -1673 2654 -1984 -2712 2873 -219 -3226 2761 2139 -3431 525 2105 -3255
4327c255K628L622m867R2N513l417k801N396j693m593M007J441m821K949L478
$$ -3255 -627 2995 -1872 -1780 3733 316 -2485 2911 1218 -3375 632 2073 -2748 201 3679
4342C679n247N60M562m362j914N054j909l471N028N78n207L403K486n790J128
$$ 3679 -1568 -1008 3554 -808 -2722 2332 423 -3048 1980 2558 -2649 754 3240 -2550 -1422
4357a422M142m318r95N692k769l045N495j011n051M117J390n778K521M293m356
$$ -1422 2720 -1598 -2593 3099 330 -2715 2780 1769 -3282 835 2225 -3553 -1032 3261 -1095
4372a095m8M594l613k771N334j525m328M246J712n138L172K978n259N07M023l834
$$ -1095 -1143 3451 -162 -2933 2401 876 -3452 794 2506 -2632 540 3518 -1741 -1234 2789 -1045
4388a045j994N602k476k921M854L73m947L085K301n721J561M214m355q15N731
$$ -1045 -3039 2563 87 -2834 2020 2393 -2554 531 2832 -2889 -1328 2886 -1469 -2284 3447
4403C447k827l314N321r95n141L844J554n210K319M337m812k41M741l220k911
$$ 3447 620 -2694 2627 1632 -3509 335 1889 -3321 -1002 3335 -1477 -1718 3023 -197 -3108
4418c108N138j441m351N051J069m998L096K891n327L58M397m028j641N523j639
$$ -3108 2030 589 -3762 1289 2358 -2640 456 3347 -1980 -1622 2775 -1253 -2894 2629 990
4433I90l722M530N89n189L063K287n140J233M583m409l76M854k518l292M571p39
$$ 990 -2732 1798 2387 -2802 261 2548 -2592 -1359 3224 -1185 -1561 3293 775 -2517 2054 1315
4449A315m880L818K185n139K277L534m229p3M406l832k339M789j041l927M491
$$ 1315 -3565 253 2438 -2701 -424 3110 -1119 -1192 3214 -618 -2957 1832 791 -3136 1355
4464A355J248m888K724K374m871M78M081l959j192M940j436l339M351m53m520
$$ 1355 2603 -2285 439 2813 -2058 -1580 2501 -1458 -2650 2290 854 -2485 1866 1413 -3107
4479c107K923K216m675J335M127l843q28M964k493l086M441j191l884M108J605
$$ -3107 -184 2032 -2643 -1308 2819 -1024 -1852 3112 619 -2467 1974 783 -3101 1007 2612
4494B612m886K037L995n137l27M310l362k022M944j446l583M775N08m710K544
$$ 2612 -2274 -237 3758 -1379 -1706 2604 -758 -2780 2164 718 -2865 1910 2418 -2292 252
4509B52K403m974O56M302m009q32N116j786l520M601m80m678K920K234m683J484
$$ 252 2655 -2319 -1663 2639 -1370 -2202 2914 1128 -2392 2209 1729 -2949 -29 2205 -2478 -994
4525i94M232m031o86M253k395l438M785j047l582L553J536m071J709L291m884
$$ -994 3238 -793 -1479 2774 379 -3059 1726 679 -2903 650 2186 -1885 -176 3115 -1769
4540a769k8M326l573j894N270q45m016L964J087m808K370K571m867P50M153l373
$$ -1769 -1797 2529 -1044 -2938 2332 1487 -2529 1435 2522 -2286 84 2655 -2212 -1462 2691 -682
4556f82j449M843j839l361M270k65m423K877K202m299J636L797m054p98M285k794
$$ -682 -2131 2712 873 -2488 1782 1517 -2906 -29 2173 -2126 -490 3307 -747 -1545 2740 -54
4572e4k978M501l07m049L983J597m624J916K937m751j8M184l271k401N684j311
$$ -54 -3032 1469 1162 -2887 1096 2693 -1931 -15 2922 -1829 -1847 2337 -934 -3335 2349 1038
4588A038l543M073L42m474K060K811m653J037M018l351j171M701k109l744M589
$$ 1038 -2505 1568 1910 -2564 -504 2307 -2346 -1309 2709 -642 -1813 2888 779 -2965 1624
4603A624k17m230L155K190m544J906L620m304q26M334l119k241M032K66m442M193
$$ 1624 1407 -2823 332 2522 -2022 -116 3504 -800 -1626 2708 -411 -2652 1380 1646 -2796 1397
4619A397R67m391K017K622m494O4M486l067j844M808j389l667M121L71n105K564
$$ 1397 2364 -2027 -10 2612 -1882 -1818 2668 -399 -2243 2565 1176 -2491 1630 2001 -3104 -540
4635e40L194m692N50M562l255j756M780k424l505M180Rm379L286K592m562J356
$$ -540 2654 -2038 -1488 3074 -181 -1937 2843 419 -3086 1094 1103 -3276 10 2602 -1960 -604
4651f04L498m243q65M354k750k516M861j75l857L606J702n264J834L251m597J32
$$ -604 2894 -1349 -2214 2140 -610 -3126 1735 1560 -2297 1309 3011 -2253 -419 2832 -1765 -1633
4667a633M288k900j572M301j074l848L747P93m809K172L027m367J041L840l203
$$ -1633 2655 -245 -1817 2484 1410 -2438 1309 2102 -2707 -535 2492 -1875 -834 3006 -197
4682a97j800M480k105l341M469l92l467K784K414m545J124L463m116j109M481
$$ -197 -1997 2483 378 -2963 1506 1114 -2353 431 2845 -1700 -576 2887 -1229 -2338 2143
4697B143k502k470M810m47l926L239J746n005J663K440l638J78M354k861j915
$$ 2143 -359 -2829 1981 1534 -2392 847 2593 -2412 -749 1691 -1947 -1769 2585 -276 -2191
4712b191M512j520l516L862M94m295K467K568l921R50L958l623k006M439j813
$$ -2191 2321 801 -2715 1147 1641 -2654 -187 2381 -1540 -590 3368 -255 -2261 2178 365
4727C65l086M133K03l911K989J987m224J047L170m120q74M188j843k520M623n23
$$ 365 -2721 1412 1615 -2296 693 2680 -1544 -497 2673 -1447 -2321 1867 24 -2496 2127 1604
4743A604l912L562J020m903J872K825l834J99M203k438k131M229j290l568L134
$$ 1604 -2308 1254 2274 -2629 -757 2068 -1766 -1567 2636 198 -1933 2296 1006 -2562 572
4758E72P39m115K506K692l613L36L315l674j296M009j498k741M046L87l810K836
$$ 572 1311 -2804 -298 2394 -1219 -883 2432 -1242 -2538 1471 -27 -2768 1278 1665 -2145 691
4774F91K100m745J547K616l788n63M342k198k083M489r59l753L196J120m279J612
$$ 691 2791 -1954 -407 2209 -1579 -2142 2200 2 -2081 2408 1449 -2304 892 2012 -2267 -655
4790f55L026l690J59L958l085j920M291j617l515L808O62l926K658K820m176L13
$$ -655 2371 -1319 -1160 2798 -287 -2207 2084 467 -3048 760 1422 -2504 154 2974 -1202 -889
4806h89L529l587j268L725j593k654M147M86l852K522J604m332J082L125l483
$$ -889 2640 -947 -2215 1510 -83 -2737 1410 1896 -1956 566 2170 -2162 -1080 2045 -1438
4821a438n85M230j818k218L762n41l989L143Q94l751J680L032l663N21L489l334
$$ -1438 -2023 2207 389 -1829 1933 1392 -2597 546 1440 -2311 -631 2401 -1262 -741 2748 -586
4837e86j534L905j323l041L747O10l435K333J830l554J90L653l960q83L924j472
$$ -586 -2120 1785 462 -2579 1168 1778 -1657 676 2506 -1048 -858 2795 -1165 -2048 1876 404
4853D04k548L725N10m027K683J254m365J453K880l352l69M256k539j719L843j227
$$ 404 -2144 1581 2091 -1936 747 2001 -2364 -911 1969 -1383 -1752 2504 -35 -1754 2089 862
4869H62l383K788J214l894K065K663l596J1L634k798j553L123q81k783L674M89
$$ 862 -2521 267 1481 -2413 -348 2315 -1281 -1270 2364 -434 -1987 1136 255 -2528 1146 1635
4885A635l604K456J941m183M18L540l319r21L963j617k171L826l87l696K402J882
$$ 1635 -1969 487 2428 -1755 -1337 2203 -1116 -2037 1926 309 -1862 1964 1577 -2119 283 2165
4901B165m515J560K931l011l41L898k414k150L374q00l254K887J394l744K035
$$ 2165 -2350 -790 2141 -870 -1211 2687 273 -1877 1497 697 -2557 330 1724 -2020 15
4916A5K482l419j11L381k979j583L716j288k702L518P63l715K013K014l862N04
$$ 15 2497 -922 -1033 2348 -631 -2214 1502 214 -2488 1030 1793 -1922 91 2105 -1757 -1253
4932a253L122l073o75M082j595k537L838o04l726K419J495l339J215L008l137
$$ -1253 1869 -1204 -1879 2203 608 -1929 1909 1305 -2421 -2 1493 -1846 -631 2377 -760
4947g60o20M169k388k114L344j096k866L081J085l467J842K478l729O2L436l176
$$ -760 -1380 2789 401 -1713 1631 535 -2331 750 1835 -1632 210 2688 -1041 -979 2457 -719
4963g19j432L715j163k714L815N82l918K175J595l613M24L181k772j215M175j444
$$ -719 -2151 1564 401 -2313 1502 2084 -1834 341 1936 -1677 -1253 1928 -844 -2059 2116 672
4979F72k389K869k9l563K295J457l509J753K779l210l55L336k154k204L293l75
$$ 672 -1717 1152 1123 -2440 -145 1312 -2197 -444 2335 -875 -1230 2106 -48 -2252 1041 666
4995F66l089L147J254l851K284K074m000O27K685k485j363M074j284k746L474
$$ 666 -2423 724 1978 -1873 411 2485 -1515 -888 1797 -688 -2051 2023 739 -2007 1467
5010A467J03l507K190J499l748Q01L192k585p88L694j582k980L381l39l094K084
$$ 1467 1570 -1937 253 1752 -1996 -1195 1997 -588 -1376 2318 736 -2244 1137 798 -2296 -212
5026b12J995l519J436L039l300m50L093k382k111L444o81k433K759J454l587J312
$$ -212 1783 -1736 -300 2739 -561 -1011 2082 -300 -2411 1033 352 -2081 678 2132 -1455 -143
5042a43K009l383J03K820k106j483L907p78k917L128L02l645J906J963l426P38
$$ -143 1866 -1517 -1414 1406 -700 -2183 1724 946 -1971 1157 1459 -2186 -280 1683 -1743 -1005
5058a005L262k624p55L255j620k604L248k9l573K892J466l377J343K673l292k78
$$ -1005 2257 -367 -1122 2133 513 -2091 1157 1128 -2445 447 1913 -1464 -121 2552 -740 -1018
5074a018K964j982k111L473m67k909L421P02l667J397K289l509O4L041k276p44
$$ -1018 1946 -36 -2147 1326 859 -2050 1371 2073 -1594 -197 2092 -1417 -1353 1688 -588 -1332
5090a332L315j457k290K793L01l322J530J900l092R10K785k431o31K799j491k521
$$ -1332 1983 526 -1764 1029 1330 -1992 -462 1438 -1654 -744 2041 -390 -1021 1778 287 -2234
5106b234L007L2l055K672J228l101J326K450l314k11K732j790j966L448m93k357
$$ -2234 773 805 -2250 422 1650 -1451 -125 2325 -989 -1200 1532 -258 -2224 1224 731 -1626
5122a626K658O55l174J210J901k982J00L166j859j341L229r39k612K315J92l117
$$ -1626 1032 1687 -1487 -277 1624 -1358 -1258 1908 49 -1292 1937 998 -1614 701 893 -2224
5138b224K132J626k960O92K818k021j295K851j644k045L170k55l088K918J418
$$ -2224 -92 1534 -1426 -734 2084 63 -1232 1619 -25 -2070 1100 845 -2243 675 2093
5153B093l680J412K049k993k21K692j847j161L409p71k625K413M12k688J123J651
$$ 2093 -1587 -175 1874 -1119 -1340 1352 -495 -1656 1753 982 -1643 770 1182 -1506 -383 1268
5169A268k902O03K938k347j078L319j524j938K150J43k571K223J518l273J065
$$ 1268 -1634 -1031 1907 -440 -1518 1801 277 -1661 489 632 -1939 284 1802 -1471 -406
5184d06K710k470j301L374k276j679L013j13k604K647J198l460R96K237l445Q9
$$ -406 2304 -166 -1467 1907 -369 -2048 965 852 -1752 895 2093 -1367 -371 1866 -1579 -1490
5200a490L139k383r17K897k45k487K477K37l280J534K168k861L97K953k268j243
$$ -1490 1649 -734 -1651 1246 1001 -1486 991 1228 -2052 -518 1650 -1211 -814 2139 -129 -1372
5216a372L191j716k051K526L77k825J886J818l015O33K622l072j50K434j528j672
$$ -1372 1819 103 -1948 578 955 -1870 16 1834 -1181 -548 2074 -998 -1148 1286 -242 -1914
5232a914K943m0k597K728P76l254R18K055k725m75K953j250j334K994p80k462
$$ -1914 1029 989 -1608 1120 1896 -1358 -440 1615 -1110 -1585 1368 118 -1216 1778 998 -1464
5248a464K008M28l296K031J960l102P21K440k132q69K927j361k553K939J95k393
$$ -1464 544 972 -2324 -293 1667 -1435 -714 1726 -406 -1275 1652 291 -2262 677 872 -1521
5264a521J697J792k956P50K015k614n97K572j482j629L395l51k503K254P58l202
$$ -1521 176 1968 -988 -238 1777 -837 -1434 1138 -344 -1973 1422 1071 -1432 822 1580 -1622
5280a622J197J759k810L73K734j658j069L014r24k830K507O68l118J782J607k672
$$ -1622 -425 1334 -1476 -1103 1631 -27 -1096 1918 994 -1836 671 1339 -1779 3 1610 -1062
5296a062Q08K622k771q87K471j024j755K414L12k819K165J500k816L16K296k696
$$ -1062 -254 2368 -403 -1290 1181 157 -1598 816 1128 -1691 474 1974 -842 -526 1770 -926
5312i26q32L085j369j386K643J87l144K366N70l007J131K156k524j16L229j895
$$ -926 -1758 1327 -42 -1428 1215 1402 -1742 624 1194 -1813 -682 1474 -1050 -1166 2063 168
5328A68j448K683q38k312K352J53k299J265K232k745L48K272k198r68K309j031
$$ 168 -1280 1403 565 -1747 605 758 -1541 -276 1956 -789 -441 1831 -367 -1335 974 -57
5344e7j830K843L28l153K625R28l066P31K161k369m23L113j526j746L023m22k702
$$ -57 -1887 956 1284 -1869 756 1684 -1382 -651 1510 -859 -1282 1831 305 -1441 1582 1160 -1542
5361a542K104O44k813J027K366l115L99K795j796j368K557j304k010K267O25k671
$$ -1542 562 1206 -1607 -580 1786 -1329 -930 1865 69 -1299 1258 -46 -2056 211 836 -1835
5377a835J768J918k943M34K286k489q41K691j077j526K688k4k577J792J411l231
$$ -1835 -67 1851 -1092 -658 1628 -861 -1702 989 -88 -1614 1074 1050 -1527 265 1676 -1555
5393a555P12K460k663m0K932j301j752K580l24k647J708J200l050J098K373k399
$$ -1555 -843 1617 -1046 -1086 1846 545 -1207 1373 1049 -1598 110 1310 -1740 -642 1731 -668
5409f68J83K582j963j577K662n58k881K674Q39k973J811J787l214O12K344k758
$$ -668 -485 2097 134 -1443 1219 661 -2220 454 1293 -1680 131 1918 -1296 -684 1660 -1098
5425a098m28K758j091j512K492j01k417J474J217k723N66K095k049k98L054j706
$$ -1098 -1526 1232 141 -1371 1121 1020 -1397 77 1294 -1429 -863 1232 -817 -1115 1939 233
5441B33j572K173R1k600J907R74k611J270J859k235l94K456j588j572K481m69
$$ 233 -1339 834 925 -1675 232 1206 -1405 -135 1724 -511 -905 1551 -37 -1609 872 403
5457D03k206K737K32k138J389J270k880N38K254k291r88K880j202j503K754l1
$$ 403 -1803 934 1166 -972 417 1687 -1193 -655 1599 -692 -1680 1200 -2 -1505 1249 1218
5473A218k493J381J203k866Q65K102j837m57K575j663j501K276m11k187J802R50
$$ 1218 -1275 106 1309 -1557 -692 1410 -427 -884 1691 28 -1473 803 392 -1795 7 957
5489I57k474J254K020k427j48K121j427j527K582m28k226K703L91k704J790J186
$$ 957 -1517 -263 1757 -670 -818 1303 -124 -1651 931 503 -1723 980 1371 -1333 457 1643
5505A643k759M75J858j621j025L017j000j817K458k57k493J612J005k834Q80K197
$$ 1643 -1116 -641 1217 -404 -1429 1588 588 -1229 1229 972 -1521 91 1096 -1738 -858 1339
5521A339j516q09K765j629j519K438o54k333J849J242k481J251J914k288n88K309
$$ 1339 -177 -986 1779 150 -1369 1069 415 -1918 -69 1173 -1308 -57 1857 -431 -1019 1290
5537A290j790j157K676r78j657K336M93k517J254J200k624M39K498k238o35L270
$$ 1290 -500 -1657 1019 41 -1616 720 1213 -1304 -50 1150 -1474 -1035 1463 -775 -1410 1860
5553A860j324j820K248O2k653J462J428k981J116K312j937p00K496j226j931K364
$$ 1860 536 -1284 964 1026 -1627 -165 1263 -1718 -602 1710 -227 -927 1569 343 -1588 776
5569G76m55j942K498O33k336Q35J973k800k22K545j769j074K581m61k359K603
$$ 776 321 -1621 877 1510 -826 9 1982 -818 -1040 1505 -264 -1338 1243 782 -1577 1026
5585A026J62k518J085J567k931L43K746j955n07K796j201j915J910l6k360J680
$$ 1026 1188 -1330 -245 1322 -1609 -1266 1480 -475 -982 1814 613 -1302 608 572 -1788 -108
5601a08J186k275R20K350k472l30K043j506j424K573o59k101K388P35k483J294
$$ -108 1078 -1197 -277 2073 -399 -729 1314 -192 -1616 957 298 -1803 585 1320 -1163 131
5617A31J704l108r4K868j910j063K761l75k074K046L16k286P20J654k609O49K270
$$ 131 1835 -1273 -1367 1501 -409 -1472 1289 914 -1160 886 1202 -1084 -364 1290 -1319 -670 1600
5634A600k109m37K358q00k131K008K45k763K285J168k157M88J843k100n94K206
$$ 1600 -509 -946 1412 612 -1519 489 734 -2029 256 1424 -733 -245 1598 -502 -1096 1110
5650A110j085j697K769n18k133K327N39k655J089J658k557j13K454j821p82K661
$$ 1110 25 -1672 1097 579 -1554 773 1312 -1343 -254 1404 -1153 -1266 1188 -633 -1415 1246
5666A246o70k275K429P24l224J385J911k701O87K568k438m19K274j031j954K522
$$ 1246 576 -1699 730 1454 -1770 -385 1526 -1175 -488 2080 -358 -777 1497 466 -1488 1034
5682A034k36k490K022J023k235N17K038k316m61K102j246j572K628J60k372K275
$$ 1034 798 -1692 330 1353 -882 -365 1673 -643 -1104 998 -248 -1820 808 968 -1404 871
5698H71N15k737Q63K045k750J10K317j317j199K733q12j902J758N66l031J404
$$ 871 1386 -1351 -488 1557 -1193 -1083 1234 -83 -1282 1451 639 -1263 495 1061 -1970 -566
5714e66J849k391N03K527k379r03K375r31k058K270N38k468J825J230k771J029
$$ -566 1283 -1108 -605 1922 -457 -1360 1015 84 -1974 296 834 -1634 191 1421 -1350 -321
5730c21J782k133n00K147j202j576L105m31k282J936P70k639J263J434k261oK633
$$ -321 1461 -672 -1172 975 -227 -1803 1302 871 -1411 525 1295 -1344 -81 1353 -908 -914 1719
5747A719j770j060K686j110k138K249M52k719J635J424k027K28K175j934q52K057
$$ 1719 -51 -1111 1575 465 -1673 576 1028 -1691 -56 1368 -659 -431 1744 -190 -1042 1015
5763A015p64j853K324n9k123J812J337k823N89J808j989p24K485q54j750L227
$$ 1015 251 -1602 722 663 -1460 352 1689 -1134 -545 1263 -726 -1450 1035 181 -1569 1658
5779A658q30k299J991O13k383P60J649k290M45K055j571j203K778o87k016J702
$$ 1658 828 -1471 520 1133 -1250 -490 1159 -1131 -686 1369 -202 -1405 1373 686 -1330 372
5795C72K02k056J379J583k109M10J884k151r84K545p15k007K557l3k025J928N84
$$ 372 574 -1482 -103 1480 -629 -219 1665 -486 -1470 1075 360 -1647 910 877 -1148 780 1364
5812A364k301K80J967k416j27K463j389j118K165l00j633J261O43k533J447J575
$$ 1364 -937 -657 1310 -1106 -1233 1230 -159 -1277 888 588 -1045 216 859 -1674 -227 1348
5828A348k282J43K709k034p95J895r56j758K164M29k224J819J183k317J67J936
$$ 1348 -934 -791 1918 -116 -911 984 28 -1730 434 863 -1361 458 1641 -676 -509 1427
5844A427j840p50K379j100j453K272K71k506J986Q86k703N77J742k087m3K424
$$ 1427 -413 -1163 1216 116 -1337 935 1206 -1300 686 1572 -1131 -554 1188 -899 -942 1482
5860A482j119j523K583q48k131J948M34k459J230J553j851o9K156j561j157K186
$$ 1482 363 -1160 1423 575 -1556 392 826 -1633 -403 1150 -701 -770 1386 -175 -1332 854
5876H54o50k168K476N60k455J372J613k595O7K351j869q64K203r15j418K267J17
$$ 854 204 -1964 512 1072 -1383 -11 1602 -993 -926 1425 -444 -1308 895 -20 -1438 829 946
5893I46k351J837R94k731M52K092j842l84K728j471j372K175q39j887J965N95
$$ 946 -1405 432 1426 -1305 -853 1239 -603 -987 1741 270 -1102 1073 234 -1653 312 907
5909I07k259R14J995k109l33K881k091j147K116o22j935K495L29k365J677Q72
$$ 907 -1352 -438 1557 -552 -885 1996 -95 -1242 874 252 -1683 812 1141 -1224 453 1325
5925A325k425J05K367k043o21K606q34j786K379J6k312J290R03k623Q81K281k087
$$ 1325 -1100 -995 1372 -671 -1292 1314 480 -1306 1073 1089 -1223 67 970 -1653 -772 1509 -578
5942e78m46K836j383j594K143m57k219J533J195k518J608J645k287j79K263j746
$$ -578 -1024 1812 429 -1165 978 521 -1698 -165 1030 -1488 120 1765 -522 -701 1562 -184
5958a84j074K263q00j660K456J03k063J132J488k627L22J976j709q33K748j296
$$ -184 -1258 1005 205 -1455 1001 1104 -959 173 1661 -966 -644 1332 -377 -1210 1538 242
5974B42j610K515j31k455J381J135k434P09K111k198j43K649j660j564K439r02
$$ 242 -1368 1147 1016 -1439 -58 1077 -1357 -648 1463 -735 -878 1771 111 -1453 986 84
5990H4j674J965P57k445J253J429j901l45J782j312j023K634n94j861K171K18
$$ 84 -1590 375 1132 -1313 -60 1369 -532 -877 905 -407 -1430 1204 610 -1251 920 1138
6006A138k197J286J039k251o1K458j993m98K569r39j729K082K3k294J245J326
$$ 1138 -1059 227 1266 -985 -1046 1412 -581 -1079 1490 551 -1178 904 927 -1367 -122 1204
6022A204k158Q35J967k308l62K207j417j292J947j97k004K448J85k155J068J546
$$ 1204 -954 -119 1848 -460 -822 1385 -32 -1324 623 426 -1578 870 1055 -1100 -32 1514
6038A514k177m82K245j572q88K385m29j852K238j40k001J023J230k261N25J886
$$ 1514 -663 -1145 1100 -472 -1360 1025 596 -1256 982 842 -1159 -136 1094 -1167 -642 1244
6054A244j587n85K521j490j527K443m37k248J496J078j875R77J880k528o9J904
$$ 1244 -343 -928 1593 103 -1424 1019 582 -1666 -170 908 -967 10 1890 -638 -707 1197
6070A197j319j335K440j44k216K021P88k432Q25J829k409l17K061j443j047K807
$$ 1197 -122 -1457 983 839 -1377 644 1432 -1000 -175 1654 -755 -1072 989 -454 -1501 1306
6086A306o11k156K326K64k508J224J220k238P34J991k001n94K487j090k049K420
$$ 1306 695 -1461 865 1129 -1379 -155 1065 -1173 -439 1552 -449 -1043 1444 354 -1695 725
6102G25k54k312J797J410k474Q78J990k113q16K278j478j241K681n87j852J913
$$ 725 471 -1841 -44 1366 -1108 -230 1760 -353 -1169 1109 -369 -1610 1071 484 -1368 545
6118E45P91k455Q81J556k278q6K206j456n93K349j221j524J828M61k762J645J449
$$ 545 1336 -1119 -238 1318 -960 -1046 1160 -296 -889 1460 239 -1285 543 1004 -1758 -113 1336
6135A336k250L98K277j936o44K126r12k014K359k97j896J424J233j981P19K001
$$ 1336 -914 -516 1761 -175 -819 1307 395 -1619 740 443 -1453 -29 1204 -777 -58 1943
6151A943k615l72K236j332j247K142k80j710J915O59k615R58J199k265K96K540
$$ 1943 -672 -1044 1192 -140 -1387 755 475 -1235 680 1339 -1276 -318 881 -1384 -1088 1452
6167A452j604j089K487m29j953J481L32k301J780Q70k090P24J887j871n56K123
$$ 1452 -152 -1241 1246 817 -1136 345 677 -1624 156 1026 -1064 -340 1547 -324 -880 1243
6183A243j162j281J996k48k073J881J135k375O26J423j870l28J969j160p94K210
$$ 1243 81 -1200 796 548 -1525 356 1491 -884 -258 1165 -705 -1033 936 -224 -1018 1192
6199A192l52j968J693N53k546J037J426k007K60K284j744p70K048p69j441J586
$$ 1192 840 -1128 565 1118 -1428 -391 1035 -972 -712 1572 -172 -942 1106 337 -1104 482
6215D82L58k468J874P81j815M70J826j986m73J772j044j193J942K1j691J735R20
$$ 482 840 -1628 246 1027 -788 -318 1508 -478 -951 821 -223 -1416 526 547 -1144 591 1511
6232A511k491P27J404k044j33K142j339q58K417q02j757J700N70k622J306J432
$$ 1511 -980 -253 1151 -893 -1026 1116 -223 -1081 1336 534 -1223 477 1047 -1575 -269 1163
6248A163k278O18K043j586r23K258q93j719K049p3j882J289J102j791L21J646
$$ 1163 -1115 -497 1546 -40 -963 1295 402 -1317 732 659 -1223 66 1168 -623 -302 1344
6264A344j825p32K075j331j047K032J80j827J271J084k173M69J664k042J14K150
$$ 1344 -481 -1213 862 -469 -1516 516 696 -1131 140 1224 -949 -480 1184 -858 -744 1406
6280A406j368r75K173r48j664J806L32k202J233J753k423M32J981j569j070K268
$$ 1406 38 -937 1236 288 -1376 430 762 -1440 -207 1546 -877 -445 1536 -33 -1103 1165
6296A165q81j734J808L40k092J618J426j987PJ643j608j105K332o32j672K474
$$ 1165 284 -1450 358 698 -1394 224 1650 -337 -330 1313 -295 -1400 932 300 -1372 1102
6312A102m92j643J416M96k125L10J811j703j34K262j241q47J588l26j949K042
$$ 1102 610 -1033 383 879 -1246 -936 875 -828 -962 1300 59 -788 800 474 -1475 567
6328E67j12j943J405J113j544K32J722j877m75J916r20j585J871P23k441J481
$$ 567 455 -1488 -83 1030 -514 -282 1440 -437 -912 1004 84 -1501 370 1093 -1348 133
6344A33J234k356O95J326j620m81K537j198r96J848k07k020J817J83k116R74J475
$$ 133 1367 -989 -294 1032 -588 -1069 1468 270 -726 1122 915 -1105 712 895 -1221 -247 1228
6361A228j971k18K424j491j105J815k83k100K273J29j961J422J261k409M94J826
$$ 1228 -743 -961 1463 -28 -1133 682 399 -1701 572 701 -1260 162 1423 -986 -492 1334
6377A334j650o33J775p50j305K082J22k038J273R80k226J96J984j946k86J918
$$ 1334 -316 -949 826 76 -1229 853 975 -1063 210 1190 -1036 -840 1144 -802 -1088 830
6393H30r02j214K143r0j827J343M68k000J064J145j575J42J652r97j208J825m10
$$ 830 -72 -1286 857 767 -1060 283 751 -1249 -185 960 -615 -473 1179 182 -1026 799 389
6410C89j828J548P61k042J461J201k029j3J933j599j131K017m46j356J900M00
$$ 389 -1439 109 870 -1172 289 1490 -539 -552 1381 -218 -1349 668 222 -1134 766 1166
6426A166j950J071R84k102P9J920j747m59K142r90j056J949m88k080J635Q52k302
$$ 1166 -784 287 1271 -831 -752 1168 -579 -1038 1104 114 -942 1007 519 -1561 74 926 -1376
6443a376J083J602j737k93K154j524j148K231n34j819J670P12j872J065J124j842
$$ -1376 -293 1309 -428 -721 1433 -91 -1239 992 458 -1361 309 1021 -851 214 1338 -504
6459e04l7J756j717o65K163l85j529J608K03j941J437N22k089P62J234j376k81
$$ -504 -541 1215 -502 -1167 996 611 -918 690 893 -1048 389 911 -1178 -416 818 -558 -839
6476h39K142j044j037J501k78j797J752K92j651R47J364j690KJ671j743q55K112
$$ -839 1303 259 -778 723 445 -1352 400 692 -959 -12 1352 -338 -336 1335 -408 -1263 849
6493H49q29j236J940Q7j650Q54R86j959K81J582j343p31K002k84j580K004j68
$$ 849 20 -1216 724 811 -839 15 1001 -958 -677 905 -438 -1169 833 549 -1031 973 805
6510H05j850J359P06k051O71J529j605J01J848j276j460J597k05j289J088Q50
$$ 805 -1045 314 1020 -1031 -360 1169 -436 -335 1513 237 -1223 374 169 -1120 -32 818
6526H18j626Q97J460j974l8J540j374o75J406L6j358J345L03j659R63J101j719
$$ 818 -808 89 1549 -425 -463 1077 -297 -972 434 470 -888 457 760 -899 64 1165 -554
6543e54J9J518j493n00K144j108r42J595k29j585P27J204k101M38J670j220k29
$$ -554 -535 983 -510 -1010 1134 26 -916 679 450 -1135 -408 796 -1305 -867 803 -417 -646
6560f46J641j042j001J658k91j791J680Q50k145R60J311j845K62J290j346p61
$$ -646 995 -47 -1048 610 319 -1472 208 1058 -1087 -127 1184 -661 -399 891 -455 -1216
6576a216J845k30j236J625J30j664Q79P50j570j90J919j551k87J913q06j172J524
$$ -1216 629 399 -837 788 918 -746 133 883 -687 -877 1042 -509 -796 1117 311 -861 663
6593F63J71j827J225O82j669M93J922j729m12J586r43j154J972n88j381J262O23
$$ 663 834 -993 232 914 -755 -262 1660 -69 -481 1105 162 -992 980 392 -989 273 896
6610H96j352K17J067j650m1J784j287o54J871p19q68J213K75j636O53J178k064
$$ 896 -456 -239 828 -822 -863 921 -366 -1020 851 132 -736 477 752 -884 -231 947 -1117
6627a117N52J379j199m2J534p50j376J340P1j516R73R39j511O54J228j348l4J243
$$ -1117 -565 814 -385 -427 1107 357 -1019 321 392 -1124 -151 788 -723 -69 1159 -189 -223 1020
6645A020j005r37J452j74j300J328P69j550K37J335j758k05J361j151l50J752
$$ 1020 15 -922 530 356 -944 384 1153 -397 -160 1175 -583 -788 573 -578 -928 824
6661H24l53j257J456O6j722O31J277j856N11J433j182n30J442m07j624J647M59
$$ 824 471 -786 670 736 -986 -355 922 -934 -423 1010 -172 -702 740 333 -1291 356 815
6678H15k084J078P56j304Q06J090j643l38J770j107j110J705j29j102J161K90
$$ 815 -1269 -191 565 -739 67 1157 -486 -824 946 -161 -1271 434 305 -797 364 654
6694F54j364O62Q98j513k96J884q92o80J794n97j530J620k5k032J092J121j578
$$ 654 -710 -48 850 -663 -959 925 33 -647 1147 550 -980 640 615 -1417 -325 796 -782
6711g82O06J215j330l73J660q10j743K144q6j798J585M15j239K93J426j531m05
$$ -782 -176 1039 -291 -664 996 186 -1557 587 501 -1297 288 703 -536 -243 1183 -348 -753
6728g53J752j137r59J429L08j477J194L63j655P10P24j491M25J298o97o69J854
$$ -753 999 -138 -1097 332 640 -837 357 720 -935 -225 499 -992 -567 731 34 -635 1219
6745A219q76j372J320K59j551O92Q80j381O93J482j165q08J559r35j240J808n4
$$ 1219 343 -1029 291 550 -1001 -309 571 -810 -117 1365 200 -608 951 16 -1224 584 530
6762E30j592J223P85j546N82P74j254o54J936o42j227J608J19j406J251L5j597
$$ 530 -1062 161 946 -600 -18 756 -498 -1152 784 142 -1085 523 642 -764 487 522 -1075
6779a075O35J167j413L0J655r67p17J552n61j366J146L62j382J097O75j343L26
$$ -1075 -440 727 -686 -656 999 32 -685 867 306 -1060 86 448 -934 163 838 -505 -179
6796a79J099j034q02J734p42j093J525J66j550J030J012j913M60J068j223l18
$$ -179 920 -114 -916 818 76 -1017 508 674 -876 154 1166 -747 -287 781 -442 -760
6812g60J531p80m00J158l8j676J477O3j506N20J121j255M0J872j530o68J563o04
$$ -760 771 -9 -409 749 711 -965 512 575 -931 -411 710 -545 -505 1367 -163 -831 732 128
6830A28j100R87M35j508J076R22j693N80J264j465o20J471l02j564J906j00j445
$$ 128 -972 15 450 -1058 18 940 -753 -173 1091 -374 -994 477 175 -1389 517 417 -1028
6847a028J190R73j934N15Q45r06n71J789j146l07J339k06j557J289L81j375Q38
$$ -1028 162 1135 -799 -284 561 -345 -916 873 -273 -580 759 553 -1004 285 666 -709 129
6864A29M16j066L05J358r58q34J311o06j141J486mj366J107R12j715N77J157j318
$$ 129 545 -521 -216 1142 184 -650 661 55 -1086 400 396 -970 137 1049 -666 -89 1068 -250
6882b50o95J670m91j421J653o9j314J063M88j597O36J090j422OJ513r83l07J299
$$ -250 -945 725 234 -1187 466 397 -917 146 634 -963 -327 763 -659 -653 860 -123 -430 869
6900H69n85j228J185J93j497P67J501j758J77J533j140q27J108j69r44R64K43
$$ 869 284 -944 241 434 -1063 -296 1205 -553 -376 1157 17 -810 298 129 -815 149 392
6917C92r89P23J012j757M23R04j317k04J484n77p79J467k42j204R31O72j913K41
$$ 392 -597 126 1138 -619 -196 708 -609 -813 671 94 -685 782 540 -664 267 939 -974 -733
6935g33J587j222j76J429n65r68J289l24j322J107M67j465N22J485j396j49J384
$$ -733 854 -368 -544 885 320 -648 641 317 -1005 102 569 -896 -374 1111 -285 -434 950
6952I50j260p27J499o56n94J188K74j390P30R26j685P7J477j172m08J448p30r66
$$ 950 -310 -1037 462 -194 -788 400 674 -716 14 940 -745 -668 809 -363 -771 677 -53 -1019
6970a019J859l2j648P36O50j398O98J277j662L55J369j259j126J758l59j049J166
$$ -1019 840 808 -840 -104 546 -852 -154 1123 -539 -184 1185 -74 -1200 558 199 -850 316
6987C16K68j545P85J541j731j43J245j035q72J857m97r35J065M70j703Q06J036
$$ 316 584 -961 -176 1365 -366 -509 736 -299 -1171 686 189 -746 319 789 -914 -108 928
7004I28j792L32R90o76l47J182k74j051J135L67j885R65Q00j427L38J396j267
$$ 928 -864 -532 458 -218 -565 617 343 -708 427 794 -1091 -126 674 -753 -415 981 -286
7021b86k05J422q82r77J284r2j298J326O08j444M26J205j513M7J008j050l35J251
$$ -286 -491 931 49 -928 356 264 -1034 292 900 -544 -118 1087 -426 -379 629 -421 -756 495
7039D95k39j065J238J81j408Q57Q04j477o1J393p43n21J425n49q79J377j53j634
$$ 495 256 -809 429 610 -798 59 863 -614 -675 718 -25 -546 879 330 -549 828 675 -959
7057i59R52M95j179M75J198r98l67R77m62j104J442k20j242J060R09j732M88J182
$$ -959 -7 488 -691 -216 982 -16 -383 594 132 -972 470 250 -992 68 977 -755 -267 915
7075I15j457J35J166j029n30J601m85j009J343k1j285Q30N31j553K83J287j205
$$ 915 -542 -407 759 -270 -800 801 316 -693 650 629 -656 174 705 -848 -565 722 -483
7092d83Q2J266q74q94J713q15p99N56R36j681Q71J320j365l17J354j111n38J058
$$ -483 -401 865 -9 -903 810 -5 -804 -248 688 -993 -122 1198 -167 -484 870 -241 -779 279
7110B79q6r15J115L23j170P10N82j534M7J317p54q15J936n09j204P30P70j712
$$ 279 193 -722 393 716 -454 256 838 -696 -649 668 -86 -901 1035 526 -678 52 822 -890
7128h90P65Q04j327P1J187p25l34J432p65q20J266j85j529R74R20j408M34J101
$$ -890 -125 679 -648 -577 610 -115 -449 983 218 -602 664 479 -1050 -76 844 -564 -130 971
7146I71j227J0R79r63m86R96r8j122J116O47j161K38J133j816K78J436j067o86
$$ 971 -256 -246 733 -230 -716 280 182 -940 176 823 -338 -100 1033 -783 -505 931 -136 -822
7164h22J831o20j375J358j9j245R54N03j602P45J344j315l63J454o99r19J089
$$ -822 1009 389 -986 372 353 -892 62 565 -1037 -292 1052 -263 -626 828 129 -790 299
7181B99Q5r19Q24L87j240N06R82j237o5J096j070q11J587o5p04P86L69j601O97
$$ 299 384 -535 289 676 -564 -58 924 -313 -378 718 -352 -1163 424 359 -345 441 810 -791 -94
7200i4R51j452K40J302r77n55J302o32q30R83L55j241R03N55j260M20R09p05q69
$$ -94 857 -595 -355 947 -30 -585 717 85 -745 238 593 -648 255 810 -450 -30 879 174 -695
7219f95J500o57j084J169K99j644J156Q65j500O10M50j261K02R35n73p84J657
$$ -695 805 148 -936 233 532 -1112 44 909 -591 19 469 -792 -590 345 -228 -1012 645
7236F45q5j393J183M32j554N21Q74j216k28J766j107l46J058k50j062J144k42
$$ 645 560 -833 350 782 -772 -251 623 -593 -821 945 -162 -508 550 300 -762 382 140
7253A40r74Q90O86j166K63J382j129n54J253n64j032J255j14r09O60R91j509K1
$$ 140 -834 56 742 -424 -161 1221 92 -462 791 227 -805 450 336 -573 87 1078 -431 -410
7271d10J325j435l30J583r61m93J117K07j325J282m6j470N15J294j750M19J250
$$ -410 915 -520 -850 733 -228 -721 396 603 -722 560 514 -956 -441 853 -897 -478 772
7288G72r44j49J150m89j319J165L01j506J482K92j025nJ366j278o84J335o96p26
$$ 772 -172 -321 829 340 -979 186 487 -1019 463 755 -270 -275 1091 -187 -871 464 -232 -958
7306i58J470l6j340J379M26j573N50J014j496J38J041k14j286J771m69j241J038
$$ -958 512 476 -864 515 941 -632 -82 932 -564 -426 615 401 -885 886 417 -824 214
7323B14M89j290N53O35r49O6J311j440q6R79o59p66Q68L98j082R21N50j306J36
$$ 214 703 -587 -34 601 -348 -282 1029 -411 -497 482 -177 -943 -75 323 -759 162 712 -594 -458
7342d58J325j119n63J342o65n26J307l25r82J202K82j556P32L61p17m47J925r52
$$ -458 867 -252 -815 527 -138 -664 643 318 -664 538 820 -736 -4 357 -360 -807 1118 166
7360A66o80J466o76j167J042O11j685O47P94o82n4J442j291o44J168j89j255J566
$$ 166 -514 952 276 -891 151 762 -923 -276 518 -164 -218 1224 -67 -711 457 268 -987 579
7378E79j41j097J072O59j618K97J089j107m79J239l25r34J341j22r95P99M79j393
$$ 579 438 -659 413 1072 -546 -249 840 -267 -746 493 168 -766 575 453 -542 257 736 -657
7396f57L93R94j174N1J179o01q23J241l09j428J481K64j338P28Q09j520M41R90
$$ -657 -264 730 -444 -393 786 185 -638 603 294 -1134 347 611 -727 1 810 -710 -269 721
7414G21n98o18J062l97j085J229K32r82Q70N95j489J21J110j076n04J541n92m66
$$ 721 123 -495 567 170 -915 314 546 -436 434 1029 -460 -339 771 -305 -809 732 140 -326
7432c26J042l33r15N29Q41j403L34J233j258k11J273o04p75J292l30j281J040
$$ -326 716 383 -532 -3 838 -565 -231 1002 -256 -467 806 202 -573 719 389 -892 148
7449A48M49j321Q72Q85j362k07J164j019o90J678m01q38R39K12j310J007P76j722
$$ 148 597 -724 148 1033 -329 -536 628 -391 -1081 597 196 -642 297 509 -801 206 982 -740
7467g40Q6J313j020l48J741j084o79J474k65j252J078K78j525N49J383j244K3
$$ -740 -654 659 -361 -709 1032 -52 -731 743 478 -774 304 582 -943 -394 989 -255 -232
7484b32J406j272n33J198k29j319J219N47j309M42P92j031j77J706j400q40J882
$$ -232 1174 -98 -631 567 338 -981 238 785 -524 -82 710 -321 -498 1208 -192 -1032 850
7501H50o17j014J358K55j229N56K63j270M11J193j233j10J331p60n69R62l8j328
$$ 850 233 -781 577 832 -397 159 422 -848 -437 756 -477 -587 744 -16 -585 377 339 -989
7519i89R76M05j227P74P00q77j17J039r94m56J156j53j046J256R9j206Q16Q49
$$ -989 -13 392 -835 -61 639 -238 -355 684 -310 -766 390 237 -809 447 546 -660 156 1005
7537A005j696K31J161j030k78J480q60p71J341J43j187O21L84j370N93J134j107
$$ 1005 -691 -460 701 -329 -607 873 13 -758 583 726 -461 160 544 -826 -233 901 -206
7554b06l13J416o23j070J311q3j800J487L64j220O55R91j380k07J494j071o14
$$ -206 -519 897 274 -796 515 432 -1368 119 483 -737 -82 909 -471 -678 816 -255 -869
7571h69J391m55r00Q94M14j062O10Q63j552L52R31o69n78J270o64m43J157J62
$$ -869 522 67 -833 61 475 -587 23 886 -666 -314 617 -52 -630 640 -24 -467 690 852
7589H52j675R78N31j427L88R37m79q49J677r70q34J316q9j223Q99O91j313O48
$$ 852 -823 155 686 -741 -353 584 105 -744 933 -37 -871 445 356 -867 32 723 -590 58
7607E8J152j610N3J064q83o86J344j74p42J117m8j274M09O52j268K20J458j631
$$ 58 1210 -400 -347 717 -166 -852 492 318 -424 693 645 -629 -220 432 -836 -616 842 -789
7625g89N18R36n54q67J320j16j516J025N25j007J57J256j176j81J174o44p89J344
$$ -789 -271 665 111 -756 564 448 -1068 -43 482 -525 -368 888 -288 -469 705 61 -728 616
7643F16l36j238J264K24r29L86N89q43k13J211j138m10J814p25r82J176J42j579
$$ 616 280 -958 306 530 -399 -13 576 -267 -480 731 -407 -817 997 272 -710 466 608 -971
7661i71Q66P57j345J71J313j253J7J296p46q34R84j27r23R84M06j099J40J172
$$ -971 -105 652 -693 -522 791 -462 -445 851 105 -729 255 128 -795 189 595 -504 -364 808
7679H08j262l05J168j71j185J446j95j266J253N39j429N56Q93j201k57J121n36
$$ 808 -454 -759 409 238 -947 499 304 -962 291 830 -599 -43 850 -351 -608 513 -23
7696b3q82J630m05q66R36K42j134M77O57j107rJ587j429R4J165m76j018J118k04
$$ -23 -905 725 320 -546 390 632 -502 -25 632 -475 -484 1103 -326 -232 933 457 -561 557 353
7715C53j098J017L93p61j13Q62p18k01P72p68l07Q74r4j021J225J68j172L96Q93
$$ 353 -745 272 665 -96 -209 653 -65 -266 506 -262 -569 305 211 -810 415 583 -589 -193 700
7734G00j128j03J339r05m37J342j75j407J011P7j172P18O68j094K87R22m84n91
$$ 700 -428 -531 808 -97 -534 808 633 -774 237 314 -858 -140 528 -566 -279 643 159 -432
7752d32J007n52q96J041qj019Q91P09j223O48Q84j422J5O06k90j083J437L9j132
$$ -432 575 23 -873 168 160 -859 32 741 -482 166 1050 -372 -357 249 -41 -1124 313 352 -780
7771g80J036K93q71M57P16j507J21J246o89o06J189l44r48Q01J23q19M03R01j528
$$ -780 256 549 -322 135 851 -656 -535 711 22 -584 605 261 -687 114 237 -582 -179 722 -806
7790h06L57J241j074m94J169l28r64J431m26p84O59L23q50L60P96j383L15J205
$$ -806 -449 792 -282 -776 393 65 -899 532 106 -678 -19 304 -546 -186 610 -773 -458 747
7808G47n48p87J162Oj141P17K94r82N03O52j255N31Q03p69k79R97k64r56O73M87
$$ 747 199 -588 574 580 -561 156 450 -532 -29 623 -632 -101 702 -67 -346 651 387 -569 104 591
7828E91j243Q54P09r54j59Q15j021j66J155p03o19R31K81j157J021N87j621L39
$$ 591 -652 202 911 -43 -202 613 -408 -574 581 -122 -741 190 471 -686 335 922 -699 -360
7846c60J042j002k00P85Jp14Q06J03j199J035K39j499O82J005r98l6J128r98n02
$$ -360 682 -320 -520 265 266 -448 358 461 -738 297 536 -963 -281 724 -274 -310 818 -180 -682
7865f82J132k20q62O90O75j454M32J178j232K46O35p17l63Q85n06n70J091J32
$$ -682 450 230 -632 58 733 -721 -289 889 -343 -97 538 -179 -542 343 -163 -733 358 490
7883D90r29P54M68j431L47R94r55r2J087o74m88R93r0j167J211J24j506N11R57
$$ 490 -439 315 783 -648 -301 693 -262 -354 733 59 -429 564 474 -693 518 642 -864 -353 604
7902F04j171K53J076n67o00P94j15j018P70K18r05N12Q10j036k75J321q02n82
$$ 604 -567 -314 762 195 -405 389 274 -744 26 244 -661 -149 661 -375 -650 671 -131 -713
7920g13J197m12p65J136K43j223M38Q05j485L86R91j232M23J245q53p48J233k07
$$ -713 484 72 -693 443 686 -537 -99 706 -779 -393 598 -634 -211 1034 181 -567 666 459
7938D59j285J018N16j274M61R35r76l20J163p28n48J389o76j016P33R03j381J001
$$ 459 -826 192 708 -566 -105 830 -146 -466 697 -31 -579 810 134 -882 -149 754 -627 374
7956C74N29j695K21J219j085M3J015n19o24J235k68r81L82P74j193K59Q24p92
$$ 374 903 -792 -571 648 -437 -394 621 102 -522 713 445 -536 -154 620 -573 -314 510 -282
7974b82k13J235l70q34R66n10p27R99N74j739P96O20p14j19O90n20o72R65K22
$$ -282 -495 740 370 -464 502 -8 -735 264 838 -901 -105 515 -199 -318 372 -148 -820 145 367
7993C67j107J220K03j299Q25N07j181L79O26q12r5J002m88m29P83Lj027N45O77
$$ 367 -740 480 683 -616 209 716 -465 -86 540 -272 -367 635 147 -282 501 504 -523 22 699
8012F99j264N68M64q09K36P12o93q35J292l7j165J027J71r35N57J036j336J94
$$ 699 -565 3 467 -342 -106 606 -87 -922 370 333 -832 195 366 -569 -12 1024 -312 -118
8030a18P06j043l52J277l76n68P51J00r28M11P56j102J71O52p54j15J028k85q79
$$ -118 588 -455 -807 470 94 -474 277 377 -551 -140 616 -486 -315 337 -417 -532 496 211 -668
8049f68J214j18q42L78J97j059O99Q01n74k11N30m61l16R32j88j224J129M52j126
$$ -668 546 428 -414 -36 161 -898 -199 602 28 -183 347 -114 -430 502 314 -910 219 671 -455
8068d55L79O45j227K04R90l16p26O99K72q51P62K18r77M54N26j063K3J107o97
$$ -455 -76 569 -658 -454 536 220 -506 193 465 -386 376 594 -383 71 597 -466 -443 664 -33
8087c3l74J061m72q21J084k54j050J299j21j067N11R30j042j13R30l58p86Q56
$$ -33 -407 654 182 -639 445 191 -859 440 319 -748 -237 693 -349 -462 468 110 -676 180
8105A80j55m40R11L17j450P07O12r04j45Q34o34k80R36l13r79J184J52j014L79
$$ 180 25 -415 496 813 -637 70 682 -222 -367 467 -167 -447 489 176 -803 381 533 -481 -102
8124a02M36r46J79R81p13j87R44k87j105J274k49r77Q96L42j016O68M26p71j16
$$ -102 334 -612 -433 548 -165 -352 592 305 -800 474 225 -752 144 486 -530 138 564 -207 -323
8143c23J073q15j52O48m08o39Q57M8o54M02K47p94r9J088m11o44J092K6r52P63
$$ -323 750 -65 -217 431 23 -616 241 289 -365 37 284 -510 -609 479 68 -576 516 542 -410 353
8163C53L2q53M57M69p69J0R86q13k01P76k17q10P18J04j279Q08N63p18K19Q05
$$ 353 385 -468 -11 458 -311 -301 685 -128 -329 447 230 -580 138 242 -1037 -229 334 -384 -165 640
8183F40p75k69N67j50q45R81P2q84
$$ 640 -135 -404 163 13 -832 149 221 -663
8191f63
$$ Imaginary data points
##PAGE= N=2
##DATA TABLE= (X++(I..I)), XYDATA
0@%%%%qQqJ6j6J6k4L2m0M8n6P2q8J01j17J40j66J90k16K53k93L34l79M31m89N52
$$ 0 0 0 0 0 -8 0 -8 8 -8 8 -16 16 -24 24 -32 40 -48 53 -64 76 -90 100 -116 137 -156 178 -201 230 -259 293
30B93o22O97p81Q74r73J086j210J340j484J646j825K020k235K474k740L041l383
$$ 293 -329 368 -413 461 -512 574 -636 704 -780 866 -959 1061 -1174 1300 -1440 1601 -1782
47a782L771m216M734n350O092p002Q157r676J1766j4834J9779k9025N1922k05110
$$ -1782 1989 -2227 2507 -2843 3249 -3753 4404 -5272 6494 -8340 11439 -17586 34336 -170774
61a70774l36281N10712K01097k38324r1109L6720r451J23907j9997j42768R2087
$$ -170774 -507055 3657 204754 -33570 -124679 -87959 -97410 26497 6500 -136268 -44181
72d4181M9209k08437J18625K82191j96902k21576K26322O6184j70756Q2173P8895
$$ -44181 5028 -203409 -84784 197407 505 -221071 5251 71435 -99321 -17148 61747
83F1747j41790L6094R1808j01955K8195R8715j30279J8611J90162j70967j93851
$$ 61747 -80043 -43949 47859 -54096 -25901 72814 -57465 -38854 151308 -19659 -213510
94b13510K51955J09403k28992L0847J59722r7791l1538Q3085p6227l587Q0927
$$ -213510 38445 147848 -81144 -50297 109425 11634 -19904 63181 -13046 -16633 64294
105F4294j41730m743K98806l8924l14585N5185J64104p7561K6161N4553j76757
$$ 64294 -77436 -82179 216627 177703 -136882 -81697 82407 4846 31007 85560 -91197
116i1197l242K11856n1261j14984Q3140n9711r7972J76686M5455j89957M8994
$$ -91197 -94439 117417 66156 -48828 34312 -25399 -123371 53315 98770 -91187 -42193
127d2193R9590j36382M2027J76445j40412j19040J65386o827j35845R0720M8943
$$ -42193 57397 -78985 -36958 139487 -925 -119965 45421 38594 -97251 -6531 42412
138D2412p3909Q6787J879j75836R6440J66409j92347j06347J89169J550q6517
$$ 42412 -31497 55290 57169 -118667 -22227 144182 -48165 -154512 34657 36207 -50310
149e0310J19333k1720j61240Q7043Q1316j18916L5173Q7119j10968K0575J30942
$$ -50310 69023 47303 -113937 -26894 54422 -64494 -29321 57798 -53170 -32595 98347
160I8347j24558o6994J87545l9280j81038J19042R7568j34545K3341R4918r4693
$$ 98347 -26211 -93205 94340 55060 -125978 -6936 90632 -43913 -20572 74346 -20347
171b0347p493Q6335p8923k117J12460j34124j09861K21201O3297j96042L3350
$$ -20347 -27840 58495 -20428 -22545 89915 -44209 -154070 67131 130428 -65614 -32264
182c2264J06696j14712j6725J00414o4793k1119Q9219p7016l0429J66625m5310
$$ -32264 74432 -40280 -57005 43409 -21384 -42503 46716 -30300 -60729 105896 60586
193F0586j80585Q9038P5639j19002O3342J16543j47545o0332J48797j2866o8662
$$ 60586 -119999 -30961 44678 -74324 -10982 105561 -41984 -102316 46481 33615 -35047
204c5047N5337o1099o2701J52272J3850j61616P3029J06015j29691N19J31349
$$ -35047 20290 -40809 -103510 48762 62612 -99004 -25975 80040 -49651 -49132 82217
215H2217j03029q4654J34098L874q2888P2795l316p3072J14706K4058j89131K9012
$$ 82217 -20812 -105466 28632 32506 -50382 22413 19097 -53975 60731 84789 -104342 -75330
227g5330J58988p9738m7006J10260o0825p5231J30815J830j32697N4327M1092
$$ -75330 83658 3920 -43086 67174 6349 -68882 61933 63763 -68934 -14607 26485
238B6485q8146P5066Q3269j33752j4161J24533p8828o3036J30360l0720j25290
$$ 26485 -61661 13405 96674 -37078 -51239 73294 -5534 -68570 61790 31070 -94220
249i4220R7717O1368r6994M3880N3127j13940J5676J04531r0594l9812J16530
$$ -94220 3497 64865 -32129 11751 64878 -49062 -33386 71145 -19449 -59261 57269
260E7269n2151p7990J35176J3065j42728N1866P1924j03868J3183Q7049q2588
$$ 57269 5118 -72872 62304 75369 -67359 -15493 56431 -47437 -34254 52795 -29793
271b9793r158J16772o4159p8008R9363j8620r5799R7465L4016j32745N4743J18170
$$ -29793 -38951 77821 13662 -64346 35017 16397 -79402 18063 52079 -80666 -25923 92247
283I2247j00111m1575R0027n7678m4096J05874l3934q9054J00330K5107j05411
$$ 92247 -7864 -49439 40588 -17090 -61186 44688 10754 -78300 22030 47137 -58274
294e8274O6539O0715j31702N938J19577q1626n4613J16863j9878p6404Q6561O70
$$ -58274 8265 68980 -62722 -56784 62793 -18833 -73446 43417 23539 -52865 33696 34366
306C4366r9243P2051M0865j19492L8179J07064r1038k3171J15779o2928q4110
$$ 34366 -64877 7174 48039 -71453 -33274 73790 -17248 -40419 75360 12432 -71678
317g1678J06842J333j03250O9648M5342r0612M8840O9619j10346n082J06732p8944
$$ -71678 35164 36497 -66753 2895 48237 -42375 6465 76084 -34262 -39344 67388 -11556
329a1556o2129J16257j4878r1287R1045L0437j09089M5536O3967j01662K174Q9258
$$ -11556 -73685 42572 27694 -63593 27452 57889 -51200 -5664 58303 -43359 -41185 48073
341D8073p3111k3608J13476m6791q3811J02196R387j15338N5265O0865r5238K2403
$$ 48073 -25038 -48646 64830 18039 -65772 36424 45811 -69527 -14262 46603 -48635 -26232
353b6232Q9365p7714k1850R5383n7870o6219R7034j3512r3346Q8626M8920j08881
$$ -26232 63133 -14581 -36431 58952 1082 -65137 31897 18385 -74961 13665 62585 -46296
365d6296L1467Q3076r0924k0462Q9845n9559m7646J03507j6900p9089Q5588J9769
$$ -46296 -14829 68247 -22677 -43139 46706 -12853 -60499 43008 26108 -52981 32607 52376
377E2376j05643N0199O2186j06506M504J04819o5958m3049J01469k7000p6766
$$ 52376 -53267 -3068 59118 -47388 -42884 61935 -4023 -47072 54397 27397 -49369
388d9369P8308J679r6022O4059N2565r7705K7651R0717q4887k9889R9115n2119
$$ -49369 28939 30618 -65404 -1345 51220 -46485 -18834 71883 -13004 -42893 56222 4103
400D103p4634R2947M801q5381O9717M1563r2831L2396O7733r4065j3351R4808
$$ 4103 -70531 22416 27217 -58164 11553 53116 -39715 -7319 60414 -33651 -47002 47806
412D7806n6521m8776J01796j3297q2684P7970K5935j02162L4545O2579q3393N854
$$ 47806 -8715 -57491 44305 31008 -51676 26294 52229 -49933 -15388 47191 -36202 -30348
424c0348Q7183o2830l2176R6474l4890p9853P8702J1698r1928N4869N6583q4608
$$ -30348 56835 -5995 -38171 58303 23413 -56440 22262 33960 -57968 -3099 53484 -31124
436c1124J6080P9287p2311k9809Q2997m5566n9855Q9269J707q2137O5667M2795
$$ -31124 -15044 64243 -8068 -37877 45120 -446 -60301 28968 30675 -51462 14205 57000
448E7000r1128K1055O3393q2385j4525Q8166m5606m6353Q7572j2647p4000O8204
$$ 57000 -34128 -13073 50320 -32065 -46590 41576 -4030 -50383 37189 24542 -49458 18746
460A8746J7477r6961L7551O4864p9837J097Q5430n4642l7561Q3799l0116p1717
$$ 18746 36223 -60738 -23187 41677 -38160 -37063 48367 -6275 -43836 39963 9847 -61870
472f1870P1768J0900q0510N5489N2410q3378J4347P5413p1410l1442Q1872l7598
$$ -61870 9898 20798 -59712 -4223 48187 -35191 -20844 54569 -16841 -48283 33589 -4009
484d009n7440Q3516O361p6087N6143L4884q4633K1623N9128p7113j0155Q7683
$$ -4009 -61449 22067 28428 -47659 8484 43368 -41265 -19642 39486 -37627 -47782 39901
496C9901m2465m4328Q2120j1840p4759O0582K2715q4229L1403N6924o6310Q309
$$ 39901 -2564 -46892 35228 23388 -51371 9211 31926 -52303 -20900 36024 -30286 -21977
508b1977P5317o1078l7652Q2493k3620o9985O1638J3585o8085N3547M5158q1872
$$ -21977 53340 -7738 -45390 37103 13483 -56502 5136 18721 -49364 4183 49341 -32531
520c2531O422O8836n9416k6464O9107l7351m5717Q4041O272p5722M5568L1415
$$ -32531 -26109 42727 -16689 -43153 25954 -11397 -57114 26927 33199 -42523 3045 34460
532C4460p5056K3792N6953p1668j2070Q2103l0756l6347O7672k4237o8686O7504
$$ 34460 -40596 -16804 40149 -31519 -43589 38514 7758 -28589 39083 14846 -53840 13664
544A3664K6771q3876K4091N6359n6082Q660O5215o1088l6617P5334k1895n7849
$$ 13664 40435 -43441 -19350 37009 -19073 -10413 54802 -6286 -42903 32431 10536 -47313
556d7313O5193Q362p1404N1742N0738p4344J09N3985n8139j1854P9040l8696n6351
$$ -47313 17880 26242 -45162 6580 57318 -17026 -16917 37068 -21071 -32925 46115 7419 -48932
569d8932P4863J3301o0916L9441J1780p9695L3802O7169o7699j9136P0578l3371
$$ -48932 25931 39232 -21684 17757 29537 -50158 -16356 50813 -16886 -36022 34556 1185
581A185l1752P0797k2404p6267N1640K9862n7610L4875L6895p4460J1210Q1492
$$ 1185 -30567 40230 17826 -58441 -6801 23061 -34549 326 37221 -37239 -26029 55463
593E5463n0136m8176N6463j6954l8799P0078K960p6996M4376M9023o7191K52M8082
$$ 55463 5327 -42849 13614 -3340 -42139 27939 30899 -46097 -1721 47302 -19889 -19637 28445
606B8445n6597j3646P4407l0880m5876O6594k768o7425M7514K7043p8226J4232
$$ 28445 -28152 -41798 32609 1729 -44147 22447 19679 -47746 -232 26811 -51415 -37183
618c7183O0921m4571m758N6479m8130l0301P7683j7840p5507N1603L0520n9389
$$ -37183 23738 -20833 -25591 30888 -17242 -47543 30140 12300 -63207 -11604 18916 -40473
630d0473L1597M4724o4665J6N9966m9587k7752O7957k6792n5594O9116K0311o4356
$$ -40473 -8876 35848 -28817 -28801 31165 -18422 -46174 21783 -5009 -60603 8513 28824 -35532
643c5532L2761L0772o8240J4583O0715n9066k1760P7970j9345m5509N5264k861
$$ -35532 -2771 28001 -40239 -25656 35059 -24007 -45767 32203 12858 -32651 22613 19752
655A9752n5369M8150J5107q0100L1760P3258n6485k3499N8316l2892l3042O0828
$$ 19752 -35617 12533 27640 -52460 -20700 52558 -3927 -27426 30890 -2002 -35044 25784
667B5784j6956o1447M9696J9038n6369M3901M3406q2351j1075P5336k9649l5855
$$ 25784 8828 -52619 -2923 16115 -40254 3647 47053 -35298 -46373 28963 -686 -36541
679c6541M5719k3123l2450P5917P834q0095K9450M4526n6713N026M6226n3177
$$ -36541 9178 -13945 -46395 29522 37356 -42739 -13289 31237 -25476 -20450 25776 -27401
691b7401r371P8533k5839n3921N3204K77n8353M3831K8578o8108J4237N6537l9462
$$ -27401 -36772 41761 15922 -37999 15205 15482 -42871 960 29538 -38570 -24333 32204 -7258
704g258N0N2494n9612m3982Q2940J1221o4528K6509J5833m2876M8019M1981q0266
$$ -7258 -7208 45286 -14326 -58308 24632 35853 -28675 -2166 13667 -29209 18810 60791 -19475
717a9475j6643O2174l2662j9584O5526k6065o3629N5904L0875m8677K0612O341
$$ -19475 -36118 26056 -6606 -26190 39336 13271 -50358 5546 36421 -12256 8356 14697
729A4697p2922L0723Q2641n3809m5227N7185m179k7893M7564k0925o8364N3793
$$ 14697 -58225 -27502 55139 1330 -43897 13288 9109 -18784 28780 7855 -60509 -6716
741f716M3680o0631Q963M6657n0572n044O5851m0489n5172N2981P345l6282M6644
$$ -6716 36964 -23667 -14704 31953 -18619 -23663 42188 1699 -53473 -492 6853 -29429 17215
754A7215M095p3001L2883O2023n3362k1238L8855l9017r836P9771j6200o8640
$$ 17215 21310 -51691 -18808 43215 -10147 -31385 7470 -31547 -41383 38388 22188 -46452
766d6452M1902K5503m6043K6707K4039o3561O826N9615l3666r752N9092l9831
$$ -46452 -4550 20953 -25090 1617 25656 -37905 -31079 28536 -5130 -14882 44210 4379
778D379n8658O3639K3138n9387J6142K4027l9949K8637M3711o0126j6645N8582
$$ 4379 -54279 9360 32498 -26889 -10747 13280 -26669 1968 45679 -14447 -31092 27490
790B7490l0517l8355N9420j100n4229M3671K7637n6551J3862L6458m9271r56N1632
$$ 27490 -3027 -41382 18038 16938 -37291 6380 34017 -22534 -8672 27786 -21485 -22441 29191
803B9191m2982k6548O8130n280n1342L7564O066n6652L5030L9002o1088l592N6619
$$ 29191 -13791 -40339 27791 22511 -28831 8733 14799 -41853 -6823 32179 -28909 -32501 24118
816B4118k7452j5090M8202l1164m2361N4007K257n6377M2026L7860n6864M355
$$ 24118 -3334 -18424 29778 -1386 -43747 10260 12517 -43860 -1834 36026 -20838 -16483
828a6483M6110l9195j0402M8520l6549l6374N9808N629m3971L8933J1216o3347
$$ -16483 29627 -9568 -19970 28550 -7999 -44373 15435 21064 -22907 16026 27242 -36105
840c6105K2400M9991m7218j5017M2289k9918j2217O3038j6486n6362L8119J4211
$$ -36105 -13705 36286 -10932 -25949 16340 -13578 -25795 37243 20757 -35605 2514 16725
852A6725m8656K7263L1437n2972O178N3540l4831j9854M9628k5474m5056M7481
$$ 16725 -31931 -4668 26769 -26203 -20025 33515 -1316 -21170 28458 2984 -42072 5409
864E409J0233m5189L4126K5113n2385J4192M4156m8183j7465N0890k2348k8789
$$ 5409 15642 -29547 4579 29692 -22693 -8501 35655 -12528 -29993 20897 -1451 -30240
876c0240N0431n217m5142M4743K0177o0882R050L8637l9017L010M8789l8869k8508
$$ -30240 20191 14974 -30168 14575 34752 -26130 -17080 21557 -17460 -14450 34339 -4530 -33038
889c3038N8189k892m2889L2130l052n3704M0728M6174n3131r004M4032k8552j1545
$$ -33038 25151 22259 -20630 11500 8448 -45256 -4528 41646 -11485 -20489 23543 -5009 -16554
902a6554M7479l1105m4724M9818J2359m2672L4185K1519n6153J2246M5666m5543
$$ -16554 30925 -180 -44904 4914 17273 -25399 8786 30305 -25848 -13602 32064 -13479
914a3479j7070N0358k1178k8850N0596j923m3869L5975J3793n6092J9096M0545
$$ -13479 -30549 19809 -1369 -30219 20377 18454 -25415 10560 24353 -31739 -12643 27902
926B7902m5537k917N2158k8082k6397M8119j1791m3673L9316R465m9642K6957
$$ 27902 -17635 -20552 31606 3524 -22873 25246 13455 -30218 9098 18563 -31079 -4122
938d122L4863m3632P536M3102m4988k3668N4732j3474m0443L9477N794l9873L7015
$$ -4122 30741 -12891 -5355 37747 -7241 -30909 23823 10349 -30094 9383 15177 -24696 12319
951A2319K4653n5941M262L9030l9670o766N1352k8003l2262N3734J404m8857K9955
$$ 12319 36972 -18969 -14707 24323 -15347 -22113 29239 1236 -31026 22708 24112 -24745 5210
964E210J5496n0099J8546L6563m3319R82N0658l2929k7206M8410j3195m3315M1258
$$ 5210 20706 -29393 -10847 25716 -17603 -16621 34037 1108 -26098 22312 9117 -34198 7060
977G060J0583n0440K9250L8028m5904k44M0913l8298j7938M9264k0176l5406M9983
$$ 7060 17643 -32797 -3547 34481 -11423 -11667 29246 -9052 -26990 22274 2098 -33308 16675
990A6675O298m7415L2207K3895n3610P917M2274m2343j1458N2664j9145k9221
$$ 16675 22973 -24442 7765 31660 -21950 -14033 28241 -14102 -25560 27104 7959 -21262
1002b1262M4771p786m5357L8058J5948n4600J7815M1699m0294j774M6665l3222
$$ -21262 23509 15723 -29634 8424 24372 -30228 -12413 29286 -11008 -12782 33883 661
1014F61k7855M8244j1340m3303L8854J3739m3547K6944L0101m8659K999M3535
$$ 661 -27194 21050 9710 -33593 5261 19000 -24547 2397 32498 -16161 -13162 30373
1026C0373l9520k2802M9926j2623l3863M4878O002m7081K8156K3497n0538P811
$$ 30373 -9147 -31949 17977 5354 -28509 16369 22371 -24710 3446 26943 -23595 -15784
1038a5784L9513l8567p760N2348k2141l3424M5629k530m7414L1233J9204m6940
$$ -15784 23729 -14838 -22598 29750 7609 -25815 19814 17284 -30130 1103 20307 -26633
1050b6633J8988L8969m1400m178M6556l1015k8752M5307j0132m0908M2052J5728
$$ -26633 -7645 31324 -10076 -14254 32302 1287 -27465 17842 7710 -33198 8854 24582
1062B4582m8294K3196L3415m6336k600M0172l4738j8056N0149j4830l4704M5315
$$ 24582 -23712 -516 32899 -13437 -16037 24135 -10603 -28659 21490 6660 -28044 17271
1074A7271O872m9508K5594K4344n0215Q092M3350l4803j1920M9134k0067l1521
$$ 17271 24143 -25365 229 24573 -25642 -17550 25800 -9003 -20923 28211 8144 -23377
1086b3377M2122m774m6214L3031K1691m5900J6962L9064m0360o972M4712k9757
$$ -23377 18745 13971 -32243 788 22479 -23421 -6459 32605 -7755 -14727 29985 228
1098B28k8794M4932n461l8855L7606J5419m2654K1475K8313m7413j906M4146l1259
$$ 228 -28566 16366 10905 -27950 9656 25075 -17579 3896 32209 -15204 -17110 27036 -4223
1111d223j9985M7362j0370l3206M0217N880m8277K2200K4467m4063P970M1304
$$ -4223 -24208 23154 12784 -20422 19795 25675 -22602 -402 24065 -19998 -12028 29276
1123B9276l4220j1598M6857k0982l4084L9329k362m3042L2103K2116m3410J3996
$$ 29276 -4944 -16542 30315 9333 -24751 14578 12216 -30826 1277 23393 -20017 -6021
1135f021L6748l8259p811L9911k9233k5851M6425m541l8807L6771J5402m4049
$$ -6021 30727 -7532 -15343 24568 -4665 -30516 15909 11368 -27439 9332 24734 -19315
1147a9315J8491K8122m4396l569M1315k6843j5431M5745j4358l4869M0280O522
$$ -19315 -824 27298 -17098 -20667 20648 -6195 -21626 24119 9761 -25108 15172 21694
1159B1694m7675K1012K4432m0246R455M1274l3248j4416M3681j8998l1458L7802
$$ 21694 -25981 -4969 19463 -20783 -11328 29946 -3302 -17718 25963 6965 -24493 13309
1171A3309l475m0185L4574K2295m2780J1586L4754l8520r109M0297k6181k6244
$$ 13309 9834 -30351 4223 26518 -16262 -4676 30078 -8442 -17551 22746 -3435 -29679
1183b9679M2732j746l2990L3254R228m4944J9779K9370m3509m589M0939k3805
$$ -29679 13053 11307 -21683 11571 20799 -24145 -4366 25004 -18505 -23094 17845 -5960
1195e960j4321M3564j3748l5836L4984P438m1834K0964K1878l8967J2088M0904
$$ -5960 -20281 23283 9535 -26301 8683 16121 -25713 -4749 17129 -21838 -9750 31154
1207C1154l3417j6675L9592j8285k8121L8594j792m0734L0578K5306l7668Q861
$$ 31154 -2263 -18938 20654 2369 -25752 12842 11050 -29684 894 26200 -11468 -2607
1219b607K5745l8943k917M3406k6651k7137M3007m37l1959L2600Q063m6527J7468
$$ -2607 23138 -15805 -18722 24684 -1967 -29104 13903 13466 -18493 14107 22170 -24357 -6889
1232f889K9839l7551m68L6745k7372j2221M6293j5391l9240L2041O545l7549K5478
$$ -6889 22950 -14601 -15069 21676 -5696 -17917 28376 12985 -26255 5786 12331 -25218 260
1245B60K1674m3178R413M1982k9948j6663L3167k1363k3384M3777j521m0393K9742
$$ 260 21934 -21244 -11831 30151 203 -16460 16707 -4656 -28040 15737 14216 -26177 3565
1258C565K1657l8755J2274K9202m1518r590M3218j6739k0106L5826r919l0801
$$ 3565 25222 -13533 -1259 27943 -13575 -23165 20053 3314 -16792 19034 9115 -21686
1270b1686L8856R370n0406J3050K9904l2294L872L6190l0803j6870M4547j1361
$$ -21686 17170 26540 -23866 -10816 19088 -13206 -9334 26856 -3947 -20817 23730 12369
1282A2369l5702K9087L085l5595K8318K4158m0571O495L4619l2278j1304L8874
$$ 12369 -23333 5754 8839 -26756 1562 25720 -14851 -8356 26263 -6015 -17319 21555
1294B1555k3545l0330M2262P534l5183K2395J3555l7520J6085K7365m3076o117
$$ 21555 -1990 -32320 9942 17476 -17707 4688 18243 -19277 -3192 24173 -18903 -25020
1306b5020M4483j9899k1391M0647o437l6876L1037J1075m1539J5982K6662l6094
$$ -25020 19463 -436 -21827 18820 12383 -24493 6544 17619 -23920 -7938 18724 -17370
1318a7370O050M0660k9597j9719L9969j3459l1453L4311L050m0116K9479K8681
$$ -17370 -11320 29340 -257 -19976 19993 6534 -24919 9392 12442 -27674 1805 30486
1330C0486m1664M78L4131k8342j1642L4720k2128k2820M4380M11l9391K8294J7808
$$ 30486 -11178 -10700 23431 -4911 -16553 18167 -3961 -26781 17599 18010 -21381 6913 24721
1343B4721m3576R480L2721l4670q801L9244j6732j6612L7580j3392l7923L5083
$$ 24721 -18855 -9375 23346 -11324 -20125 19119 2387 -14225 23355 9963 -27960 7123
1355G123J4001m3967J2381K7876l1791O076L8097l3065k3873M0748o045l2339
$$ 7123 21124 -22843 -10462 17414 -14377 -8301 29796 -3269 -27142 13606 7561 -24778
1367b4778K7918M617l3808K8617K4000m0647L188L1115l3575j0982M6122j6492
$$ -24778 3140 7757 -26051 2566 26566 -14081 -10893 20222 -13353 -24335 21787 5295
1379E295l4304L5655J1674k9561K0420O586m1940J7206L5942l6311r892L9397
$$ 5295 -29009 6646 18320 -11241 9179 15765 -26175 -8969 26973 -9338 -19230 20167
1391B0167j7839j9284M0923q691m2453K6583J7090l3391J5822K4599l7702K638
$$ 20167 2328 -16956 23967 15276 -27177 -594 16496 -16895 -1073 23526 -14176 -11538
1403a1538M1268k4953k3137L0676j4096k4503M2750O545m8266J8911L2642l1358
$$ -11538 29730 4777 -18360 12316 -1780 -26283 16467 23012 -25254 -6343 26299 -5059
1415e059k532K3315l2109p738M3593j4007k7697L4060q78l4849K9199J8609m6834
$$ -5059 -7591 15724 -16385 -24123 19470 5463 -22234 11826 10948 -23901 5298 23907 -22927
1428b2927L129L5124k2654k862L3593k4850k3163M0953k177l6963K2641J1117
$$ -22927 -19798 15326 -7328 -10190 23403 -1447 -24610 16343 14166 -22797 -156 10961
1440A0961l2529K1188K8702l7916l739L6711k3876k0339L5159q267l0834L1634
$$ 10961 -21568 -380 28322 -9594 -13333 23378 -498 -20837 14322 6055 -24779 6855
1452F855J1419l1358J8765J5053l8838P234L6098l2075j7527M0468p607k3813
$$ 6855 18274 -13084 5681 20734 -18104 -10870 25228 -6847 -24374 16094 8487 -15326
1464a5326L0925r00l6653K1816J7521l4739Q784K6852k9921r68L9335k1663k7332
$$ -15326 15599 14699 -21954 -138 17383 -17356 -8572 18280 -11641 -12609 26726 5063 -22269
1477b2269L3251l875l2417K8703J4298l6913J3489K8886k8729k945K7885k6748
$$ -22269 10982 7107 -25310 3393 17691 -19222 -5733 23153 -5576 -8521 19364 -7384
1489g384j4534L7339j0848k8064L6062Q371l9626J6514K4524l3037r93K6797k5132
$$ -7384 -21918 15421 4573 -23491 12571 20942 -18684 -2170 22354 -10683 -11676 15121 -10011
1502a0011o440L8412j4043k5746L1410j295l4550K4659J6787l9120Q419L3916
$$ -10011 -16451 21961 7918 -17828 13582 12287 -22263 2396 19183 -19937 -11518 22398
1514B2398k4831p749L1122j9950k0660L2353n387l0603K6546J2603l1617J6639
$$ 22398 -2433 -10182 20940 990 -19670 12683 7296 -23307 3239 15842 -15775 864
1526H64K3262l6054l420L4652k1880j9430L2007n219k3224L0432N300l4524J6333
$$ 864 24126 -11928 -15348 19304 -2576 -22006 10001 4782 -18442 11990 17290 -17234 -901
1539i01J7241l4028N842L2353k7207j2181L7000r676k3274K7707k663l4430K2247
$$ -901 16340 -17688 -11846 20507 -6700 -18881 18119 8443 -14831 12876 10213 -24217 -1970
1552a970J8864l0017Q691K4355k8887j542L5388k1687k6251L0351j031k5521K8566
$$ -1970 16894 -13123 -4432 19923 -8964 -10506 24882 3195 -23056 7295 6264 -19257 9309
1565I309J0058l5543J3913K5576l0470m048K6396k3058j0901L7327r613k8189
$$ 9309 19367 -16176 -2263 23313 -7157 -11205 15191 -7867 -18768 18559 8946 -19243
1577a9243K9976O675l4705J5560J7840l3776M384L2480k2760j0443L1563j4148
$$ -19243 10733 17408 -17297 -1737 16103 -17673 -13289 19191 -3569 -14012 17551 3403
1589C403k1932L0156l069l4177K3722J8176l1912J0919K7519k8908q094L1283
$$ 3403 -18529 11627 8558 -25619 -1897 16279 -15633 -4714 22805 -6103 -14197 17086
1601A7086j7622j9999L0667m517k6559K8057J2254l2198J2373J9283l3272N54
$$ 17086 -536 -20535 10132 5615 -20944 7113 19367 -12831 -458 18825 -14447 -13893
1613a3893L3728k1774j8188L3660l796k3290K5538J817l3432J7260J8614l0228
$$ -13893 19835 -1939 -20127 13533 9737 -13553 11985 13802 -19630 -2370 16244 -13984
1625a3984N766K9328k5334r085L4649j5014k6496K7415J666k9177K0886J5740
$$ -13984 -8218 21110 -4224 -13309 21340 6326 -20170 7245 8911 -20266 620 16360
1637A6360k9569J0555K5098l0210o993L0979j8714j9398L2891k982k7284K6837
$$ 16360 -13209 -2654 22444 -7766 -14759 16220 -2494 -21892 10999 8017 -19267 7570
1649G570J1278l3924J1084K1312k9929j543L0138j9866j0936L3886j0770k7275
$$ 7570 18848 -15076 -3992 17320 -12609 -14152 15986 -3880 -14816 19070 8300 -18975
1661a8975K8478N562l4531J5092J9991k9410O650L0333k4553j1406L0166j4378
$$ -18975 9503 15065 -19466 -4374 15617 -13793 -7143 23190 -1363 -12769 17397 3019
1673C019k2456K9554q76l0831K3909J8631l1249O818K4208k8004p282L0388j6712
$$ 3019 -19437 10117 9241 -21590 2319 20950 -10299 -3481 20727 -7277 -14559 15829 -883
1686h83j8988L1737j055k6188K3741Q416l2699J2221K1612l1499j514L2999j7426
$$ -883 -19871 11866 10811 -15377 8364 16780 -15919 -3698 17914 -13585 -15099 17900 474
1699D74j5148L0518p496k6275K4503M358l1426J6591K0127k8375N046K8913k4357
$$ 474 -14674 15844 8348 -17927 6576 10934 -20492 -3901 16226 -12149 -7103 21810 -2547
1712b547j2165L0605j3385k4152K7839M015k7405K0767J5536l0202P087K3657
$$ -2547 -14712 15893 2508 -21644 6195 10210 -17195 3572 19108 -11094 -4007 19650
1724A9650k8003p556L0689j5110j7525L1708j794k7909K2085J0619l2542R213
$$ 19650 -8353 -15909 14780 -330 -17855 13853 12059 -15850 6235 16854 -15688 -6475
1736f475K1463k6011k33L0014j8816j3886L0963q804k7906K3753O536k9294J6182
$$ -6475 14988 -11023 -11256 18758 -58 -13944 17019 8215 -19691 4062 10598 -18696 -2514
1749b514J9893k7303L043K7243k3119j2674K8061j2052k1711K8462L056k7622
$$ -2514 17379 -9924 -6881 20362 -2757 -15431 12630 578 -21133 7329 10385 -17237
1761a7237K0067J5522l0040M113K3009k5208o346K9405j3266j6612K9060j017
$$ -17237 2830 18352 -11688 -7575 15434 -9774 -16120 13285 19 -16593 12467 11450
1773A1450k6444K0074Q388l0476J0439K2802k4753k309K9011j5392j4379K5916
$$ 11450 -14994 5080 13468 -17008 -6569 16233 -8520 -10829 18182 2790 -11589 14327
1785A4327q112k4798K3151P061k8142J5080J9992k5563J532K4721k2799j2778
$$ 14327 6215 -18583 4568 11629 -16513 -1433 18559 -7004 -5472 19249 -3550 -16328
1797a6328K7863q626k0459K5175L822k4969J7815J3577k9903L773K2464k2779
$$ -16328 11535 2909 -17550 7625 11447 -13522 4293 17870 -12033 -8260 14204 -8575
1809h575n844K9318j2711j7458K7315j099k5864J7799P977k7920J0310K2565k3474
$$ -8575 -14419 14899 2188 -15270 12045 10946 -14918 2881 10858 -17062 -6752 15813 -7661
1822g661j843K7088j6872j4650K6027p083k4741K2275R047k5392J4371J7430k5778
$$ -7661 -9504 17584 712 -13938 12089 5006 -19735 2540 11587 -13805 566 17996 -7782
1835g782J643K3893k1289j2117K6182q050j7589K6033K315k6993J6070J4721k7671
$$ -7782 -6139 17754 -3535 -15652 10530 2480 -15109 10924 13239 -13754 2316 17037 -10634
1848a0634K735K0167k0403m107K9042j2487j7987K4871k539k4221J8210Q643k7818
$$ -10634 -7899 12268 -8135 -12242 16800 4313 -13674 11197 8658 -15563 2647 11290 -16528
1861a6528J0171K2590k0691k745K3075j6733j4008K5511o449k2820K1146Q303
$$ -16528 -6357 16233 -4458 -7203 15872 -861 -14869 10642 4193 -18627 2519 10822
1873A0822k3249J3934J5862k6656r7K3475j8415j1640K4912p414j6367K4707K040
$$ 10822 -12427 1507 17369 -9287 -9384 14091 -4324 -15964 8948 1534 -14833 9874 11914
1886A1914k5450J4207J1565k5358N540K1251k1374m639K8274r838j7640K0676
$$ 11914 -13536 671 12236 -13122 -7582 13669 -7705 -12344 15930 6092 -11548 9128
1898I128k859k2283J8822R324k6029R423K1061k0707j237K2558j8861j4942K5896
$$ 9128 6269 -16014 2808 12132 -13897 -4474 16587 -4120 -5357 17201 -1660 -16602 9294
1911I294l563k1015J9317O703k2182J4268J4761k6888j404K2423j6601q310K4952
$$ 9294 5731 -15284 4033 10736 -11446 2822 17583 -9305 -10709 11714 -4887 -13197 11755
1924A1755r318j7455K5476K815k7182J2271J1657k3076N998K0975j9612n272K5299
$$ 11755 2437 -15018 10458 13273 -13909 -1638 10019 -13057 -7059 13916 -5696 -10968 14331
1937A4331j1040j5462K1556m890k4006J9576J2640k3840O939J8850j9473j429
$$ 14331 3291 -12171 9385 4495 -19511 65 12705 -11135 -4196 14654 -4819 -6248
1949f248K1882j8189j4012K4287k239j8712K0569N101k3904J2520J6084k5051
$$ -6248 15634 -2555 -16567 7720 5481 -13231 7338 12439 -11465 1055 17139 -7912
1961g912j759K1005j5251p761K5583p129j9659K0534L098k2966J2507R173k4313
$$ -7912 -9671 11334 -3917 -11678 13905 6776 -12883 7651 10749 -12217 290 9463 -14850
1974a4850P715K4410j9756q164K3729j0293j6130K0293k543k1590J7675J0787
$$ -14850 -7135 17275 -2481 -10645 13084 2791 -13339 6954 4411 -17179 496 11283
1986A1283k1922R243J7500k3407k550K3151j5472j4579K3686k774j6738J9917
$$ 11283 -10639 -1396 16104 -7303 -9853 13298 -2174 -16753 6933 4159 -12579 7338
1998G338N661k5319J0561J5803k2921p15K0692j5738n692K5597r258j9535K1304
$$ 7338 12999 -12320 -1759 14044 -8877 -9592 11100 -4638 -10330 15267 6009 -13526 7778
2011G778K769k4564J2621J2920k1675M825K1024j7262n663K0989j3498j5706K3381
$$ 7778 10547 -14017 -1396 11524 -10151 -5326 15698 -1564 -7227 13762 264 -15442 7939
2024G939j390k3336J7111J3225k1242O015J5255k0863l061K2049j4590j3164K3230
$$ 7939 6549 -16787 324 13549 -7693 -1678 13577 -7286 -10347 11702 -2888 -16052 7178
2037G178j407j6967J7986M891k4709R467J5916k1828k08K1558j4715q071K4303
$$ 7178 5771 -11196 6790 11681 -13028 -3561 12355 -9473 -9681 11877 -2838 -10909 13394
2050A3394n972j9894J6113K153j9739J4785J1015k3859N570K3796j7259r065J9871
$$ 13394 7422 -12472 3641 5794 -13945 840 11855 -12004 -6434 17362 103 -8962 10909
2063A0909j0843j4827K1041R37k0135J5405J0302k0956P885J6197k2847n693K2932
$$ 10909 66 -14761 6280 7217 -12918 2487 12789 -8167 -282 15915 -6932 -12625 10307
2076A0307j0264j1091K1110m201j8125J9615O424k5311N703J4689j7563K564J9595
$$ 10307 43 -11048 10062 5861 -12264 7351 13775 -11536 -5833 8856 -8707 -6143 13452
2089A3452j6166q018K3256o387j9635J7085J971k1470J3749J5296j9699J267J7382
$$ 13452 -2714 -10732 12524 6137 -13498 3587 5558 -15912 -2163 13133 -6566 -5299 12083
2102A2083j5636m836K0226j3129j6122K2405L449j9200J3813R105k1041N832J5944
$$ 12083 -3553 -8389 11837 -1292 -17414 4991 8440 -10760 3053 12158 -8883 -3051 12893
2115A2893j9057n050K0526j0222r445K2083l141j9712J5261N703k1077Q991J3672
$$ 12893 -6164 -11214 9312 -910 -10355 11728 8587 -11125 4136 9839 -11238 -2247 11425
2128A1425k0038J078K2241j2273j0901J8195o257j5736J6714K316j9760J2949
$$ 11425 -8613 -7535 14706 2433 -8468 9727 3470 -12266 4448 6764 -12996 -47
2140d7J2670j9002L485J6945j7778q425K0402p658j3567J8039R73j6933J5256
$$ -47 12623 -6379 -2894 14051 -3727 -12152 8250 592 -12975 5064 6037 -10896 4360
2153D360P832k2291M409J5691j7442l094K0469j0248j0175K0618l469j8407J4686
$$ 4360 12192 -10099 -5690 10001 -7441 -10535 9934 -314 -10489 10129 6660 -11747 2939
2166B939N573k0739P949J4338j6402J786J8501j4300q703J9553p049j7293J7449
$$ 2939 8512 -12227 -4278 10060 -6342 -4556 13945 -355 -9058 10495 3446 -13847 3602
2179C602L699j7719J1696J2415j8891J552J5332j5786n807J9021r376j2977K1357
$$ 3602 7301 -10418 1278 13693 -5198 -3646 11686 -4100 -9907 9114 -262 -13239 8118
2192H118J504j8484J1417P553j9594N567J3882j7008k590J9685q276r730J7478
$$ 8118 9622 -8862 2555 10108 -9486 -3919 9963 -7045 -9635 10050 1774 -7956 9522
2205I522m592j7617J4866N156j9486Q841J4578j7219P93J8436j3107j0336J6952
$$ 9522 4930 -12687 2179 7335 -12151 -3310 11268 -5951 -5158 13278 171 -10165 6787
2218F787n746j3785J7194K756j7596J1966J1533j9341K002J5969j6224o750J9466
$$ 6787 1041 -12744 4450 7206 -10390 1576 13109 -6232 -4230 11739 -4485 -11235 8231
2231H231o033j1642J7143l23j6297J2904O518k1202M774J5599j4912j315J8651
$$ 8231 2198 -9444 7699 7376 -8921 3983 10501 -10701 -5927 9672 -5240 -6555 12096
2244A2096j1255j0741J9515l760j8681J3208N609j6701R648J2703j7541N41J7315
$$ 12096 841 -9900 9615 5855 -12826 382 5991 -10710 -1062 11641 -5900 -5359 11956
2257A1956j3607r206J7741o058j4389J7997M399j7731R966J0060j8499K102J4713
$$ 11956 -1651 -10857 6884 826 -13563 4434 8833 -8898 1068 11128 -7371 -5269 9444
2270I444j5535m358J9428p478j2066J8909P0j8449J0863O831j8237O125J5275
$$ 9444 -6091 -10449 8979 1501 -10565 8344 8414 -10035 828 7659 -10578 -4453 10822
2283A0822j5978j990J9599j0051j0565J5865m449j6078J5777N892j8716Q756J4300
$$ 10822 -5156 -7146 12453 2402 -8163 7702 3253 -12825 2952 8844 -9872 -1116 13184
2296A3184j6464j175J6099j3641q951J7977m464j3374J6773K874j6903J0175R765
$$ 13184 -3280 -4455 11644 -1997 -10948 7029 2565 -10809 5964 8838 -8065 2110 11875
2309A1875k0343J742J6655j3937n311J9059p250j1243J6553q18j8156J1351P371
$$ 11875 -8468 -6726 9929 -4008 -9319 9740 2490 -8753 7800 6982 -11174 177 7548
2322G548j8166O190J5239j5393r99J7873j2165j1813J7883k366j7027J3797O777
$$ 7548 -10618 -4428 10811 -4582 -5581 12292 127 -11686 6197 3831 -13196 601 7378
2335G378j5876R223J2132j8458n24J6493j2750q733J8528m323j3235J7289L411
$$ 7378 -8498 725 12857 -5601 -6125 10368 -2382 -11115 7413 3090 -10145 7144 10555
2348A0555j8466R180R274j8208K084J5595j3568l811J9393p664j2654J5980o40
$$ 10555 -7911 1269 10543 -7665 -5581 10014 -3554 -7365 12028 4364 -8290 7690 7050
2361G050j7944J1280Q115j7955N983J6027j4667l810J6486j0262j0808J6231l067
$$ 7050 -10894 386 8501 -9454 -3471 12556 -2111 -5921 10565 303 -10505 5726 2659
2374B659j5515J5150P280j7373O652J2176j6905j398J5491j2191q342J8853l226
$$ 2659 -12856 2294 9574 -7799 -1147 11029 -5876 -7274 8217 -3974 -12316 6537 3311
2387C311j3253J4776L221j8111Q966R457j8076K080J6463j1404n249J8047p106
$$ 3311 -9942 4834 8055 -10056 -1090 8367 -9709 -7629 8834 -2570 -7819 10228 3122
2400C122j2988J5546J4j7459J1070Q692j5937N187J5284j4820l893J6624j0227
$$ 3122 -9866 5680 5694 -11765 -695 7997 -7940 -2753 12531 -2289 -6182 10442 215
2413B15j1737J6548p03j4963J4234O368j6938O590J1781j7199k101J6035j0203
$$ 215 -11522 5026 4323 -10640 3594 9962 -6976 -386 11395 -5804 -7905 8130 -2073
2426b073p662J7723l577j3685J5286K827j8579P297J0127j5746K474J5766j2265
$$ -2073 -9735 7988 4411 -9274 6012 8839 -9740 -2443 7684 -8062 -5588 10178 -2087
2439b087n082J7411o714j3638J4054N43j6134J1558R112j5782M499J4262j4491
$$ -2087 -7169 10242 3528 -10110 3944 4487 -11647 -89 9023 -6759 -2260 12002 -2489
2452b489m257J4998r219j0144J6484o39j4350J3249P015j6940N508J0254j5786
$$ -2489 -6746 8252 -967 -11111 5373 4734 -9616 3633 10648 -6292 -784 9470 -6316
2465f316j092J6326r812p748J6885k681j3080J2903J734j7219P981J0916j5644
$$ -6316 -7408 8918 -894 -8642 8243 5562 -7518 5385 7119 -10100 -2119 8797 -6847
2478f847J780J5671j1002n344J5233p257j3121J4786P86j5090J1121Q673j5592
$$ -6847 -5067 10604 -398 -5742 9491 2234 -10887 3899 4685 -10405 716 9389 -6203
2491f203M281J3555j4743m874J5035q313r484J6967j130j3780J2667N423j6663
$$ -6203 -1922 11633 -3110 -7984 7051 -1262 -10746 6221 5091 -8689 3978 9401 -7262
2504g262N574J0198j5632o09J6946r829o813J6227m518j2896J2870K550j6740
$$ -7262 -1688 8510 -7122 -7731 9215 -614 -7427 8800 4282 -8614 4256 6806 -9934
2517i934P444R721j2949L230J4180j3696n397J6045o200j2735J3076J000j3687
$$ -9934 -2490 7231 -5718 -2488 11692 -2004 -7401 8644 2444 -10291 2785 3785 -9902
2530i902J2035Q259j6406L154J2541j3749l755J4300q487q688J6646m45j3650
$$ -9902 2133 10392 -6014 -2860 9681 -4068 -7823 6477 -2010 -10698 5948 5503 -8147
2543h147J0921M298j6033N715J1029j5260q85J6579q655o141J4528n177j3126
$$ -8147 2774 7072 -8961 -3246 7783 -7477 -8362 8217 -438 -6579 7949 2772 -10354
2556a0354J3240L189j6819Q314J0927j3792K606J3934j2291o344J4483o635j0803
$$ -10354 2886 6075 -10744 -2430 8497 -5295 -2689 11245 -1046 -7390 7093 458 -10345
2569a0345J5086M44j4325J1667Q424j6152L065J0922j3616k924J5813p951q745
$$ -10345 4741 5185 -9140 2527 10951 -5201 -2136 8786 -4830 -7754 8059 108 -8637
2582h637J5803o36j3469J0339L414j6233O533J1561j4325k36J5712r363o996J5066
$$ -8637 7166 6530 -6939 3400 6814 -9419 -2886 8675 -5650 -5886 9826 463 -6533 8533
2596H533n461j4011J2447L396j3836Q583R008j4909K679J4852j3140p345J4723
$$ 8533 3072 -10939 1508 4904 -8932 -349 8659 -6250 -3571 11281 -1859 -9204 5519
2609E519o138r618J4880R08j4285J0809P695j5515K552J0936j3488k268J6323
$$ 5519 -619 -10237 4643 5551 -8734 2075 9770 -5745 -3193 7743 -5745 -8013 8310
2622H310p087r274J5556j609j3824J0920M000j6252N373J2117j2457k42J4612
$$ 8310 1223 -8051 7505 5896 -7928 2992 6992 -9260 -3887 8230 -4227 -4469 10143
2635A0143r932p385J5443n371j4252J3221L897j3970Q932R260j4725J281J3592
$$ 10143 211 -7174 8269 2898 -11354 1867 5764 -8206 726 9986 -4739 -3458 10134
2648A0134j2358o282J4548n926r763J5094J710j4802R243O532j5428L237J1861
$$ 10134 -2224 -8506 6042 116 -9647 5447 7157 -7645 1598 8130 -7298 -4061 7800
2661G800j3379k805J6448o087r214J4058k620j3759J1577M099j6323O377J2891
$$ 7800 -5579 -8384 8064 1977 -7237 6821 4201 -9558 2019 6118 -10205 -3828 9063
2674I063j3046k58J4634j0467p796J4299m154j2675J2685L881j4078R070R567
$$ 9063 -3983 -4241 10393 -74 -7870 6429 2275 -10400 2285 6166 -7912 1158 10725
2687A0725j5292O29J2905j1845n598J4998n508r821J5125J495j5037Q060P219
$$ 10725 -4567 -3938 8967 -2878 -8476 6522 1014 -8807 6318 7813 -7224 836 8055
2700H055j5303L265J1805j2480k297J6677p397j0081J4106j920j4334J0376N725
$$ 8055 -7248 -3983 7822 -4658 -6955 9722 2325 -7756 6350 4430 -9904 472 6197
2713F197j4568N162J1915j2397n22J4226j0953q719J5090l148j2686J2688M228
$$ 6197 -8371 -3209 8706 -3691 -4213 10013 -940 -9659 5431 2283 -10403 2285 6513
2726F513j4077Q338R338j5562lJ2990j0526n100J4988m886r732J4321P87j4762
$$ 6513 -7564 774 10112 -5450 -5453 7537 -2989 -8089 6899 2013 -7719 6602 7389 -7373
2740g373Q284O316j5037L499J3462j1302l937J4976o371q835J3096l371j4262
$$ -7373 911 7227 -7810 -4311 9151 -2151 -6088 8888 2517 -6318 6778 3407 -10855
2753a0855J1728O638j4570N381J1357j2814p20J3416j0376q926J3842k247j0932
$$ -10855 873 7511 -7059 -1678 9679 -3135 -3855 9561 -815 -9741 4101 1854 -9078
2766i078J2685L651j4605P554R016j4921J09J2459j0866m045J5700m559j1150
$$ -9078 3607 7258 -7347 207 9223 -5698 -5589 6870 -3996 -8041 7659 3100 -8050
2779h050J2732J683j4440Q309N837j4160M284J2670j1681k293J4571p927r958
$$ -8050 4682 6365 -8075 234 6071 -8089 -3805 8865 -2816 -5109 9462 1535 -8423
2792h423J3053p42j3472R903O335j2833O057J0501j3786j398J2726q873p831J3853
$$ -8423 4630 3888 -9584 319 6654 -6179 -122 10379 -3407 -4805 7921 -952 -8783 5070
2806E070k422j0928J2793L609j4491O291Q213j4314P78J2511r223m709J4109m410
$$ 5070 2648 -8280 4513 8122 -6369 -78 8135 -6179 -5401 7110 -2113 -6822 7287 2877
2820B877r660J2152k48j5150R179P805j3965L508J2107j0492k937J2818p012r208
$$ 2877 -6783 5369 5121 -10029 -850 6955 -7010 -3502 8605 -1887 -4824 7994 982 -8226
2834h226J2316j547j1840J1249N419j3701N366J0074j2596j949J2590q919p337
$$ -8226 4090 2543 -9297 1952 7371 -6330 -964 9110 -3486 -5435 7155 -1764 -9101
2847i101J4157j646j0555J1344K825j4008O122P995j4049J380J3206r234m409
$$ -9101 5056 3410 -7145 4199 7024 -6984 -862 7133 -6916 -5536 7670 -1564 -5973
2860e973J4187m783j0666J1135J061j3291P905O679j2750M900J1960j2060l624
$$ -5973 8214 3431 -7235 3900 4961 -8330 -425 6254 -6496 -1596 10364 -1696 -5320
2873e320J3311p615r113J2319o16j1708J0777N800j2922M305R047j2802j271J2522
$$ -5320 7991 376 -8737 3582 2966 -8742 2035 7835 -5087 -782 8265 -4537 -5808 6714
2887F714q670n880J3873k403j0347J1247K900j4692N958Q107j2439J606J2051
$$ 6714 -1956 -7836 6037 3634 -6713 4534 7434 -7258 -1300 6807 -5632 -4026 8025
2900H025r090l931J3564n827r929J1435R4j3372R204P854j2934K989J1653j1286
$$ 8025 -1065 -4996 8568 2741 -7188 4247 4341 -9031 173 8027 -4907 -1918 9735 -1551
2914a551l028J2285p736q511J3185m19j1246J0603M674j3431M560R146j3247j333
$$ -1551 -4579 7706 -30 -8541 4644 4225 -7021 3582 8256 -5175 -615 8531 -4716 -6049
2928f049J2950p675n866J3288k943j0596J0348J777j3280O486P305j2446K181
$$ -6049 6901 -774 -6640 6648 3705 -6891 3457 5234 -8046 -1560 5745 -6701 -4520
2941d520J3014r900m887J3255n391j0671J1624P15j1705Q921O676j2471L781J0830
$$ -4520 8494 -1406 -6293 6962 1571 -9100 2524 3239 -8466 455 7131 -5340 -1559 9271
2955I271j2186l408J2494o906p659J3187n52j1343J0218M998j3322L825Q175j1806
$$ 9271 -2915 -6323 6171 -735 -8394 4793 4241 -7102 3116 8114 -5208 -1383 6792 -5014
2969e014k58J2520p854n269J3290k855j1570J0507K285j3610O393Q721j1599R67
$$ -5014 -5272 7248 -606 -5875 7415 4560 -7010 3497 5782 -7828 -1435 7286 -4313 -3346
2983c346J1939r567m459J2478o198j0084J2108O14j1935R195O826j2743K737R996
$$ -3346 8593 -974 -5433 7045 847 -9237 2871 3485 -8450 745 7571 -5172 -2435 7561
2997G561j1473l142J2031n935p584J2780j18j0945R959L589j4111N099Q946j2143
$$ 7561 -3912 -7054 4977 -958 -8542 4238 4120 -6825 3134 6723 -7388 -2289 6657 -5486
3011e486k01J2965o679n975J2470l542j0786J0069K219j2794O867Q698j2163K336
$$ -5486 -5687 7278 599 -5376 7094 3552 -7234 2835 5054 -7740 -873 7825 -4338 -2002
3025b002J1827j0150n375J2484m912j0039J1273J915j0770Q182N968j2340K546
$$ -2002 9825 -325 -5700 6784 1872 -8167 3106 5021 -5749 2433 8401 -3939 -1393
3038a393R624j1065k990J2405n942p395J3197l07j2212Q518M659j3122L658Q963
$$ -1393 8231 -2834 -5824 6581 639 -6756 6441 6134 -6078 2440 7099 -6023 -2365 6598
3052F598j1048j2J2816p469p010J2312k724j1302R866K606j2510O336R182j0418
$$ 6598 -4450 -4462 8354 885 -6125 6187 3463 -7839 2027 4633 -7877 -1541 7641 -2777
3066b777K1J0685r038n199J1963m929r070J1241K148j1279Q174O069j2804J775
$$ -2777 -2756 7929 -1109 -6308 5655 726 -8344 2897 5045 -6234 1940 8009 -4795 -3020
3080c020R945j0198l322J2422n245o527J1864j166j1315Q441L717j3030M798R535
$$ -3020 6925 -3273 -6595 5827 582 -5945 5919 4753 -6562 1879 5596 -7434 -2636 6899
3094F899j0262j246J2616p051o958J1434l139j0729R500L638j1442O707P448j1296
$$ 6899 -3363 -4609 8007 956 -6002 5432 2293 -8436 1064 4702 -6740 -33 7415 -3881
3108c881J012J0783r974n416J2293l455q762J0374J793j0760O868N758j2163J666
$$ -3881 -2869 7914 -2060 -7476 4817 1362 -7400 2974 4767 -5993 875 6633 -5530 -3864
3122c864R740r550k643J2620m996p481J1393o71j1160P087M291j1644M124R521
$$ -3864 5876 -3674 -6317 6303 1307 -6174 5219 4548 -6612 475 4766 -6878 -2754 6767
3136F767r631j027J1595p022o546J0216k640r981J0022L581j1460N842Q183j0757
$$ 6767 -2864 -3891 7704 682 -5864 4352 1712 -8269 1753 5334 -6126 -284 7899 -2858
3150b858l47R373q220m384J1493m020q218J1003K004j1382O535N139j1742K088
$$ -2858 -3205 6168 -2052 -6436 5057 1037 -7181 3822 5826 -5556 979 6118 -5624 -3536
3164c536R534q762k288J1820n384o981J0654r29j0962P166M148j0645M855Q942
$$ -3536 5998 -2764 -5052 6768 1384 -5597 5057 4128 -6834 332 4480 -6165 -1310 7632
3178G632j0151o91J0843p361o382J0371k453r234R818L327j0484O118O522j1195
$$ 7632 -2519 -3210 7633 272 -6110 4261 1808 -7426 2392 5719 -4765 1353 7875 -3320
3192c320J37R656q355m747J1564k686p330R988M67j1135O926N036j1829J957R514
$$ -3320 -3183 6473 -1882 -6629 4935 2249 -5081 4907 5374 -5761 1165 6201 -5628 -3671 5843
3207E843p831k090J1563o035p437J0053j141j0043P550M155j0557M673Q602r332
$$ 5843 -1988 -4078 7485 1450 -5987 4066 2925 -7118 432 4587 -5970 -1297 7305 -2027
3221b027j798R559o742n637J0561k510r201R725L593r826M580N923j0709N11R494
$$ -2027 -3825 5734 -1008 -6645 3916 1406 -7795 1930 5523 -4303 277 6200 -4509 -3998 5496
3236E496p756l638J1059l093p622R881O15j1181O147N294j0838K898R134q663
$$ 5496 -2260 -5898 5161 2068 -5554 4327 4942 -6239 -92 5202 -5636 -2738 6396 -2267
3250b267j832J1335n560p187R033j140r142Q005M081j0358M240Q697r738j829
$$ -2267 -4099 7236 1676 -5511 3522 2382 -6760 1245 5326 -5032 -792 7905 -1833 -3662
3264c662R148o700n368J0613j911q416R141K395j0263N011O101j1309K31R824
$$ -3662 5486 -1214 -6582 4031 2120 -6296 2845 5240 -5023 -12 6089 -5220 -4989 4835
3278D835o677l819J0943l662p535R620O95j1134N905N462r850K806R019q257k168
$$ 4835 -1842 -5661 5282 1620 -5915 3705 4400 -6734 -829 4633 -5217 -2411 6608 -1649 -3817
3293c817J0464o121p140R639n33r385P990M699r975L686P566r542j208R303o634
$$ -3817 6647 526 -6614 3025 2492 -6893 1097 5796 -4179 -493 7073 -2469 -3677 5626 -1008
3308a008n552J0827j303q182Q395K259j0567M869O306j0287O6J0058o984l661
$$ -1008 -6560 4267 2964 -5218 3177 5436 -5131 -262 6044 -4243 -4177 5881 -1103 -4764
3322d764J0577l492p886Q488N13j0280O260N269r750K750R410q239k964R433n374
$$ -4764 5813 2321 -5565 2923 3436 -6844 -584 4685 -5065 -2315 7095 -1144 -4108 5325 -49
3337d9o630R553o72r168Q556M554j0493L560P087r603j343R504o440m566J0859
$$ -49 -6679 2874 2202 -6966 1590 6144 -4349 -789 6298 -3305 -4648 4856 -1584 -6150 4709
3352D709j618q190Q015K311j0555M353O547r888N72R668o598l461J0601m339p822
$$ 4709 3091 -5099 2916 5227 -5328 -975 5572 -4316 -3744 5924 -674 -4135 6466 2127 -5695
3367e695Q602N55r621N677N752r143K597Q502q470l259R608m807o840R148K76
$$ -5695 2907 3462 -6159 -482 5270 -3873 -1276 7226 -1244 -4503 5105 298 -6542 2606 2882
3382B882q453P455M027r982L069O834r422j350R728n469n309R934p13q202P215
$$ 2882 -5571 1884 5911 -4071 -1002 5832 -3590 -4940 4788 -681 -5990 3944 3231 -4971 2244
3397B244J881r981M110O440q787K07R852o281l809R374l683q057Q267J051r268
$$ 2244 4125 -5856 -1746 4694 -4093 -3886 5966 -315 -4124 5250 1567 -6490 1777 2828 -6440
3412f440O131N957q957J886Q315p940l197Q617m685n974R676J92q654P003M257
$$ -6440 -309 5648 -3309 -1423 6892 -1048 -4245 4372 -313 -6287 3389 3581 -5073 1930 6187
3427F187r726J855O690q476j066R808n340m703R590j815q113P156J997r679L968
$$ 6187 -3539 -1684 5006 -3470 -4536 5272 -68 -4771 4819 3004 -5109 2047 4044 -5635 -1667
3442a667O249p930P92R191o592m175Q884l566p179P186J331q155N981N280r214
$$ -1667 4582 -3348 -2556 6635 43 -4132 4752 1186 -5993 1193 2524 -5631 350 5630 -3584
3457c584J491Q106q000k985Q778l752n804Q573N85q049O653L375r714K349O839
$$ -3584 -2093 6013 -1987 -4972 3806 54 -5750 2823 3408 -4641 2012 5387 -4327 -1978 4861
3472D861p809j031R007m664m181Q667j671q361O712K174q978L886O521p693O29
$$ 4861 -2948 -3979 5028 364 -3817 4850 3179 -5182 1530 3704 -5274 -1388 5133 -2560 -1931
3487a931P952o320l949Q062l065p033Q116J803q610N514N337q737J298O740p728
$$ -1931 6021 -299 -4248 3814 749 -6284 1832 3635 -4975 539 5876 -2861 -1563 5177 -2551
3502b551k251Q929l721n690Q813Mq203O058L050r250K513O887p672j93Q717m976
$$ -2551 -4802 4127 406 -5284 3529 3533 -4670 1388 4438 -4812 -2299 4588 -3084 -3277 5440 464
3518D64m567Q474k024p823O505K030q124M773O071p956O43P718o651m043Q307
$$ 464 -4103 4371 2347 -5476 1029 3059 -5065 -292 5779 -2177 -1534 6184 -467 -4510 3797
3533C797l196o106P782J440p763N136M202q832J161P080p163k398Q533l459m988
$$ 3797 601 -5505 2277 3717 -4046 1090 5292 -3540 -2379 4701 -2462 -4860 3673 214 -4774
3548d774Q340n68q015N565L024q481K429O314o821n86Q770m728n068Q144k010
$$ -4774 3566 2998 -5017 548 3572 -4909 -2480 3834 -2987 -3573 5197 469 -4599 3545 1535
3563A535p620O598K091p580M653N437p267J23P343o704l585Q287k619o343Q403
$$ 1535 -6085 513 2604 -4976 -323 5114 -2153 -2030 5313 -1391 -4976 3311 692 -5651 2752
3578B752J100p357M749M101q791J302O560p016j519R110l750n149Q037n76p981
$$ 2752 3852 -3505 1244 5345 -3446 -2144 4416 -2600 -4119 4991 1241 -3908 4129 3553 -4428
3593d428N425K708q532L277O789p362k41P799m782m977P704k077p269P027K486
$$ -4428 997 3705 -4827 -1550 5239 -2123 -2364 5435 653 -4324 3380 1303 -5966 1061 3547
3608C547q065M567N243p611M0O695o087l061Q275l218n120P654R69p859M769L562
$$ 3547 -4518 49 5292 -2319 -2279 4416 -1671 -4732 3543 325 -4795 2859 3828 -4031 738 4300
3624D300q338J129O773n866j681Q209l606m891P769n75q221N385L260p869L191
$$ 4300 -4038 -2909 3864 -2002 -3683 4526 920 -3971 3798 3223 -4998 387 3647 -4222 -1031
3639a031O624p138l35P741n026n028P523j472o636O515K589p545L759N119p593
$$ -1031 5593 -1545 -1880 5861 835 -4193 3330 1858 -4778 1737 4326 -3219 540 5659 -1934
3654a934m8O689n868l349Q759k748n685P217J111q230M484L373p881J181O882
$$ -1934 -1982 4707 -1161 -4510 4249 1501 -4184 3033 4144 -4086 398 3771 -4110 -2929 3953
3669C953n724j902Q186l214n669O862q24p639N749L185p519K863O551o823o93
$$ 3953 -1771 -3673 4513 1299 -4370 2492 1668 -5971 -222 2963 -4556 -1693 4858 -1965 -2658
3684b658P136n416m246P367j451o235O788K591p622L576M968q066j4O923n209
$$ -2658 4478 -938 -5184 2183 732 -5503 1285 3876 -3746 -170 4798 -3268 -3282 3641 -1568
3699a568l090Q083j777n444O566P14p514M067L589p535J506P029n604j671P550
$$ -1568 -4658 3425 1648 -3796 2770 3484 -4030 37 3626 -3909 -2403 4626 -978 -2649 4901
3714D901l655n393P093r18p034N516L426p496L061N967o735j656O974m485m359
$$ 4901 1246 -4147 2946 2028 -5006 510 3936 -3560 -499 5468 -1267 -2923 4051 -434 -4793
3729d793P155q56n891O061K640p797K928M810p228o9O577m924k661Q288k437n824
$$ -4793 2362 1506 -4385 1676 4316 -3481 -553 4257 -2971 -3040 3537 -1387 -4048 4240 1803 -4021
3745d021O508N59p721L977L921o768J460O957n424j963P388m131n281O634l9o910
$$ -4021 2487 3046 -4675 -698 3223 -3545 -2085 4872 -552 -2515 4873 742 -4539 2095 2056 -4854
3761d854N314L446o488K328N581o676j500O748m425l973P171l45o040N729K052
$$ -4854 460 3906 -2582 -254 5327 -1349 -2849 3899 -526 -4499 2672 2327 -3713 2016 4068
3776D068p401L205M157p144K05O942m795k601P378k155n370N525O96p701M164
$$ 4068 -3333 -128 4029 -3115 -2910 4032 -763 -3364 4014 1859 -3511 2014 2710 -4991 -827
3791h27M558o622J073O776n974j497O616l987m723O193j13o243N314L492o628
$$ -827 3731 -2891 -1818 4958 -1016 -2513 4103 116 -4607 1586 1473 -4770 544 4036 -2592
3806b592K267N118o776j186O619m139l458P112r46n554N315K151p544K605M390
$$ -2592 -325 4793 -1983 -3169 3450 -689 -4147 2965 2019 -3535 1780 3931 -3613 -1008 3382
3821C382o558P00O582m735k698P453k275o015N566N55o590M007M119o493J758
$$ 3382 -3176 -2476 4106 -629 -3327 4126 1851 -4164 1402 1957 -4633 -626 3493 -3000 -1242
3836a242N871n769j956O197l170m696O578k78n497N134K931p084K027M919o085
$$ -1242 4629 -1140 -3096 3101 -69 -4765 1813 1535 -3962 1172 4103 -2981 -954 3965 -2120
3851b120j278O153l227l343O800j233n447N676J335p197L033M121o104M88O521
$$ -2120 -3398 2755 -472 -3815 2985 1752 -3695 1981 3316 -3881 -848 3273 -2831 -2343 4178
3866D178l944k850O465k593n250N902J93o539M294M459o158P70N769o094j265
$$ 4178 234 -2616 3849 1256 -3994 1908 2101 -4438 -144 4315 -1843 -1073 4696 -1398 -2663
3881b663O140l715m524O730L38n781M854K424o847K224M420n868j102O809l788
$$ -2663 3477 -238 -4762 1968 2306 -3475 1379 3803 -3044 -820 3600 -2268 -3370 3439 -349
3896c49l378P458j262n924M335J820o666K914M436o200O48O839m792k769O039
$$ -349 -3727 3731 2469 -3455 880 2700 -3966 -1052 3384 -2816 -2168 4671 -121 -2890 3149
3911C149k082n637N593J185o352M109L814n627R49N497n730k277O539l340l649
$$ 3149 1067 -4570 1023 2208 -4144 -35 3779 -1848 -899 4598 -1132 -3409 3130 -210 -3859
3926c859O184K79n682M691K611o953J348M755n728j50O083l394l184O526j539
$$ -3859 2325 2604 -3078 1613 4224 -2729 -1381 3374 -2354 -2504 3579 185 -2999 3527 1988
3941A988n729M843J199o708L352M936o248P70N573m321k502O264l104n013N688
$$ 1988 -3741 1102 2301 -4407 -1055 3881 -2367 -1597 3976 -345 -2847 3417 313 -4700 988
3956I88J548o335M236L689o146Q45N336n740j985O474k557m085O476p1n764M335
$$ 988 2536 -3799 437 4126 -2020 -1175 4161 -1579 -3564 2910 353 -3732 2744 2673 -3091 1244
3972A244J915o447J605N030n673n21O817l319l564O150j504n554M976J159o302
$$ 1244 3159 -3288 -1683 3347 -2326 -2847 3970 651 -2913 3237 1733 -3821 1155 2314 -3988
3987c988L695M358n691K12N839m584l387O051j977m747O241N71o041M114L366
$$ -3988 -293 4065 -1626 -1414 4425 -159 -3546 2505 528 -4219 2022 2593 -3448 666 4032
4002D032o497P58N300n677j653O621k884l580O363k45o144M045K453o512J905
$$ 4032 -2465 -1707 3593 -2084 -3737 2884 0 -3580 2783 2538 -3606 439 2892 -3620 -1715
$$ [...]
8191H2
##END NTUPLES=NMR FID
##END=
