##TITLE=1H_Pr 5-5-T2
 D2O, 8 sc, 
 29.8.2019
##JCAMPDX= 6.0         $$ Bruker NMR JCAMP-DX V2.0
##DATA TYPE= NMR FID
##DATA CLASS= NTUPLES
##ORIGIN= UXNMR, Bruker Analytische Messtechnik GmbH
##OWNER= root
$$ XWIN-NMR		Version 3.5
$$ Thu Aug 29 14:34:00 2019 Russian Standard Time (UT+4h)  she@DPX200
##.OBSERVE FREQUENCY= 200.13155
##.OBSERVE NUCLEUS= ^1H
##.DELAY= (6, 6)
##.ACQUISITION MODE= SIMULTANEOUS
##.ACQUISITION SCHEME= undefined
##.AVERAGES= 8
##.DIGITISER RES= 18
##SPECTROMETER/DATA SYSTEM= spect
##.PULSE SEQUENCE= zg30
##.SOLVENT NAME= D2O
##.SHIFT REFERENCE= (INTERNAL, D2O, 0, 15.7039)
##AUDIT TRAIL= $$ (NUMBER, WHEN, WHO, WHERE, WHAT)
$$ ##TITLE= Audit trail, XWIN-NMR		Version 3.5
$$ ##JCAMPDX= 5.01
$$ ##ORIGIN= Bruker BioSpin GmbH
$$ ##OWNER= she
$$ F:/spectra/data/she/nmr/H-F/1/audita.txt
$$ ##AUDIT TRAIL=  $$ (NUMBER, WHEN, WHO, WHERE, WHAT)
(   1,<2019-08-29 14:32:56.32 +0400>,<she>,<DPX200>,
      <created by zg, POWCHK disabled, PULCHK disabled
       configuration hash MD5:
       00 E9 B6 7A A2 85 ED C7 34 08 36 98 17 FE 4E 26
       data hash MD5: 16K
       3D 0F 2A D5 9A 16 93 AD 8A 42 80 74 6E D9 0A 59>)
$$ ##END=
$$ 
$$ hash MD5
$$ 96 EB 22 F9 E4 C5 7B 42 B2 2B 19 D5 CA 9F 54 81
##$RELAX= 
##$RELAX= 
##$RELAX= 
##$RELAX= 
##$RELAX= 
##$RELAX= 
$$ Bruker specific parameters
$$ --------------------------
##$DU= <F:/spectra>
##$EXPNO= 1
##$NAME= <H-F>
##$PROCNO= 1
##$TYPE= <nmr>
##$USER= <she>
##$AMP= (0..31)
100 100 100 100 100 100 100 100 100 100 100 100 100 100 100 100 100 100 
100 100 100 100 100 100 100 100 100 100 100 100 100 100 
##$AQSEQ= 0
##$AQ_mod= 1
##$AUNM= <au_zg>
##$AUTOPOS= <>
##$BF1= 200.13
##$BF2= 200.13
##$BF3= 200.13
##$BF4= 200.13
##$BF5= 200.13
##$BF6= 200.13
##$BF7= 200.13
##$BF8= 200.13
##$BYTORDA= 1
##$CFDGTYP= 0
##$CFRGTYP= 5
##$CHEMSTR= <none>
##$CNST= (0..31)
1 1 145 1 1 1 1 1 1 1 1 1 1 1 1 1 1 1 1 1 1 1 1 1 1 1 1 1 1 1 1 1 
##$CPDPRG= <>
##$CPDPRG1= <>
##$CPDPRG2= <>
##$CPDPRG3= <>
##$CPDPRG4= <mlev>
##$CPDPRG5= <mlev>
##$CPDPRG6= <mlev>
##$CPDPRG7= <mlev>
##$CPDPRG8= <mlev>
##$CPDPRGB= <>
##$CPDPRGT= <>
##$D= (0..31)
0 1.2 0 0 0 0 0 0 0 0 0 0.03 0 0 0 0 0 0 0 0 0 0 0 0 0 0 0 0 0 0 0 0 
##$DATE= 1567074775
##$DBL= (0..7)
120 120 120 120 120 120 120 120 
##$DBP= (0..7)
150 150 150 150 150 150 150 150 
##$DBP07= 0
##$DBPNAM0= <>
##$DBPNAM1= <>
##$DBPNAM2= <>
##$DBPNAM3= <>
##$DBPNAM4= <>
##$DBPNAM5= <>
##$DBPNAM6= <>
##$DBPNAM7= <>
##$DBPOAL= (0..7)
0.5 0.5 0.5 0.5 0.5 0.5 0.5 0.5 
##$DBPOFFS= (0..7)
0 0 0 0 0 0 0 0 
##$DE= 6
##$DECBNUC= <off>
##$DECIM= 24
##$DECNUC= <off>
##$DECSTAT= 4
##$DIGMOD= 1
##$DIGTYP= 9
##$DL= (0..7)
0 120 120 120 120 120 120 120 
##$DP= (0..7)
150 150 150 150 150 150 150 150 
##$DP07= 0
##$DPNAME0= <>
##$DPNAME1= <>
##$DPNAME2= <>
##$DPNAME3= <>
##$DPNAME4= <>
##$DPNAME5= <>
##$DPNAME6= <>
##$DPNAME7= <>
##$DPOAL= (0..7)
0.5 0.5 0.5 0.5 0.5 0.5 0.5 0.5 
##$DPOFFS= (0..7)
0 0 0 0 0 0 0 0 
##$DQDMODE= 0
##$DR= 18
##$DS= 0
##$DSLIST= <SSSSSSSSSSSSSSS>
##$DSPFIRM= 0
$$ [...]
##$SUBNAM2= <"">
##$SUBNAM3= <"">
##$SUBNAM4= <"">
##$SUBNAM5= <"">
##$SUBNAM6= <"">
##$SUBNAM7= <"">
##$SUBNAM8= <"">
##$SUBNAM9= <"">
##$SW= 24.9336996594482
##$SWIBOX= (0..15)
0 0 2 0 0 0 0 0 0 0 0 0 0 0 0 0 
##$SW_h= 4990.01996007984
##$TD= 16384
##$TD0= 1
##$TE= 0
##$TE2= 300
##$TE3= 300
##$TEG= 300
##$TL= (0..7)
0 120 120 120 120 120 120 120 
##$TP= (0..7)
150 150 150 150 150 150 150 150 
##$TP07= 0
##$TPNAME0= <>
##$TPNAME1= <>
##$TPNAME2= <>
##$TPNAME3= <>
##$TPNAME4= <>
##$TPNAME5= <>
##$TPNAME6= <>
##$TPNAME7= <>
##$TPOAL= (0..7)
0.5 0.5 0.5 0.5 0.5 0.5 0.5 0.5 
##$TPOFFS= (0..7)
0 0 0 0 0 0 0 0 
##$TUNHIN= 0
##$TUNHOUT= 0
##$TUNXOUT= 0
##$USERA1= <user>
##$USERA2= <user>
##$USERA3= <user>
##$USERA4= <user>
##$USERA5= <user>
##$V9= 5
##$VALIST= <valist>
##$VCLIST= <CCCCCCCCCCCCCCC>
##$VD= 0
##$VDLIST= <DDDDDDDDDDDDDDD>
##$VPLIST= <PPPPPPPPPPPPPPP>
##$VTLIST= <TTTTTTTTTTTTTTT>
##$WBST= 1024
##$WBSW= 4
##$XGAIN= (0..3)
0 0 0 0 
##$XL= 0
##$YL= 0
##$YMAX_a= 328763
##$YMIN_a= -444244
##$ZGOPTNS= <>
##$ZL1= 120
##$ZL2= 120
##$ZL3= 120
##$ZL4= 120
##$ABSF1= 10
##$ABSF2= 0
##$ABSG= 5
##$ABSL= 3
##$ALPHA= 0
##$AQORDER= 0
##$ASSFAC= 0
##$ASSFACI= 0
##$ASSFACX= 0
##$ASSWID= 0
##$AUNMP= <proc_1d>
##$AZFE= 0.1
##$AZFW= 0.1
##$BCFW= 1
##$BC_mod= 2
##$BYTORDP= 1
##$COROFFS= 0
##$CY= 11.3945322036743
##$DATMOD= 1
##$DC= 2
##$DFILT= <>
##$DTYPP= 0
##$F1P= 20.1720416913024
##$F2P= 0.152960286110954
##$FCOR= 0.5
##$FTSIZE= 0
##$FT_mod= 4
##$GAMMA= 1
##$GB= 0.15
##$INTBC= 1
##$INTSCL= 1
##$ISEN= 128
##$LB= 0.24
##$LEV0= 0
##$LPBIN= 0
##$MAXI= 10000
##$MC2= 0
##$MEAN= 0
##$ME_mod= 0
##$MI= 1.114404
##$NCOEF= 0
##$NC_proc= 0
##$NLEV= 6
##$NOISF1= 3.799351
##$NOISF2= 2.8
##$NSP= 1
##$NTH_PI= 0
##$NZP= 0
##$OFFSET= 15.70392
##$PC= 1
##$PHC0= -9230.366
##$PHC1= 25.80096
##$PH_mod= 1
##$PKNL= yes
##$PPARMOD= 0
##$PSCAL= 0
##$PSIGN= 0
##$REVERSE= no
##$SF= 200.130013532006
##$SI= 16384
##$SIGF1= 3
##$SIGF2= 2
##$SINO= 400
##$SIOLD= 16384
##$SREGLST= <1H.CDCl3>
##$SSB= 0
##$STSI= 0
##$STSR= 0
##$SW_p= 3612.71676300578
##$SYMM= 0
##$S_DEV= 0
##$TDeff= 0
##$TDoff= 0
##$TI= <>
##$TILT= no
##$TM1= 0
##$TM2= 0
##$TOPLEV= 0
##$USERP1= <user>
##$USERP2= <user>
##$USERP3= <user>
##$USERP4= <user>
##$USERP5= <user>
##$WDW= 1
##$XDIM= 8192
##$YMAX_p= 0
##$YMIN_p= 0
$$ End of Bruker specific parameters
$$ ---------------------------------
##NTUPLES= NMR FID
##VAR_NAME=  TIME,          FID/REAL,        FID/IMAG
##SYMBOL=    X,             R,               I
##VAR_TYPE=  INDEPENDENT,   DEPENDENT,       DEPENDENT
##VAR_FORM=  AFFN,          ASDF,            ASDF
##VAR_DIM=   8192,          8192,            8192
##UNITS=     SECONDS,       ARBITRARY UNITS, ARBITRARY UNITS
##FACTOR=    0.0002004,     1,               1
##FIRST=     0,             0,               0
##LAST=      1.6414764,     0,               0
##MIN=       0,             -444244,         0
##MAX=       1.6414764,     328763,          0
$$ Real data points
##PAGE= N=1
##DATA TABLE= (X++(R..R)), XYDATA
0 0 0 0 0 0 8 0 8 -8 8 -16 16 -24 32 -32 40 -52 63 -73 88 -104 121 -138 163 -190 216 -249 282 -321 367
29 367 -411 464 -520 584 -657 731 -817 909 -1007 1119 -1240 1374 -1523 1685 -1866 2068
45 2068 -2293 2547 -2836 3169 -3555 4006 -4551 5216 -6051 7144 -8625 10782 -14211 20547
59 20547 -36273 161308 130412 -244830 -278107 -197968 -35118 98300 258735 283099 150283
70 150283 -75545 -207513 -236177 -155798 6599 224681 328763 224522 -29070 -229095
80 -229095 -277070 -174857 1615 185493 276068 218875 38761 -154517 -266726 -235790 -70000
91 -70000 150862 282629 238434 58592 -128667 -232132 -223261 -110364 70945 227924 255819
102 255819 130745 -63845 -214239 -250114 -160047 21525 205862 275837 173940 -33366
112 -33366 -205404 -246968 -160649 -5880 150246 237920 198118 37394 -149165 -242848 -196704
123 -196704 -52695 110077 219042 217618 90451 -98935 -231271 -224768 -95066 74833 200990
134 200990 225264 126633 -52477 -206150 -236183 -129933 39818 177738 220373 147296 -8375
145 -8375 -162151 -223180 -158838 -12059 137082 215792 181467 44487 -121726 -217199 -185992
156 -185992 -52572 105020 207114 203277 88563 -81235 -203840 -202236 -81927 78215 190418
167 190418 203431 112588 -37632 -165013 -194721 -113664 25601 151586 206549 157529 17364
178 17364 -138040 -208433 -150556 -7838 134947 204865 169452 43501 -106167 -190862 -163739
189 -163739 -47895 90866 184161 183949 81737 -69204 -177178 -178627 -81745 52878 157764
200 157764 183436 112249 -23818 -151126 -192645 -124375 12756 141857 190866 132185 -651
211 -651 -131311 -186149 -138018 -18231 106530 171983 145518 40443 -88725 -173596 -164423 -62026
223 -62026 76644 169669 163952 66873 -64954 -158344 -166019 -85222 40932 143667 167276 99317
235 99317 -23588 -135694 -174474 -115670 8669 126941 171521 120628 3168 -113839 -166042
246 -166042 -127064 -21227 92905 156438 136757 43271 -76632 -157561 -150315 -57618 66592
257 66592 152065 152423 68053 -54078 -145566 -154251 -77895 37575 129814 150929 91486 -18396
269 -18396 -119402 -155899 -105892 2255 108831 154547 114495 11123 -98748 -152182 -122898
280 -122898 -25611 84740 148475 129456 38565 -72345 -142671 -133988 -52662 57764 135649
291 135649 138300 65136 -43444 -127086 -139913 -76879 28988 118667 143108 88006 -14530
302 -14530 -109010 -143072 -97205 2353 100169 142239 106168 11882 -88124 -138921 -112544 -23773
314 -23773 76849 134261 118122 38256 -62140 -129006 -124397 -50868 50861 124338 128644 61633
326 61633 -38847 -116917 -129827 -71786 25528 107982 130606 81619 -12677 -99313 -130521 -90469
338 -90469 -1047 88523 129839 98550 12535 -80154 -127793 -104380 -24514 67769 122306 109854
350 109854 36807 -56913 -118785 -115166 -47281 45296 112394 117537 57862 -33464 -105761 -120018
362 -120018 -68165 21100 98029 120181 75992 -9519 -89504 -120121 -85071 -3289 79979 118864
374 118864 91595 14619 -70233 -116029 -98077 -26393 59453 112638 102850 36260 -49671 -107806
386 -107806 -106111 -46751 38058 101378 108722 56602 -26768 -95110 -110954 -65568 15952 87917
398 87917 111008 73143 -4599 -79720 -110771 -80611 -6034 70668 108796 86286 16275 -61403
410 -61403 -105974 -91951 -27248 51704 102144 95573 36202 -42716 -97993 -99117 -45785 31892
422 31892 91716 101203 54163 -22736 -86829 -102722 -62010 11998 78500 101742 68728 -1760
434 -1760 -72003 -101813 -75652 -7462 63784 99466 80180 17025 -55246 -96715 -85017 -27110
446 -27110 46360 93703 88860 35082 -37464 -88672 -91362 -43928 27743 83552 93534 51706 -18141
459 -18141 -77571 -94061 -58670 9074 71346 94549 65117 411 -64048 -92541 -70361 -9424
471 -9424 56314 90790 75904 19064 -48362 -89102 -79666 -26697 40858 85179 82287 34826 -31495
484 -31495 -80054 -83995 -42255 22941 75592 86373 49796 -14422 -70080 -86822 -55402 6234
496 6234 64066 86360 61046 2106 -56929 -84623 -65692 -11098 49326 83154 71144 19635
508 19635 -43307 -81166 -73875 -25852 36354 78012 76238 32272 -28173 -72544 -77070 -40179 19535
521 19535 68561 79722 46617 -12319 -63847 -80218 -51539 4840 58539 79285 55904 2886
533 2886 -51320 -77982 -61501 -11818 45039 76779 65110 17386 -40191 -75041 -68121 -24210
545 -24210 32263 69376 68789 30714 -24364 -66802 -73308 -38926 16334 62309 73198 43092 -11176
558 -11176 -59423 -73924 -48287 3005 51559 71720 52960 4168 -47085 -72400 -57907 -11761
570 -11761 40071 69760 60483 17471 -35150 -67516 -62860 -24738 26815 63953 65554 31182 -20694
583 -20694 -61096 -67562 -36956 14473 57155 67835 40919 -7488 -51538 -66858 -46348 650
595 650 47006 67282 50241 5665 -40485 -64616 -54172 -12779 36241 65012 57205 17823 -29413
608 -29413 -60764 -58501 -24354 23890 58816 61096 30239 -17391 -55419 -62256 -33971 12880 51467
621 51467 61802 38940 -4763 -45954 -62386 -43075 223 42122 61101 46907 7561 -37100
633 -37100 -61198 -50547 -11291 33457 58014 51235 17295 -26422 -56010 -54752 -23261 21629
645 21629 53773 55654 27194 -16694 -50430 -56441 -31998 9239 45769 57555 37294 -4678
657 -4678 -43512 -57936 -40528 -1515 38243 56641 43329 5614 -34751 -55282 -45474 -11971
669 -11971 28282 52833 48177 16610 -24486 -51620 -51212 -22054 18910 48535 50715 25273 -13593
682 -13593 -45189 -53284 -31924 7871 43028 53090 33123 -4049 -38810 -52609 -38107 -2077
694 -2077 34411 51331 39682 6804 -29963 -50715 -43480 -12327 25386 48317 44946 16515 -21395
707 -21395 -47569 -47694 -20779 16404 43818 46915 24381 -11771 -41896 -48465 -28235 7230 37937
720 37937 47781 31638 -2418 -34714 -48137 -35569 -3688 30907 48114 37715 6486 -28003
732 -28003 -46238 -39862 -12468 22279 45169 41933 15027 -19664 -42559 -42571 -19953 13883 40355
745 40355 44471 23209 -10470 -37882 -44686 -26632 5576 34747 44296 29570 -1261 -30976 -44399
758 -44399 -33329 -3677 28189 44112 34992 7269 -24727 -43368 -37657 -10929 21888 40839
770 40839 37128 14280 -16196 -38289 -39797 -19440 11869 36893 40787 22429 -8541 -34988 -41894
783 -41894 -25420 4997 31974 40703 27373 -1206 -29026 -40402 -30249 -3482 24782 39570
795 39570 32891 7148 -22225 -38980 -34210 -11097 17862 37531 36048 13951 -15370 -35944 -36816
808 -36816 -17352 10916 33412 37457 20743 -7780 -31183 -37856 -23405 3709 29062 37729 25744
821 25744 -578 -25927 -37048 -28421 -3958 22737 37065 30269 6862 -19816 -35879 -32412 -10809
834 -10809 17355 35126 32477 12680 -14010 -32370 -33814 -16858 9558 30608 34485 19626 -6659
847 -6659 -28627 -35465 -22305 3184 26629 34997 23828 -78 -23960 -34371 -26229 -3187 20732
860 20732 33732 28241 7365 -18086 -33366 -29699 -9608 15217 31819 30347 12876 -11996 -29837
873 -29837 -31277 -15385 8608 27771 31831 18151 -5099 -25556 -32581 -20741 2217 24146 32545
886 32545 22524 242 -21677 -31542 -23922 -3612 18880 31083 25723 6428 -16079 -29936 -27186
899 -27186 -9610 13338 29140 28727 11872 -10946 -27530 -28893 -14356 8124 26217 29319 16698
912 16698 -5494 -24028 -29634 -18679 2633 21786 29417 20663 877 -19585 -29312 -22615 -3330
925 -3330 17835 28607 23894 5939 -15178 -28192 -24952 -8336 12753 26812 25679 10901 -9753
938 -9753 -25202 -26919 -13238 7473 23706 27180 15388 -4895 -22171 -27670 -16916 2329 20628
951 20628 26983 18809 188 -18133 -26771 -20604 -3514 16031 26684 22487 5681 -14301 -25784
964 -25784 -23114 -8012 11806 24874 24269 9967 -9253 -23160 -24513 -12355 6441 22054 25318
977 25318 14133 -4151 -20320 -25410 -15831 1994 19285 25301 17630 557 -16657 -25078 -19579
990 -19579 -2725 14970 24467 20340 5448 -12942 -23465 -21385 -7477 10403 22706 22386 9542
1003 9542 -8215 -21359 -22757 -11772 5699 20539 23425 13543 -3665 -18656 -23068 -14795 1597
1016 1597 16867 23097 16553 1116 -15149 -22839 -18046 -3339 13343 22405 19350 5495 -11608
1029 -11608 -21719 -19881 -7124 9444 20674 21023 9179 -7167 -19386 -21254 -11004 5077 18538
1042 18538 21880 12928 -3014 -16862 -21738 -13996 1032 15538 21629 15344 972 -14036 -21022
1055 -21022 -16667 -3202 12005 20738 17634 4993 -10095 -19977 -18462 -7106 8522 18921 19219
1068 19219 8616 -6541 -17771 -19451 -10333 4676 16835 19825 11861 -2715 -15522 -20030 -13480
1081 -13480 548 14120 19889 14735 1403 -12791 -19483 -15288 -2860 10869 18865 16249 5217
1094 5217 -9566 -18369 -17151 -6549 7626 17198 17661 8556 -5373 -16663 -18452 -10035 3679 15272
1108 15272 18496 11293 -1997 -13994 -18298 -12430 -49 13024 18319 13732 1546 -11314 -18002
1121 -18002 -14644 -3132 9774 17602 15336 4642 -8339 -16956 -15907 -6390 6620 16123 16599 8096
1135 8096 -5011 -15341 -16538 -9118 3519 14383 16970 10725 -1742 -13078 -17246 -11750 363
1148 363 11747 17045 12688 1668 -10416 -16574 -13529 -3140 8990 16383 14358 4523 -7532 -15835
1162 -15835 -14845 -5956 6006 14856 15563 7181 -4644 -14065 -15301 -8593 2829 13054 16122 9834
1176 9834 -1777 -12013 -15689 -10568 167 10957 15556 11718 1667 -9456 -15469 -12371 -2833
1189 -2833 8339 15130 13287 4159 -6778 -14519 -13645 -5379 5786 13635 14099 6778 -3962 -13179
1203 -13179 -14420 -7753 3175 12148 14680 9149 -1309 -10988 -14638 -9944 -77 9898 14496 10963
1217 10963 1823 -8825 -14097 -12107 -2732 7317 13658 12237 4028 -6269 -13303 -13220 -5539 5030
1231 5030 12740 12911 6435 -3842 -11929 -13407 -7803 2299 11073 13590 8529 -1307 -10085 -13443 -9402
1246 -9402 -46 8833 13296 10244 1578 -8338 -13321 -10748 -2565 7128 12486 11526 3903 -5799 -12379
1261 -12379 -11850 -5154 4756 11667 12293 6330 -3495 -11050 -12176 -7088 2350 10146 12463 8101 -994
1276 -994 -9270 -12639 -8783 -358 8559 12279 9726 1460 -7367 -12297 -10338 -2605 6526 12003 10503
1291 10503 3540 -5167 -11312 -11294 -4891 3960 10972 11496 5918 -2941 -10247 -11431 -6500 1974 9434
1306 9434 11837 7741 -761 -8231 -11848 -8455 -401 7709 11506 8837 1667 -6816 -11449 -9411 -2401
1321 -2401 5959 11076 10023 3537 -4694 -10364 -10428 -4666 3755 9839 10771 5550 -2895 -9371 -10901 -6195
1337 -6195 1819 8628 10915 7110 -537 -7714 -10932 -7990 -628 7225 10630 8169 1436 -5954 -10125
1352 -10125 -9073 -2618 5389 10215 9274 3269 -4241 -9674 -9703 -4313 3252 9197 9837 5174 -2220 -8638
1368 -8638 -10035 -5826 1617 8120 10077 6358 -555 -7387 -10224 -7144 -116 6658 9734 7820 1551
1383 1551 -5707 -9850 -8276 -2056 4948 9548 8390 3148 -4453 -8762 -8854 -3708 3417 8285 8959 4519
1399 4519 -2036 -7930 -9392 -5417 1388 7449 9182 6008 -421 -6527 -9296 -6593 -626 5996 9036
1414 9036 7034 1173 -5259 -8824 -7443 -2228 4506 8619 8122 2825 -3787 -8421 -8415 -3731 2848 7671
1430 7671 8648 4350 -2053 -7475 -8375 -5183 1076 6869 8631 5684 -448 -5919 -8474 -6364 -530
1445 -530 5381 8511 6787 1270 -4958 -8354 -7220 -2013 4248 8084 7749 2565 -3390 -7471 -7723 -3478
1461 -3478 2811 7182 7825 3901 -1776 -7078 -8098 -5007 1274 6211 8213 5350 -243 -5948 -8127
1476 -8127 -5852 -405 5053 7869 6693 1039 -4519 -7668 -6878 -1772 3726 7449 7005 2521 -3423
1491 -3423 -7351 -7173 -3267 2351 6713 7357 3949 -1640 -6291 -7432 -4341 1218 5905 7360 4890
1506 4890 -195 -5424 -7443 -5416 -657 4794 7431 6037 1193 -4256 -7230 -6124 -1763 3404 6724
1521 6724 6360 2420 -3001 -6521 -6925 -3195 2220 6417 7021 3869 -1646 -5867 -6994 -4154 1282 5353
1537 5353 6966 4620 -359 -5142 -6846 -5106 -396 4432 6948 5557 1019 -3882 -6694 -5861 -1690
1552 -1690 3246 6466 6172 2342 -2847 -6421 -6356 -3277 1797 5935 6501 3364 -1560 -5434 -6523 -3831
1568 -3831 520 5287 6800 4192 -91 -4562 -6400 -5097 -416 4251 6189 5226 904 -3771 -6399
1583 -6399 -5440 -1607 3096 6079 5806 2239 -2171 -5879 -6073 -2704 2286 5608 6164 3573 -1493 -5650
1599 -5650 -6010 -3579 744 4818 6033 4128 -155 -4298 -6125 -4450 -516 3945 5958 4978 864
1614 864 -3441 -6070 -5089 -1445 3019 5719 5548 2309 -2276 -5317 -5608 -2783 1896 5019 5629 3244
1630 3244 -1553 -4893 -5811 -3692 580 4318 5872 3583 158 -4035 -5455 -4311 -510 4079 5587
1645 5587 4647 913 -3369 -5368 -4765 -1417 2664 5124 4910 1815 -2097 -5356 -5142 -2561 1673 4503
1661 4503 5114 2798 -914 -4385 -5196 -2913 518 4007 5442 3693 174 -3677 -5312 -4229 -487
1676 -487 3157 5412 4264 793 -2820 -5200 -4314 -1516 2440 5145 4634 1637 -1940 -4830 -4731 -2081
1692 -2081 1375 4322 4924 2485 -1017 -4073 -5139 -3094 827 3741 4967 3377 -273 -3274 -4646
1707 -4646 -3845 -739 3344 5031 4353 933 -2622 -4756 -4504 -1384 1942 4580 4587 2042 -1862 -4358
1723 -4358 -4327 -2175 1376 4118 4484 2594 -986 -4027 -4327 -3050 407 3212 4551 3319 124 -3271
1739 -3271 -4602 -3366 -677 2927 4762 3633 1113 -2505 -4452 -3917 -1359 2271 4080 4074 1496 -1356
1755 -1356 -3657 -4193 -1899 1261 3837 4375 2189 -721 -3574 -4054 -2720 219 3442 4402 2649 144
1771 144 -2972 -4327 -3141 -331 2288 3900 3675 713 -2241 -4122 -3589 -947 1829 4275 4210 1584
1787 1584 -1298 -3687 -3919 -2055 1316 3653 3940 2019 -1203 -3234 -3945 -2836 403 3049 4102 2872
1803 2872 -109 -2917 -3916 -2988 -476 2555 3953 3332 869 -1726 -3955 -3437 -1235 1792 3598 3690
1819 3690 1633 -1380 -3267 -3704 -1954 1107 3239 3841 2028 -321 -3249 -3630 -2348 81 2692 3549
1835 3549 2679 96 -2520 -3889 -3067 -574 2260 3906 2783 787 -2033 -3534 -3290 -1041 1587 3278
1851 3278 3557 1000 -1066 -3235 -3501 -2015 953 2930 3431 2046 -341 -2679 -3700 -2072 112 2613
1867 2613 3474 2718 44 -2282 -3557 -2682 -454 2041 3195 2997 829 -1928 -3246 -2994 -1057 1669
1883 1669 2978 2981 1629 -1053 -2877 -3557 -1786 712 2663 3280 2179 -585 -2261 -3099 -2204 227 2675
1900 2675 3409 2502 208 -2042 -3199 -2281 -394 1863 3265 2964 942 -1572 -3370 -2840 -1185 1411
1916 1411 3065 2989 1515 -862 -2716 -3191 -1545 600 2647 3007 1752 -577 -2223 -3223 -2250 85
1932 85 2176 3245 2134 296 -2085 -3199 -2446 -313 1649 3108 2497 602 -1243 -2962 -2524 -1124
1948 -1124 871 2588 2715 1175 -1082 -2736 -3153 -1806 584 2438 2813 1816 -328 -2612 -3083 -1800
1964 -1800 11 1747 2711 2071 110 -2126 -2865 -2614 -670 1759 3009 2150 829 -1375 -2866 -2600
1980 -2600 -872 1080 2416 2570 1439 -676 -2551 -2574 -1446 704 2446 2671 1687 -23 -1903 -2539
1996 -2539 -1715 199 2239 2975 2110 178 -1714 -2678 -2129 -425 1453 2743 2593 655 -1586 -2400 -2615
2013 -2615 -1150 1142 2307 2525 1090 -672 -1981 -2462 -1418 490 1978 2912 1699 -98 -1811 -2873
2029 -2873 -1748 -356 1905 2621 1886 212 -1759 -2467 -1827 -358 1399 2470 2223 893 -1044 -2532
2045 -2532 -1883 -816 919 2343 2445 858 -801 -2143 -2472 -1048 505 1901 2469 1634 -205 -2004
2061 -2004 -2452 -1602 0 1566 2058 1673 214 -1395 -2554 -1894 -618 1365 2200 1893 485 -1321 -2260
2078 -2260 -1867 -900 1069 2205 1939 983 -702 -1791 -2298 -1274 597 2062 2204 1067 -7 -1639
2094 -1639 -2254 -1369 21 1600 2153 1478 180 -1378 -2374 -1796 -487 1548 1922 1819 877 -814 -1905
2111 -1905 -1934 -923 773 2035 1918 918 -429 -1681 -2093 -1164 374 1899 2288 1451 -217 -1496 -1978
2128 -1978 -1266 35 1431 1904 1288 305 -1307 -2152 -1417 38 1099 2087 1854 558 -1010 -1929 -1732
2145 -1732 -708 528 1953 1890 1028 -515 -1693 -2055 -1032 219 1519 1964 1150 -537 -1477 -1627 -1163
2162 -1163 0 1255 1776 1500 -116 -1214 -2101 -1225 -581 1207 1757 1563 606 -893 -1562 -1470 -829 575
2180 575 1494 1603 949 -430 -1377 -1964 -742 418 1403 1817 1142 -19 -1381 -1787 -1243 97 1155 1646
2198 1646 1390 177 -1203 -1558 -1488 -464 1033 1620 1442 355 -824 -1884 -1500 -807 760 1579 1969
2215 1969 752 -641 -1395 -1625 -1252 405 1371 1579 1399 -286 -1433 -1818 -1321 -150 1261 1756 1292
2232 1292 439 -1085 -1637 -1539 -378 1127 1455 1814 401 -633 -1368 -1568 -286 761 1481 1542 769 -422
2250 -422 -1498 -1561 -956 165 1514 1689 1078 -90 -1325 -1685 -1273 -134 1207 1402 1164 244 -984 -1559
2268 -1559 -1380 -618 897 1586 1338 610 -411 -1306 -1448 -541 791 1217 1495 815 -490 -1074 -1478 -874
2286 -874 461 1488 1488 910 11 -1219 -1418 -1164 -145 864 1645 1080 234 -838 -1452 -1293 -439 648
2304 648 1307 1308 596 -813 -1319 -1448 -771 278 1212 1355 542 -470 -1020 -1209 -676 -168 905 1394 1086
2323 1086 -240 -1105 -1445 -1028 2 1051 1314 978 73 -757 -1363 -1178 -435 551 1275 1215 217 -321 -1287
2342 -1287 -904 -696 494 1093 1191 570 -448 -1273 -1269 -847 -43 1372 1344 950 232 -811 -1219 -1081 23
2361 23 1122 1245 925 240 -1007 -1286 -801 -168 557 1097 1350 177 -310 -1117 -1176 -509 406 1169 985 732
2381 732 -250 -828 -1265 -770 154 800 1330 929 -52 -448 -883 -1146 -157 953 1282 1083 487 -733 -1116
2400 -1116 -1202 -345 565 1262 960 246 -429 -1365 -1149 -319 252 1180 1394 593 -325 -910 -1028 -829 83 1102
2420 1102 1087 842 -29 -636 -1111 -910 -131 825 1048 1071 1 -615 -830 -662 -265 285 949 768 480 -586
2440 -586 -1040 -714 -198 481 981 887 950 -546 -1010 -1180 -720 -93 573 1096 804 -78 -549 -1150 -743 10
2460 10 725 987 768 96 -334 -806 -1074 -461 339 892 1191 496 -579 -1046 -989 -574 333 879 1125 670
2480 670 99 -876 -863 -672 151 762 1025 754 -66 -586 -1137 -563 -46 920 915 1046 173 -411 -819 -952 -267
2501 -267 443 887 788 486 -42 -1100 -684 -274 236 656 987 625 -131 -679 -918 -564 127 484 838 415
2521 415 -151 -286 -971 -935 -167 707 756 647 462 -550 -964 -763 -369 383 1065 725 508 -687 -834 -786
2541 -786 -127 106 801 855 354 -201 -644 -1081 -662 405 625 753 397 -190 -715 -1061 -909 -183 577 661
2561 661 658 -32 -699 -621 -724 -195 447 696 448 257 -288 -760 -910 -444 115 616 866 418 -347 -565 -801
2582 -801 -818 229 567 1217 611 88 -852 -796 -863 -74 771 814 891 154 -580 -659 -888 -352 236 762 699 223
2604 223 -145 -1196 -851 -275 204 564 551 349 125 -640 -812 -574 -70 499 686 717 -83 -628 -948 -509
2624 -509 -236 533 747 645 223 -632 -1043 -759 -19 323 1117 428 521 -305 -677 -623 -327 -25 413 805 481
2645 481 15 -792 -790 -265 -105 514 787 670 36 -470 -733 -445 -12 248 733 481 208 -591 -547 -498 10
2666 10 336 363 758 456 -327 -478 -692 -240 203 1016 355 277 104 -777 -504 -244 -151 619 439 385 70 -378
2688 -378 -732 -433 27 299 587 687 -105 -251 -597 -332 -185 128 927 542 129 -70 -512 -539 -300 356
2708 356 818 402 285 -242 -340 -795 -320 65 823 551 674 283 -380 -319 -429 -182 364 508 411 276 -353
2729 -353 -635 -337 -241 267 540 707 338 -237 -575 -542 -204 31 790 249 315 -68 -763 -716 26 362 649
2750 649 718 295 -96 -624 -237 -293 -107 260 440 493 308 -406 -710 -522 195 480 578 49 137 -287 -497 -458
2772 -458 -225 308 372 453 352 177 -446 -634 -482 -140 445 500 354 2 -127 -550 -689 -272 590 417 629
2793 629 30 -488 -461 -418 -89 69 425 144 169 -271 -545 -495 -260 243 399 786 452 -73 -379 -661 -33
2814 -33 41 423 556 381 -233 -321 -428 -250 -78 131 470 521 36 -148 -390 -609 -338 181 317 607 269
2835 269 -111 -508 -473 -356 -25 483 664 115 -60 -267 -380 -93 62 326 120 381 -351 -12 -519 -408
2855 -408 -169 233 727 420 -119 -473 -475 -371 -318 318 871 287 101 -117 -412 -340 -212 466 339 437 170 -166
2877 -166 -413 -538 -459 -130 681 194 230 -144 -511 -365 -443 -251 414 373 400 161 -348 -247 -408 -102 182 240
2899 240 383 89 -415 -171 -747 -94 309 216 428 132 56 -385 -395 -271 66 472 513 217 -128 -311 -376 -423
2921 -423 -130 245 438 349 502 -409 -744 -631 -226 238 316 177 327 -220 -740 -463 48 36 489 224 -170
2942 -170 -150 -440 -601 -235 -19 619 642 699 294 -309 -432 -277 41 450 170 408 194 -81 -345 -563 81
2963 81 34 434 181 16 -113 -325 -298 -81 39 380 553 108 -281 -130 -252 -2 -22 546 306 303 32 -94
2985 -94 -542 -563 -26 501 664 383 -94 139 -38 -214 -350 293 611 202 97 29 -138 -147 -21 -391 372 182
3007 182 -47 -167 -195 -574 -357 -87 303 520 135 -227 -253 -549 12 5 178 421 168 -83 -208 -203 -263 -122
3029 -122 -4 521 769 205 -297 -227 -504 -72 -52 109 440 182 -160 -58 -157 -440 100 253 392 362 -89
3050 -89 -191 -394 -138 -286 16 86 458 -247 -286 -407 -153 -96 68 250 146 206 52 -324 -467 -244 -144 190
3072 190 506 -84 358 -67 -437 -345 -85 397 403 417 -116 -439 -144 -251 -27 -156 258 33 -214 -301 -460 -106
3094 -106 -241 130 116 274 -7 -78 -63 -369 27 2 363 237 280 22 -252 -369 -311 55 110 498 198 -210
3116 -210 -122 -27 -381 -3 321 397 126 32 -42 -244 -247 -49 111 -7 637 330 -270 -209 -254 -140 290 56 118
3139 118 9 -185 -418 -184 -118 -5 97 219 158 -343 -442 -398 -250 70 184 140 216 88 -99 -169 -121 -190 69
3162 69 311 359 122 -86 -510 -478 -253 123 205 197 -66 -61 -305 -451 -16 54 322 405 263 229 -316 -341 -247 -196 34
3187 34 191 419 -165 174 -378 -213 -16 10 342 297 -141 -51 -129 -278 -324 14 276 350 136 25 73 -253 14
3210 14 -67 235 29 352 95 -443 -204 -6 -45 259 287 164 41 27 -176 -26 -321 101 162 338 51 -320
3232 -320 -358 -337 135 15 94 -73 327 219 -330 -229 -197 -133 307 187 66 -456 18 -31 12 284 134 189 413
3255 413 176 -282 -285 -308 -193 77 30 182 -100 -26 -186 -122 142 233 -197 134 84 17 -250 89 -37 64 235
3278 235 453 251 106 -2 -25 -113 -249 139 524 428 264 -160 -247 -112 -22 -160 -45 -35 145 -95 -292 -165
3300 -165 -346 245 32 0 88 142 200 -299 96 -146 170 336 180 -419 -367 -191 85 -26 229 203 -13 -26
3322 -26 -120 -143 -130 57 96 56 328 139 -151 90 -109 -63 -32 159 173 124 157 -13 -401 -98 177 53 217 412
3346 412 -165 49 -152 46 214 360 436 63 64 29 -101 -108 79 -95 35 -9 0 34 -155 207 -32 280 246 367
3370 367 8 18 -258 61 -193 -167 180 155 192 -123 112 -206 -283 -72 306 30 35 -270 -117 -98 -153 -155 104 266
3394 266 -158 -175 118 -205 -175 183 288 20 59 353 -151 40 -241 99 71 -32 112 106 -170 -139 -83 -357 112
3417 112 122 45 4 194 -85 -401 -152 -256 236 303 47 187 -22 -158 225 251 186 169 -53 193 -28 34 -31
3440 -31 -290 -47 -76 141 142 30 -135 -102 -329 1 68 76 178 -77 -153 -78 -161 -431 -70 439 0 136 -222 -490
3464 -490 -108 -179 48 229 276 -115 430 -271 -35 -166 93 160 243 244 29 -337 -224 -179 211 12 289 361 -25
3487 -25 51 -286 -60 51 -64 82 49 187 -39 -90 -95 -119 317 208 15 -142 -303 -184 -282 2 -167 -307 -75
3510 -75 115 5 -468 6 -200 -240 313 -47 277 -69 -31 -125 -41 -96 -41 235 361 118 126 -340 70 180 326
3533 326 199 220 270 75 -29 -131 -230 198 102 28 -18 -177 -172 -30 -26 41 43 27 150 48 136 -1 -118 26 -11
3558 -11 366 75 152 -46 -196 243 -181 -191 233 74 14 245 -139 -153 -174 20 64 16 -39 11 -174 -316 -62
3581 -62 -172 202 250 -67 -75 32 -421 -89 -47 -140 377 -22 147 29 111 -66 -85 -6 192 108 -69 48 -294
3604 -294 -78 36 67 36 147 179 -56 -39 54 25 -104 13 98 -59 8 40 116 3 -127 184 -194 249 -71
3627 -71 -279 -45 156 32 -105 -105 226 240 -165 -277 -109 -100 -137 195 67 -55 -75 -163 -129 -78 -237 344 -200 34
3651 34 -174 139 -41 23 87 45 -44 106 -19 3 23 46 -107 145 -194 287 -192 46 -35 -65 67 -402 313
3674 313 38 478 -170 -237 145 41 -141 320 44 -115 100 -47 -193 -134 -67 123 124 -25 146 -177 -113 -106 -176
3697 -176 213 191 59 -31 -366 93 -194 63 265 673 58 -34 55 84 -30 -183 67 226 -78 224 292 -92
3719 -92 70 -294 5 -62 -38 -128 -25 135 -81 117 66 -192 -95 127 100 -134 -37 -211 -4 -3 164 -85 271
3742 271 21 -147 -57 6 -185 65 87 252 99 -23 -96 73 22 -17 219 -124 67 -372 -108 -69 -110 52 -107
3765 -107 158 -202 19 -125 -136 -152 -128 26 -74 187 126 -173 -55 -138 -152 -16 130 221 57 130 95 -37 -205
3788 -205 196 147 -158 -118 104 165 -22 64 -28 -2 -227 -162 23 6 -104 55 148 -10 30 18 -52 73 -173 17
3812 17 56 205 -52 -170 2 333 59 242 -128 -281 234 216 3 5 -79 -265 -285 107 64 -98 285 164 13
3835 13 -22 -85 -98 16 224 -53 -156 -132 -104 94 338 -52 -50 46 -119 187 -141 -307 -198 166 -55 -159 81
3858 81 73 -72 18 -136 -124 -194 58 198 282 45 8 141 59 13 330 -36 -219 320 -123 10 21 246 -109 183
3882 183 56 -32 154 -307 133 280 -362 247 17 14 78 -253 -186 159 -31 123 -375 -327 -8 -124 104 71
3904 71 17 73 150 187 -95 26 -190 -238 82 -18 298 71 -222 -106 -193 121 161 271 -98 -39 -259 -36 91
3927 91 -126 -43 16 128 271 -116 -25 -85 -479 74 28 150 91 119 54 -73 -45 -250 -12 27 -78 89 35 67
3951 67 -26 -221 -304 171 -147 40 -49 -136 356 160 165 -65 109 211 140 23 -20 -57 -23 -64 205 48 -379 120
3975 120 160 -143 -350 18 34 150 -202 19 23 -82 76 27 -135 117 -166 -148 -52 27 -344 -130 -36 -189 -108
3998 -108 -177 47 -329 83 -75 -144 -118 50 173 160 -277 -245 81 20 76 196 -338 95 -38 276 55 -35 73
4021 73 114 110 -193 -125 -141 -225 -32 104 250 244 -407 14 -213 130 74 124 268 152 28 124 -90 -190 56 -196
4045 -196 -5 -27 149 -115 -102 -65 -11 268 43 61 -113 -184 -303 -74 41 -70 292 45 92 67 -189 188 408
4068 408 -26 50 -10 -290 -88 137 231 51 41 201 213 -140 98 -143 -405 37 -127 -161 -12 183 71 -6
4090 -6 -156 49 13 15 88 115 292 271 220 -46 -202 -48 200 88 136 -25 -29 -103 -197 -34 -119 381 215 45 63
4115 63 59 -80 66 151 95 1 -71 23 116 -94 -27 -3 86 -32 98 29 16 -325 -26 160 15 -71 27 26 40 -85
4141 -85 182 112 6 -64 27 43 -79 -8 62 200 74 128 266 -68 52 -147 155 -254 40 -110 265 -146 -172
4164 -172 -123 -311 -218 13 94 3 98 -205 110 -173 -298 -23 309 -90 -56 -39 126 -263 27 -150 330 -71
4186 -71 88 -246 119 156 -53 212 127 -2 13 1 164 28 28 -177 244 290 -518 -43 17 75 8 -105 221 -3
4210 -3 223 -146 42 254 -18 -193 -106 255 39 -67 -140 150 -312 -239 -254 252 103 137 32 -246 232 -39
4232 -39 58 21 -281 -139 10 160 -182 -167 -171 -1 317 -34 128 -200 -161 -74 -21 82 252 -85 132 -158 -462
4255 -462 -61 -66 -119 30 275 -82 -285 -121 -76 -526 91 53 -18 -131 303 -32 -250 50 -195 -70 -54 -4 88
4278 88 -114 -13 428 -29 64 153 -69 381 64 -76 -216 -98 249 220 8 -16 137 -91 -35 -76 -145 11 137
4301 137 -255 -77 -161 116 -64 -90 92 -186 -113 -38 10 35 94 -130 167 -152 14 -465 19 -12 49 7 -96
4324 -96 -118 279 237 178 -164 -282 179 -28 89 -154 170 350 -23 -41 144 -46 46 52 240 -65 -153 150 384
4347 384 -153 166 4 -55 96 -100 162 11 -75 -144 149 -183 137 -66 113 -69 102 21 -94 163 -325
4368 -325 -118 -211 -165 -282 120 165 -179 -278 112 6 -111 -327 -39 263 -39 14 -321 -82 26 -79 76 15
4390 15 105 142 184 79 -193 -91 100 -46 182 48 -66 -76 72 -22 -33 -186 -63 -33 130 -82 -31 -10 -226
4413 -226 8 -277 -200 -275 95 297 -36 -215 177 -48 -264 5 65 -255 -150 -168 -175 -29 223 -85 -50 270
4435 270 -108 -6 -123 -69 69 -109 -55 -92 91 33 7 -306 47 90 -73 110 162 -79 143 -455 98 -67
4457 -67 -100 -41 338 101 106 18 56 56 10 -36 -109 32 225 -195 -172 164 -44 474 0 197 -123 -156 -26 123 24
4482 24 -189 0 107 115 -26 60 -354 113 -67 247 -130 213 -131 190 -278 -59 149 70 77 242 -35 -227
4504 -227 -10 95 -178 -194 161 75 91 3 -195 87 239 311 69 90 129 103 182 -168 -100 -181 -66 -120 -179 -272 120
4529 120 29 296 68 8 135 156 -68 -46 31 -181 136 159 -93 65 132 -212 209 -239 -236 -106 32 209 -105
4552 -105 -101 -96 -170 199 27 166 -189 65 324 330 -231 27 79 -25 62 150 154 -195 46 59 -158 148 47 -1 -320
4577 -320 -80 -290 124 21 -98 -44 -37 -370 171 -147 95 41 -135 78 156 77 -27 109 -98 -269 96 -278
4599 -278 62 33 -325 103 142 -4 -63 -64 -148 148 34 -181 -180 -23 -28 6 -94 157 165 -118 -303 84 55 196 120
4624 120 191 20 305 -6 -73 -80 70 178 60 62 -85 -131 189 57 18 128 -53 43 -21 -31 7 249 45 -73
4648 -73 -143 -106 11 15 -138 255 37 69 -18 113 -251 181 71 -112 -290 63 -92 -139 136 150 313 100 -15
4671 -15 -4 211 -12 -27 -166 -2 93 147 -36 144 90 174 -9 52 -317 126 -1 20 140 -49 120 13 163
4694 163 23 -68 -135 -93 68 219 -126 38 -98 -125 -22 358 -237 133 -142 26 -58 -203 28 18 -383 -147
4716 -147 248 -194 -138 -96 -140 -251 -170 26 -38 -93 -51 253 -138 260 -32 250 2 -317 -212 -69 26 46 -124
4739 -124 -189 214 130 68 -124 -150 -26 -61 -141 -18 -49 -161 -110 42 -139 292 280 126 128 -74 -405 -101 -92 103
4763 103 272 245 -94 7 251 92 53 -65 392 -308 -58 -85 -89 -100 -73 -138 14 -222 69 -146 78 -146 -121
4786 -121 -29 -22 121 305 -12 142 113 178 -94 -56 -137 -41 96 -35 -57 155 141 285 19 -91 -327 -383 115 152
4810 152 -15 -96 99 59 -56 -168 160 220 -125 88 427 -31 150 94 -191 175 -10 29 430 13 3 -167
4832 -167 -217 -135 173 26 -88 156 -24 263 -136 437 178 -198 -168 301 223 103 29 -66 195 4 -155 -32
4854 -32 133 -255 210 -302 -40 -125 78 -109 61 -21 -137 354 188 -62 -138 -92 -47 -104 78 -136 -79 -42 -61
4877 -61 154 -393 28 97 196 -7 -339 -70 9 114 57 84 333 201 74 -25 -5 22 -128 1 78 -116 -117 81
4901 81 0 148 6 319 -37 67 -132 -153 -289 109 112 -30 254 -11 45 -119 1 -82 -128 100 125 162 -154
4924 -154 100 -242 -194 35 -168 84 4 -139 -235 -202 18 228 212 -240 245 -124 -27 123 -208 -440 3 -152
4946 -152 -11 -117 -1 -8 49 -276 -16 -290 -65 -188 87 174 -124 33 6 -154 -21 -214 -234 34 -20 136
4968 136 -228 189 -148 114 49 -222 27 133 54 -50 -449 106 101 353 -49 -99 30 16 -40 -74 -173 207 -132
4991 -132 137 74 44 176 188 -53 -155 -105 157 25 -135 118 85 -165 -109 102 -117 44 150 26 -144 -4
5013 -4 57 36 221 143 -150 -33 496 -160 118 110 90 -6 -60 -43 -98 -92 -111 -78 -13 55 -77 321 41 88 151 85 256
5040 256 40 90 -33 -18 -217 28 -259 190 -57 -76 61 -9 -231 319 -121 -298 53 -228 246 -215 -35
5061 -35 258 137 -33 108 -238 -206 -121 -46 198 90 208 68 -24 -110 -259 -113 -31 310 -213 -112 -33 103 -164
5084 -164 -142 112 -143 26 -82 -167 -59 35 -30 20 105 264 139 258 -141 155 -32 60 374 -59 -46 -366 -174
5107 -174 72 38 -313 128 -96 81 237 24 -197 -32 79 103 122 -58 99 -390 63 -47 5 106 199 -83
5129 -83 153 -213 -5 79 22 -106 -120 22 -8 163 181 47 -214 -30 -171 -65 33 50 -48 252 41 336 472
5152 472 15 89 -61 105 -50 -91 13 -200 -289 55 177 45 196 65 183 34 -4 51 -356 141 -47 -131
5174 -131 -52 153 88 52 -167 118 28 -132 63 -91 -97 11 -36 -201 197 195 222 177 2 399 -317 -97 -26 -212
5198 -212 230 88 -134 -221 170 120 -153 115 -60 108 7 -143 -1 90 -49 -1 -227 -225 12 96 -197 136
5220 136 -65 -18 148 -107 149 -118 -65 -65 -116 7 243 113 190 9 312 -231 -444 98 -489 101 137 -8
5242 -8 244 -171 250 499 8 -138 -17 25 -52 60 -75 -127 -63 -125 289 164 -17 -115 8 -188 -229 97 -225
5265 -225 59 -69 47 -43 158 -188 -221 154 113 -73 -241 11 155 -52 44 -200 64 -169 160 5 -137
5286 -137 -85 229 -71 -234 -259 180 -139 -168 -72 -145 -72 76 146 41 -94 -144 117 111 5 -410 219 18 -134
5309 -134 467 122 12 105 175 -30 -26 124 -197 -165 -277 -187 -208 243 79 36 -25 -94 176 -45 -78 -252 -118 -48
5333 -48 -176 -154 48 -129 107 -56 -83 -126 -150 25 -238 71 -134 -188 15 22 -71 45 -40 -26 -21 93 201 194 439
5358 439 152 62 -146 84 32 244 -49 -261 -142 -225 121 -78 224 -64 -108 -50 -93 134 299 34 16 -44 -5
5381 -5 100 -204 -95 -47 -97 -23 121 55 -206 -205 -250 -44 -13 -86 175 161 109 -19 15 135 -174 -106 245 176 196 -90
5407 -90 -231 -2 27 192 -22 -173 -188 -273 65 -164 330 -126 -244 102 169 -113 44 -130 -111 -2 145 -22
5429 -22 -180 154 127 179 -128 47 204 91 353 -137 -71 -184 417 -52 40 24 -195 21 -89 173 60 289
5451 289 -128 103 -34 -63 -28 96 -149 -1 28 239 203 -163 44 115 151 96 -106 33 57 -137 -133 28 -57 -520
5475 -520 -115 -39 140 -77 -99 -35 -195 13 -53 -242 102 52 4 -101 257 -356 147 -182 -264 -193 167 -234 38
5498 38 146 -96 -255 -37 -121 -6 -133 -15 -63 -340 -136 -52 24 127 -330 12 -128 61 -82 -12 -119 -438
5520 -438 242 41 -81 -253 -250 -207 -46 63 -239 17 163 165 -100 -33 -139 196 -230 47 -11 62 36 49 -360
5543 -360 -125 -74 125 -280 -287 75 7 -7 -9 377 156 -84 159 -259 -211 -179 -38 30 -357 233 14 144 338
5566 338 -47 -195 71 223 -104 15 -41 -80 47 -84 -71 -373 96 64 -50 -3 -142 3 -35 -14 95 -176
5588 -176 1 123 197 4 -194 86 4 -138 148 65 -183 -186 134 45 -11 -181 217 134 64 119 91 -123 -36 166
5612 166 103 278 201 22 55 191 -77 336 269 174 66 274 -27 -11 -288 -87 28 84 301 106 73 -30 145
5635 145 53 -217 -178 -54 26 117 -368 252 -144 -128 59 -28 -186 -163 -10 -94 -70 446 197 378 193 21 -172
5658 -172 266 238 67 88 -54 136 122 -98 -112 -43 -83 116 -65 -60 -109 69 -63 -225 514 79 -262 175 -114
5681 -114 -81 97 20 129 99 164 55 258 -44 -229 105 115 128 -54 108 185 -163 -152 -69 -159 -223 -323 68 -39
5705 -39 116 75 254 -89 -178 -368 -43 156 -133 -30 21 98 218 121 -28 -103 -118 -326 -280 -489 54 -105 -245
5728 -245 156 105 -42 -118 -29 14 103 -159 159 -108 43 142 126 131 -32 -24 88 44 -300 -56 -187 -269 -226 -243 218
5753 218 -79 -342 -199 172 55 328 -140 269 -123 -69 -66 -334 47 155 56 -47 331 -145 21 103 68 88
5775 88 184 21 -96 79 52 -1 -353 362 -43 -280 362 95 327 -108 136 -233 32 -8 72 24 -91 123
5797 123 -224 10 235 -68 -72 -151 -172 -172 124 64 193 -45 -60 64 -22 -51 -4 147 -98 -330 303 -74 -148 153
5821 153 1 -72 12 -168 21 -147 -88 -196 -162 -8 -391 67 109 -53 -25 -16 -51 167 20 99 317 -73 -50 46
5845 46 -47 -58 20 75 193 88 210 113 101 -309 80 -144 148 116 147 34 -191 -167 113 131 -38 2 80 154 -100
5870 -100 3 -162 90 279 -70 127 101 314 240 150 -104 -266 -214 -16 319 31 -47 164 135 18 241 386
5892 386 -52 236 -58 280 -100 -194 57 -34 68 74 -310 73 -41 -26 321 86 222 146 211 -213 -23 -396
5914 -396 5 53 -141 -192 -199 -146 108 162 -198 127 185 341 63 64 -149 -98 0 -134 -92 57 -219 -60 106 -282
5938 -282 -181 71 -300 -373 -18 -60 49 -253 -60 114 -74 -134 168 61 -63 -97 -444 -234 342 -52 -46 15
5960 15 -184 130 -91 -33 285 173 305 67 249 105 271 -36 13 154 -116 134 -130 60 115 -182 -33
5981 -33 -48 73 193 54 71 -159 -173 172 -3 -190 -108 74 -351 89 -241 111 -6 -120 -10 196 -24 184
6003 184 269 195 124 -122 104 -140 72 73 134 -214 -80 -98 17 -4 -62 137 -8 116 28 -10 43 -171 -196 -40
6027 -40 107 -1 -198 -114 189 203 -38 -251 166 184 8 -178 -48 -161 -132 378 -289 193 -261 -117 -232 -208
6049 -208 -133 -120 146 88 -98 -32 25 -263 76 122 -165 63 7 -245 -67 -209 -224 -73 -346 233 174 -201 18
6072 18 320 292 190 -217 26 336 99 218 243 -228 -163 196 -257 39 -139 -46 -192 -136 181 -218 139 -123
6094 -123 -31 136 116 62 374 209 -83 -189 145 22 -55 -126 -232 135 242 111 186 62 -159 142 228 179 -285
6117 -285 17 105 2 -78 138 6 -41 42 -136 85 -74 -152 -3 117 -64 143 94 167 -174 2 -261 64
6139 64 21 -11 224 -112 59 51 140 183 85 21 -57 114 -15 92 -85 177 102 44 -107 -306 -505 150 -58 -262
6163 -262 136 88 106 34 -2 55 112 -47 -73 -119 -208 -31 243 10 87 -221 -91 -101 -284 -14 -21 109 9 -13 -59
6188 -59 4 153 156 176 279 49 -55 -268 66 146 296 45 95 178 -168 95 220 17 -83 144 166 -146 52
6211 52 -139 -230 129 45 51 28 11 93 90 -37 -140 65 -230 -141 117 200 215 -83 134 219 258 -324 133 76 212
6236 212 35 9 -98 -123 -130 89 38 -53 -8 25 -79 -82 -101 339 -14 -3 -116 -261 -117 -73 18 -92 -99 -233 24
6261 24 -188 -142 233 -268 -7 17 -2 -72 -135 -151 -77 -137 108 -379 27 273 181 -155 -219 -49 -381 -96 -282 259
6285 259 -312 102 -155 -57 249 -35 -66 -5 207 -203 75 -17 269 -258 -212 128 -17 62 46 -141 -289 72
6307 72 -82 -12 -62 233 194 -147 -40 66 55 -34 -214 -193 201 13 66 -196 139 -46 -230 88 184 244 -63
6330 -63 4 71 -116 -118 -105 268 121 331 171 -16 314 265 102 286 64 -48 -39 -97 107 50 -143 -117 56 -182
6354 -182 -174 -8 154 157 49 203 -343 -353 -114 -190 149 182 221 154 -108 -173 -106 406 45 -197 33 168 -101 15
6378 15 292 -102 -425 -151 129 167 257 -41 -59 35 -231 128 162 -127 135 -138 149 -65 241 -76 -45 -257
6400 -257 -123 -191 -96 168 -130 -97 -223 42 166 -229 -92 -12 -126 -116 79 20 56 -200 -21 -36 48 228 7
6423 7 80 114 -248 -88 364 55 -183 63 -10 -43 -27 -219 -512 131 55 -21 133 -120 49 12 -16 112 4 -18
6447 -18 148 17 94 99 19 33 13 181 -144 84 -143 4 -134 27 152 -266 218 68 110 -42 -32 17 -110
6470 -110 51 205 526 81 135 -89 201 134 202 36 -111 6 -303 204 -383 51 59 28 -293 -239 -14 74 60
6493 60 -305 -243 -182 -205 -57 -74 109 -299 84 -87 -329 -144 53 143 82 -23 66 -142 126 -110 304 211 -300
6516 -300 -120 -52 171 -67 -35 -23 -15 -161 167 8 -244 90 -135 -51 0 31 -343 -41 -166 34 179 -147 128
6539 128 -16 205 -121 -322 6 171 -206 221 -183 -31 -67 -5 79 -74 169 197 -58 -177 -72 129 -116
6560 -116 115 78 -99 313 38 45 -108 19 143 21 50 172 -48 8 -139 -60 144 18 77 -150 -114 235 296
6583 296 77 1 4 -271 -176 -357 87 263 -19 235 -346 27 -57 -29 146 44 -81 59 196 -10 8 81 -118
6606 -118 -194 25 186 28 102 57 -75 109 -94 -103 -9 65 0 -68 -101 25 -203 -60 -185 -309 -1 -21 22 43
6630 43 -237 -103 -166 -114 -213 53 -81 -319 -331 -421 -120 -129 -153 203 169 103 -216 -67 -66 108 172 23 46 26 85 -27
6656 -27 -36 242 201 -119 -107 82 170 -65 -336 107 -105 23 -203 -139 158 102 -156 -86 54 -273 -70 51 -63
6679 -63 -395 317 166 -132 -66 84 277 214 223 -107 -117 -247 62 131 5 -99 -152 -257 357 16 61 -215 152
6702 152 -161 149 -59 143 53 41 -206 251 274 -75 -220 51 71 -3 -1 18 79 298 -24 -78 -117 -389 27 -49
6726 -49 -156 27 33 168 81 -279 318 111 -100 -89 163 287 339 -27 -160 76 100 -294 119 129 -102 -95 14
6749 14 -73 -5 112 250 -76 71 263 51 -201 15 192 -340 62 124 129 -319 281 -60 -232 221 151 -228
6771 -228 97 131 -207 -27 -300 143 3 -234 -55 -62 -262 170 129 40 17 152 354 -280 13 -1 -229 -94
6793 -94 -143 -219 131 63 91 -211 -100 -165 -31 68 -105 -59 -139 64 -146 -424 11 269 132 -150 136 342 -264
6816 -264 4 44 141 195 -19 -191 -154 -395 82 -261 -102 -147 -284 -272 226 102 15 -244 -45 114 77 190 104
6839 104 -354 -122 343 103 395 -138 36 -3 22 216 46 -199 -218 -85 95 108 -88 -103 220 -77 -115 80
6861 80 52 -201 84 96 -247 -92 -111 4 -51 31 17 -94 120 -19 207 209 150 47 -18 -173 -171 -210 17 12 179
6886 179 -95 -412 65 59 69 -255 -182 176 -194 0 164 -268 -275 135 -55 -130 -200 168 -64 -138 61 -127 38
6909 38 38 106 433 248 153 -146 98 80 -281 -124 -98 -5 113 104 10 -78 -116 -158 194 -67 -81 -3 -209 -179 67 48
6935 48 -23 91 44 -6 5 193 -159 128 150 138 39 158 23 -3 55 -168 -53 276 86 149 73 -107 128 168
6959 168 -108 64 -73 -110 -155 36 82 -6 3 1 236 -42 182 -22 141 -125 75 -69 21 -11 -252 -96 -77 136
6983 136 12 96 64 -146 152 -56 -55 -290 116 -294 -22 231 251 -266 -131 -47 -132 -253 -9 -96 -124 -87 205
7006 205 269 352 68 82 383 -58 -31 -37 -275 -162 -74 -38 -41 -7 245 181 -143 -232 -6 -38 -180 -280 -55 -86 -39
7031 -39 -178 -464 -258 100 -85 3 -436 325 -129 -24 252 -146 -288 153 139 -101 -84 -203 -125 57 -107 -100
7053 -100 119 -27 311 215 343 -64 -318 -187 -413 -75 -22 112 44 125 -15 44 33 -12 66 45 -139 -287 -2
7076 -2 -225 64 55 155 34 -24 152 -286 311 -160 252 20 -113 -169 203 -265 -6 58 51 -86 166 -93 336
7099 336 -24 -62 -40 -100 17 165 -58 -61 -196 -28 -206 21 132 93 178 231 139 263 258 86 -43 121 -34 -178
7123 -178 307 41 -32 -112 7 288 -16 125 -169 174 33 217 0 76 68 27 116 84 -165 16 380 159 -64
7146 -64 224 188 -27 130 186 -58 -336 30 -344 -41 -202 -111 127 64 -250 -2 -297 -342 -430 -124 -42 -166 110
7169 110 -69 8 284 -27 -72 66 251 -273 -98 -55 63 -44 -196 117 -210 -122 154 86 -176 -265 168 -78
7191 -78 7 -339 36 -297 -303 -84 182 -215 -17 89 -144 214 64 0 100 -80 -2 -74 -47 239 -135 -123 -59
7214 -59 122 -145 -136 13 -242 87 8 -240 94 -142 14 -220 274 -254 317 300 12 26 369 -98 52 357
7236 357 -61 195 -77 166 158 -111 -222 -414 159 294 31 -19 -63 125 -235 30 14 -121 -77 -203 93 -11
7258 -11 14 304 -46 -84 101 -264 58 -366 -282 135 55 92 28 3 -34 -140 108 -103 286 -249 -46 157 38
7281 38 -87 52 86 -159 84 316 116 102 14 -198 162 46 161 154 56 -52 72 -232 251 -4 192 270 239
7304 239 77 113 -27 12 -185 301 -76 184 267 -91 -206 203 137 30 -48 7 350 -50 -123 -485 -182 128
7326 128 176 231 -186 -2 -147 292 139 89 168 -49 -50 47 87 -294 -136 364 150 -54 -285 -25 229 359 -272
7349 -272 -190 173 253 -160 -47 -6 -166 -11 -17 -141 152 -161 -322 -78 112 -136 139 -32 -183 198 -109 -78
7371 -78 69 -92 104 61 143 166 -192 -228 27 135 156 101 54 57 -10 124 132 -136 -218 187 -178 -165 273 -79 206
7396 206 -252 -18 23 -118 101 143 166 -46 -21 -152 108 -183 -66 -21 28 16 -158 -120 -29 -189 -135 93 484
7419 484 229 -62 -275 -28 -2 30 -102 177 33 125 200 388 -77 -146 -77 22 -317 -5 182 -220 -25 188
7441 188 -43 -179 63 -270 -360 18 117 223 -164 -114 -40 30 -92 -226 15 -235 -203 -86 359 -278 -44 -303
7463 -303 85 -241 9 -187 153 -23 -300 33 -129 -328 139 66 -30 142 -118 -220 -188 206 -68 -503 -74
7484 -74 178 128 38 344 -134 -23 -134 320 66 23 15 56 -158 -44 -49 56 178 -53 -59 172 97 -166 154 31
7508 31 -94 -147 12 -142 38 -539 5 240 349 -194 21 104 14 94 -32 242 47 43 -75 30 43 -134 146
7531 146 247 132 195 78 18 -17 55 -29 289 72 202 68 31 -39 196 -135 71 -42 -312 -296 -25 -128 -165
7554 -165 -47 80 -2 -103 18 53 -14 -36 -43 67 22 35 30 -126 64 127 163 -104 29 -239 -232 -30 -84 -255 -350
7579 -350 32 -129 488 117 220 134 48 90 115 81 38 355 205 125 -9 39 -254 137 320 42 -90 150 -267
7602 -267 75 -458 -74 178 -55 37 -125 120 148 96 -199 -13 368 248 83 -142 129 299 -4 -47 -61 -157
7624 -157 195 8 -130 -137 -97 125 137 168 76 -147 21 -104 172 113 -59 14 -42 -50 -69 -140 -33 -180 78 -381
7648 -381 -60 89 -83 47 41 -35 455 -196 -294 -243 -233 -27 376 -106 151 150 81 -18 116 298 -277 90 134 215
7672 215 138 37 -205 123 147 -36 -153 21 -29 57 275 -176 119 86 185 23 -65 -35 -231 102 249 47 127
7695 127 -287 -243 -111 -119 38 3 357 -139 105 -125 -42 -119 -58 114 -22 67 -152 -168 -29 21 -144 8 -48 134
7719 134 48 -149 -141 378 -193 391 -252 102 -39 -76 -47 111 -173 -160 -301 16 63 -119 172 -56 17 -33 -23
7742 -23 58 -193 -34 -93 100 125 -61 75 -122 -130 1 108 39 -47 -286 -83 325 12 53 -72 176 -63 -188
7765 -188 228 -92 -115 -5 -18 -64 -177 -138 79 77 -1 -102 139 -76 -30 375 -159 44 156 -103 -112 218 -61
7788 -61 100 126 377 588 65 208 -174 -58 182 30 219 -109 91 149 -110 158 -4 -41 -54 255 20 193
7810 193 -9 50 135 -176 -25 -384 -199 -9 -105 165 -169 97 -243 -201 200 -83 -294 -121 126 28 92 222
7832 222 -247 -133 -80 3 156 -28 96 -155 88 37 280 247 -91 25 -93 -94 172 166 170 172 -104 -113 274 78 -147
7857 -147 62 -62 -102 -228 53 -70 140 70 180 -177 -67 -87 41 -86 -320 154 291 44 -142 -54 -74 229
7879 229 93 171 41 -35 27 -50 -103 -15 -57 -266 157 216 -197 -79 -32 -15 -22 66 -105 109 332 -178 -166 -60 18
7904 18 -102 53 -119 -26 -228 -321 7 60 -122 74 -136 -305 263 387 30 9 -142 -181 -25 29 271 -75
7926 -75 101 151 -352 110 -19 -152 122 -29 78 73 251 -109 -353 277 -4 -49 -105 108 42 -74 -140 -58 66
7949 66 -284 -33 -142 133 59 -180 143 -67 8 162 95 -137 109 60 24 -158 -3 -168 -55 65 -103 -26
7971 -26 43 24 -196 123 187 -52 123 109 145 -186 -119 -7 150 126 20 -31 -73 74 -251 -173 -18 222 -60 191
7995 191 53 136 -20 -104 92 -161 -41 -116 90 -27 148 46 68 -18 -64 -25 -68 139 156 -126 172 2 -267
8018 -267 -177 56 177 172 -57 -83 207 39 102 2 -240 -162 197 160 154 93 188 2 -164 72 122 13 22 224 -52
8043 -52 -235 3 -38 -68 -77 7 -241 39 -8 -22 312 -144 63 -7 -101 -208 -121 -9 -98 -359 163 180 -262 -217 -57
8068 -57 242 37 -198 -73 -356 -161 -7 -72 76 -58 -146 154 170 -331 325 134 -215 203 -244 38 -2 -78
8090 -78 123 -34 28 98 -54 -89 -212 -81 52 162 16 68 87 176 -231 -5 41 -120 -196 -77 149 -98 -133
8113 -133 -228 -50 -75 196 246 -255 -236 231 140 116 -135 -161 54 -110 175 -47 -214 -211 -250 -84 316 96 -53
8136 -53 -221 98 -187 265 31 -150 -8 -166 13 -264 -200 118 44 290 495 96 -282 -221 -44 34 149 181
8158 181 -246 -153 301 107 -167 -54 2 -247 107 -20 -34 -20 -19 135 124 159 179 -224 -95 157 136 23 58 -40
8182 -40 59 -156 -146 -55 24 -371 367 172 -75
8191g5
$$ Imaginary data points
##PAGE= N=2
##DATA TABLE= (X++(I..I)), XYDATA
0 0 0 0 0 0 0 0 -8 8 -8 8 -8 16 -16 24 -32 32 -40 48 -56 68 -78 88 -104 119 -137 158 -180 205 -230 260
30 260 -293 328 -370 412 -458 513 -568 633 -703 775 -862 953 -1054 1170 -1293 1437 -1599
47 -1599 1781 -1995 2240 -2531 2885 -3320 3875 -4610 5627 -7144 9647 -14540 27766 -141088
61 -141088 -444244 -278647 -32818 159526 214035 221373 109833 -91556 -271151 -272757 -142604
72 -142604 31275 177696 268172 204602 -17363 -258492 -325550 -195851 20272 191590 260011
83 260011 193077 16792 -179821 -277507 -228380 -60797 140257 273303 245296 62951 -154943
94 -154943 -264585 -221165 -77279 90491 219762 244425 129770 -70316 -228601 -250654 -137473
105 -137473 41741 201835 264237 178210 -23149 -214526 -268485 -159805 24188 175521
115 175521 233092 179754 31041 -146966 -248413 -201851 -38509 134813 225085 200756 75560
126 75560 -97491 -228545 -229989 -92628 93605 215629 217200 109471 -57124 -202252 -237932
137 -237932 -132344 51247 195998 224456 134496 -21434 -166877 -223940 -155646 1280 153079
148 153079 217956 168534 32424 -124671 -216794 -186295 -45552 119570 213399 192636 73516
159 73516 -85597 -202633 -205585 -84463 87388 203082 202303 97291 -52537 -172824 -198768
170 -198768 -111931 37823 162726 199043 135324 3465 -137961 -209697 -158076 -8382 143584
181 143584 207505 157903 27758 -116074 -198436 -168544 -43143 102296 186420 170908 67576
192 67576 -75778 -182090 -185953 -80793 65976 167465 176742 96428 -35307 -152775 -190431
203 -190431 -120940 18571 147180 191737 128291 -6446 -137545 -190342 -135547 -7699 119544
214 119544 177829 140061 28752 -96483 -172077 -155480 -53525 81421 172670 165860 63656
225 63656 -72820 -164781 -164628 -75604 52173 150371 165987 91590 -32803 -139630 -171192 -108927
237 -108927 14756 131167 173320 117419 -4198 -121500 -169804 -125066 -12432 103399 159961
248 159961 129566 31022 -84249 -156864 -145474 -52789 71273 155508 150952 62310 -60869
259 -60869 -149169 -154979 -73815 46975 138012 151575 83507 -27537 -123726 -153539 -99367 10089
271 10089 114792 156295 110515 4922 -103438 -153370 -118052 -17340 92476 151001 127333
282 127333 33564 -77803 -144466 -130889 -44364 65844 139679 137536 60168 -50060 -130627
293 -130627 -138241 -69521 37333 123570 143099 83763 -20919 -113252 -142128 -92133 8879
304 8879 105430 143547 102398 5357 -93676 -140322 -109413 -17394 83081 137189 115028 30499
316 30499 -69181 -130943 -121353 -44946 56431 127205 126606 56027 -45292 -120781 -129665 -66682
328 -66682 32270 112299 130196 76351 -19050 -104007 -131147 -86084 5865 93842 130169 94714
340 94714 6841 -84479 -129328 -102132 -18400 74088 124686 106838 30584 -62275 -120917 -112964
352 -112964 -42289 51154 115767 116275 52461 -39333 -109404 -119348 -63311 26945 101752 120248
364 120248 72122 -15594 -94068 -120625 -80783 2713 84801 119489 88430 8831 -75630 -117767
376 -117767 -94891 -20683 64765 113959 100450 31468 -54693 -110394 -105080 -41827 43651 104690
388 104690 107344 51090 -32678 -98483 -110086 -61237 20980 90954 111111 69245 -10658 -83770
400 -83770 -110958 -77150 -1228 75266 109576 83245 11345 -66944 -107625 -89159 -21864 56670
412 56670 103819 93574 32039 -47163 -100083 -97602 -41192 37390 94527 100097 50220 -26918
424 -26918 -89465 -102240 -58050 17500 82968 102700 65789 -6301 -74970 -101327 -71718 -2159
436 -2159 68413 101451 78173 13071 -58995 -97380 -81860 -21127 51572 96307 88169 31864
448 31864 -41389 -90561 -89400 -38763 32980 86820 93333 48719 -22296 -80186 -93536 -54945
460 -54945 13726 74784 94544 62294 -3887 -67670 -93579 -67626 -4644 60540 92081 72701
472 72701 14583 -52013 -89832 -78151 -22921 44497 86970 80949 30474 -36240 -82835 -83647 -38556
485 -38556 27078 77445 85100 45676 -18438 -73176 -87261 -53144 9942 66919 86657 58356
497 58356 -2056 -61348 -86261 -63455 -6611 52906 83224 67695 15275 -46303 -82715 -73054
509 -73054 -22990 39236 79448 74688 29288 -32757 -75717 -76776 -36072 22989 69996 78480 43786
522 43786 -15781 -66623 -80332 -49538 8505 61213 79776 53819 -1386 -55305 -78075 -58747
534 -58747 -7408 47985 77167 64188 14896 -42610 -76223 -66705 -20389 36572 72847 68408
546 68408 27484 -27973 -67744 -70508 -34775 20547 65391 73791 41475 -13442 -60515 -73510
558 -73510 -45093 7917 55959 73303 50658 1681 -48486 -72088 -55134 -7688 44466 72020
570 72020 59782 15397 -37066 -68592 -61386 -20121 31677 65548 64724 28675 -23249 -62068 -66161
583 -66161 -33479 18069 59469 68346 39205 -10934 -54213 -66582 -43090 4209 49385 68024
595 68024 48767 2730 -43742 -65736 -51297 -9508 38434 65438 56347 15518 -33102 -62638
607 -62638 -57110 -20780 26661 60067 60255 26993 -20738 -56862 -61422 -32313 15334 54289 61722
620 61722 35996 -8618 -48043 -61719 -41813 2351 45142 62016 44426 3414 -38804 -60926
632 -60926 -49541 -9654 36151 60252 50483 13867 -29549 -56891 -53385 -20881 23704 55220
644 55220 55426 24862 -19295 -52359 -56375 -29264 12910 47170 56464 34751 -6705 -44975 -58113
657 -58113 -38732 1472 40519 56775 41498 3484 -36980 -56742 -44467 -8537 30971 53552
669 53552 46576 14108 -26377 -53104 -49949 -19710 21154 49995 50793 23029 -16846 -47069 -51518
682 -51518 -29163 9973 44087 53620 32331 -6708 -41550 -52541 -35735 630 36299 51951
694 51951 38587 4034 -31993 -50896 -42140 -10089 27584 49905 44214 14323 -22997 -48508
706 -48508 -46568 -19276 19127 45730 47051 22502 -14139 -42846 -48334 -27115 9860 40102 47946
719 47946 29466 -4725 -36335 -48221 -33544 -717 32586 47742 37021 5168 -29880 -47153
731 -47153 -38624 -8861 24649 45164 41409 13873 -21397 -44445 -42189 -17201 16147 40953 43545
744 43545 21837 -12533 -39687 -44275 -24543 7878 36080 44565 28180 -3993 -33254 -44473
756 -44473 -31680 -2032 29314 44316 34100 4802 -26844 -43541 -36927 -9799 22808 42551
768 42551 37472 11505 -19638 -39321 -38381 -17155 13508 37532 40500 20702 -10827 -36210 -41377
781 -41377 -23956 6447 33711 41639 26111 -3187 -30667 -41354 -28650 -990 26801 39939
793 39939 31292 5495 -23438 -39606 -33949 -9206 20429 38046 35141 13060 -16804 -37392 -36522
806 -36522 -15410 13530 34154 36893 19359 -9339 -32844 -37782 -21947 5788 30175 38318 24858
819 24858 -2318 -27764 -37492 -26756 -1755 24394 37227 29517 5111 -21751 -36210 -30994 -8846
832 -8846 18465 35583 32809 11259 -15802 -33396 -32670 -14368 11323 31443 34152 18054 -8141
845 -8141 -29605 -34894 -20806 4643 27748 35526 23042 -1523 -25237 -34782 -25052 -1724 22427
858 22427 33694 26750 5463 -19289 -33469 -29141 -8698 16857 32712 29746 10783 -13565 -30740
871 -30740 -31249 -13833 10297 28892 31326 16790 -6797 -26944 -32278 -19546 3754 24736 32460
884 32460 22141 -1030 -23211 -31826 -23239 -1958 20557 31380 24950 5152 -17771 -30509 -26225
897 -26225 -8145 14696 29499 27929 10657 -12580 -28579 -28506 -13054 9241 26877 29398 15494
910 15494 -6897 -25390 -29508 -17772 4172 22925 29612 19676 -1106 -20952 -29331 -21494 -2308
923 -2308 18709 29182 23384 4715 -16465 -28739 -24344 -6858 14276 27431 25620 9464 -11167
936 -11167 -25619 -26313 -12267 8686 24831 26811 14575 -6159 -23034 -27463 -16552 3735 21669
949 21669 27556 18046 -963 -19444 -27076 -19798 -1734 16715 26664 21898 4756 -15302 -26730
962 -26730 -22507 -6650 12620 25149 23781 9171 -10745 -24080 -24112 -11013 8084 22500 25007
975 25007 13455 -5619 -21429 -25259 -15445 3222 19680 25088 16960 -913 -17461 -25359 -18628
988 -18628 -2114 15989 24946 19865 4160 -13740 -24040 -20928 -6439 11483 23017 21816 8388
1001 8388 -9305 -22061 -22256 -10969 6908 20803 22991 12488 -4666 -19280 -23391 -14602 2563
1014 2563 17957 23320 15950 -224 -16021 -23023 -17220 -2098 14257 22439 18669 4260 -12185
1027 -12185 -21972 -19708 -6285 10542 21380 20120 7890 -8202 -20229 -20896 -10056 6059 19198
1040 19198 21362 12011 -4150 -17524 -21598 -13440 2033 16665 21429 14411 -197 -14746 -21265
1053 -21265 -16000 -2314 13038 20835 17301 4137 -11057 -20356 -18357 -5776 9630 19674 18922
1066 18922 7654 -7827 -18648 -19164 -9450 5703 17522 19628 10957 -3593 -16544 -20103 -12136
1079 -12136 1305 14902 20046 13658 194 -13434 -19662 -15156 -1891 12062 19332 16133 4004
1092 4004 -10037 -18813 -17048 -5655 8458 17843 17685 7446 -6681 -17018 -18068 -9122 4646
1105 4646 15928 18289 11065 -3102 -14742 -18500 -11876 1224 13592 18589 12851 512 -12414
1118 -12414 -18402 -14017 -2029 10610 17894 14964 4246 -9062 -17188 -15836 -5454 7593 16512
1131 16512 16226 7315 -6005 -15813 -17042 -8555 4112 14416 17123 9735 -2746 -13639 -17102 -11170
1145 -11170 1193 12562 16847 12232 440 -10877 -16837 -12982 -2430 9820 16548 14041 3959
1158 3959 -8355 -15838 -14714 -5118 6734 15360 15172 6747 -5419 -14434 -15336 -7745 3650 13394
1172 13394 15712 8894 -2302 -12523 -15795 -10316 945 11512 15662 11297 472 -10368 -15349
1185 -15349 -12227 -2149 9002 15251 12741 3663 -7701 -14637 -13786 -4960 5910 14005 14246 6321
1199 6321 -5082 -13267 -14410 -7395 3557 12690 14468 8336 -2115 -11502 -14783 -9539 600 10529
1213 10529 14448 10605 676 -9168 -14475 -11243 -1799 8053 13968 12169 3157 -7244 -13441 -12591 -4579
1228 -4579 5822 12848 13051 5973 -4412 -12333 -13337 -6939 3208 11289 13878 7698 -1879 -10538
1242 -10538 -13295 -8907 303 9808 13559 9667 866 -8507 -13536 -10484 -1981 7597 12638 11171 3383
1257 3383 -6027 -12361 -11856 -4475 5246 11969 12390 5673 -4071 -11423 -12501 -6524 3071 10563 12369
1272 12369 7716 -1721 -9613 -12763 -8505 275 8840 12839 9133 769 -8321 -12532 -10005 -1817 6913
1287 6913 11903 10476 2889 -5961 -11509 -10904 -4155 4805 11038 11363 5243 -3540 -10615 -11389 -6253 2630
1303 2630 10025 11552 7222 -1517 -8826 -11700 -7814 114 8202 12134 8539 943 -7436 -11269 -9315
1318 -9315 -2225 6480 11175 9966 2999 -5310 -10560 -10279 -3779 4262 9991 10204 5087 -3242 -9555
1333 -9555 -10696 -5585 2327 9216 10952 6707 -1294 -8052 -11137 -7845 268 7499 10966 7937 1196
1348 1196 -6514 -10086 -8844 -2231 5898 10208 9134 2834 -4770 -9883 -9542 -3791 3498 9532 9811
1363 9811 4683 -2968 -9000 -9879 -5546 2000 8473 10166 6295 -651 -7352 -10003 -6747 -17 6960
1378 6960 10477 7428 887 -5954 -10004 -7879 -1742 5513 9471 8386 2625 -4565 -8951 -8749 -3459
1393 -3459 3601 8696 9082 4273 -3033 -8270 -9365 -5127 1578 8249 9655 5719 -800 -6949 -8913
1408 -8913 -6345 -31 6375 9334 7150 1047 -5923 -9087 -7582 -1581 5044 8824 7947 2655 -4010
1423 -4010 -8651 -8299 -3093 3339 8120 8593 4077 -2479 -7444 -8690 -4632 1017 7493 8723 5400
1438 5400 -831 -6740 -8833 -6224 188 5756 8496 6689 940 -5003 -8431 -6912 -1736 4396 8253
1453 8253 7347 2541 -4091 -7744 -7531 -3206 3233 7588 8004 4234 -2201 -6674 -7942 -4343 1125 6467
1469 6467 8170 4966 -768 -5973 -7914 -5477 -64 5506 7848 5924 759 -4819 -7783 -6674 -1507
1484 -1507 4368 7409 6866 2412 -3332 -7613 -6854 -3102 3060 6771 7419 3559 -2009 -6628 -7325 -4033
1500 -4033 1418 6304 7300 4696 -725 -5459 -7550 -5036 151 5457 7180 5613 836 -4188 -7429
1515 -7429 -6007 -1427 3673 7064 6221 2228 -3328 -6871 -6767 -2899 2607 6360 6735 3326 -1701 -6219
1531 -6219 -6930 -3989 911 5833 6943 4201 -391 -5174 -6860 -4947 -35 4796 7202 5404 639
1546 639 -3889 -7046 -5649 -1484 3592 6460 6115 1899 -3009 -6528 -6282 -2793 2568 5720 6313 3194
1562 3194 -1702 -5947 -6615 -3304 1017 5420 6508 4219 -834 -5003 -6608 -4597 -91 4563 6422
1577 6422 5134 766 -4216 -6569 -5471 -1247 3306 6153 5431 1663 -2897 -5938 -5804 -2280 2301
1592 2301 5779 6059 2982 -1610 -5162 -5883 -3396 709 4709 6103 4067 -299 -4596 -5899 -4247
1607 -4247 -238 4104 6164 4678 597 -3597 -5916 -4885 -1314 3168 6027 5069 1788 -2549 -5517
1622 -5517 -5584 -2171 1951 5236 5504 2856 -1807 -4780 -5832 -3508 615 4967 6051 3670 -570 -4508
1638 -4508 -5612 -4116 -181 3848 5618 4405 692 -3454 -5682 -4584 -1381 2910 5306 4930 1782
1653 1782 -2512 -4974 -5078 -2100 1817 5096 5138 2645 -1601 -4698 -5425 -2979 967 4113 5358 3311
1669 3311 -163 -3667 -5133 -3743 -397 3469 5261 4026 434 -3011 -5180 -4155 -1090 2660 5334
1684 5334 4289 1479 -2119 -4865 -4535 -2316 1896 4795 5172 2534 -1480 -4341 -4976 -3063 1056 4162
1700 4162 5203 3115 -119 -3669 -4734 -3329 115 3254 5033 3588 820 -3059 -4735 -4315 -1205
1715 -1205 2447 4745 4243 1485 -2066 -4472 -4537 -1957 1761 4361 4455 2399 -901 -4199 -4318 -2814
1731 -2814 439 3748 4884 3214 -287 -3404 -4733 -3540 -135 2794 4475 3401 560 -2867 -4771
1746 -4771 -3658 -758 2355 4190 3846 1390 -1619 -4043 -4200 -2158 1399 4107 4047 2370 -1214 -3776
1762 -3776 -4201 -2697 569 3548 4165 2978 -148 -3012 -4483 -3180 -420 2813 4011 3383 640 -2530
1778 -2530 -4257 -3358 -1097 2349 3918 3503 1475 -2044 -4077 -3818 -1789 1286 3685 3756 2401 -1073
1794 -1073 -3421 -4270 -2451 593 3332 4343 2839 -166 -2993 -4110 -3068 -193 2690 3956 3162
1809 3162 681 -2232 -3796 -3164 -1114 2038 3839 3491 1560 -1213 -3463 -3602 -1683 1093 3358 3642
1825 3642 2131 -721 -3401 -3618 -2479 458 3078 3763 2668 165 -2629 -3814 -2877 -559 2186 3618
1841 3618 2864 882 -1852 -3473 -3440 -1011 1966 3610 3394 1192 -1438 -3346 -3406 -1774 1264 3662
1857 3662 3635 1804 -805 -3080 -3453 -2186 305 2859 3532 2310 1 -2447 -3629 -2705 -279 2185
1873 2185 3411 2644 580 -1696 -3374 -2716 -1070 1819 3356 3350 1376 -1374 -3018 -3415 -1486 1318
1889 1318 3132 3236 1907 -788 -2683 -3303 -2190 317 2940 3657 2432 -132 -2586 -3463 -2422 -199
1905 -199 1833 3100 2479 361 -1914 -3089 -2790 -788 1512 2932 2850 902 -1022 -2645 -3035 -1706
1921 -1706 873 2681 3236 1601 -556 -2497 -3095 -2021 36 2134 2896 2227 196 -1981 -3292 -2366
1937 -2366 -124 1956 3238 2870 814 -1743 -2939 -2638 -1101 1243 2538 2606 935 -870 -2520 -2896
1953 -2896 -1366 510 2335 3027 1724 -380 -2200 -2919 -1756 405 2017 2941 2017 -139 -1795 -2772
1969 -2772 -2306 -347 1662 2643 2124 605 -1597 -2657 -2205 -910 1614 2776 2555 962 -998 -2077
1985 -2077 -2900 -1051 888 2517 2659 1650 -458 -2220 -2792 -1725 167 1839 2799 1792 -180 -1698
2001 -1698 -2788 -2222 -111 1541 2309 1991 466 -1207 -2368 -2221 -919 1128 2313 2495 1208 -948
2017 -948 -2416 -2633 -1380 679 1896 2416 1448 -496 -1910 -2473 -1653 113 1768 2411 1893 335 -1711
2034 -1711 -2403 -1850 -230 1601 2608 2185 570 -1278 -2243 -2038 -770 1140 1846 2042 1048 -543 -1992
2051 -1992 -2259 -1235 476 2041 2251 1460 -25 -1994 -2633 -1334 159 1894 2471 1913 297 -1599
2067 -1599 -2423 -1658 -395 1265 2292 1722 483 -1036 -2273 -1766 -928 860 2329 2274 874 -995 -2111
2084 -2111 -2247 -621 553 2294 1998 1225 -383 -1308 -2175 -1281 145 1672 2045 1635 87 -1494 -2237
2101 -2237 -1674 -114 1295 2045 1776 534 -1280 -2277 -1886 -886 847 1680 1960 903 -366 -1773 -2045
2118 -2045 -772 385 2172 2343 1406 -137 -1394 -2201 -1230 -64 1487 1810 1112 120 -1143 -1919 -1350
2135 -1350 -704 1264 2137 2044 604 -949 -1790 -1738 -661 746 1539 1917 816 -479 -1642 -1996 -821
2152 -821 526 1437 2067 1416 -265 -1664 -2041 -1285 -22 1725 1847 1153 93 -1141 -1718 -1611 -402
2169 -402 806 1771 1579 761 -1109 -1962 -1881 -663 867 1652 1517 514 -687 -1351 -1778 -1050 311 1495
2187 1495 1466 1026 -219 -1573 -1767 -1471 42 1231 1728 1314 232 -1039 -1262 -1503 -439 866 1473
2204 1473 1313 224 -1002 -1785 -1861 -687 768 1655 1527 879 -749 -1406 -1738 -601 377 1299 1804 923
2222 923 -35 -1203 -1727 -1313 63 1066 1560 1426 34 -870 -1612 -1293 -489 1192 1625 1460 5 -692
2240 -692 -1535 -1564 -385 533 1270 1259 823 -282 -1434 -1402 -869 67 1212 1447 1027 -263 -996 -1576 -919
2259 -919 -75 1184 1598 1121 156 -641 -1052 -1099 -291 901 1554 1295 439 -861 -1470 -1287 -527 807 1553
2278 1553 1338 936 -413 -1502 -1616 -381 178 1292 1227 1014 76 -1404 -1240 -968 37 905 1590 1096
2296 1096 71 -1150 -1373 -878 -419 669 1467 1558 28 -588 -1562 -1277 -527 494 1197 1668 428 -434
2314 -434 -936 -1200 -587 477 1212 1376 654 -308 -1129 -1444 -797 -73 716 1314 1033 346 -734 -1719 -934
2333 -934 -59 652 1505 1225 292 -540 -959 -1022 -367 463 1174 1010 503 -253 -1173 -1318 -937 145 1278 1244
2353 1244 592 -229 -1019 -1408 -727 71 1077 1243 880 321 -855 -1259 -862 -303 636 1445 1183 761 -263
2372 -263 -1097 -1092 -383 204 1395 1007 590 -278 -909 -1190 -704 444 1430 1400 789 -187 -1247 -1362 -1043 18
2392 18 838 1506 738 -31 -563 -1206 -995 -169 478 1339 1132 200 -405 -964 -1045 -183 181 765 1463 347
2412 347 -67 -990 -1094 -723 249 934 1284 870 -34 -839 -947 -703 -178 672 1157 710 368 -580 -1047 -1036
2432 -1036 -174 672 979 980 144 -201 -1019 -873 -590 316 863 1078 571 -165 -849 -782 -637 48 1053 848
2452 848 681 -53 -844 -900 -734 110 841 1169 784 34 -728 -779 -1159 -386 393 829 911 416 -331 -1250 -882
2473 -882 -450 231 1008 1214 727 -436 -1102 -1010 -671 104 798 803 588 -176 -980 -768 -686 -99 697 1203 570
2494 570 148 -610 -955 -833 -436 396 920 395 143 -114 -974 -843 -618 411 990 870 591 -108 -896 -906
2514 -906 -282 261 394 906 819 -85 -637 -1095 -695 51 621 1083 937 334 -655 -966 -651 -299 358 824
2534 824 1058 264 -228 -772 -776 -181 515 986 1012 690 -104 -900 -896 -519 32 574 1138 519 157 -383 -518 -392
2556 -392 136 749 826 489 246 -144 -878 -994 -74 379 539 669 275 -400 -718 -1087 -397 298 888 921 406
2577 406 50 -539 -987 -223 78 493 716 166 41 -457 -418 -365 -123 631 546 481 35 -330 -529 -608 -300 475
2599 475 966 292 195 -143 -825 -947 -321 57 680 694 642 -182 -811 -840 -603 132 555 420 482 -153 -575 -810
2621 -810 -801 -351 639 918 686 78 -264 -742 -426 -319 102 676 353 126 -272 -840 -720 -180 155 502 578
2642 578 345 -268 -895 -616 -173 -2 672 532 381 -39 -669 -964 -770 62 388 516 503 318 -420 -836
2662 -836 -259 -405 351 976 487 354 -531 -620 -758 -157 69 491 790 487 -203 -380 -933 -565 47 235
2682 235 744 59 14 -435 -542 -422 58 291 502 98 104 -542 -689 -478 -191 334 792 445 189 -196 -808
2703 -808 -785 -694 116 566 590 295 -114 -494 -405 -404 -122 421 591 381 -159 -350 -635 -438 114 296 646 450
2725 450 63 -545 -595 -691 -216 474 556 384 91 -331 -405 -471 -336 339 501 571 233 56 -318 -586 -50 143
2747 143 452 614 420 33 -161 -496 -182 -49 225 439 352 2 -334 -447 -289 54 313 545 331 424 167
2768 167 -534 -771 -332 157 381 551 313 58 -488 -617 -368 -72 234 652 798 90 -675 -470 -503 46
2788 46 364 594 549 -71 -93 -501 -381 -227 457 463 602 148 -256 -600 -294 -145 140 632 792 535 -133 -300
2810 -300 -656 -195 272 517 778 197 26 -274 -693 22 27 300 500 259 132 -166 -512 -539 -177 188 227
2831 227 163 -73 -393 -303 -292 -372 149 461 347 521 47 -628 -373 -118 -83 362 557 385 -147 -261 -296 -406
2853 -406 -78 173 367 41 270 -206 -584 -459 -139 289 328 385 83 -423 -395 -462 -251 263 134 593 290
2874 290 130 -75 -433 -307 360 394 613 382 -104 -132 -233 -109 119 175 539 97 -3 -197 -338 -397 -99
2895 -99 130 273 502 -87 -118 -216 -302 -146 221 337 396 259 -348 -438 -439 -418 -178 287 375 94 -249 -10 -308
2918 -308 -233 -50 294 588 516 -124 -309 -632 -296 -154 223 469 630 419 -84 -626 -256 -235 466 451 254
2939 254 190 -203 -551 -359 -242 303 325 248 186 -221 -421 -615 -146 -124 416 610 437 159 -181 -530 48 -56
2961 -56 159 171 526 153 -356 -391 -260 82 -34 243 285 210 131 -468 -370 -368 10 115 253 130 199 290 -596 77
2985 77 -10 297 551 318 -44 -320 -196 -91 -335 335 528 765 91 211 -446 -62 -224 -139 243 77 91
3006 91 -338 -80 -514 -116 90 53 456 514 0 -127 -395 -501 44 45 345 55 300 10 -83 -465 -136 547
3028 547 497 -233 -172 -310 -569 -321 -450 345 -8 429 306 -230 -373 -367 -322 -159 660 175 263 -428 -159 -179
3050 -179 -316 122 -16 554 499 -250 -357 -472 -85 -312 225 97 -7 151 -34 -176 -125 98 210 -45 174
3071 174 267 -140 -278 -311 13 73 282 568 254 -118 -232 -216 -194 156 431 349 236 113 -182 -68 -465 -320
3093 -320 131 168 146 226 -406 -493 -144 -126 -12 195 150 85 -369 -32 -221 -93 76 37 231 156 -110 -378 -109
3116 -109 -226 -118 43 232 8 225 -26 -183 -253 105 206 23 103 168 -177 -478 -370 -108 -197 254 386
3137 386 -186 -169 -405 -247 -300 36 321 420 374 -63 -313 -277 8 -149 352 335 26 -196 -331 -252 -326 145 11
3160 11 297 198 -51 -193 -122 -122 8 152 219 400 223 1 -288 -73 -119 24 46 213 213 62 -47 -297 -501
3183 -501 208 33 65 113 13 -393 -146 -207 -23 441 241 364 169 66 -312 -362 -85 147 251 382 -88
3204 -88 -1 -271 -397 -207 -44 35 364 340 55 -536 -269 180 -49 -45 -66 97 -139 -236 -295 -316 7 -45 108 684
3228 684 299 -188 -304 -8 -83 -65 114 -38 262 -70 -252 -176 -237 227 95 264 15 311 -68 -279 -392
3249 -392 -65 163 555 -22 94 -212 -489 -286 -134 398 234 77 -29 319 -399 -491 -215 7 391 -41
3269 -41 68 -80 -290 -139 -265 236 66 33 102 31 -124 -135 -191 282 9 133 288 -212 -160 -205 -89 63 -63
3292 -63 123 120 -177 -422 -397 -155 -314 78 344 -83 324 -116 -50 -45 -357 -118 273 -33 250 -77 -300 -229 -224
3315 -224 -91 98 62 -414 -145 -223 -345 205 -64 111 6 -93 22 -223 78 -366 -54 -114 238 318 -322 -185
3337 -185 -377 30 4 301 31 375 140 64 -139 -57 1 -128 182 360 -59 -203 -158 -310 -239 78 -84 332
3359 332 227 -16 -3 47 -180 -329 -54 -73 327 153 -127 -333 -144 285 193 55 275 176 171 -4 -187 -42
3381 -42 68 48 29 208 -311 -120 -14 -88 -312 295 -318 -187 359 -42 6 -279 294 -46 213 224 206 15
3403 15 -22 -466 -119 190 315 429 204 -312 -143 -326 -176 -63 224 46 298 -72 -27 -232 -64 -11 161
3424 161 98 196 117 -381 -175 -90 -60 88 95 -15 -110 -8 -66 -27 -196 -93 180 117 -92 -273 -28 -200 -303 197
3448 197 250 341 127 69 -132 25 23 173 98 93 49 -261 -344 6 -349 98 264 308 235 353 -212 -315 11 -5
3472 -5 159 355 27 75 87 -327 -180 -345 -57 271 64 112 -104 -132 -174 139 -121 -237 220 12 -177 -91 75
3495 75 -426 -152 16 149 -43 99 151 -137 -93 -137 298 65 190 -148 388 -271 -61 -86 -45 -13 -100 189 106
3518 106 -332 -94 89 -81 29 97 393 118 -62 -162 56 -14 204 164 247 -115 -94 -215 -222 -313 -64 -37 -37 241
3542 241 -82 373 -130 -203 -19 69 32 201 173 209 -108 -62 167 220 -250 136 420 -77 -52 -320 36 158 182
3565 182 77 325 264 -283 84 -96 -278 203 482 -117 68 -71 -353 -65 -137 302 101 390 174 6 98
3586 98 -166 -179 -135 403 -43 -167 -110 -130 -375 -176 206 -122 -226 100 106 -432 49 381 -244 -47 296 68
3608 68 135 85 -260 -305 167 294 191 99 -120 -61 -42 234 -88 267 -229 -3 -68 -135 45 -219 -18 161 263
3631 263 -1 -100 -209 -477 -144 -40 80 -38 154 -132 79 26 117 -179 179 130 -128 -92 250 -108 -56 -196
3653 -196 -206 7 -18 -48 53 297 -95 -228 -259 -93 73 159 2 -123 -57 -74 -129 -201 -34 -1 213 0 -73 -92
3677 -92 -84 109 324 126 -201 236 -1 -98 -34 -156 -309 -55 -122 415 -132 144 -246 -87 366 76 293 -155
3699 -155 -31 8 79 175 178 -115 -86 181 173 -298 27 -350 -147 113 31 128 218 -87 206 -243 -122 13 -125 280
3723 280 -170 147 -49 233 -157 -86 185 499 -76 32 328 -115 -194 16 -159 82 76 -166 84 111 -383 -342
3745 -342 292 -33 281 343 125 -58 -222 134 15 20 62 -25 10 -21 99 47 -95 56 -60 123 -124 4 -256
3768 -256 36 109 -128 98 37 -139 -364 -102 54 -169 402 -58 227 162 -90 -185 169 87 245 226 -35 301
3790 301 66 -65 191 87 205 301 -52 109 8 -115 5 97 -91 241 29 258 92 -9 -129 44 284
3811 284 345 -233 -120 254 -157 -3 101 -223 -74 22 -11 81 -83 -157 -125 32 176 151 155 -6 -40 15 91 94 93
3836 93 392 49 42 -61 -51 -68 -84 114 -366 340 -170 -93 1 -17 86 -174 151 -323 106 20 -136 -313 -119
3859 -119 103 -183 22 110 -28 -71 17 -89 -166 280 -81 -1 247 -32 2 -222 -188 165 9 -86 349 -41 -36
3882 -36 136 -330 -48 168 31 -184 396 135 -93 -180 -40 15 257 35 188 106 -252 -127 278 89 30 -12
3904 -12 187 274 95 -189 -77 52 87 -127 34 -7 -9 76 -25 -222 156 -42 17 43 -182 -203 29 44 193 209
3928 209 -145 316 118 -219 58 -106 12 204 158 -126 118 27 52 65 -65 98 -234 51 221 -201 91
3949 91 320 7 -99 -19 64 127 121 -173 21 -139 77 -75 -49 -72 -143 -227 181 252 -11 -162 -399 -22 -58 62
3973 62 -199 -72 55 -62 -75 -97 3 -354 73 -136 46 -62 251 25 37 -57 -264 102 174 -119 -45 111
3995 111 96 110 169 -163 -58 -120 -32 -119 13 97 -239 18 -14 102 266 123 186 -330 169 -172 -91 238 -144
4018 -144 -121 -65 142 -237 -198 -77 -69 52 0 167 -50 85 -102 -89 -48 -26 -256 225 128 -54 -190 31 -203
4041 -203 -68 -99 -92 -199 65 85 -258 -178 47 215 12 204 -3 2 68 169 154 239 365 14 543 -135 -74 -50
4065 -50 -248 95 -220 249 222 -158 61 -87 -92 -170 10 28 122 -107 18 -391 114 13 91 -100 -10 -242 -27
4088 -27 247 19 -164 -113 120 85 -207 59 55 -48 114 264 -98 -13 244 -218 -138 41 -183 44 30 -103 -70
4111 -70 -26 -45 233 -61 -64 146 145 -181 105 190 -134 -32 132 -149 185 86 304 21 115 -107 -220 -56 -194
4134 -194 150 255 49 277 3 201 54 93 -71 191 66 -257 18 36 -35 -57 -24 -265 156 214 77 -266
4156 -266 209 57 -31 13 -306 -35 99 -172 3 -180 71 86 59 -24 -65 -123 117 -62 53 383 113 -149
4178 -149 -17 216 64 -2 286 134 -163 -82 -69 -592 -135 156 104 307 -211 7 151 -236 -72 184 -106
4199 -106 125 -222 -106 -99 -92 -114 92 -192 181 8 -31 -128 206 -139 -82 141 -164 370 -179 48 -312 -14 -91
4222 -91 214 46 -187 -108 150 3 -40 275 -17 113 91 112 -76 142 -82 233 47 -96 -141 -160 228 -104
4244 -104 -54 -362 -86 196 -87 88 -65 60 215 221 -101 206 -198 248 -55 -14 185 -141 28 -110 149
4265 149 90 75 176 62 85 -39 -120 148 192 26 187 189 -56 82 36 151 7 46 -166 -283 -25 -197 28
4288 28 34 -112 -200 2 175 45 187 -21 -281 121 -81 171 278 -192 27 -14 -354 35 28 150 221 -300 132
4311 132 -54 200 390 129 87 -53 84 96 101 370 11 -230 70 14 9 -67 9 -254 -71 65 -31 215 189 -12
4335 -12 -142 120 -164 338 -41 -242 -48 14 -34 -56 71 -69 -193 -327 20 -275 -222 56 128 -196 -114 -53 -72
4358 -72 -107 113 -55 -271 149 130 142 122 -74 -160 -161 117 -213 89 -199 196 -152 -59 -179 -206 41 135 87 -6
4382 -6 142 -43 94 -104 218 -37 64 -6 -9 84 87 124 -5 -55 223 -189 -144 -83 -229 -222 -41 84 -49 97 159
4407 159 299 -12 116 -85 -5 47 -9 -314 -29 -23 120 265 254 -39 -38 32 77 -316 -5 -141 -6 213 -75
4430 -75 46 -113 96 99 74 110 18 119 26 -68 -385 67 -21 36 -61 140 104 -92 120 -214 72 82 25 -3 218
4455 218 -48 -56 -204 -183 15 218 81 140 -26 87 97 -267 -537 8 -102 -32 81 -176 -43 -47 -6 40 278
4478 278 -37 -112 5 139 110 -134 -197 -45 -39 -273 -12 -8 -4 -23 -107 124 104 127 106 255 165 104 -251 51 -188
4503 -188 -112 120 100 57 -142 -208 110 -216 -145 -72 -44 61 215 21 -143 112 289 24 75 41 27 -64 -185 80
4527 80 -367 175 -39 -32 36 -286 -302 80 144 -90 96 -214 90 15 268 -5 283 -205 7 134 321 -127
4549 -127 152 -6 -47 -135 27 -133 -6 51 75 24 -116 64 -210 -112 -95 106 159 -161 34 -119 -127 126 12
4572 12 29 87 -85 191 135 401 299 -81 128 -70 -131 50 -22 58 -274 42 -54 160 5 -63 0 14 42 215
4596 215 -186 -366 124 280 -38 -144 71 207 141 190 18 208 12 118 -363 -45 24 52 174 42 75 293
4618 293 87 208 -82 -100 -279 -162 -66 -316 66 -223 3 -359 -50 60 77 152 -199 -64 -93 146 32 -190
4640 -190 -130 -182 174 -137 207 134 -35 -10 115 138 155 111 -54 26 -19 -145 -84 -126 27 106 -46 -214 -169 -151 45
4665 45 52 96 102 306 98 -155 -167 -313 -155 -153 126 96 137 -78 165 135 -153 227 77 154 7 -32 75 141 258
4690 258 128 44 137 71 173 -171 -37 38 444 -273 -17 -148 168 -111 -227 -202 14 76 -123 -195 117 -28
4712 -28 -88 -201 95 -12 -91 162 498 72 -80 -66 -82 -50 172 186 -165 78 186 -131 -244 207 144 31 28
4735 28 148 -343 407 252 111 -166 26 114 -129 -137 -118 32 61 437 -234 -223 3 13 17 -83 -174 328 -85 15
4759 15 -82 118 -96 -242 -208 131 -13 -189 -48 -144 147 143 -33 141 219 -39 73 -19 -164 -159 101 41 51 -48
4783 -48 212 -335 104 -198 -65 -48 -52 -20 233 -17 -159 240 13 -35 -72 -51 173 -36 13 -178 -136 -254 198
4806 198 104 -111 105 -59 181 62 -174 110 65 120 -100 -163 -131 -265 108 -254 51 309 217 98 -249 -10
4828 -10 -270 -103 -17 -191 21 25 -31 177 -91 246 350 22 126 -49 -157 163 71 160 223 -10 13 -133 137
4851 137 -55 193 -167 -276 -248 -18 137 21 67 -368 -37 -288 -159 98 -53 71 -96 -310 -52 7 -291
4872 -291 190 31 -110 -183 71 -5 -395 140 159 -124 -104 -29 306 149 -99 -91 -64 155 -26 124 -138 -152 -23
4895 -23 -389 26 -172 -9 -222 -97 -141 -115 90 125 326 235 -14 -250 257 -71 84 46 -178 12 -198 -101
4917 -101 104 110 -163 -125 -106 -115 38 21 -241 -266 241 -151 -68 236 -66 -79 -9 -126 153 7 -219 -45 9 -93
4941 -93 -107 264 46 -3 251 -146 -180 35 -173 79 92 -28 -107 -40 57 -64 150 -89 166 248 32 239 -59
4964 -59 1 169 -347 -43 65 -387 -155 -138 106 46 -105 73 -303 103 210 -49 28 -11 174 215 -284 179
4986 179 -258 -177 -104 111 -236 144 -90 -287 2 -282 -308 10 -84 -196 206 4 11 124 12 -149 71 189
5008 189 -7 398 73 -38 293 38 -138 171 98 452 236 -73 -152 -142 -128 130 -65 221 -154 420 89
5029 89 -171 96 227 -5 -3 290 31 -4 5 277 0 228 -150 14 -23 73 -202 145 -55 -111 -16 195 53
5052 53 18 -109 -44 69 -53 -90 -143 88 131 -284 6 -67 -152 -52 -77 287 -160 -329 -344 137 -230 35 254
5075 254 88 73 138 66 -26 -133 33 50 8 -108 47 40 237 155 -244 192 84 -108 -276 98 178 -23 62 113
5099 113 94 -100 9 80 99 -128 -133 23 -107 262 53 -49 1 109 8 -5 -406 -154 -1 -74 125 106 -271
5122 -271 60 -201 130 101 -130 -59 99 -159 243 -14 123 195 220 -57 27 431 13 -100 238 -77 -18 45
5144 45 3 -166 377 265 202 -511 -175 247 -313 -7 -43 -67 -416 -171 40 -124 -33 -75 -141 18 -57 -217 40
5167 40 7 -192 150 -294 45 214 -104 14 14 -23 61 -344 -57 -131 197 137 -149 -54 91 -105 28 -56 -25 210
5191 210 -126 -9 38 136 -69 1 269 -77 -212 11 115 -216 158 204 -44 -286 154 -118 184 -182 -87 -13
5213 -13 28 -149 396 256 18 -276 -125 -56 134 146 95 -191 207 394 120 117 153 3 -231 -205 -168 -217 45 125
5237 125 11 94 157 358 -216 175 -276 -85 203 91 -105 137 -330 -156 -7 158 108 -56 -325 -219 -186
5258 -186 -120 -97 -160 -191 -80 365 132 -124 -143 261 -96 -3 -181 56 74 83 -40 -112 -34 46 177 -38 -66 -89 49
5283 49 -359 218 77 -123 79 -34 80 306 144 -163 -43 149 -96 -176 -104 46 -115 -70 -133 -103 -109 47 88
5306 88 30 258 -95 -7 -123 52 104 -308 -98 -51 -110 -105 161 -4 -88 -161 50 -93 14 -132 15 243 -76
5329 -76 -15 -66 253 -10 -109 134 -361 -144 -269 200 -71 199 102 7 -34 139 -89 152 78 -83 77 10 -420
5352 -420 -259 96 319 139 -70 22 -179 24 -57 274 202 169 -123 -23 -97 87 -54 218 89 113 136 -131
5374 -131 244 -107 191 -179 -7 -50 -45 19 325 -212 -250 -113 -140 212 -19 155 57 59 -114 103 119 279 72
5397 72 181 118 -263 -100 -133 -108 270 -87 69 -211 0 91 -15 -113 -88 -2 118 -103 13 19 -133 122 -33
5420 -33 30 123 136 -146 -509 -7 138 -124 128 48 341 -132 -48 -118 243 58 -255 13 235 -33 -160 288
5442 288 -318 187 -265 -70 -89 106 -144 -211 -43 229 -13 126 -53 -194 62 53 -6 -4 -118 -64 -281 -68 164
5465 164 17 -126 70 83 52 79 -127 -310 -11 19 -133 -57 259 -188 55 -157 57 426 -68 407 191 168
5487 168 -273 -55 -45 -205 227 355 -225 -115 -168 43 -85 64 -314 -575 -75 155 136 -133 107 79 89 242
5509 242 158 -254 -167 -14 -258 -317 29 -220 -41 -89 165 -192 -161 -19 -197 -171 264 -282 12 107 -104 178
5531 178 -17 59 -38 91 -190 -94 -141 -135 -184 13 142 -67 130 -381 -6 38 -326 11 -77 0 -144 -63 -45 -165
5555 -165 -35 140 79 -100 -191 211 235 -5 122 -138 -331 -72 78 -13 151 -39 132 134 -73 -353 408 121
5577 121 -249 71 46 -22 -53 138 -81 -92 -3 105 209 205 38 -168 -175 -119 230 -44 33 -21 31 113 -197 -48 101
5602 101 16 -161 -234 93 -72 61 38 -119 -47 -410 208 1 277 131 12 -36 22 58 96 -176 66 -124 -72
5625 -72 -59 248 345 -160 116 292 -160 -17 231 35 27 -39 185 99 -73 10 -76 -50 -67 -54 393 402 -138 -5 -159
5650 -159 308 -148 136 10 -329 -133 18 -128 13 166 -7 -471 -271 -167 80 301 -41 119 -109 -150
5670 -150 27 26 -438 182 -4 365 363 -106 25 -118 -5 38 136 -54 -139 17 9 100 124 -108 -122 57 68 249
5694 249 -195 -286 157 -203 -211 95 58 219 60 -143 274 380 -185 280 -203 27 23 -66 66 160 31 0 12
5717 12 -200 -125 -240 121 270 49 -26 141 106 -202 92 -124 -58 -154 -87 138 76 287 -4 205 -276 -188 328
5740 328 104 -44 417 453 -264 -133 42 -41 105 -69 -98 18 247 -63 -46 -162 160 45 50 380 -238 -230 -52
5763 -52 1 -41 115 4 99 -5 -2 -95 -135 137 -272 240 262 -22 -1 478 138 51 -84 -16 -203 -126 -147 -103 260
5788 260 224 137 190 -55 -62 23 -284 167 -291 -293 -234 -216 164 81 48 71 -11 -27 61 96 -17 106 -217 -36 263 -27
5814 -27 -234 -153 167 132 110 -164 -35 -201 -130 423 -46 90 74 -29 231 104 -125 49 233 90 79 107 114
5837 114 152 83 100 27 40 -5 -17 164 0 108 258 129 66 -24 -177 -24 12 191 -345 -99 -237 132 207 -206
5861 -206 114 -1 74 157 141 90 198 -131 226 -178 -278 -258 95 209 -374 -95 99 143 92 -190 357 258 -155
5884 -155 71 20 -70 190 -46 -45 -11 -138 154 -17 -8 30 -66 -25 -85 -33 217 155 91 84 133 409 -293 63 196 -69
5910 -69 -1 76 -58 -22 -15 80 197 -78 132 -187 84 -105 119 -150 30 247 56 -95 -301 196 40 117 57
5933 57 137 133 -272 -69 -103 117 66 -28 -272 2 -261 123 -20 -53 -51 43 131 -22 -181 -53 -91 -209 -99 80
5957 80 -200 100 -82 46 -79 -5 276 -58 148 159 72 47 -227 233 364 28 -49 97 -42 35 -243 -166 147
5980 147 221 -82 -92 -35 73 -383 -41 64 -54 32 93 97 -39 29 -60 -77 -131 223 32 -151 116 53 -109 78
6004 78 17 5 -24 62 173 37 278 -6 13 26 -229 -15 -95 -31 202 -47 7 -151 184 1 28 163 -288 -301
6028 -301 -57 -96 -17 183 5 190 1 120 376 -23 78 149 46 151 58 192 295 22 -218 133 44 -224
6050 -224 44 -84 244 -108 -207 -94 -167 -131 -234 -102 103 -89 182 -60 82 -51 69 179 12 203 -318
6071 -318 77 -1 13 112 125 142 -45 22 77 84 -8 254 19 77 -371 -220 -71 1 3 -205 -21 -26 34 -174 -52 -72
6097 -72 -63 -21 -153 237 183 184 12 27 -99 -156 0 87 178 -83 223 -116 -41 -120 170 225 195 -367 242 -166 80
6122 80 85 143 283 -279 -152 -314 -128 -213 -32 192 -210 186 -222 -242 126 -11 185 17 82 263 100 -71
6144 -71 69 -49 61 60 143 -164 -445 -326 219 -13 -159 12 17 139 -64 54 -211 -42 -140 223 16 -13 154
6167 154 -35 -46 29 -448 -129 64 -169 24 -122 -60 -126 354 194 40 -167 140 -92 -104 32 174 -15 -57
6189 -57 93 328 -2 192 66 138 -49 207 61 -237 -73 94 21 -23 65 29 -21 166 -99 153 222 105 -186
6212 -186 -396 114 184 93 59 -249 201 43 -287 -393 47 248 13 -137 144 -173 -163 -90 31 -63 -34 77
6234 77 -204 19 -16 90 -1 156 -78 -238 -122 334 -355 -183 -236 123 -115 -21 66 -16 119 27 346 -56 -186
6257 -186 126 38 -56 -25 -133 -42 -68 142 -168 -2 -125 151 -134 -106 203 -138 41 6 26 196 55 -70 219
6280 219 92 -77 -74 178 -38 -253 167 -288 -176 -56 -46 209 72 -92 -405 0 131 312 -156 -370 19
6301 19 -444 9 214 -275 41 355 -206 334 -202 -98 -47 103 -59 72 -153 142 -207 -137 -244 -50 -145
6322 -145 -26 156 -74 -9 -246 -35 -126 -30 -128 104 -154 -257 56 -93 223 -358 -190 -8 -234 59 157 -317
6344 -317 -132 -43 -143 19 28 296 -103 -34 -33 151 184 -59 -175 -162 129 169 -100 10 -439 -82 85 -159 -346
6367 -346 38 66 -245 48 -77 10 32 87 143 -37 76 369 21 187 182 -61 -33 -232 -176 277 -246 -48 -203
6390 -203 -122 -38 -88 -95 -16 41 166 111 52 -1 -75 133 -122 77 154 68 -176 -35 125 -36 189 -95 69 122 -165
6415 -165 -15 287 40 175 -152 65 -14 149 114 113 -76 -53 61 83 121 65 216 -186 98 335 13 253 61
6438 61 45 78 -11 -30 24 247 36 123 -111 -88 87 12 -142 33 -54 359 -60 -9 -186 23 -10 29 -130 -29
6462 -29 -78 -29 49 35 -109 86 28 -181 172 62 10 -74 -146 32 137 260 -338 43 133 -35 -31 21 -243 32
6486 32 -58 23 209 -83 -45 158 -240 36 165 156 358 48 -23 -62 275 -28 -78 159 52 267 188 -173 310
6509 310 -63 -6 73 182 -9 22 164 337 -195 -12 -106 253 -276 -23 100 280 48 18 49 108 40 -1 -250
6532 -250 164 -64 289 -162 -66 -106 188 -81 133 -284 -166 -58 64 215 7 -118 -188 -254 358 -335 238
6553 238 165 89 10 117 265 -77 161 105 193 -2 -187 -39 143 168 -169 58 140 -55 121 187 -226 59 52
6576 52 -256 143 -115 41 2 20 -50 -240 29 281 -92 -34 20 268 -10 22 -132 197 136 -5 58 -296 -29
6599 -29 13 -210 55 232 251 -60 -101 -204 -329 36 -16 169 -474 -111 83 220 41 -57 246 104 1 142
6621 142 -38 -35 -357 -101 138 -78 207 358 -108 -182 -40 -24 -161 -137 71 -29 139 -24 -219 58 193 -88
6643 -88 -42 -39 165 80 182 12 277 -48 8 244 -182 -18 -32 -216 84 66 416 214 148 -6 160 68 194
6666 194 -378 75 49 -151 263 380 -93 -370 -16 -264 -300 31 -275 195 257 42 310 -80 67 9 174
6687 174 -62 118 -111 -326 9 171 -38 34 -47 -148 -166 -143 159 -148 133 96 75 -197 -78 347 -128 -8
6709 -8 66 184 -111 143 246 -60 -156 -253 187 182 -81 9 -182 -60 155 136 -17 137 -151 -255 93 367 82
6732 82 -219 253 131 61 -175 -104 65 107 -38 11 28 62 -194 132 -30 -105 -102 -43 149 136 -185 30 96 4 -86
6757 -86 -78 33 -92 51 -201 -400 226 400 -26 14 -143 289 -66 105 58 -2 70 -197 302 151 -254 68
6779 68 -292 165 138 -200 -174 -30 -106 28 101 -15 -77 237 202 127 259 -267 76 223 86 -116 52 257 -132
6802 -132 1 -291 126 -348 22 -132 178 -19 107 -198 -290 139 -8 -202 -29 -99 88 -59 -129 -150 -7
6823 -7 106 18 -60 -131 318 10 51 -204 -126 -106 -99 -20 -220 -178 -141 74 13 -11 -339 -89 -289 111 -114 139 -21
6848 -21 329 -179 -125 91 -141 175 -114 -118 76 -164 -93 -64 -61 -170 -214 292 -260 -216 -47 -33 -148 -146 -126 7 -242
6873 -242 -45 -34 90 -202 -73 16 -65 225 -82 -90 42 349 -4 -57 419 318 -230 25 90 -85 22 84 -153
6896 -153 131 249 65 7 115 -9 218 44 166 144 174 68 -13 80 -259 -28 -68 -75 -51 153 345 44 77
6919 77 -63 -41 -44 -30 -313 171 316 -214 -67 -44 -190 -38 -100 -512 56 -6 0 -100 129 243 -115 -14 -9 -265
6943 -265 -401 305 -215 217 23 -185 87 244 -132 -193 282 77 94 -352 -161 323 77 116 -179 53 -79
6964 -79 -73 154 -35 -133 -157 33 228 83 -202 19 -104 329 -145 -207 9 19 121 171 -200 -53 -311 -34 288
6987 288 77 -265 -21 40 -101 119 -27 -118 -111 -59 -258 -135 222 -67 215 -48 11 14 -129 -390 -36 -83 -86 182
7011 182 -179 -331 -222 -235 90 -236 -137 150 168 -108 -192 128 -88 24 -51 -84 25 154 77 -87 111 21 -67
7034 -67 121 -124 -98 -185 19 245 -175 23 350 -140 -323 -196 -117 -102 -37 -42 -11 -134 115 89 23 -200 269 -137
7058 -137 -131 344 182 0 139 327 -229 -191 25 162 -90 -162 -310 183 -58 -232 -235 49 4 10 -66 350 -197
7081 -197 -34 250 -183 20 -362 133 -160 163 9 -144 -163 27 204 -220 -245 -52 -200 -197 6 118 364
7102 364 -58 279 -54 -180 178 -78 141 -330 46 -363 30 -50 -378 -113 -4 52 78 257 -18 -99 149
7123 149 -127 88 160 70 -7 -99 -3 70 -70 50 -27 121 134 -156 -16 35 10 196 2 -28 -89 -81 42 -31 -105
7148 -105 -209 151 18 154 280 -18 47 86 -278 132 -199 66 -112 -240 160 -154 77 -165 -272 40 83
7169 83 460 -135 130 220 96 -25 -115 4 31 23 -118 22 -166 -85 116 22 -392 62 -134 26 -131 -56 73
7192 73 66 107 -71 -35 239 353 -105 103 -236 232 55 -153 17 62 -115 -119 107 21 -77 -266 -124 151 -23
7215 -23 45 -225 -275 -287 51 315 130 88 -92 134 83 34 40 30 -210 -77 -191 -54 91 35 -193 167 76 -1
7239 -1 55 41 206 -108 63 14 -170 164 -204 27 -17 138 34 156 -443 -57 -26 -70 -77 39 -434 41 -22 -83
7263 -83 -38 131 -134 -88 -91 47 165 -15 -132 -288 119 -10 -96 116 324 17 148 355 -40 -300 -107 -58
7285 -58 24 -125 -96 -194 -3 -52 -300 444 -66 212 -251 108 -126 -62 239 104 -48 -115 75 146 -56 89 -166
7308 -166 247 15 -154 -60 -3 304 62 -234 15 -289 -127 269 -139 -93 70 -100 3 52 181 -136 -337
7329 -337 -186 -102 -80 -97 -29 -54 36 67 -21 -153 -13 60 34 82 -122 222 149 43 -164 149 -191 -96 48 -18 84
7354 84 295 -46 -129 -372 49 154 274 -94 260 162 -383 130 -70 -122 96 153 -94 87 178 14 44 -197
7376 -197 133 243 -101 169 353 38 -37 237 -35 102 7 -44 -3 -107 -47 160 -55 -193 129 -128 46 -17
7398 -17 260 -9 -174 -74 -214 221 -170 13 24 -207 -189 -74 -241 16 94 129 78 132 42 -203 167 -45 -140
7421 -140 -28 19 -108 -282 220 108 -1 -24 -106 -228 275 132 208 100 46 -12 112 -267 -72 34 47 132 -147
7444 -147 84 218 222 113 126 44 32 21 -11 165 7 -116 47 281 183 144 -128 287 15 -32 222 -12 -16 -133
7468 -133 187 -118 16 112 -361 171 -158 -129 -84 196 -10 84 137 -122 -35 -38 184 -50 195 -49 -8 110 42
7491 42 186 138 2 -95 -59 -163 222 -30 -28 269 75 -175 -38 -10 -45 -13 103 -85 -44 -120 264 118 -24 -20
7515 -20 -237 15 183 -259 93 -214 -55 -28 5 144 289 260 91 -15 64 -103 152 -215 272 -46 -254 57
7537 57 56 -45 111 94 -48 -69 191 229 105 -70 -254 37 -209 -168 34 -67 -44 -133 34 -59 164 -246 301
7560 301 -95 9 57 327 70 -186 -113 152 -11 -173 -7 -189 -44 -108 198 74 -85 -238 -96 84 -183
7581 -183 -78 -314 -22 61 -74 21 8 35 157 134 -185 66 -145 174 63 299 151 -178 38 62 -304 -135
7603 -135 151 -132 -226 228 -74 -37 -56 -102 203 -70 -286 127 146 188 -4 129 35 -200 209 -1 53 107 -65
7626 -65 -1 -55 54 122 10 77 -207 -336 126 53 144 -251 226 441 62 95 118 124 -219 102 -315 -126 36 118
7650 118 117 62 -85 -200 104 293 45 168 83 -404 -29 -17 -59 289 -120 -145 -98 -160 -64 152 263 -252 199
7673 199 172 31 -122 25 -131 189 10 -202 -72 -70 -75 6 -78 275 -66 -142 -106 131 -146 -170 167 -95 -72 -58
7697 -58 177 192 -79 -128 -239 236 72 20 96 -60 -288 -140 -123 114 -150 82 -53 67 -176 -129 -102 -277 53
7720 53 149 -12 202 232 144 319 31 47 -42 95 148 -17 -3 -36 -44 -138 -32 227 -69 -29 93 -14 -172 197
7744 197 -58 5 -42 -243 106 152 -111 -14 15 51 287 31 40 -45 -128 -301 -71 141 -193 -127 88 80 -3 -32 237
7769 237 265 51 271 55 -134 140 -31 28 68 -202 15 164 24 49 11 325 79 114 196 -348 140 -148
7791 -148 68 -7 -173 119 88 65 -17 25 191 248 -102 -217 35 -244 -200 -157 -175 -21 -194 -105 -19 -254 -113 45
7815 45 21 -211 -91 86 42 -128 -15 203 -14 -114 -44 2 -64 -13 170 290 -102 148 -44 410 -11 -8 -16 -322
7839 -322 -261 191 320 -152 -357 -348 -96 -6 1 -164 116 7 279 -102 -74 -390 -197 59 -89 191 -217 -63
7861 -63 19 -42 -53 -213 37 270 110 209 -60 -123 89 102 91 -105 114 96 -164 -80 -124 82 -222 111 -3 30
7885 30 -87 42 -46 -134 -264 133 -79 148 36 -114 -193 135 133 30 -95 -11 124 -68 181 139 329 -17 -19
7908 -19 -188 -21 122 102 -73 305 -7 132 325 -22 -237 28 -83 -199 89 -106 -219 9 -11 96 -35
7929 -35 181 -145 138 129 60 273 -24 215 106 -69 358 -359 41 158 87 154 -179 -26 -182 -4 60 286
7951 286 -323 -70 220 -232 -23 463 659 68 71 -303 -59 100 52 -69 146 -246 81 -134 -10 164 94
7972 94 11 -175 148 -60 -70 -23 5 -25 54 -152 -28 -100 256 -47 62 388 -60 117 22 24 -121 188 -16 70
7996 70 6 82 203 74 176 288 -120 13 -118 261 -129 47 -254 -424 -105 369 140 2 149 130 43 -77
8018 -77 -163 110 37 -202 167 -97 270 -100 33 -93 -81 285 -222 86 228 -167 -37 67 69 -185 -20 -1
8040 -1 -51 -77 87 -160 -68 136 285 -97 -111 50 -158 -31 -67 306 -58 66 -17 -171 -131 -110 80 8 77 237
8064 237 72 -219 241 48 42 -118 -120 -29 -34 102 -55 216 130 120 255 -249 -47 -125 99 80 -158 147 366 338
8088 338 159 -110 -176 232 23 163 191 -135 -87 -68 -279 177 125 -82 100 -112 98 -139 15 -17 -3 25 276
8111 276 28 59 65 202 -69 -58 -14 220 184 290 130 -134 123 -9 37 -276 125 -269 307 40 -76 61
8133 61 -309 -307 54 -5 127 234 47 6 -250 21 98 7 -236 -20 -59 -4 -192 31 -141 -40 -100 -19 112 -560
8157 -560 -105 -5 -97 98 154 -108 135 -232 193 -17 -23 -127 69 39 -132 332 -216 265 261 220 87 -127 248
8180 248 -16 -131 187 29 -103 8 45 -38 -444 175 273
8191B73
##END NTUPLES=NMR FID
##END=
