##TITLE=1H_Pr 5-5-T
 D2O, 40 sc, 
 28.8.2019
##JCAMPDX= 6.0         $$ Bruker NMR JCAMP-DX V2.0
##DATA TYPE= NMR FID
##DATA CLASS= NTUPLES
##ORIGIN= UXNMR, Bruker Analytische Messtechnik GmbH
##OWNER= root
$$ XWIN-NMR		Version 3.5
$$ Wed Aug 28 15:30:14 2019 Russian Standard Time (UT+4h)  she@DPX200
##.OBSERVE FREQUENCY= 200.13155
##.OBSERVE NUCLEUS= ^1H
##.DELAY= (6, 6)
##.ACQUISITION MODE= SIMULTANEOUS
##.ACQUISITION SCHEME= undefined
##.AVERAGES= 40
##.DIGITISER RES= 18
##SPECTROMETER/DATA SYSTEM= spect
##.PULSE SEQUENCE= zg30
##.SOLVENT NAME= D2O
##.SHIFT REFERENCE= (INTERNAL, D2O, 0, 15.7039)
##AUDIT TRAIL= $$ (NUMBER, WHEN, WHO, WHERE, WHAT)
$$ ##TITLE= Audit trail, XWIN-NMR		Version 3.5
$$ ##JCAMPDX= 5.01
$$ ##ORIGIN= Bruker BioSpin GmbH
$$ ##OWNER= she
$$ F:/spectra/data/she/nmr/H-F/1/audita.txt
$$ ##AUDIT TRAIL=  $$ (NUMBER, WHEN, WHO, WHERE, WHAT)
(   1,<2019-08-28 15:29:15.48 +0400>,<she>,<DPX200>,
      <continue with go, POWCHK disabled, PULCHK disabled
       configuration hash MD5:
       00 E9 B6 7A A2 85 ED C7 34 08 36 98 17 FE 4E 26
       data hash MD5: 16K
       5C 56 20 A5 F6 65 B2 1A 32 6C 3B C8 75 73 4C D2>)
$$ ##END=
$$ 
$$ hash MD5
$$ B5 A1 7B 7E 52 42 2B 34 C9 DC 04 8A F1 07 67 FE
##$RELAX= 
##$RELAX= 
##$RELAX= 
##$RELAX= 
##$RELAX= 
##$RELAX= 
$$ Bruker specific parameters
$$ --------------------------
##$DU= <F:/spectra>
##$EXPNO= 1
##$NAME= <H-F>
##$PROCNO= 1
##$TYPE= <nmr>
##$USER= <she>
##$AMP= (0..31)
100 100 100 100 100 100 100 100 100 100 100 100 100 100 100 100 100 100 
100 100 100 100 100 100 100 100 100 100 100 100 100 100 
##$AQSEQ= 0
##$AQ_mod= 1
##$AUNM= <au_zg>
##$AUTOPOS= <>
##$BF1= 200.13
##$BF2= 200.13
##$BF3= 200.13
##$BF4= 200.13
##$BF5= 200.13
##$BF6= 200.13
##$BF7= 200.13
##$BF8= 200.13
##$BYTORDA= 1
##$CFDGTYP= 0
##$CFRGTYP= 5
##$CHEMSTR= <none>
##$CNST= (0..31)
1 1 145 1 1 1 1 1 1 1 1 1 1 1 1 1 1 1 1 1 1 1 1 1 1 1 1 1 1 1 1 1 
##$CPDPRG= <>
##$CPDPRG1= <>
##$CPDPRG2= <>
##$CPDPRG3= <>
##$CPDPRG4= <mlev>
##$CPDPRG5= <mlev>
##$CPDPRG6= <mlev>
##$CPDPRG7= <mlev>
##$CPDPRG8= <mlev>
##$CPDPRGB= <>
##$CPDPRGT= <>
##$D= (0..31)
0 1.2 0 0 0 0 0 0 0 0 0 0.03 0 0 0 0 0 0 0 0 0 0 0 0 0 0 0 0 0 0 0 0 
##$DATE= 1566991610
##$DBL= (0..7)
120 120 120 120 120 120 120 120 
##$DBP= (0..7)
150 150 150 150 150 150 150 150 
##$DBP07= 0
##$DBPNAM0= <>
##$DBPNAM1= <>
##$DBPNAM2= <>
##$DBPNAM3= <>
##$DBPNAM4= <>
##$DBPNAM5= <>
##$DBPNAM6= <>
##$DBPNAM7= <>
##$DBPOAL= (0..7)
0.5 0.5 0.5 0.5 0.5 0.5 0.5 0.5 
##$DBPOFFS= (0..7)
0 0 0 0 0 0 0 0 
##$DE= 6
##$DECBNUC= <off>
##$DECIM= 24
##$DECNUC= <off>
##$DECSTAT= 4
##$DIGMOD= 1
##$DIGTYP= 9
##$DL= (0..7)
0 120 120 120 120 120 120 120 
##$DP= (0..7)
150 150 150 150 150 150 150 150 
##$DP07= 0
##$DPNAME0= <>
##$DPNAME1= <>
##$DPNAME2= <>
##$DPNAME3= <>
##$DPNAME4= <>
##$DPNAME5= <>
##$DPNAME6= <>
##$DPNAME7= <>
##$DPOAL= (0..7)
0.5 0.5 0.5 0.5 0.5 0.5 0.5 0.5 
##$DPOFFS= (0..7)
0 0 0 0 0 0 0 0 
##$DQDMODE= 0
##$DR= 18
##$DS= 0
##$DSLIST= <SSSSSSSSSSSSSSS>
##$DSPFIRM= 0
$$ [...]
##$SUBNAM2= <"">
##$SUBNAM3= <"">
##$SUBNAM4= <"">
##$SUBNAM5= <"">
##$SUBNAM6= <"">
##$SUBNAM7= <"">
##$SUBNAM8= <"">
##$SUBNAM9= <"">
##$SW= 24.9336996594482
##$SWIBOX= (0..15)
0 0 2 0 0 0 0 0 0 0 0 0 0 0 0 0 
##$SW_h= 4990.01996007984
##$TD= 16384
##$TD0= 1
##$TE= 0
##$TE2= 300
##$TE3= 300
##$TEG= 300
##$TL= (0..7)
0 120 120 120 120 120 120 120 
##$TP= (0..7)
150 150 150 150 150 150 150 150 
##$TP07= 0
##$TPNAME0= <>
##$TPNAME1= <>
##$TPNAME2= <>
##$TPNAME3= <>
##$TPNAME4= <>
##$TPNAME5= <>
##$TPNAME6= <>
##$TPNAME7= <>
##$TPOAL= (0..7)
0.5 0.5 0.5 0.5 0.5 0.5 0.5 0.5 
##$TPOFFS= (0..7)
0 0 0 0 0 0 0 0 
##$TUNHIN= 0
##$TUNHOUT= 0
##$TUNXOUT= 0
##$USERA1= <user>
##$USERA2= <user>
##$USERA3= <user>
##$USERA4= <user>
##$USERA5= <user>
##$V9= 5
##$VALIST= <valist>
##$VCLIST= <CCCCCCCCCCCCCCC>
##$VD= 0
##$VDLIST= <DDDDDDDDDDDDDDD>
##$VPLIST= <PPPPPPPPPPPPPPP>
##$VTLIST= <TTTTTTTTTTTTTTT>
##$WBST= 1024
##$WBSW= 4
##$XGAIN= (0..3)
0 0 0 0 
##$XL= 0
##$YL= 0
##$YMAX_a= 1487800
##$YMIN_a= -1854319
##$ZGOPTNS= <>
##$ZL1= 120
##$ZL2= 120
##$ZL3= 120
##$ZL4= 120
##$ABSF1= 10
##$ABSF2= 0
##$ABSG= 5
##$ABSL= 3
##$ALPHA= 0
##$AQORDER= 0
##$ASSFAC= 0
##$ASSFACI= 0
##$ASSFACX= 0
##$ASSWID= 0
##$AUNMP= <proc_1d>
##$AZFE= 0.1
##$AZFW= 0.1
##$BCFW= 1
##$BC_mod= 2
##$BYTORDP= 1
##$COROFFS= 0
##$CY= 11.3945322036743
##$DATMOD= 1
##$DC= 2
##$DFILT= <>
##$DTYPP= 0
##$F1P= 20.1720416913024
##$F2P= 0.152960286110954
##$FCOR= 0.5
##$FTSIZE= 0
##$FT_mod= 4
##$GAMMA= 1
##$GB= 0.15
##$INTBC= 1
##$INTSCL= 1
##$ISEN= 128
##$LB= 0.24
##$LEV0= 0
##$LPBIN= 0
##$MAXI= 10000
##$MC2= 0
##$MEAN= 0
##$ME_mod= 0
##$MI= 1.114404
##$NCOEF= 0
##$NC_proc= 0
##$NLEV= 6
##$NOISF1= 3.799351
##$NOISF2= 2.8
##$NSP= 1
##$NTH_PI= 0
##$NZP= 0
##$OFFSET= 15.70392
##$PC= 1
##$PHC0= -9233.173
##$PHC1= 39.00096
##$PH_mod= 1
##$PKNL= yes
##$PPARMOD= 0
##$PSCAL= 0
##$PSIGN= 0
##$REVERSE= no
##$SF= 200.130013532006
##$SI= 16384
##$SIGF1= 3
##$SIGF2= 2
##$SINO= 400
##$SIOLD= 16384
##$SREGLST= <1H.CDCl3>
##$SSB= 0
##$STSI= 0
##$STSR= 0
##$SW_p= 3612.71676300578
##$SYMM= 0
##$S_DEV= 0
##$TDeff= 0
##$TDoff= 0
##$TI= <>
##$TILT= no
##$TM1= 0
##$TM2= 0
##$TOPLEV= 0
##$USERP1= <user>
##$USERP2= <user>
##$USERP3= <user>
##$USERP4= <user>
##$USERP5= <user>
##$WDW= 1
##$XDIM= 8192
##$YMAX_p= 0
##$YMIN_p= 0
$$ End of Bruker specific parameters
$$ ---------------------------------
##NTUPLES= NMR FID
##VAR_NAME=  TIME,          FID/REAL,        FID/IMAG
##SYMBOL=    X,             R,               I
##VAR_TYPE=  INDEPENDENT,   DEPENDENT,       DEPENDENT
##VAR_FORM=  AFFN,          ASDF,            ASDF
##VAR_DIM=   8192,          8192,            8192
##UNITS=     SECONDS,       ARBITRARY UNITS, ARBITRARY UNITS
##FACTOR=    0.0002004,     1,               1
##FIRST=     0,             0,               0
##LAST=      1.6414764,     0,               0
##MIN=       0,             -1854319,        0
##MAX=       1.6414764,     1487800,         0
$$ Real data points
##PAGE= N=1
##DATA TABLE= (X++(R..R)), XYDATA
0@%%%%J8j8M0q0Q0j20J60j60K00k80L60m40N18n98O95q17R67j128J321j546J767
25I39k022K317k637L000l390L825m307M826n418O054o742P512q347R273j0289
40e406J1390j2618J3968j5464J7139j8990K1084k3458K6159k9300L2963l7315
52a9848M2606m9173N7613o8906Q4901j09530J52774k51138Q84855o063j674286
63i56195l29406J64243O50963P19190R46492K85804n94547j194045q26872k17914
73a352287M73495Q86764J019759M60069m03253j096026j028913m07361M22557
82a025196R00961R18417M85106j30260p75322j068151p37179J54077R22292J035617
92F80362N35950q6262n87474q89975q29775k05009O64593J114289P97300O4803
$$ plain form
0 0 0 0 0 0 18 0 40 -40 40 -80 80 -80 120 -160 200 -240 278 -320 375 -442 525 -603 718 -828 939
25 939 -1083 1234 -1403 1597 -1793 2032 -2275 2551 -2867 3187 -3555 3957 -4390 4883 -5406
40 -5406 5984 -6634 7334 -8130 9009 -9981 11103 -12355 13804 -15496 17467 -19848
52 -19848 22758 -26415 31198 -37708 47193 -62337 90437 -160701 724154 718091 -956195
63 -956195 -1285601 -1121358 -470395 248795 1195287 1481091 886544 -307501 -1134373 -1352287
73 -1352287 -878792 7972 1027731 1487800 1084547 -11479 -1040392 -1447753 -1025196
82 -1025196 -124235 794182 1279288 1149028 373706 -694445 -1431624 -1277547 -355255 680362
92 680362 1216312 1130050 542576 -347399 -1177174 -1382183 -717590 396699 1193999 1258802
102A258802n64682q65095q19088l55441M24204J028109R45583K49401m86172q22379
112f758p64280m34595J47637P94656J031834N67923k70941q54280q77914m92321
122a159039P3590O39160R44245P07784j204p18991r61435o34581j2018N55979
132e66510Q38592P26321K20756m68892r30152q14537k05876M65377Q10702P48466
142H24247L53842k56231q20531r32979m25158L46305Q27604P79093L78897j29765
152I45324o14572q71239o34345O8892P48923Q96673N05511n9597n13665p71863
162b99958o99855j81046N46936R41501P03379P9527m89414p56039o84429k77294
172a116692L37490Q13273Q02455K96457l50775p43323p22563l67737J63313O63305
$$ plain form
102 1258802 694120 -170975 -990063 -1345504 -921300 106809 1052392 1301793 815621 -6758
112 -6758 -771038 -1205633 -1057996 -263340 768494 1336417 1065476 211196 -666718 -1159039
122 -1159039 -1085449 -446289 497956 1205740 1204536 485545 -475890 -1110471 -1122489 -566510
132 -566510 272082 998403 1219159 750267 -179885 -994422 -1200298 -734921 75781 824247
142 824247 1178089 921858 101327 -831652 -1256810 -910505 -82901 696192 1075089 945324
152 945324 330752 -540487 -1174832 -1105940 -357017 539656 1045167 985570 471905 -299958
162 -299958 -999813 -1180859 -633923 307578 1010957 1090484 601070 -154969 -839398 -1116692
172 -1116692 -779202 34071 836526 1132983 782208 38885 -683678 -1051415 -888102 -224797
182b24797Q51004N21278j77222p51262q06884m13854J00728N18034P45018O33715
192I95758Q9319n95553q91150n85387R708M81336O90886O27347K44559l74194
202F92629q28365p45932j84350M14157P00927O39743L16955j89040o85748q23680
212f92704m14400K77205P30667O98368L38968j02528n16027p55445n74907K9564
222i81239O37061P91990M71563k0894m48361o95139o26913j63065M65235Q12161
232B42399O28357R1048m17271o55982n97016k67871K47466P01171P51250L02886
242A026437l16620o74000o32714l23762J17637N64170P60892M81253j38165o42753
252B22375p06659l94994N2611M56377O80360N64909Q3324m95736p66358n49687
$$ plain form
182 -224797 626207 1147485 970263 219001 -587883 -1001737 -901009 -382975 362043 995758
192 995758 1085077 489524 -401626 -987013 -977305 -495969 194917 822264 1066823 692629
202 692629 -135736 -881668 -1066018 -651861 49066 688809 1005764 816724 130976 -692704
212 -692704 -1107104 -829899 -99232 599136 938104 835576 319549 -435896 -1010803 -981239
222 -981239 -344178 447812 919375 898481 450120 -245019 -871932 -1034997 -569762 242399
232 242399 870756 961804 544533 -111449 -708465 -976336 -728870 -27699 723551 1026437
242 1026437 709817 35817 -596897 -920659 -803022 -238852 522040 1003293 865128 222375
252 222375 -484284 -879278 -826667 -370290 310070 874979 958303 462567 -303791 -853478
262h53478m1012M19514O36479N65534K16137l06478p07463o76779k11245L45011
272f13780O37522N86936K84274j62349n91333p19171l87954K00084O25365O46086
282E05680L41595p9375m67012o66551n13345r594N33989P26640M61913j8368m16968
293C98604o02615n32893j73769L60307P16376O06661J14410l72666n93372n33650
303f12607k51076J97544O09041O77224L01170k54226o04838n88237k98100J08752
313g15353M86455O56226M48747p3640n58502o64829l78739N1444M06920N87780
323B46509N06559J08616m18251o92239n12589n0692L67788N66810N12098K08230
333H42839k57271o24214o14746k14418K95053N79502N31491K51807j34693m99188
$$ plain form
262 -853478 -894490 -474976 161503 727037 943174 636696 -70767 -747546 -958791 -613780
272 -613780 23742 610678 894952 732603 141270 -577901 -965855 -765771 -140406 505680
282 505680 847275 767900 300888 -365663 -879008 -888602 -354613 372027 833940 815572 398604
293 398604 -204011 -736904 -910673 -550366 166010 772671 887081 514415 -78957 -612607
303 -612607 -863683 -666139 -57098 620126 921296 667070 62232 -526005 -824105 -715353
313 -715353 -228898 427328 876075 802435 243933 -420896 -799635 -748191 -341271 246509
323 246509 753068 861684 443433 -248806 -761395 -812087 -444299 122511 634609 842839
333 842839 585568 -38646 -653392 -867810 -572757 6745 538236 790043 655350 156162
343A56162o35650l81527J46683N66569O01092L10579p5605m05806n83018m68713
353g69234l5560M61617O57318M30352k819l69480n38649m76227j63649K98771
363e07560O26546N55904J33334l26014n43318m82932k20966J62469N23298O13822
373E34583K97723k15612n49326n29629k63254Q3975M13691N86360M19617m7093
383G31035m94331n98084l50344L3669L58120N27689M55618J09271l54994o16526
393a98877m77665o2184L31697N08198M49985J92993k04493n46497n67421k09822
403g84086K58770N17201M77928K35615j07584m43411n70908l45789J14642M87763
413a59859N43884L03611n6985l72055n21287m11136m3063L88067N84448M10045
$$ plain form
343 156162 -479488 -861015 -714332 -147763 453329 763908 688303 282497 -300521 -769234
353 -769234 -804794 -343177 314141 744493 741674 372194 -166455 -642682 -806331 -507560
363 -507560 118986 674890 808224 482210 -61108 -544040 -765006 -602537 -79239 534583
373 534583 832306 616694 67368 -462261 -725515 -641540 -227849 358511 778128 731035
383 731035 236704 -361380 -711724 -678055 -319935 207754 663372 772643 417649 -198877
393 -198877 -676542 -738726 -407029 101169 551154 744147 539654 -6843 -574264 -784086
403 -784086 -525316 -8115 469813 705428 597844 154433 -416475 -762264 -647622 -159859
413 -159859 384025 687636 630651 258596 -262691 -673827 -716890 -328823 255625 665670
423F65670J2763l33363m87162m24425j54671K51209N53816N08470J36129k79862
433D48574m88113m40757k06136J41146M61749N43198K80037j67871m86358m96287
443d10818k50400Q2711L72239N06883L76316q910m20980n56956l39386L2317L29764
454b87220M62103M00408J16527k94086n53288m48975o9885K94841M58998M10402
464D89825J77365j74796m79589n08427k08945K11052M70309M47306K12687j02331
474E34456l82665n00613l29154P4871M41821N08969K75739n5590l23594m56559
484b12319l80599o1829L41395N31635L77862K3769k93357m42534l88932j40853
494f45762K17347M86009M62222J47285k40994m52649m04620j81527J20526L95846
$$ plain form
423 665670 678433 345070 -142092 -566517 -721188 -469979 83837 592307 728436 448574
433 448574 -39539 -480296 -686432 -545286 -83537 459661 739698 571827 85469 -410818
443 -410818 -661218 -578507 -206268 300615 676931 668021 247041 -309915 -649301 -616984 -287220
454 -287220 174883 575291 691818 397732 -155556 -604531 -674416 -379575 79423 489825
464 489825 667190 492394 12805 -495622 -704567 -493515 -23206 424100 636787 534456
474 534456 151791 -348822 -677976 -603105 -161284 347685 623424 567834 244240 -212319
484 -212319 -592918 -654747 -313352 218283 596145 619914 326557 -115977 -504909 -645762
494 -645762 -428415 57594 519816 667101 426107 -26542 -431162 -612689 -492163 -96317
504i6317M87384K79150j33412m46591m58095k27046P1275L24892M54301L49376
514F04917N043l68840n02216l21320J2009K94253M25179L65899J07146k49391
524C72679m88584m19569q6929K64477M25219L66403J59531j38910m14193m73365
534d33241k16723J85481M33521M04166J93930p7689l31758m54755l13356N4409
544e56015L88693M61590K67428l6234k92231m16176l44081o5317K86391M76518
554A70566L64222M0219k67915m00954l47378j38077J72871M31638M35406J49318
564F09916k10706m04336l70481j80738R5836L57455M44149K57277j02226l87293
574A08853m22436k28563N5605K98008M05276L12753K5774l10486m59974l14719
$$ plain form
504 -96317 391067 670217 536805 90214 -367881 -594927 -523652 -198760 255541 604917
514 604917 609960 241120 -261096 -582416 -570407 -276154 149025 514924 622070 372679
524 372679 -115905 -535474 -622403 -357926 67293 433696 593227 454317 40124 -433241
534 -433241 -649964 -464483 -30962 373204 567134 489445 157687 -297068 -610424 -556015
544 -556015 -167322 294268 561696 525462 233231 -182945 -527026 -592343 -305952 170566
554 170566 534788 575007 307092 -93862 -441240 -579317 -406446 25192 460598 609916
564 609916 399210 -5126 -375607 -556345 -460509 -103054 341095 598372 496146 108853
574 108853 -313583 -542146 -486541 -188533 216743 529496 555270 244784 -215190 -529909
584e29909P17K70309L81750L27998J11459k07468m39173l90672r3930K28138L84051
595D3270L41885J53667j22381l66552m20720k09705J40225L86941L88849J85967
605E21446p7525k96937l93608k87255J4887L36966M38925K59373l5274k66795
615B14203l66120l09631p8025K43886M33690L39975M5323k34706l60168l19084
625c90657j34812J45835L82763L97399J56552j76115l75767l45979j57320Q6218
635d11883L03629L90824K54677o7495l51707l97789k09783N0192K57455L58971
645A77091K94507M0176k72414m18177k93273j3160K36926L48910L00427J04856
655E05869j75840l83252l64234j08493J99841L58159L12018J33760r8888l12082
$$ plain form
584 -529909 -529192 -258883 122867 450865 562324 354856 -84317 -474989 -568919 -340781 43270
595 43270 385155 538822 416441 49889 -370831 -580536 -440311 -53370 335479 521446
605 521446 443921 146984 -246624 -533879 -518992 -182026 256899 516272 480998 214203
615 214203 -151917 -461548 -539573 -295687 138003 477978 523301 288595 -71573 -390657
625 -390657 -525469 -379634 3129 400528 557080 380965 5198 -340781 -498101 -411883
635 -411883 -108254 282570 537247 469752 118045 -279744 -489527 -439335 -181880 177091
645 177091 471598 511774 239360 -178817 -472090 -485250 -248324 100586 401013 505869
655 505869 330029 -53223 -417457 -525950 -326109 32050 344068 477828 378940 66858
665F6858l83951k13268J14546L54532L54272J73076n8280k58776l61808k70519
675d83318P261K99094L94195K43310j7905k36682l32926k81155p8546K02004L85467
686A00799L25528O0406k12959l33731k86798j20362J16289L30594L68728J61319
696E09813j50579l42849l17539j47762O8685K67582L55254K37598m8116l09258
706A22829l62569k03694L5312K33501L26413K65413M7389k31017l77697k81958
716d26078k1492K15863L13104K71735J04405j43492l44734l39898j07141J73959
726c03769L18880K85569J34579q0130k82085l47311j98435Q4361L09597L34684
736B55940J74758n2438k41213l16610k41573j4401K48929L63332K43043q663k19087
$$ plain form
665 66858 -317093 -530361 -415815 -61283 292989 466065 407785 149009 -212799 -483318
675 -483318 -476057 -176963 217232 460542 442637 205955 -126971 -408126 -486672 -284668 100799
686 100799 426327 486733 273774 -59957 -346755 -467117 -350828 -20234 348494 509813
696 509813 359234 16385 -301154 -448916 -380231 -112649 242605 480203 432087 122829
706 122829 -239740 -443434 -408122 -174621 151792 417205 464594 233577 -144120 -426078
716 -426078 -447570 -231707 81397 353132 457537 314045 -30689 -370587 -477728 -303769
726 -303769 15111 300680 435259 355129 73044 -274267 -472702 -388341 -78744 255940
736 255940 430698 378260 137047 -179563 -421136 -435537 -186608 176724 419767 411104 192017
747A92017k97998k50364q4594J66162L46863L08894O7094j86398l04808k64211
757c07343j14285R7375K92016L32695J61197j20024l09601k99862j40589O1716
767c46705K37232L13920K25046k4700k74191l39137j94208L2147K05698K87349
777A22451K45909N8628j97110l46223k68160k9481J94584K89116K45496R4208
787D09418j20170l00191l09756j17193J45126K97624K68483J19182p0831k42364
797G9328l12011j96756O4795K84635L10634J56945m4990k06845k85506k29412
807c79183k1419K23782L28219K24808J883j91879k74348k32834p6577J42447L05298
818E0197K85211P8472j64905k84903k41192j02181Q2981K53236L03609J59409
$$ plain form
747 192017 -105981 -356345 -440939 -274777 72086 380980 448074 261676 -43132 -307343
757 -307343 -421628 -324253 -32237 300458 461655 341631 32030 -267832 -408421 -346705
767 -346705 -109473 204447 429493 404793 130602 -208535 -402743 -370596 -164898 122451
777 122451 368360 426988 229878 -116345 -384505 -413986 -219402 69714 315210 409418
787 409418 289248 -10943 -320699 -437892 -292766 4858 273341 392523 321692 79328
797 79328 -232683 -429439 -364644 -80009 230625 387570 342580 135735 -149771 -379183
807 -379183 -400602 -176820 151399 376207 378090 186211 -88137 -320971 -397548 -255101 50197
818 50197 335408 413880 248975 -35928 -277120 -379301 -296320 -43084 260525 419934
828D19934r9727k82359k76316j30703N3281K07658K82429K08140r461k39046l12465
839a78635j89917K3378J93863K60418K16420N8334j62791l10031k55528l6613
849c81102J76186K61502K21997R2736r7998k68433k88407j16188J27023K67033
859e651K46219J14811n7635k15653k82109j84420M5461K50967K89118J53409m0513
870C14004j88265k51381k06913l3249J88448L01441K17449P726j73304k48117
880g2161k11126p8714J20267K75529K63709P8891j41721k55163k26514r7590P1448
891b73145K24738K71748J52191p4131k52013k61119j26729M7951J86357K50311
901A46159J91461O203k08189k89226j81258J6479J72667K35901K00688N7773j42361
$$ plain form
828 419934 320207 37848 -238468 -369171 -315890 -108232 174197 382337 372876 133830 -178635
839 -178635 -368552 -345174 -151311 109107 325527 383861 221070 -88961 -344489 -381102
849 -381102 -204916 56586 278583 371319 273321 4888 -283519 -399707 -272684 -5651
859 -5651 240568 355379 297744 82091 -200018 -384438 -338977 -88010 201108 354517 314004
870 314004 125739 -125642 -332555 -365804 -177356 124085 341534 349260 175956 -72161
880 -72161 -283287 -362001 -241734 33795 297504 376395 234674 -20489 -247003 -344593 -273145
891 -273145 -48407 223341 375532 301401 49388 -211731 -338460 -290509 -104152 146159
901 146159 337620 343823 135634 -153592 -334850 -318371 -145704 90197 290885 348658 206297
912B06297k75917k35681m5723J54343K41075K05058Q3408q3126k31573k63029
922b44868j22588J04718K52994K31960R9270n5488j85957k47239j76296K6861
932c16633K24312K68813J46455l2314j69310k29819j88607l6179J63641K71179
942A01538K04517J7182j56936k27659j90974p1322R7878K41662K47550Q6257j26665
953B23028k39494k05857q6590O0649J93311K46474J49706n9288k28164k41839
963a88064j19304M0162J67112K26601J77272J1215j82663k62817j73228R277J59751
974a34686K14027J76832N6486j15417k46970k25184n1766J41496K24379J85065
984B24262P5173p0141k03873k40594j18625Q9169K26657K15791R6880m8772j70500
$$ plain form
912 206297 -69620 -305301 -351024 -196681 44394 249452 332860 249734 18161 -244868
922 -244868 -367456 -262738 -9744 222216 321486 265998 80041 -167198 -343494 -316633
932 -316633 -92321 176492 322947 290633 121323 -108496 -297103 -333282 -169641 101538
942 101538 306055 323237 166301 -61358 -252332 -323654 -225776 15886 263436 349693 223028
953 223028 -16466 -222323 -308913 -248264 -54953 191521 341227 281939 53775 -188064
963 -188064 -307368 -267206 -100094 126507 303779 314994 132331 -130486 -303714 -294437 -134686
974 -134686 79341 256173 312659 197242 -49728 -274912 -326678 -185182 39197 224262
984 224262 299435 229294 25421 -215173 -333798 -244629 -17972 197819 294699 245927 75427
995G5427k23610j57639J6355J96027K47429J42283k9075j57444k03771j67372
1005b61390m2124J38284K51253J97281J4650j48292k04325j69858o7634Q3055
1015b09100K16822K26882Q4012j10569k17755j92050q1245N6131J76411K18288
1025A67827J37606m3825k04266k26082j14486L9433J52854K00626J59422J9925
1035B89034j60185k42135j64216O903J44980J93776J61587N5822j03155k21470
1045c9059k05488n3008J20862K04851J74902P0167o4868j81513k12992j15337
1055c01483P0122K05907K05532Q9906m7825j50735j96047j48520L058J74270K31852
1066A36037J33975k4176j41805j84913j52808m0956J18859K22860J82867K7238
$$ plain form
995 75427 -148183 -305822 -289467 -93440 153989 296272 267197 109753 -94018 -261390
1005 -261390 -303514 -165230 86023 283304 297954 149662 -54663 -224521 -292155 -209100
1015 -209100 7722 234604 318616 208047 -9708 -201758 -283003 -226872 -50461 167827
1025 167827 305433 261608 57342 -168740 -283226 -243793 -90939 109687 269109 289034
1035 289034 128849 -113286 -277502 -270599 -125619 68157 229744 285566 182411 -39059
1045 -39059 -244547 -297555 -176693 28158 203060 273227 208359 26846 -186146 -301483
1055 -301483 -231361 -25454 180078 269984 222159 71424 -124623 -273143 -270085 -95815 136037
1066 136037 270012 245836 104031 -80882 -233690 -274646 -155787 67073 249940 277178
1076B77178j30428j94328j58197n7340P4222J84914K05891R0879r2375k04591
1086d175j79966p2325N0947J50358J97522J34472l1513j86950k10099j05957L3484
1097b24202J36298J80463J48158K2295j37843k18730j57698k192J33252J80567
1107F0368J45040M9075q3540j94507j93617o0789J10234J92521J57984O1974n2737
1118A92006j57068j96440j13417N7064J87757J87937Q6742l8519j35256j78315
1128a07509j36924k721J50290K09878J32949j5275j31388j70225j37347l9526
1138b47798R8091J99685J75100L2090j19104j78689j41368n4763N8913J65622
1148a2221J91896Q7257p9477j83253j66966p0293M2913J36060J77915J23314j9993
$$ plain form
1076 277178 146750 -47578 -205775 -263115 -188893 -3979 201912 292791 200416 -4175
1086 -4175 -184141 -256466 -205519 -55161 142361 276833 245320 58370 -151729 -257686 -224202
1097 -224202 -87904 92559 240717 263012 125169 -93561 -251259 -253451 -120199 60368
1107 60368 205408 254483 170943 -23564 -217181 -277970 -167736 24785 182769 244743 192006
1118 192006 34938 -161502 -274919 -217855 -30098 157839 244581 206062 70806 -107509
1128 -107509 -244433 -247154 -96864 113014 245963 230688 99300 -70925 -208272 -247798
1138 -247798 -149707 49978 225078 257168 138064 -40625 -181993 -236756 -177843 -12221
1148 -12221 179675 266932 187455 4202 -162764 -233057 -190144 -54084 123831 247145 227152
1159B27152j62484j96233j06474K9882J28177J61227J29585K8235j14662k01681
1169g7276j52032n541J22202J64360J31217M8668p2376j75290j77060o0199R4755
1180a58572J74601J49611N9068m9042j42123j75096j04710M2734J68417J77428
1190A42316Q4045l7485j24400j58048j24489r077J32674J93660J26105j2286j21008
1201I2007j53541j25273l7890Q6023J78603J61361L5625j04945j65470j34826
1211a68326m8398N6411J47504J68583Q5501o2671j68679j61023o4759M3400J23461
1222d8996J56079J13935r958j45389j83622j00771K6999J16932J47408J18335
1232A90952K5468j00895j80694j41532j1565J10719J55588J19688M0754o3401
$$ plain form
1159 227152 64668 -131565 -238039 -208157 -79980 81247 210832 239067 124405 -77276
1169 -77276 -229308 -234849 -112647 51713 182930 231598 159222 -16068 -193128 -253327 -158572
1180 -158572 16029 165640 224708 175666 33543 -141553 -246263 -203529 -35112 142316
1190 142316 226361 188876 64476 -93572 -218061 -227138 -94464 99196 225301 213015 92007
1201 92007 -61534 -186807 -224697 -138674 39929 201290 236915 131970 -33500 -168326
1211 -168326 -216724 -160313 -12809 155774 241275 178604 9925 -151098 -215857 -172457 -48996
1222 -48996 107083 221018 211060 65671 -117951 -218722 -191723 -74791 72617 190952
1232 190952 216420 115525 -65169 -206701 -218266 -107547 48041 167729 208483 145082
1242A45082j53533j63257o2839Q3688J65799J39827M7618m5116j22318j58116
1252a23165j01404L4802J55381J65743P6739l5492j13761j42989j11612r931J16128
1263h9561J76545J19969q359j13624j44080j10610l2010P4970J59345J50410L7744
1274B20739r7435j55063j21120m1778M8525J30561J56433Q1962n7746j53938j47389
1285a36249o1158L9772J12529J42694J02428q213j27726j67809r7552K3192J10805
1296f7287J34858J04446K4049q7402j63497j34099j3697J03978J42079J08186
1306A51614L8050n5392j37626j50052o0773P2970J51157J30343M7558m3994j12855
1317C1000j40498r0846K5234J36071J56137P6366l3149j06707j29142r9780j3696
$$ plain form
1242 145082 -8451 -171708 -234547 -150859 14940 154767 202385 157269 34951 -123165
1252 -123165 -224569 -189767 -34386 131357 208096 172604 58843 -84146 -195758 -205689 -89561
1263 -89561 86984 206953 198594 84970 -59110 -169720 -201730 -126760 32585 182995 220739
1274 220739 123304 -31759 -152879 -194657 -146132 -15571 140862 222824 165078 11140 -136249
1285 -136249 -197407 -157635 -45106 97588 200016 191803 64077 -103732 -201284 -178092 -67287
1296 -67287 67571 172017 196066 108664 -54833 -188932 -202629 -98651 43428 151614
1306 151614 189664 134272 -3354 -153406 -214179 -141209 9948 140291 187849 143855 31000
1317 31000 -109498 -200344 -175110 -39039 117098 193464 160315 53608 -75534 -175314 -189010
1328a89010J02628J62264J13768o717j03379j31032j01907l1009O5809J44913
1338B6328J37668L7303q4683j42797j15157l7676M7007J16889J38374P7026m4737
1349A55545j41276j39344n8317L9291J02674J27626R3767l249j15137j54263r1627
1360a84310J9605J01441J24243R5687K1597p8168j45584j24219j8099R2473J34723
1371C9389J01990L0425n1912j20498j34971n9724O1855J39908J22381M3816m0941
1382A31718j02522j26662q4734K0508J22031J44749P2398k9095r8936j17317r0269
1393a58131j3296Q8285J46420J09011j97r7388j24857r0128k5052N6128J26549
1404A7344J28721M1422p6312j34489j06530l4436M3083J05377J24864P3025l7411
$$ plain form
1328 -189010 -86382 75882 189650 182933 79554 -51478 -153385 -184394 -118585 26328
1338 26328 163996 201299 116616 -26181 -141338 -179014 -132007 -15118 123256 200282 155545
1349 155545 14269 -125075 -183392 -144101 -41427 86199 179966 176717 61580 -92683 -184310
1360 -184310 -164705 -63264 60979 156666 178263 100095 -45489 -169708 -187807 -95334 39389
1371 39389 141379 171804 119892 -606 -135577 -195301 -133446 6462 128843 172659 131718
1382 131718 29196 -97466 -182200 -161692 -39661 105088 177486 148391 49455 -67862 -158131
1393 -158131 -171427 -83142 63278 172289 172092 74704 -50153 -140281 -165333 -109205 17344
1404 17344 146065 187487 111175 -23314 -129844 -164280 -121197 -15820 109044 182069 144658
1415A44658j27351j30229n6471L5365R6082J15764Q3810n26r9617j42251q9701
1426a70467J6003R6365J14541Q4654K0366o6604j32417j17127j9330Q5492J23634
1437C5110R3007K9826m6845j10011j22551n7245N4198J26912J15479M2412m0291
1448A20001r4513j12551p6938J4221J09314J35093P0698k7861r2806j07642q0242
1459a43226j2589P7106J34299J02331J463q8727j15093q4212k3056N2263J14144
1470A4703J17168L8590o5449j23344j01652l1489M1608R5613J11865O6773l0070
1481A34316j14996j23152n3048L3699R0312J02525P6103K814q9117j32604q3850
1492a56998J4549Q8141J05309P8672J8378o1177j18059j06863k2161P4005J16867
$$ plain form
1415 144658 17307 -112922 -169393 -134028 -37946 77818 161628 161102 61485 -80766 -170467
1426 -170467 -154464 -58099 56442 141096 161462 94858 -37559 -154686 -174016 -88524 35110
1437 35110 128117 157943 111098 1087 -121464 -178709 -124511 2401 117880 160292 120001
1448 120001 25488 -87063 -164001 -149780 -40466 94627 165325 137464 44658 -62984 -143226
1459 -143226 -155815 -78709 55590 157921 159384 70657 -44436 -128648 -151704 -99441 14703
1470 14703 131871 170461 105012 -18332 -119984 -151473 -109865 -14252 97613 164386 134316
1481 134316 19320 -103832 -156880 -123181 -32869 69656 145759 148573 59456 -73148 -156998
1492 -156998 -142449 -54308 51001 129673 148051 86874 -31185 -138048 -160209 -86204 30663
1503C0663Q9584K3941m4850r7142j09711n6072M4511J17091J11444L7919l6172
1514A11206q6158j02604p1669J0448R8478J23633O7551k2014q5366j01153p3414
1525a31062j0311O9060J18490R5465P706q0588j09414p8910j8579M7297J00031
1536I185J07396M1717n7503j16100r4985k9121L8308Q5631J02266O3542k4762
1547A25574j03727j14156n2683K9507Q3741R5134O8892K690p6562j18201q2862
1558a42653O787Q3316J00374P0840J4066n0781j05328j01600k5355O8488J08992
1569B7146Q1270K3737l8478q8034j02262n2958L8867J06314J02415L9131l3255
1580A03893q0932r3353o2709N047Q5608J16005O7431k0150q1121r1546o5192j2353
$$ plain form
1503 30663 120247 144188 99338 2196 -107515 -163587 -119076 -1985 109459 147378 111206
1514 111206 25048 -77556 -149225 -138777 -40299 83334 150885 128871 43505 -57648 -131062
1525 -131062 -141373 -72313 46177 141642 149348 68760 -40654 -119564 -138143 -90846 9185
1536 9185 116581 158298 100795 -15305 -110290 -139411 -101103 -15472 86794 150336 125574
1547 125574 21847 -92309 -144992 -115485 -31744 63390 132282 134972 58410 -59791 -142653
1558 -142653 -135866 -52550 47824 118664 132730 81949 -23379 -124979 -150334 -81846 27146
1569 27146 108416 132153 93675 5641 -96621 -149579 -110712 -4398 98017 137148 103893
1580 103893 22961 -70392 -133101 -128054 -42446 73559 140990 120840 39719 -51827 -117019 -129372
1592a29372N8640J08534R2164Q787p3731r9897p4056j9377M3634R1896R7328L9522
1604A44072m9255j04581r1294k9063L6031Q0977R0448N8276j8011r3786j07601
1615h3787n1338K8339P7983Q5760O2309N505o9026j09700p6844M848P6344R2164
1627D2557O6447J3669m7845r5397r1427k5147N8727J02282P8240K0279l8805p9228
1639D352q9609n0365L0723R8406R8304L6012l3993p3441q3872n8337M080P7490
1651d0250J06226O2993j5699p5322q6042o1677q938N4339R8184Q2692J2040o5349
1663F3197r5854o9159j5271M0490Q1581Q8402L9677m2540r8964q6299k5109L4660
1675h5189P2218Q2944N3750j5223q4190r9295m9538K3642P2271Q2859N5877L327
$$ plain form
1592 -129372 -70732 37802 129966 138753 65022 -34875 -108931 -128308 -84674 7222 104550 144072
1604 144072 94817 -9764 -101058 -130121 -94090 -13113 77335 135611 117600 23814 -83787
1615 -83787 -135125 -106786 -28803 56957 119266 124771 55745 -53955 -130799 -125951 -49607 42557
1627 42557 109004 122673 74828 -20569 -111996 -137143 -78416 23866 102106 122385 83580 4352
1639 4352 -85257 -135622 -104899 -6493 91811 127823 93830 20389 -63483 -121820 -117740 -40250
1651 -40250 65976 128969 113270 37948 -48094 -109771 -118709 -64370 33814 116506 128546 63197
1663 63197 -32657 -101816 -117087 -76597 4984 93386 133063 90523 -8441 -94740 -119849 -85189
1675 -85189 -12971 69973 123723 108500 24310 -74985 -124523 -100881 -28610 54249 110126 113453
1687A13453o1160r8558p3700J583P0767Q8423N9491J1333m3398q4685q4706k7443
1699a28600N4531R4716P4782J7425l5450p2944q1800m6715K6601Q8841R1725L5587
1711A18699k9774o9994p7150n2647L087O8155R6923O1959j3326p1094q0470n3171
1723i8803p704M5935Q8193P9352J3993o1335q9779o3795j2420L6114P3489Q0537
1735H3777L8692l6978r0166q1154k6475L2286O8799P4213M8360j1404p4463r2817
1747f7330m8372K1752O7932P4651M9932N650n3718r0710o9491n26O3908Q2816
1759C6494N5458J2028m0545p7358p6373k7372M6333Q7524P1313J8614l4361o6303
1771E452p3802m3746K0060P9824Q7119L6874k8851o5493o9694m7613J008N9617
$$ plain form
1687 113453 52293 -46265 -119965 -118382 -47615 40808 100299 111632 68234 -16451 -101157 -128600
1699 -128600 -74069 20647 95429 112854 77404 4460 -77340 -124055 -97454 -8613 83112 118699
1711 118699 88925 18931 -58219 -110866 -107779 -39624 57299 119258 105932 34838 -45632 -98803
1723 -98803 -106507 -60572 27621 106973 120966 59631 -30148 -93943 -106363 -70249 3240 83777
1735 83777 122469 85491 -4675 -85829 -112304 -80018 -11219 62994 111354 99950 25487 -67330
1747 -67330 -115702 -93950 -26018 48633 98565 104215 50497 -40213 -109704 -110230 -46322 36494
1759 36494 91952 103980 63435 -13923 -90296 -117668 -71335 16189 87502 106116 71755 5452
1771 5452 -68350 -112096 -92036 -12212 74907 111781 82930 17437 -52257 -99870 -98862 -39245
1783c9245Q9839N9005j0129o4624p5527n1487o700M3193P8446P1804J7164n2708
1795E9031q4824o1582j1933L4832O6286P2540L6871l0280q1721p8353k5652L0488
1807g4297O2985O8783M3407p928o6015q7135m7163J8392O4782O9345M5321M316
1819I4793m7359q0651o5328n058N8020P8595N2807P920l6221o7654p1057k7990
1831a09183M0010Q2155O6723J8093l1498o0855o6864m0631J7446P1222Q0038L6309
1843A02965k4323o2191o4759m2294O86N2712Q0195N7235o425n9692p2049m6080
1855h4020n441L7134P0358O8720J7203m8281p8222n7648j1574L1855O0452O5865
1867F6401L5085k5759p3736p3101k6790K8227N9361O1278M0573o287n7640p9917
$$ plain form
1783 -39245 50594 109599 99470 34846 -40681 -92168 -98868 -55675 22771 94575 111739 59031
1795 59031 -25793 -87375 -99308 -64476 1810 74350 111221 80941 -780 -79133 -104785 -74297
1807 -74297 -11312 57471 100878 92950 26935 -60200 -107363 -88971 -24189 45156 90477 94793
1819 94793 47434 -33217 -98545 -103603 -45583 33012 85819 93739 57518 -10136 -81193 -109183
1831 -109183 -69173 12982 79705 97798 66300 5445 -61419 -102050 -84604 -13382 66656 102965
1843 102965 78642 16451 -48308 -90602 -89916 -37204 42991 100226 93801 34109 -37940 -84020
1855 -84020 -89461 -52327 18031 86751 103954 55673 -22549 -80197 -91771 -59916 536 66401
1867 66401 101486 75727 1991 -71110 -97900 -69673 -10312 50966 91539 85252 27612 -52305
1879e2305m6919J5387O0152O4856M1706L398m1655p2666o2797n849N2720P2861
1891B8889N0636O951l2347o2485o3983k7146L4093P4382O4795J7675l0195n6585
1903D680n9718l6647J1916O4163P5748L5813k1839n8397n9816l9271P6M7566P3687
1916C7961N4019m195n4927o7131m3971m540L4292O4688O0976J8620m2174p2265
1928a8647n6404j0458L1545N4189N9172L3129k0579o7883o9333k5731K6201N5286
1940i513N6473L7004n199n2510p2395m5169J1696N5903O2000L8818J699l7014
1952D1793o5734n6394r840M6968O9720M7943N478l0733n5339n8208k7163K8913
1964f2596O9524O0785J7122k8004n2377n4780l4058J0975N7461O9762L4968j9106
$$ plain form
1879 -52305 -99224 -83837 -23685 41171 82877 86275 44620 -28046 -90843 -96692 -43972 28889
1891 28889 79525 86476 54129 -8356 -72339 -99485 -65392 8990 73785 91460 61265 4680
1903 4680 -55038 -91685 -79769 -15606 60142 95955 74116 15719 -44097 -83368 -83292 -35726 37961
1916 37961 91980 87785 32858 -34273 -78244 -82784 -48492 16196 77172 95792 53618 -18647
1928 -18647 -75051 -85509 -53964 225 59397 92526 71947 4064 -65269 -91000 -64799 -9513
1940 -9513 46960 83964 78765 26255 -46140 -91309 -79613 -23710 38290 77108 78807 41793
1952 41793 -23941 -80335 -90175 -43207 26513 74456 79934 49201 -6138 -64346 -91509 -62596
1964 -62596 6928 67713 84835 56831 4454 -50326 -84384 -73409 -15948 53814 88782 69676
1976F9676n4663n6458l4264M88M1323O5218N2382k30n2200o4000l9185l456L2165
1989d3204N5839N6566J9547l7767o7956n2357j0402K9560N0463N4064L0059j8974
2001F5438n9561o5189k6222K4335N3155N1530L1997l926m5400o6301m4333R947
2013g4530N3160N7217L4824R32l3187n9343n3065r431M3809O3306M5279N470k9589
2026D4852n1023n2431k3673K4436O2504N8392J7619k8153n0368m8679k8266P585
2038f7205N0180O6017L4576j8529n1275n1664l1419M90L6677O1355M7536j32m5902
2051C0705n9959l8713j670K9928N1921N0472J7736l1182o2501n1977r400K8899
2063d5741M7362M6804K7291j3607n4699o1454k4815K2750M8423M7244K9764l214
$$ plain form
1976 69676 15013 -41445 -75709 -75221 -33898 31320 83702 83472 31272 -32728 -71913 -75369 -43204
1989 -43204 12635 69201 88748 50981 -16975 -69332 -79734 -50174 289 54353 84412 65438
2001 65438 5877 -59312 -85534 -61199 -8044 43486 75483 71557 26157 -40144 -84477 -74530
2013 -74530 -21370 35847 70671 71603 38416 -20927 -73992 -83423 -39614 23692 68971 74441 44852
2026 44852 -6171 -58602 -82275 -57839 4665 63057 80676 52523 2155 -46524 -74790 -67205
2038 -67205 -17025 48992 83568 65039 13764 -37900 -69319 -68829 -32152 29203 76739 76607 30705
2051 30705 -29254 -67967 -69637 -39709 12212 62684 80420 49238 -13263 -65240 -74640 -45741
2063 -45741 1621 48425 75716 62109 7410 -54044 -78859 -56109 -7686 39558 69322 66108
2075F6108m1279o0682m0875P308M7784N3943L4459p68l1633n2111m7885j1323
2087g6954L6950O1222M3560M197k8731m5178m6258k4984K0368N9116N4142J7124
2099G4574k4915m6288m5996k6592P299M5255N9044L3567j3978m7698m9690k9558
2111f4976K613L3127N3642M4659L645m2329n8108l5183q45K7374M5849M6699J9055
2124G5222k8384n8002m8316j0103K6679M4343M4000K3783j2755m8328n6662k5756
2136g4279J9881M6919M5550K4711l996l5606n4099l9743M238M5440N2111K9923
2148F1050j072k7918m7251m4767j2141L4053N6376M0732N150k6114m3302m2060
2160d7264k1666J7185N2150N2165J7724k3889m4366m0555k3868N452L9842N5208
$$ plain form
2075 66108 24829 -35853 -76728 -69420 -21636 32307 66766 65998 34365 -17746 -65631 -76954
2087 -76954 -40004 21218 64778 68975 40244 -4934 -51192 -76176 -55808 3308 57450 74574
2099 74574 49659 3371 -42625 -69217 -61918 -16663 42381 75948 61970 14272 -35418 -64976
2111 -64976 -62363 -29236 24406 69065 72710 30381 -27727 -62910 -63755 -36381 9468 56167 75222
2124 75222 46838 -11164 -59480 -69583 -42904 1439 45439 69222 56467 8139 -48523 -74279
2136 -74279 -54398 -7479 38071 62782 58786 23180 -30919 -70662 -66424 -20984 31127 61050
2148 61050 59978 32060 -15191 -59958 -72099 -38046 18330 59062 64212 38098 -5204 -47264
2160 -47264 -68930 -51745 405 52570 70294 46405 2039 -38516 -62384 -56932 -17090 38118
2172C8118L2572j2005m6125m6265k5351J438K9920M8636M1870N174l8994n2255
2184b3267l5175j200K6396M2403M0556J7524k2631n2565m6191j0883K5046M1303
2196A316L9105K1559q723m4146n2543k5671J8152M3214M1845K3257k418l2501
2208B2446m9670l6615J890M0589M9442K8885r52k7546m1810m0367j1928K7942
2220c7694N3308L9407N318k6142l8918l6915k1427J4811M6218N0083J7568k2386
2232D3231m0663l7949k1707M983L5054N0047L1439q950m1923m3796k5414L431
2244e2217K6398M3958L7569P347l3560n1167l2991m50K4923L6688L8303J8350
2256F3151k0508m8757m3574j0849K2939L9014L5622K0223q294l9422m7791k4705
$$ plain form
2172 38118 70690 58685 12560 -33705 -59056 -57618 -27698 20938 62808 67982 28988 -23267
2184 -23267 -58442 -59642 -33246 9157 49713 67237 44606 -7959 -54150 -65033 -39987 1316
2196 1316 40421 61980 53257 9111 -43432 -69103 -50951 -7737 34108 57365 54947 22446
2208 22446 -27224 -63839 -61949 -21360 28082 56967 56015 28469 -13341 -53708 -65636 -37694
2220 -37694 15614 55021 60339 34197 -4721 -41636 -63063 -48252 -2034 48049 65617 43231
2232 43231 2568 -35381 -57088 -52105 -17051 32996 64435 55485 13562 -30234 -55648 -52217
2244 -52217 -25819 18139 55708 63055 29495 -21672 -54663 -55113 -30190 6498 44801 63151
2256 63151 42643 -6114 -49688 -60537 -37598 1416 37038 57261 48967 9545 -38246 -62951
2268f2951J4626M0071M0899K1250m054k9281m3848l4871j89L6485M7886K6356
2280E2379j113k4347l9006l6702j2332K5845M8409L7664N851k4558l5846l4930
2292c8686j7522J1570M1378M5173J8299j7851m0287l4956j9082N034K9608M6416
2304B9094L0042o441l8955m1991k3069L045K5049L8986L4748P533l0368m6133
2316a8460l2068j352K4183L5305L2851J6264j6741m3357m1829j2529K2445L6651
2328A363L3330J7217p719l3849m3738k5538J3457L8134L7042K0625m792k6562
2340A8970l9985l2352k67L3280M3579K6078r66k4648l4594l2758j1996K1640M5274
2353A1255L5945N215k3020l4098l1111j6019R833L8118M2095J8778j7871l6536
$$ plain form
2268 -62951 -48325 -8254 32645 53895 49841 20560 -23288 -58159 -58348 -21863 26023 52379
2280 52379 51266 26919 -12087 -48789 -61121 -35276 13133 50797 56648 32090 -3756 -38686
2292 -38686 -56208 -44638 -3260 41913 60212 42361 2074 -32882 -51964 -46930 -17322 29094
2304 29094 59136 52695 13740 -28251 -51320 -48275 -23226 15760 50508 58041 27673 -18460
2316 -18460 -50528 -51880 -27697 7608 40459 56723 39982 -3375 -45204 -57733 -35288 1363
2328 1363 34693 51910 44191 10342 -33396 -58934 -45477 -7343 29699 50324 45532 18970
2340 18970 -21015 -53367 -53634 -20354 23225 49303 48337 23689 -10905 -43663 -55659 -34019 11255
2353 11255 47200 52415 29395 -4703 -35814 -51833 -42000 -3882 38213 56991 39120 2584
2365B584l3773j7301N249K7734M0021K9686m701l4834m1027k1150L166K3533L4487
2378A3674L2232P795k6309m3060l1208n62K1915L1729L0174J5476j4471l9229
2390a844l9185j2554K0074L4495L0957J5429o251l1121m0384k4053J0502L5689
2402h246L6282J8417m914k3448l5513l0533k121K9586M1821K4228j379k1846l2261
2415i927k9680j1279J8822M1027L4046O047k0827l2519k8578j4066Q684L3665
2427d585L9193J7780j4976l5639l0825j4761M744K4704L6666K7183k881l2963
2439A3640l7605k0152L334K1606L1632K8753Q370k3802m0062k9577j582K2006
2451b3439K9799K7757J2038j2224l4578l7349j2318J8027L3962K8500J2468n636
$$ plain form
2365 2584 -31189 -48490 -43241 -15507 24514 54200 49499 14665 -26362 -47512 -44346 -20813 13674
2378 13674 45906 53701 27392 -15668 -46876 -47438 -25523 6206 36380 51856 37385 -1844
2390 -1844 -41029 -53583 -33509 986 31943 47372 41121 10000 -30384 -54437 -43935 -8246
2402 -8246 28036 46453 41539 18091 -17422 -47955 -50076 -20490 21331 45559 44180 22334 -9927
2415 -9927 -39607 -50886 -32064 8963 43009 49056 28229 -4290 -32868 -46934 -38250 -4585
2427 -4585 34608 52388 37412 1773 -29052 -43813 -39069 -14365 22301 49484 46603 13640
2439 13640 -23965 -44117 -40783 -19177 12455 41208 49578 25776 -14286 -43863 -45445 -23439
2451 -23439 6360 34117 46155 33931 -647 -37996 -50314 -32287 1675 30175 42643 37007
2463C7007k6886l6962k2865Q754L3286L4023J6612m403k1657l2494k7681l155
2475d6421K6248L9217K4245j446k1297k9990k6102j0938J6496L7088L2987O177
2487D6264j9409l0743k6094j3166P801L0981L5621J7145j3029l2178l0343j3530
2499d0680M740K2776L3463K4749j637k9876l6032j9411L157K1963K9088K5660
2511C7960P474k0844l7160k8019j968K0139K9188K4676J2104j1389l1799l4144
2523c3782j1975J5964L0680K6908J2462o277k4551l3009k1518O228L0610L2427
2535B4167J5861m715k0649k8463k5287m507K3527L6887K3791k306j9346k6988
2547h028k4234r798J3496L4241L0782P308j8889k9002k4192j1400Q192K6943L2007
$$ plain form
2463 37007 10121 -26841 -49706 -40952 -7666 26357 42969 38566 16909 -15585 -43266 -46421
2475 -46421 -20173 19044 43289 41843 20546 -9444 -35546 -46484 -29988 7100 40087 46264
2487 46264 26855 -3888 -29982 -43148 -35347 -4366 31255 48400 35371 3193 -27150 -40680
2499 -40680 -35940 -13164 20299 45048 43411 13535 -22497 -41908 -38751 -16788 12300 37960
2511 37960 45434 24590 -12570 -40589 -42557 -22418 6770 31446 43550 32161 362 -33782
2523 -33782 -45757 -29793 887 27795 40257 33980 9429 -23580 -45098 -38870 -8260 24167
2535 24167 40028 35313 14664 -13799 -39086 -43593 -20066 16821 40612 38306 18960 -8028
2547 -8028 -32262 -42060 -28564 5677 36459 43767 24878 -4124 -28316 -39716 -31524 -4581 27426
2560B7426J7744j1231l0412k9503j2299N754K0733K9746K3956k008k7162l3466
2572b0722j8390L816J9842K5502K4103P533j8445l4320k6004l193J9788K6541
2584F051K3260R454r501k8194l2108j2863J4971L0314K5304J0518o343k2187l0431
2597b1755k0212N544K8815K9721J5303n522j8166k7790k2060l571K1340L3328
2609A4975K1651O6j9327k5890k1566p805J1319L1161K9119P703j7827k8227k2189
2622b6837r082N570K4993L0392J6999j0641k8155k8302j1119N786J9508K7550
2634A6662K0654n84k3706l1213j8612L708J9087K4488K0373P105j5436l1340k5790
2647c4604k950J8054K6301J9269R242q151k6131k9200j2208J3539K7669K3493
$$ plain form
2560 27426 45170 33939 3527 -25976 -38275 -32521 -11788 17958 41914 39906 12744 -20722
2572 -20722 -39112 -35296 -15454 10048 34151 41684 23239 -11081 -37085 -40278 -20490 6051
2584 6051 29311 38765 29264 1070 -31038 -43901 -28930 1384 26688 37206 30863 8676 -21755
2597 -21755 -41967 -36423 -7608 22113 37416 31894 13728 -14062 -36122 -39693 -18353 14975
2609 14975 36626 36692 17365 -8525 -30091 -37896 -26577 4584 33703 41406 23579 -4648 -26837
2622 -26837 -35919 -30349 -5356 25036 42035 31394 3239 -25063 -36182 -30396 -10888 16662
2634 16662 37316 36732 13026 -18187 -36799 -33091 -14004 10484 30857 37962 22526 -8814 -34604
2647 -34604 -37554 -19500 6801 26070 35312 27161 1030 -28170 -40378 -26839 830 24323
2659B4323R519n536k0487k7266j9044L942K5887K9670J3459m378j8044k4590j9593
2672c2138m412J8701L1323K1614r67j8576k4007j8537q799J1777K7710K6736P609
2685C8034j5769k5588k2023q238P151K1212K7779J5671q412k6026k6248j1018
2697c3475O463J7010K3725K0191P15k2211k9576j6816L760J8018K1972J9005N912
2710C4693j3702k8581k4186l337J6153K4189J9344P544p433k3369k5803j2872
2722c7360J1616K5515K3210Q132n508j7628k4619j8556L234K3664K7616J3572
2734C2888m412j7174k1985j8907l871J6511K8257K1121l35j7155k2620j8015o300
2747c1997J0086K4153K5493P882j3742k5220k0087p451O742J7976K6436J4588
$$ plain form
2659 24323 33842 28306 7819 -19447 -38491 -34549 -8662 21008 34467 30089 12045 -12545 -32138
2672 -32138 -36550 -17849 13474 35088 34121 15545 -8462 -26999 -35798 -24021 3689 30425 38034
2685 38034 22265 -3323 -25346 -33584 -26433 -5221 22558 38229 29817 3791 -22457 -33475
2697 -33475 -27012 -10002 13723 33914 34629 12418 -17158 -33974 -30214 -12196 9776 28781 34693
2710 34693 20991 -7590 -31776 -35113 -18960 5229 24573 32117 24684 1315 -24488 -37360
2722 -37360 -25744 -229 22981 31113 25605 7977 -16642 -35198 -31964 -8300 19316 32888
2734 32888 28476 11302 -10683 -29590 -33461 -16950 11307 32428 32093 14938 -7682 -25697 -31997
2747 -31997 -21911 2242 27735 35617 21875 -3345 -23432 -30883 -24141 -6165 20271 34859
2759C4859o374k4710k4568r980M586J6957K2669J8137o4j8199k8321j6799K191
2772b9616J7158K1280J6672N717j1011k6666k2329m618J5871K3251J7295O732
2784B9736o633k0847k5614j0520R699K3747K1647P735n048j6572k2359j6619K294
2797b9354K0936K5744J3212m075j7111j9562j6069m448J4763K5945K0025L42j6087
2810A4261k1029j6028o312P965K3186K3538P432j2435k3373j8833o263N494J7868
2823d529K2073J4481n289k1980k3459j0948N255J5742K0506J6352J745j7245k5866
2836a3162j6571K079J5579K0169J5450N670j0804k3867k0565n596J5323K1566
2848E271J6698N546o938j8880k1644j1746Q701K2182K0777P614o132j5019j9498
$$ plain form
2759 34859 28485 3775 -20793 -30773 -26187 -9230 13439 31576 31512 13313 -15008 -31807 -29616
2772 -29616 -12458 8822 25494 31211 20200 -6466 -28795 -33413 -17542 5709 23004 29736
2784 29736 23103 2256 -23358 -33878 -24179 -432 21215 28950 23902 7330 -15029 -31648 -29354
2797 -29354 -8418 17326 30538 26463 9352 -10210 -26279 -30727 -15964 9981 30006 30348 14261
2810 14261 -6768 -22796 -29108 -21143 2043 25581 33013 20578 -2795 -21628 -27891 -22397 -4529
2823 -4529 17544 32025 26736 4756 -18703 -29651 -24396 -8654 11852 28204 29949 12704 -13162
2836 -13162 -29733 -27654 -12075 8094 23544 29214 18410 -5457 -26022 -31618 -16295 5271
2848 5271 21969 27515 20577 1697 -19947 -31693 -22992 -810 19967 27581 21449 6430 -13068
2861a3068j5356R74J8675K4533J3195m909j4257j9493j4907l713J3086K3101J9242
2874B7103J818j5543k0304j4612n012P000J9713K2765P985j1399k1398j8659n843
2887b6386N648J5745K0461J3925m219k0137k2547r494M895J4590J7975J4671J792
2900B6919j3866k4652j5566R25J5584J8865J3612M131q698k0987k0719l994J2869
2913a5577K0022J5434N487o529j6154j9967j1570O750K0864J9535P722n863j4033
2926F121j8718j3961M64J7560K2387J2693l001j4705j7782j3405l257J1293K1537
2939G226J7824K487j4836j9445j3729m030P069J7147K0861P365q990k0444j7975
2952a9470n384O078J4069J8414J2607l055j8525k0926r281N149J3551J6102J3229
$$ plain form
2861 -13068 -28424 -27450 -8775 15758 28953 24044 9787 -9706 -24613 -28326 -15240 7861 27103
2874 27103 28921 13378 -6926 -21538 -26550 -19550 163 22928 30913 19514 -1884 -20543 -26386
2887 -26386 -20738 -4993 15468 29393 25174 5037 -17510 -27004 -22109 -7519 10456 25127 26919
2900 26919 13053 -11599 -27165 -26240 -10656 8209 21821 25952 17254 -3733 -24452 -28446 -15577
2913 -15577 4445 19879 25366 18837 2683 -17284 -28854 -22104 -1240 18295 26017 20154 6121
2926 6121 -12597 -26558 -26094 -8534 13853 26546 23545 8840 -8942 -22347 -25604 -14311 7226
2939 7226 25050 27537 12701 -6744 -20473 -24503 -17434 -287 20574 27939 18949 -1495 -19470
2952 -19470 -24854 -18776 -4707 13707 26314 23259 4734 -16192 -25473 -20324 -6773 9329 22558
2965B2558K815j3520k1650j5621J320J3773J6711J3335L766p780j8495j8964n525
2978b7277J1189K0447J4492M549n811j5212j8101j1832O558J9370J8973P109o438
2991A8016j2134j6917j2057j056J5726K1241J2186l347j3305j6760j1651l382
3003b3440R632J8958J7369K144j2052j7996j3580l532O277J5638J8213Q989q783
3016A7837j9326j5683n557O378J2329J6564J1751j383j7152k0239r491M486J3383
3029f103J5028J1851J618j0732k0432j4349j27J3386J6277J1120M418p539j5846
3042a430j8468n097R938J9139J3735L263m748j4045j6413r876M624J6935J8009
3055A5566P044n280j3052j4336j1348m67J3520J9508J2580l219j2660j5274j1139
$$ plain form
2965 22558 25373 11853 -9797 -25418 -24098 -10325 6386 19721 23487 15707 -2788 -21752 -27277
2978 -27277 -16088 4359 18851 23400 17589 2377 -15724 -27556 -20998 -1628 17345 24454 18016
2991 18016 5882 -11035 -23092 -24148 -8422 12819 25005 21658 8353 -8407 -20058 -23440
3003 -23440 -13808 5150 22519 24663 12611 -5385 -18965 -22497 -16220 -582 17631 26620 17837
3016 17837 -1489 -17172 -22729 -16351 -4022 12542 24293 22910 5758 -14481 -23972 -19486 -6103
3029 -6103 8925 20776 22394 11662 -8770 -23119 -23246 -9860 6417 17537 21955 14416 -1430
3042 -1430 -19898 -24995 -15057 4082 17817 21080 16332 2287 -14126 -24002 -19378 -2443 15566
3055 15566 22610 17330 4278 -10058 -21406 -21873 -8353 11155 23735 20516 7856 -7418 -18557
3068a8557l158Q016J7855J7044K353j1452j6725j3086l253O113J4690J5773Q305
3081B3918o345j8409j5185n478N949J2659J3884J0981j115j4270j9768q997L824
3094a8352J2756J3914J0074K688j0200j8141j3795l25J2102J5682J0204K605n901
3107A3311j4744j6080n487Q030J7469J4251L793m946j3541j4395j0147M116J6018
3120b352J6739O486m961j1649j3298j0227l56J1691J7798J1684k267j2455j4325
3133g492r622k822P998J5990J4769L152j0567j6248j1379k227N135J2282J4548
3146A3517Q609n749j6981j4644m268N246J1327J2583R578l85j3144j7000q895
3159b0206L220J1642J2951R770J451q445j5991j3852j019J1546J5146J0183J944
$$ plain form
3068 -18557 -21715 -13699 4156 21200 23553 12101 -4624 -17710 -20963 -14850 -160 15613 23918
3081 23918 17573 -836 -16021 -21499 -15550 -2891 10993 21974 20859 6589 -13179 -22176 -18352
3094 -18352 -5596 8318 18392 21080 10880 -7261 -21056 -21381 -9279 6403 16607 19212 13311
3107 13311 -1433 -17513 -23000 -14970 2499 16750 20543 15597 2056 -12339 -22486 -18370 -2352
3120 -2352 14387 20873 15912 4263 -9035 -19262 -19618 -7927 9871 21555 19288 6833 -7492
3133 -7492 -17114 -19936 -11938 4052 18821 21973 11406 -4842 -16221 -18448 -13313 -1031 13517
3146 13517 22126 16377 -604 -15248 -19516 -14270 -2943 9640 19218 18833 5689 -11311 -20206
3159 -20206 -16986 -5344 7607 17377 18828 10383 -5608 -19460 -20479 -8933 6213 16396 18340
3172A8340n994j2706j4743o469P931J6312J2793L239n250j1484j2896q882L078
3185a6731J3346J5695P423l816j1775j2779q808o59J0026J5856J1233q68j1141
3198G002j3862q204k589O246J4056J4115L930r884j5638r847l500N269J2090J3519
3212A2703P123m651j4723j4315m864N139J0330J2288Q512nj1296j6359q998L361
3226a5755J0763J2346P804K061p201j4822j3031j042R924J3498R725K410m808
3239A1872j1865j3997n488N854J4160J3370L365n014j0107j1799q179R91J2649
3252d188J5336P303m380j0634j0158q789j047P960J5519J1263j557j0140j2393
3265e905p761k074M367J3062J2941M231p799j4461j1177j193M357R868J2467P436
$$ plain form
3172 18340 12346 -360 -15103 -21572 -13641 2671 15464 18703 13453 1969 -10927 -19809 -16731
3185 -16731 -3385 12310 19733 15917 4142 -8637 -17445 -18104 -8078 7778 19011 18143 7002
3198 7002 -6860 -15064 -17653 -11407 2649 16764 20694 10810 -4828 -14675 -18175 -12906 -816 12703
3212 12703 19826 15175 452 -13863 -18727 -13588 -3258 9030 17542 17537 6241 -10118 -19116 -15755
3226 -15755 -4992 7354 15158 17219 10018 -4804 -17835 -18877 -8953 4545 14270 16680 11872
3239 11872 7 -13990 -19478 -13624 536 13906 17271 12257 2150 -9649 -17828 -16837 -4188
3252 -4188 11148 18451 14071 3437 -6721 -15510 -16557 -8597 6922 18185 16628 6488 -5905
3265 -5905 -13666 -15740 -11373 1689 14630 18861 11062 -3399 -14576 -15769 -11412 -1544 10923 18359
3279A8359l525j3656j3794m872N111R422J0921P727Q7r902j3916r796K043J0682
3293e109J1515Q088J343o108j3155j1777k468Q698J3429Q842J992m928j0236j1897
3307a1771o218N501J3045J1655L643m363r231j0710p658J139J1053J3983P546
3320A7614m027r982j0593p406j331P373J3926J0311M79j0312j1970p510j220M554
3334a0094J1255J1239M790o994j2855r752l038M934R265J0654O874k700j1411
3347B167j3333m770M097R123J0082O890O57q361j3742r474J874R804J0624O721
3361A2359J679n502j1312j1276k436Q003J2048R270J626m994r164j1304n221M381
3375a1843J1415J2366L110m426q676j0024o036Q8J0026J3167P134l275r708r166
$$ plain form
3279 18359 14834 1178 -12616 -17488 -12377 -2955 7966 15693 15780 5878 -8038 -17834 -15791 -5109
3293 -5109 6406 14494 15837 9729 -3426 -15203 -17671 -8973 4456 13298 15290 10362 126 -11771
3307 -11771 -17989 -12488 557 12212 15855 11492 2261 -8449 -16107 -14968 -3915 10068 17614
3320 17614 13587 3605 -6988 -14394 -15725 -8352 5574 15885 16364 6052 -5918 -13428 -14648 -10094
3334 -10094 1161 12400 17190 10196 -2659 -12411 -15449 -10515 -1250 9404 16278 13578 2167
3347 2167 -11166 -15936 -11839 -2716 7366 14256 14913 6552 -7190 -16664 -14790 -4986 5638 12359
3361 12359 14038 8536 -2776 -14052 -16488 -8485 3563 12833 14459 9465 301 -11003 -16224 -11843
3375 -11843 -428 11938 15048 10622 1946 -8078 -14114 -14026 -4000 9167 16301 13026 3318 -5848
3389e848o110j565O290J2065R081J226q613j1957o900q92L948R823J0774M758
3403A6080n871j1685j0785j950M588Q744R365O355k183j0539j2166m827L772R586
3417a516Q045O807O38p957j2328r000J019R570R963O854P85m089j1330j0260l101
3432a5900P863J1364Q713J194n207p943r284o142L588J1311J1166L664m984p438
3446A965r020n839R6Q025J2983O230k197r132r373n343j154N743J0878R480J401
3461A4743q489r997p821q17M422Q032J0367L974m215j1607r620k683N331P384
3475i96Q121O043j153r536j1331n320L363Q394Q997N887k33p191j0910p832J99
3490a3498Q082J0012O593M27m512q751q920l326N634J1019P660J235m157q152
$$ plain form
3389 -5848 -11958 -13523 -7233 4832 13913 15139 6526 -5431 -12331 -13223 -9275 548 11322 16080
3403 16080 10209 -1476 -12261 -14211 -9623 -879 8486 14841 12658 2119 -10047 -14874 -11102 -1516
3417 -1516 6529 13336 13974 6017 -6311 -15311 -14292 -4722 5241 12095 12880 8791 -2539 -12799 -15900
3432 -15900 -8037 3327 12040 13234 8027 84 -9200 -15342 -11754 -443 10723 14387 9403 1965
3446 1965 -7055 -12894 -12798 -4773 8210 14440 12243 3111 -6262 -11605 -12759 -7016 3862 13342 14743
3461 14743 6254 -3743 -11564 -12381 -7959 73 10440 14414 10199 -1408 -11028 -13711 -8380 -996
3475 -996 7125 13168 12015 2479 -8852 -14172 -10809 -2415 6582 12469 12236 5045 -5865 -13697 -13498
3490 -13498 -5416 4596 11189 11616 7104 -1647 -10567 -13893 -8259 2760 10420 11655 7498 -654
3504f54p695n396L865R127J0584L684n047p248p503n376L64O953J0657P302j862
3519A1755r148p598n847p11M693J0096Q028K611p720j0213o909n32M442P475R414
3534I836K810k736j1199r105k177M581P165P411N227q56q444r992n391K367Q109
3549b394Q273M523O33n714r653q371L38Q007R119N722k74m105p866q331k874N353
3565g614J0562P209K37k726p613p517n057K485R092R560L366l452p359o997m878
3580a0702m7O894R320O945j324q330p694m324j853N585Q464P716Q65n185r832
3595c502o452r24M459O714P353M172l114r808p316k425L394P085P275M124j269
3610I766p156r546m922J716Q007P410L894O33n115q781o438q07O354R089N660
$$ plain form
3504 -654 -8349 -13745 -9880 -753 9831 13515 8468 1220 -6283 -11659 -11295 -4342 6315 13617 11755
3519 11755 2607 -4991 -10838 -11549 -6856 3240 11268 13879 6159 -4054 -10963 -11495 -7053 422 9836
3534 9836 12646 9910 -1289 -10394 -12571 -7990 -825 6586 11813 10957 2513 -7479 -12870 -10503 -2394
3549 -2394 5879 10402 11035 5321 -4332 -12703 -12365 -4358 4761 10483 10209 6104 -1762 -10093 -12967 -7614
3565 -7614 2948 10157 10394 7668 55 -7462 -12519 -10034 -942 8618 11984 8532 1173 -5824 -10702
3580 -10702 -10749 -3855 5465 12410 11086 2756 -4938 -9262 -11115 -5530 2934 10650 11515 6330 -3502
3595 -3502 -9954 -10878 -6419 295 7648 11820 8706 -1102 -8418 -10843 -7449 -364 6911 11035 9766
3610 9766 2610 -6936 -11858 -10142 -2135 5275 9169 9802 4687 -4094 -10532 -11339 -4985 4104 9764
3625I764m20k791p415p197m190N116R613O281J533l441o561o328m390J433P483
3640a510R479M038l956o681o720l992l26N367J0128N532j480o423q164m473o84
3655i865M792P508O955K076n877p835p358J6L440P159O226L777k302q895q181
3670h364k656L506P187O077M453q71o701q921n123K590O674O681M568k42m463
3685D395p968p012K25N929Q115N148O79l850o300p594k550L548Q739P163J496
3700A0163l762o079o024m201J107P833P834L646k698o350o117m638O36M658P890
3715C898O700j139o616o447n119Q90K932P187O492K153m690r078o230J61L584
3730e322N372O223M192k131q066p084l159L139O873M965L800r18m051q730n378
$$ plain form
3625 9764 9344 6553 -862 -8059 -12249 -7133 2480 8761 10294 6853 292 -6036 -10426 -8993 -1510
3640 -1510 7969 12007 8051 1370 -5350 -9342 -9668 -4301 5827 11359 9879 3456 -4708 -9181 -9865
3655 -9865 -5073 2435 9390 11466 5589 -2246 -9604 -9588 -6148 1011 7237 11014 8712 -183 -8364
3670 -8364 -11020 -7514 -327 5750 10203 9332 2631 -6290 -11413 -8823 -2149 4532 9100 8858 4395
3685 4395 -3573 -10585 -10360 -4431 3684 8832 9511 5661 -639 -8233 -10783 -7235 1504 8667 10163
3700 10163 6401 322 -5702 -9903 -8796 -963 6871 10517 7819 1469 -4648 -9286 -8650 -3992 3898
3715 3898 10598 9459 2843 -3604 -8723 -7833 -4901 2286 8778 10931 6241 -2837 -9067 -8906 -5322
3730 -5322 50 6273 10465 8334 268 -6816 -9975 -6836 37 5002 8802 7884 3833 -4897 -10275
3745a0275J757O816O195L411J04l068p832o601n97O411P971L857j01m129m146
3760b27o681k662K412Q337O379J441l225n771n307l282N82N839Q139L381k169
3775G186o434n810k855O63L119P778N440M77o362p622m010J027K941O015N630
3790G183K188l756p666n518q98L682N946M805K736j439o975p411k526L451O043
3805a55M604L828p37m610p497n206J757N759O238L720K35l776o034n740j642N652
3821c604P357L554M66l012n195n555k836K481P119O487J355l031n229m801l421
3836g865P01N025P236M486k615n886n566k658J84L512O063N883p29n094n643m425
3852g391J94L146M748O410J009k850p221m902j007L392M620N220L339k382o295
$$ plain form
3745 -10275 -8518 -1702 4493 7904 8008 4940 -2892 -9493 -10090 -3679 4292 8149 8048 3919 -227
3760 -227 -6908 -9570 -7158 1179 7558 8999 5774 3 -5304 -8586 -8004 -2165 5974 9355 7186
3775 7186 752 -5058 -7913 -7250 -4131 3647 9087 9564 3202 -4420 -8430 -7403 -4462 1553 7183
3790 7183 9371 5615 -2051 -7569 -8467 -4785 1161 5966 8702 7263 288 -7123 -9649 -6198 -155
3805 -155 4449 8277 7540 2930 -4567 -9773 -8016 -2257 3981 7701 7936 4160 -1874 -7614 -9256 -3604
3821 -3604 3753 7307 7773 4761 -434 -5989 -8825 -6344 775 7262 8617 5586 357 -4444 -7865
3836 -7865 -7164 -2139 5097 9583 6968 1082 -4484 -7142 -6958 -3446 2617 8500 7771 2677 -2966 -7391
3852 -7391 -7197 -4051 697 7107 8116 5266 -1955 -6857 -7864 -4472 148 5368 8707 6325 30
3867C0o375k947L309N572N448J580K4l363o710n556J792O065M941K750L5k752
3883C843n752m956j657M889O599L652J21k658n232m029l009K654O082N625J632
3898G804k878n028m782j904M12M235O920L518j733n808n091k398P30K944N062
3913B003N955n50m297o181m034R44K820M062N317K084l177o803m584r30K970M532
3929A31M293K450p07n581n796l234K912M934M587K406q9l889n935m397J094M918
3945a903M994L875q70k898m765m978j282L857O844L926o09l156l829m440j691
3960f925J405O185N432J237j992m621m265k742O67L925N407L765j229m917m382
3975c050l498O71K341M674N801N96m474n981l660M24K085M922M498K343k782o365
$$ plain form
3867 30 -6345 -9292 -5983 -411 5037 6617 6641 3278 -3432 -8988 -7196 -1131 3810 6560 6595 3843
3883 3843 -1909 -6865 -8522 -3633 2966 6618 6739 4081 -1151 -5180 -8189 -5535 547 6172 7804
3898 7804 4926 -102 -4884 -6788 -6376 -2141 4779 8297 6564 756 -4335 -6733 -6003 -3059 2003
3913 2003 7958 7408 3111 -3070 -7104 -6160 -3340 722 6039 8123 4946 -1857 -6441 -7371 -4401 131
3929 131 4424 6874 6167 586 -5210 -8444 -5532 -598 3989 6395 6306 2417 -3518 -7915 -6821 -1903
3945 -1903 3091 6966 6096 3198 -1567 -6545 -7827 -3970 2874 6800 6191 3035 -794 -5234 -6925
3960 -6925 -5520 665 6097 7334 5342 721 -3544 -6286 -5619 -1694 3713 7478 6249 1332 -3050
3975 -3050 -6548 -5877 -3536 1138 6939 7535 3061 -2920 -6580 -6156 -4071 851 5349 7692 4910 -1455
3991a455m989n04K701M086M262K150r12m068n813l070K073N166M253K305j005
4006E180k549n237l945M87L832N950K570o12j896n015m113j537L088N720L882
4021E805J012l597l605m047j889P30N539N075J558k368l942m104k052Q03L540
4036a542N387K722r57n368m415j733N44K907L812M412M77l725o075k120o07L546
4052b735L558L400K324k262m804n429j42K241L398M373K011q54l950n409k606
4067f886J911M827L699K312n40l227m103m185k65M539N482J590N0k839l982l204
4083d821j183K418M660M161Q20k903l015l732k187R98L966M900K592k348m970
4098f44k667k096R05K821M628L371q21m406m277j563J7K074L654M352J060l029
$$ plain form
3991 -1455 -6444 -6948 -4247 -161 4101 6251 5339 1271 -4542 -7612 -5539 -373 3880 6185 5180
4006 5180 2631 -2606 -6551 -6064 -2232 3718 6288 5676 3780 -1235 -5348 -6885 -3797 1923 5805
4021 5805 6817 3220 -385 -4432 -6321 -5591 -52 5023 6581 4213 271 -3833 -5885 -5082 -1542
4036 -1542 3845 6567 5610 242 -4173 -5906 -5362 -2455 1357 5769 6246 2521 -3554 -5674 -6281 -2735
4052 -2735 823 4223 6547 4285 -519 -5948 -6090 -3849 -451 3922 5933 5079 1129 -4280 -6886
4067 -6886 -4975 -148 3551 5863 5323 2096 -2007 -6192 -6457 -1918 3564 5154 5204 2365 -1617 -4821
4083 -4821 -6004 -3586 1074 5235 6055 3152 137 -3595 -5782 -4784 -818 4082 6674 4326 -644
4098 -644 -3311 -5407 -4502 -1681 2947 6318 5497 1091 -3186 -4749 -4732 -2658 996 5348 6408 3379
4114C379n784l270N90K123L401L981J326j116m193o132M3J931M031L581J579j021
4130D449l180n061k241N28M538M365J881j321j740m499l262n5L836M193K730J8
4146E179k483m098k686j864K047M936L653J022k678l107l622j747Q26M006M463
4161C847J934k219l750k844j934L6L214M122L490p89l778l831k415M93J961L528
4177A065L820J119l381l759l535m24K391K990K996J814m18n097m284m02J835K843
4193d27L688N60Q12l098n229k207J054L866L980J574J03k951l210l607J53K609
4209b330M012L243l72k135l320k871j647K113L443M204K60j676l697k190j284
4224d247M77K856M206J938j118l881k388j832K20K178L464L790p71l270l708k364
$$ plain form
4114 3379 -2405 -5675 -5085 -2962 439 4420 5746 4630 437 -5695 -5652 -3721 310 3891 5470 4449
4130 4449 1269 -3792 -6033 -5505 -967 3398 5279 3958 2218 -2281 -5543 -5598 -1762 2431 5161 5179
4146 5179 2696 -1402 -4088 -5952 -3905 1031 4684 5706 3028 -79 -3701 -5448 -4622 -616 3847
4161 3847 5781 3562 -188 -3032 -4966 -4930 -1716 2406 5896 5107 1329 -2502 -4917 -4424 -2463 1065
4177 1065 4885 6004 2623 -1136 -4671 -5095 -2704 286 3282 5096 4678 -419 -4703 -5105 -3270 -427
4193 -427 3261 3821 4633 1535 -3694 -5901 -4847 -981 2999 4573 4676 1725 -1485 -5092 -4939 -2330
4209 -2330 1682 4925 4553 2418 -902 -3773 -5420 -3307 136 4340 4600 2924 -773 -2963 -4247
4224 -4247 -3770 -914 3292 5230 4112 231 -2157 -3989 -3769 -1591 1873 5663 4892 1622 -2086 -4450
4240d450K72K288K419M228Q08k456m410l177K81O86L773L280R66m86l133n401
4256d512j164K820L141K321J399m13k239m151k134Q47K531M282J619r34j414l176
4272a177l519m25K495M457J560P68j894k262l451j148J077L707L692K25j453l291
4288f39j419k350L43L276L948K033k017k888l022r49k89K505L036K818R2k640
4304A838l616k196j02K385L397J542J701j459m633k704p42K196K470K235K070
4319D382n26l484l707j517J464L535K459J414j072p86m075k675M78L578J999K443
4335C910k74j503k990l027q39K669L839K252o47j246k202l985j3J5M301L020P12
4352C992j690k134k854q88R34J434M388J299j484k198l729p89M7K253L341K020
$$ plain form
4240 -4450 -4178 -1890 529 4757 5565 3109 -1301 -4478 -4197 -3511 262 3542 4508 4022 889 -4512
4256 -4512 -5676 -2856 285 2606 4005 3592 1353 -2798 -4932 -4085 -1554 2728 4347 3413 1999 -1177
4272 -1177 -4696 -5121 -2626 1831 3391 4159 2265 3 -3448 -4596 -3519 188 3880 4105 2652 -639
4288 -639 -2058 -4408 -4065 -789 3159 5192 3175 287 -2735 -3684 -3973 -1468 1568 4386 4478 1838
4304 1838 -1778 -3974 -4076 -1691 1706 3248 4949 3490 -1143 -3847 -4589 -2393 77 2312 4382
4319 4382 3856 372 -3335 -4852 -3388 147 2606 4020 2948 2162 -1913 -4588 -4110 -532 1467 3910
4335 3910 3636 2133 -857 -3884 -4723 -2054 1785 4037 3390 2144 -58 -4043 -4056 -4041 260 3280 3992
4352 3992 2302 168 -2686 -3574 -2640 -1206 3182 4481 2997 799 -2930 -3719 -3672 -1419 1922 3942
4368C942K33k455l529k361O85J967K683K155R93j726l152l251j58K022J444L159
4384B651J616p29k767l630j735J833K872J880J454p60j372l188k123r2L230K321
4400A461J581N91k315j812k733j285K360L434K771k9k288k518k159q63J209K215
4416c80L634J515k787k174j965j131OJ976L023K520n78l082l298p00M46J370K643
4433A038K477M59k028l921j594nK307J792K555L95n91l319k821n26J753K684J782
4450B437P04P6l148k791r99O56K628K179J893l37k225k888k143R86J892K287J683
4467B890J4k136j614k674k56J626L626J634k3j743k084j907q72P27K646L192P35
4484C781j197l047j812m27j33J606L085J488N32l339k592r81N39P87K996J274
$$ plain form
4368 3942 4175 1720 -1809 -4170 -3485 -1518 1165 3320 4313 2587 -565 -3816 -3974 -1952 -508 2651
4384 2651 4267 3538 771 -2859 -4594 -2761 111 1991 3445 2685 1313 -1875 -3998 -4090 -860 1461
4400 1461 3042 3633 1318 -494 -3227 -4512 -2152 1282 4053 4024 1736 -782 -2941 -3804 -2595 -380
4416 -380 3254 4769 1982 -192 -2157 -3288 -3282 -1306 1717 4237 3659 577 -2721 -3421 -2975 -1605 1038
4433 1038 3515 3974 1946 -1975 -3569 -3574 -1267 525 3080 3475 2884 -435 -3256 -3782 -2029 655 2437
4450 2437 3141 3217 69 -2722 -3721 -3065 -437 1742 3635 3298 1073 -1815 -3958 -2972 -1080 1207 2890
4467 2890 2904 768 -846 -3520 -3776 -2150 1476 3110 3087 1344 -740 -2647 -3519 -2792 -146 3046 3781
4484 3781 2584 -463 -2275 -2702 -2835 -1229 1856 3344 3876 537 -2055 -3036 -2497 -1710 1286 2560
4500B560P67k012l174j599M39J847J972R56K196j667l081l163L81J988J301K744
4516B455L24r6k458j945k638J964J527K963O52L79j916k358k539k06K044L563
4532A715J262P5j963j646j536j185J487K560J921L80j044k182j792j165L14K275
4548e24K396J687j192k467j659j467R86O75L100K123l83k466k439r22K39J201
4564a112J756J845R16j464l164j743p2J133K153K338Q59j750j770k506r7R47K240
4581E09J524O80n70j306k714j980N64K306L392M48o8j495k050k143m31K306K012
4598I84K166m08j304k506j330l49J027K316K035M88j820j443k403j84K31J816
4614f84L129O61o42k317k158j10j29J256K230J966J78k067k432j679k48J642J745
$$ plain form
4500 2560 3327 1315 -1859 -3458 -3019 -1172 800 1756 3952 2285 -796 -3959 -3578 -1590 -289 2455
4516 2455 2779 2683 225 -1720 -4358 -2394 -867 2096 2748 3127 1211 -1147 -3686 -3892 -1848 1715
4532 1715 2977 3052 1089 -557 -2093 -3278 -1791 769 2690 3070 2026 -156 -1948 -3113 -2799 -524
4548 -524 1872 3559 2367 -100 -1759 -3226 -2240 -1565 1535 3658 3275 809 -1630 -2552 -2313 -1112
4564 -1112 644 2489 3405 1941 -1223 -2966 -3038 -1905 248 2586 3445 1695 -75 -2581 -2678 -1731 509
4581 509 2033 2713 2143 837 -1877 -3857 -3293 -987 2405 2853 2785 1290 -760 -2903 -3334 -1028 984
4598 984 3150 2742 1438 -1068 -2398 -2747 -1720 596 2631 3119 1299 -144 -2547 -2731 -2500 -684
4614 -684 2445 3106 2464 147 -2011 -2121 -2250 -994 1236 3202 3380 1313 -1119 -2798 -3046 -1404 341
4631C41K079J069k007l007j134K59J038J551J906M10l75j653k955j341J763K275
4647B19Q86J262j073o34k122j439M95J686K140Q80k51p91j890j610j023K124J699
4664E58J906q1j704q53j704m00K01K365K273j76j009j250k093l96L76J551J915
4681A479J751j445j326j913o57k72J387J471J443J364k368k495r48m42J401J504
4697f6J674J314j282k289j937j83J952J015N10J064n27j045k140q68J241J874
4713C07J894L20k95j883j540j482KK053J947J295j38k014j771p08l55J195K513
4730A340J334q43q00j770p89o96O84J394J793P45m66j913j327j134N1J142L420
4747B165L31l84j695j912p57K51R70J612J498L66j116l095p38QJ348J613J835
$$ plain form
4631 341 2420 3489 1482 -1525 -2659 -2400 -1362 189 2095 2505 2130 477 -2478 -3819 -2056 219
4647 219 1105 2367 1294 660 -1462 -2901 -2406 -720 1420 2300 2049 1258 -632 -2242 -3265 -1141 558
4664 558 2464 2383 679 -174 -1878 -2278 -2077 288 2561 2385 1376 126 -1967 -2363 -1987 -436 1479
4681 1479 3230 1785 459 -1454 -2111 -2383 -996 475 1918 3282 914 -1581 -2529 -2971 -1570 -66
4697 -66 1608 2922 1640 -649 -2586 -2769 -817 198 708 1772 1245 200 -1940 -2808 -1567 307
4713 307 2201 2521 2226 343 -1197 -2679 -2677 -624 1323 2618 2480 466 -1305 -2013 -2368 -1173 1340
4730 1340 2674 1831 1031 -739 -1528 -2224 -1540 -146 1647 2392 1926 13 -1314 -2448 -2397 -1255 2165
4747 2165 2496 2112 417 -1495 -2252 -2001 -1031 581 2079 2445 1329 -1766 -2504 -2496 -1148 465 2300
4764B300k1k72k450j333j069J608J780J344L95p31j398j746j140J082J943J452
4780A744K3M77j339j860j490M99J406K104L77K99j320j504j870J96R23J683J709
4797B057K9j347o64j144k92j58J467K203N49r11j399j560j139M67J371Q12K363
4814B704r78j110k146l37k78J460J019J141J222j701j719r64p23J107J470J203
4830A370P80o72j697p04p61L72J879Q03K48K4p12k014r02J84J798O09J257j95
4848A667j164j402r51q12J783J108R43N25j275n62j465m56L54J774J807o9q17
4865I88r81j326m61L77J613J092Q10j330j062r56j288O04J122J539J746L91k034
4882H44k418l96k46J189J183R31J124p51k029j280N0P88Q45J133R93o73l81k132
$$ plain form
4764 2300 2279 2007 -443 -1776 -2845 -1237 543 1887 2282 1551 153 -1593 -2733 -1651 292 1744
4780 1744 1767 2244 905 -955 -2445 -1946 -540 1564 1941 2240 920 -584 -2454 -2258 -1335 348 2057
4797 2057 2086 739 75 -1069 -1361 -1519 -52 2151 2700 1789 390 -1170 -2309 -1842 -471 341 2704
4814 2704 1726 616 -1530 -1867 -2145 -685 334 1475 2697 996 -723 -1687 -2410 -1303 167 1370
4830 1370 2150 1478 -219 -923 -1684 -1312 567 1370 1618 1642 930 -1084 -1986 -1802 -4 605 1862 1667
4848 1667 503 -899 -1850 -2662 -879 229 1172 1697 422 -140 -1605 -2061 -1707 67 1874 1805 988
4865 988 7 -1319 -1780 -1403 210 1302 2112 782 -280 -1236 -2524 -1920 -798 741 2487 2878 844
4882 844 -1574 -1970 -2216 -1027 156 1087 2211 1460 -569 -1849 -1799 -1011 -166 967 1960 1287 906 -1226
4900a226j041M38J887J385j21J71p09j917j009J231O13J703K96l67L70k303j709
4917b308l3J230K052J326j134PJ9k410j102J193J495J014J26m53j381j032l73
4934a764K19R69J764J509j468j184q48j281P55O49J160J539P1j242j364q21m62
4951a799M68J804J139N82j041j924r77j69J407J082N17J241r55j389j269p38J071
4968i50O48J072Q48M7j179j530q32o63J683J587R41j06j112p16j394l12R62J994
4986I88J104j590Nn97j473K13j1J253J885q57K92j001j290p93P05K83J810J068
5004A994o41r36r44j145J59J003J647L81K04j050j078j091L13N71Q16Q26J112
5021B141r22j389j357k38J286P32K94P21l19n71j306j196J094J512J000j30r5
$$ plain form
4900 -1226 -2267 -1829 58 1443 1322 1493 784 -1133 -2142 -911 -298 1405 1701 1334 1704 -599 -2308
4917 -2308 -2341 -1111 941 2267 1133 1140 1159 -1251 -2353 -1160 335 1349 1475 1022 -359 -1391 -1764
4934 -1764 -1545 -576 1188 2697 1229 45 -803 -2084 -1329 -680 480 2019 2090 848 -516 -1337 -1799
4951 -1799 -1331 473 1612 2194 1153 -771 -1748 -1917 -510 572 1089 2330 1375 -14 -1283 -2021 -950
4968 -950 -302 770 1618 1665 486 -1044 -1876 -2539 -856 731 1672 1566 454 -262 -1656 -1968 -1006 988
4986 988 2092 502 507 -90 -1563 -1350 -1361 -108 1777 920 1212 211 -1079 -1872 -1167 -884 926 1994
5004 1994 1353 417 -527 -1672 -1513 -510 1137 1518 1722 672 -406 -1497 -1184 -613 203 1029 2141
5021 2141 1219 -170 -1527 -1765 -479 253 547 1268 949 378 -928 -2124 -1030 482 1482 1352 1257
5038A257q6j926r07L41J290J225P04j012m48p12q34j036J407J274P83j60n00m09
5056B51j402k36r8J509J331N22p09j679N0k45o28Q28J319P69j81j200r66p74K43
5075a296L61J025Q82J30l08j164j407J91N51J279O39J106r10j310j410J9p35K107
5093b50J416j04j0r89o26q70P22l8J829k77O78p75j675j376M70J306O42J309L95
5112A777q81j077p00k82N6J406J450p28k26m20j485l86l03J594Q43J182p95j358
5130c33q17J67K88R63K44J560J06j964j027m00N74m65J485M65Q85r42r92q59m17
5149a479Q66R00R13K11r0j003j308q51J177Q73J28J114L39j469j097j006P30M53
5167e99J070J065o98k97n19j239J6l76K270Q74n26k84q34o89p44P86J068R29p8
$$ plain form
5038 1257 1171 -755 -1662 -1321 -31 1194 1898 886 438 -274 -1108 -2144 -737 537 1320 1160 660 251
5056 251 -1151 -1387 -1485 24 1355 1877 1168 -511 -461 -706 -1334 -506 813 1582 1401 201 -765 -1539 -1296
5075 -1296 -935 90 972 1102 794 -370 -1777 -1586 -1035 244 883 1989 1079 -231 -1641 -1622 -2357 -250
5093 -250 1166 1062 1052 63 -563 -1433 -711 -749 1080 803 1481 706 -969 -2345 -1875 -569 73 1382 1777
5112 1777 896 -181 -881 -1163 -1107 299 1749 1021 795 375 -1110 -1496 -1799 -205 638 1820 1025 -333
5130 -333 -1150 -983 -695 268 512 2072 2178 214 -813 -1213 -639 -1104 381 846 1731 789 -203 -1062 -1479
5149 -1479 -613 287 1200 1411 1321 318 -990 -1841 -664 209 337 1451 1790 321 -776 -1782 -1052 -599
5167 -599 471 1536 838 541 22 -1217 -1201 -1577 693 1567 1041 757 -77 -766 -1510 -724 344 1273 1195
5186A195k41p66q84m84l02J015J483P01m67j322k10n08L45K67J0K106l31j003
5204F04j047j342J113r8O65J259O08p80q14j573K44K09J086R94K8L18j115r88
5222f29k76N4J180l5O17j93l72j161k73k53J025O43L64K69m78j141l43n67J298
5241b71Q52O6N18q40J07j467pK07Q82O95K0K84j732l31j72j08J009N19J316k05
5261A342j252q68n15P07N0J111L76O49j174J60j588m8N19O52K60M61k50j136l30
5280h74j12K93J352J60P58o33m08j257n17k30J582O63l8L70j174l72j238P4O31
5299i70J772m9K48L96j495r60k44M87R37J235m36r12p9j18j166N59M69J542m7
5318A169l46j70j746J21M47k4R55R97K5j162q94L54m24k1J173J123m78m30o53
$$ plain form
5186 1195 954 188 -696 -1180 -1482 -467 1016 1717 1250 -72 -282 -790 -445 -178 -168 1938 1607 604
5204 604 -443 -1785 -672 -770 -105 1154 1762 982 168 -1405 -1161 -952 134 1128 1156 1474 359 -629
5222 -629 -905 -851 329 294 911 718 346 -815 -1088 -1341 -316 327 691 960 482 -659 -1002 -1569 -271
5241 -271 581 647 1165 325 432 -1035 -1042 -835 47 742 762 1046 -686 -1017 -1189 -1297 -288 231 1547 1342
5261 1342 90 -778 -1293 -586 -536 575 951 1600 426 586 -1002 -1050 -531 121 381 842 592 -544 -874
5280 -874 -986 -693 659 819 1577 944 536 -721 -1238 -1468 114 777 739 1109 -65 -437 -1675 -1601 -970
5299 -970 802 753 1001 1397 -98 -1058 -1302 -815 122 1357 921 9 -70 -188 -1354 -795 -326 1216 1169
5318 1169 823 653 -1093 -972 -525 -549 406 1403 1428 266 -628 -274 -698 -719 454 1577 1099 669 16
5337A6j265N80m61J297R17L49k23j502o34oL82J8J382M1l9n27j173m19j07R30
5357d44J107N76m16q06m74n24j00L45Q81R08j86j80j212k7o78Q66K92J251J53
5376A332j066r8k79r67M39J11P82R82o11k72j173M13J51j63P76P87j64j162k76
5395d58l6n60J237K56J015m99J45q82j097l99J157L24R49j09m32r36o3k25O63
5414E0l73O06M9M02j277R4p52J97Q67r1J419m39l50k02j006q3O12N35Q78p7o50
5435D09l11K4o26m63J392L79J38k29j446J50j05j72J144r6L43o43J39j00m26l85
5455h84M7J454L97n86p3m94n57j55L29R69J29O71q05q72M9p24k10J210N90K67
5475G52P9p72k99r07j71J587L03l7j20J22q53p67N2N45J161R2M0m6m38j028J11
$$ plain form
5337 16 -1249 -669 -1130 167 1084 1433 1210 -292 -926 -932 -550 -532 850 891 852 325 -848 -1267 -1374 -444
5357 -444 663 1239 823 17 -457 -981 -1081 -736 145 1053 867 687 -525 -552 -1230 -364 -72 1179 1332
5376 1332 266 168 -111 -1078 -639 -528 254 1236 625 353 -820 -407 -256 -419 357 1144 980 -182 -458
5395 -458 -494 -1054 183 439 1454 955 1100 218 -879 -1278 -121 203 1152 1043 611 -325 -388 -613 50
5414 50 -323 283 332 734 -543 -449 -1201 -1004 -137 -228 1191 752 402 200 -806 -889 -277 258 1136 1059 409
5435 409 98 122 -504 -967 425 804 942 713 -733 -583 -688 -860 284 188 531 -112 27 -73 -499 -884
5455 -884 -837 617 1014 428 355 -139 -696 -851 -522 447 576 1247 442 -430 -381 -1105 -1315 -105 485 752
5475 752 831 59 -240 -1147 -1318 269 572 535 415 537 -316 -1083 -1031 -486 675 767 807 761 323 -705 -594
5496e94O4J169l40J074j521J68o63k95K09J075J51P9K91M01j665r6m83J408j39
5515B93J188o60n45m89o65j45J184L0O31K98j359n8j20k08m40R14O20P11q43j97
5535A40o96L41L4N5J72J038K9j297N54k124Q91P82K81Q58m49k08j81j007k78L63
5555g02J136K45l74Q84j334k87K88j16K8J460p08l9No61l68j11M79Q14M08m88
5575E59j06l71k55q28J103K99Q65j83j306M01q68L19j53O68M66M90p06o72o47
5594i25L30k36Q93J66J267p73K9j958J34M35L07N70j69N64m96k62j296J128k89
5613e81J056M17M32o91j262j28k31N91J18N79O59o18k88k56k87P9O09L98L07M31
5633A334j114p16l39J18Q49M03l78N22r35l82k40J95M67N8J096m15n95p9m86p76
$$ plain form
5496 -594 -530 639 299 1373 -148 20 -643 -938 -729 346 497 576 867 1268 -397 -493 -976 432 293
5515 293 1481 821 276 -213 -878 -1023 161 191 822 1120 -239 -297 -417 -625 -1065 -151 469 1180 337 140
5535 140 -556 -215 -181 -126 46 1084 1113 -184 370 -1754 -863 -81 200 1058 609 401 220 -787 -1065 -702
5555 -702 434 679 305 1189 -145 -432 -144 -260 -232 1228 520 481 486 -175 -543 -654 -175 639 1047 559
5575 559 453 82 -173 -1001 102 401 1266 1083 -223 178 -690 -371 -524 144 610 1100 394 -278 -925
5594 -925 -595 -831 62 228 1495 722 751 -1207 -1073 -638 -331 239 70 634 138 -124 -1420 -292 -581
5613 -581 475 892 1324 633 -629 -757 -988 -397 -279 300 959 341 53 -203 -490 -411 198 596 903 1334
5633 1334 220 -496 -835 -717 132 535 157 679 -256 -638 -878 -683 -216 -158 938 523 -72 -151 -637 -1413
5653a413L67J245M83o2m3n11p88k4P11l89R07K65n73m4l35j024N00J62Q76M13
5673G23j50o04M22j095L83L70R4J33L87k87m74j290R94OR84K78m20M16o68L19
5693E21j487N74N07O8L84j28o3p78O69p78O60L28j0Q61l15j492K52j21J27N78
5713C57L38q13K06j23N0l14m9R3N44J123q71M9r28q01R37N4N3J229l62o65q08
5734g01L03L78j90j70J172n89P2k88r47J010m03J355J8p70N58p55m24l95L4P52
5754B0N21M03j56o13j44o86j43R8J208J39L11j298K02j90J35j48O12K80j33J05
5774E23r36M7l74L24Q2J287k36r32L58k57o22k5Q31O34L66m3p08n26o54N17n03
5795h47J115J17j99j49l31l71O66o91P49j44L40N41p45j40r00J146r7N64L16m32
$$ plain form
5653 -1413 -1046 199 682 620 577 66 -722 -746 -35 -424 483 748 175 131 -204 -1228 -728 -566 310 723
5673 723 573 -31 391 -704 -321 49 143 276 663 376 -98 -1388 -394 -388 596 874 454 870 202 521
5693 521 -966 -392 115 183 567 439 376 -402 267 -511 149 477 467 1328 1013 -479 -227 -348 -221 357
5713 357 695 -118 88 -35 15 -299 -348 -255 289 1412 541 590 -338 -1139 -202 -148 -95 1134 772 107 -701
5734 -701 -398 -20 -210 -380 792 203 275 -13 -960 50 -353 1002 1020 250 808 53 -371 -766 -732 20
5754 20 541 944 788 175 31 -655 -798 -700 508 647 958 -340 -138 -328 -193 -341 271 551 418 523
5774 523 -413 -366 -740 -416 -334 953 717 -215 143 -114 -736 -761 70 704 1070 1027 319 -207 -861 -344 -847
5795 -847 268 385 186 37 -294 -665 1 -690 59 -85 255 796 51 -89 -989 157 60 624 940 508
5815E08k05j238j33O01P59K48J02n58K39p22m42L21N03K99L94r4n48n62m1N06
5835f3p02O55Q70l56L37j238K70n70l0M75J407J35r63J08q44j48J60N84P94L4
5855I15p03J84j364K6O97O35n10L42N7p52M16q90O83j5J20M67l5p9j84r53P09
5876b34N30j22O68k93m26r2o19k08L3P00o15P25k13O55m53j009O47K32J28P32
5896G66J86n65J35o14k54m3Q03M10j73l58k95n86q9N46M84k72M0n8K70p33J43
5917b57k27K80K33J99L45j91L0j071Q12m76R58q81J142n02j44j880Q23N02N56
5936B51L70O3m82j41o88l15J85R83lK68j09m93J22j9q22O30J82L25j48j01m02
5957c44o49P19p22N46Q45J12p94L37p75K58l83K46J203l65m90L81o73K89O4O5
$$ plain form
5815 508 303 -935 -1068 -467 292 540 642 84 323 -399 -841 -520 -17 282 676 582 34 -528 -569 -63
5835 -63 -765 -110 760 404 741 -497 -227 -797 -827 -352 1055 1190 227 335 -509 -657 -497 87 881 915
5855 915 212 396 -968 -942 -245 390 -120 222 279 -473 -57 -947 -264 -279 -159 308 273 194 10 -943 -234
5876 -234 296 174 842 549 123 31 -588 -796 -763 -63 -678 47 -166 489 36 -973 -326 -94 34 766
5896 766 952 387 522 -92 -346 -389 414 824 651 293 -2 -588 -677 -131 353 81 121 63 333 -400 -257
5917 -257 -484 -204 29 228 573 382 412 -659 153 -323 635 -246 896 394 250 -1630 -807 -305 251
5936 251 621 684 202 61 -627 -942 -757 226 223 491 382 -111 11 -8 -830 -200 -18 307 159 58 -344
5957 -344 -993 -274 -996 -450 395 507 -287 50 -725 -467 -850 -604 599 234 -256 125 -548 -259 -195 -130
5977a30M42n85P30n17k74R9k89P98l56Q54P6o30j06p00K95M56p20N71R47l43q98
5998b80o70O82K54N77k68j57L4N00q29o17N73M68k83N28K26n48K20o02N28l82
6018d6O56n75j90N66l61l44m93J090M7J58j58n70J026j331L09L7j60P94N87k9
6038A013n29p92L08n90k08P97J247l99j344M13j30j66l28J520j97J54q43L56m72
6057a90P97p11M36j21L87l95l74J21m45N23k14N09J58L1k05m29k74L1k27J137
6077E45lL61j128N89j076Q05k16K43l57J127o76k63j98k47K08o8J006j50l05j03
6097I4L89r16J30N62P00m37q1n94l19k2l08L40O0J071J72o33j40j044O54k16N75
6118C7J62Q56q15L80j344Q26K39p55J039n27L33l76p55J41j61Q80M92M16m35o28
$$ plain form
5977 -130 312 -273 457 -60 -334 -235 -524 274 -82 772 848 218 112 -588 -293 163 -557 14 961 618 -280
5998 -280 -950 -268 -14 563 295 138 172 672 -157 -774 -201 267 -16 512 738 190 410 -192 336 -46
6018 -46 610 35 -155 411 50 -294 -787 303 350 508 350 -220 806 -525 -216 -179 -339 455 1042 1013
6038 1013 484 -308 0 -590 -798 -1 1246 847 -497 -84 -214 -380 -708 812 615 769 -74 282 -190
6057 -190 607 -104 332 211 598 203 -171 -50 -495 28 -186 323 481 512 307 -122 -396 -365 -592 545
6077 545 542 903 -225 364 -712 93 -123 120 -237 890 214 -49 -247 -494 -286 -354 652 502 197 94
6097 94 483 -433 -303 259 959 522 441 -153 -472 -494 -802 -462 -402 669 841 208 68 -976 -322 -538 37
6118 37 199 1055 240 620 -724 102 341 -414 625 98 431 55 -700 -559 -720 160 652 1068 633 5
6138El57p45K24J085N07j32P4j06k14q5m28j090J479L13J18m14M30j341Q29j310
6158a158J405M27o73K68Kj188k92P23M48O16j56N40q92j062J215l69M0L51r9L71
6178E17n74k79q05J195m83L73M70Q28j465Q8j28m69N5M01N13L4K95k74j197L31
6198e74M99N03l24R75l60j261K4q3K92q6N66r8j21P21n05l23q52K97P77L35j45
6219B57L09q18o27L62m76N84O43M14m87M8r44P5M02M22j25K87j51p36M13j44p
6240b99k94N06N57J66j371M79RJ76l00r5J636k4j239k49j64M20M0j4p1J46M60
6261D75n07q10L79J24N28M22l85P83p98l02o40M50r9O26J9j08Q11q30n95P4J93
6282a90M53l2L50l99m07k54k77n45J073M28m84K08J94k21k05N3o4P60Q9o3K83
$$ plain form
6138 5 -352 -1097 -873 212 719 587 661 555 341 256 -172 -1262 217 530 648 234 664 -677 152 -1158
6158 -1158 247 674 1 269 271 -917 -1209 -486 -38 578 422 962 70 -992 223 -146 -106 245 146 517
6178 517 -57 -336 -1141 54 -429 -56 414 1242 -223 -135 -263 -732 -677 -276 237 271 566 292 -905 -574
6198 -574 -75 428 104 1079 719 -542 -518 -601 -309 -395 171 73 -48 673 168 -155 -1007 -710 67 402 257
6219 257 566 -252 -879 -517 -993 -409 234 648 161 209 -735 -660 -258 164 39 326 175 -561 -148 -292 -299
6240 -299 -593 -87 470 636 -735 -256 -247 -71 -371 -466 1170 1146 -93 -342 -506 -86 -46 -60 -131 15 475
6261 475 -32 -842 -463 -339 189 611 226 1009 211 -91 -731 -281 -380 246 265 157 968 138 -457 -383 -190
6282 -190 263 231 581 182 -225 -479 -756 -1301 -228 200 -284 -76 118 -103 -308 -255 -319 441 530 467 750
6303G50l80l89L05j89j35Q32Lp04j055j7J154n30N93l53J89j34J1l3m85J30m30
6324h67O26R19m0n21K9r55j1M55J335r87R38q42Q6p0j119Q07O83l06j01R5L15
6345D69j180J50M81K63o82O21J16j031N23l55l2Q63K44J68Q3q49N5m94p9M34R30
6366F98r1l00Op57M12r78M34M07J11O42n0l85n37n02k99R53P49m87L23j68n05
6387c24o77Q33L9N49k89L70p40r6p71M01Q03J38n71N98P28o64j212P0K35M71J052
6408I43l06q77M57j179m2O86K32M71L15k56k66l32o58O91K3N11l92P32r58L46
6428A41j318R36M42l65O64L5l84j18m51M0K90L66N16m1j07n50q8q24n6J026J174
6449A328q97n07n48N88n94O82K90J0L62o71j38J20n18k90J268p77N95O26n18k72
$$ plain form
6303 750 370 -19 286 97 -38 794 797 93 -962 -979 175 -355 238 -115 74 -60 -49 -82 -567 -437 -867
6324 -867 -241 678 638 117 146 -809 -820 -365 970 -17 921 79 165 95 -1024 -217 466 160 59 154 469
6345 469 -711 -561 -80 183 -499 122 238 -793 -270 -625 -657 206 450 618 701 -148 -93 -587 -666 -232 698
6366 698 607 307 313 -444 -32 -1010 -576 -169 -58 584 534 149 -388 -890 -1189 -236 513 26 349 181 -324
6387 -324 -1001 -168 -129 420 131 501 -239 -335 -1106 -705 98 236 -335 263 991 327 -885 -815 -580 -109 943
6408 943 637 -240 217 -962 -1004 -318 -86 385 700 444 178 -154 -812 -121 -98 413 21 753 -205 141
6428 141 -1177 -241 201 -164 500 535 151 33 -418 -378 -88 278 794 753 646 96 8 -816 -872 154 1328
6449 1328 431 -76 -624 -36 -630 52 342 352 714 43 -95 25 -493 -783 485 -292 303 929 411 139
6469A39r4j46L87j53M86K31k28p09m76R1P13L04k7q72O18n1o60J93l32N18P6N67
6491E75n89O59j152K48j7kQR4Q5M06J23j129L54M98R2M17k46k46k07o11N17q11
6513i34O63M53M74n40r5j87K98r49J32J133K2J66J62p61r26L01J31O35M46l25
6533B99K86n04N8q15L81N67L72o4m20l32N18j034M11P28q5J22q16J61l27M01j36
6554b29%j76Q39m61n51N69k52o02R78L34LJ32m55l58K3r2q8L50J54j51N75m76
6576F6q30j63O77R6O65k27j24L84r64j04N33j67J36M04N72o27n30j36n5j69M84
6597g9J202n67k38k37j95l46O3L94K70J1L50j142M75m39l0J32O71O95n7o89p38
6618d94J59m34P41P43M88q40J61j426M75l23J026k55N83J54m42l05q92k00O20
$$ plain form
6469 139 45 -101 286 133 619 850 622 -87 -563 -472 241 545 518 -354 264 213 -447 -254 -586 -68 8 575
6491 575 -14 645 -507 -259 -276 -278 -270 -176 -91 315 438 -691 -337 161 253 670 424 178 -29 -640 -123 -934
6513 -934 -271 182 656 116 21 -166 132 -817 -685 448 470 636 798 37 -889 -588 -457 178 624 299
6533 299 585 81 139 -676 -295 272 644 580 160 -172 346 -688 -277 451 366 488 -328 -167 -494 -93 -229
6554 -229 -229 -405 434 -27 -578 -9 -261 -863 115 449 452 584 129 -229 -206 -298 -386 -36 118 -33 542 66
6576 66 -764 -927 -250 -154 511 284 160 544 -420 -524 9 -158 -22 382 954 327 -203 -339 -394 -563 -79
6597 -79 1123 556 318 81 -114 -460 -397 -3 267 278 628 -514 -39 -478 -508 -376 295 990 933 244 -494
6618 -494 -335 -769 -28 715 1203 363 524 -902 -427 -750 276 21 604 758 316 11 -881 -1081 -461
6637d61J82K02J078o57M1m0j015N62j88M88N75k23k33j006j16J270o44L71L6j02
6657A20Qk72L98k90p55J176K04K16n23l25K66j236j38J055P79j24n70j93L73r01
6677g32L34l92J080Q45r30M35p77l97Q21j479J492j92O58l83n91m05N5r6M66J101
6697I13o48L07r73p47N97J242r09P17rJ03j190R4O08l22N25O65j86j97k92j135
6717h37O38l14K04J009l88L30j34q85K04o41K72N54O14k54M30p69p71k7J93L58
6737b14M29O3J82j12k38kL59n37k01R78l29n59M92r7j08n00N47K74K12q79J28
6758a12l0K10M5k94O21k70M52j000n85M11M13l39J217l57k1m40P1L54k71q0P97
6779G92m44J53k50n05m37L25M48K96L95j290P33j86l48o8N79l61J126q59m99J89
$$ plain form
6637 -461 -279 -77 1001 344 385 345 -670 -108 -296 192 767 544 311 -695 -811 459 -185 186 222 120
6657 120 128 -144 254 -36 -791 385 589 805 282 -43 223 -1013 -1151 -96 683 559 -11 -204 169 -732
6677 -732 -398 -790 290 1135 205 640 -137 -534 287 -1192 300 108 766 383 -208 -613 -558 -654 -188 913
6697 913 265 572 -401 -1148 -551 691 -218 499 490 593 -597 -503 105 -217 308 973 787 590 298 -837
6717 -837 -199 -513 -309 700 312 642 508 -377 -173 -814 -542 12 626 372 802 33 -738 -765 -572 -214
6737 -214 215 278 460 348 110 108 467 -70 -271 707 378 -181 311 214 106 -394 153 427 639 -240 -112
6758 -112 -142 68 113 -181 440 170 622 -378 -963 -552 -139 -478 739 382 361 -79 -8 346 75 -5 792
6779 792 348 501 251 -254 -691 -366 82 378 773 -517 216 30 -318 -386 193 -168 958 99 -400 -211
6799b11n00K23m5J28Q10J89n35L57k44r19Q8L03M61O78l52Mm42l73J27k31L55
6820a29Q34j4n11J61j351Q55k2j59Q03J67l15k78q41L41J094k51j53K4j81k57
6840a83N27p63j12J323p38O1N02l47p67J01L31l05O35K39r12K94n89K31n1O75
6860A52O2L99l52k46L16n05j17k55P68L4M16l59N77q13p62L4O92J24N88m91n72
6881c10n5j22m56P53N50k30k5q8P2n26j85j91O22O61k04J87p95j56l59J96J077
6902D16L27o9o78J15l61p17m5J133l97O37J6J01m63r11J42N84M23M8M09o23m44
6923c57L25p05J249p54J315n05m10J24o89K89n59m2P27K47J00r0p37J32K06j07
6943b41L49J051j057N13k0j103J95L58R8J177j088j30M90o82o16P37L82j05P8
$$ plain form
6799 -211 -711 -488 -533 -405 405 594 59 416 172 -747 -659 -356 105 783 431 435 -7 -380 -253 -484 -129
6820 -129 705 691 180 341 -1010 -155 -177 -336 467 634 319 41 -800 -459 635 384 231 255 74 -183
6840 -183 344 -419 -531 792 54 115 617 270 -497 -396 -65 -370 265 504 -408 -114 -703 -472 -523 152
6860 152 214 613 261 15 331 -174 -291 -546 222 256 672 313 890 77 -685 -651 41 165 753 262 -310
6881 -310 -365 -487 -943 -190 360 130 105 17 89 -437 -622 -813 -191 470 266 453 -342 -498 -857 -661 416
6902 416 743 674 -4 111 -250 -967 -1012 121 -276 361 377 478 15 -896 -754 -170 253 301 710 87 -357
6923 -357 -32 -737 512 -242 1073 568 158 282 -407 -118 -677 -719 8 255 355 265 -472 -340 -134 -241
6943 -241 108 1159 102 615 595 -508 -313 45 143 1320 232 102 592 -90 -706 31 413 308 386
6962C86j07n03N66r73J6N94N35k23l31K81p03m47L95O20j0n83L90n05M25J29j39
6983a87L23N37K3j38m64j63L09o06r8O56N90l65m81N21p83j50j25M44J187n39
7003D91n09M08n64n14K95j8L53M35K2r72L84l09N65j66j08J202J38j295m06K73
7023b95k00Q31q05O72R7J54p03M30l63L67j33k22N51j41l02K1m43nP93m05O06
7044E05J67p43n35M7K2M29L52N6J44m1o69l58K74R3k24P54K23j92lj33k6k94n10
7067f62J178k88J11Q3o92J67n23N75J066k22Lq09K05m02j86ok25J296K30o42q14
7088e57N86j98j4M13j054R22J70m47n45N57l51K72P38m32n9N2O4r99K01N65J016
7109I00m51R2l28k82K82q35O44J33r6P99q91k23k18K62J31M26j6K07n88Q46r33
$$ plain form
6962 386 279 -224 342 -631 -615 -21 514 291 -40 241 -462 -909 -514 106 96 -487 -97 -602 -177 -48 -187
6983 -187 136 673 696 558 94 -69 240 -366 -464 192 782 417 -64 457 -326 -476 -601 -157 1030 491
7003 491 -18 390 -174 -688 -393 -411 -58 377 399 -573 -189 -498 67 -99 -207 995 1133 -162 -568 -295
7023 -295 -495 336 -469 203 300 454 -249 181 -182 185 52 -170 381 240 -62 -41 -484 -489 304 -101 505
7044 505 672 -71 -606 -559 -537 -108 244 300 444 403 -266 -624 -350 -257 -481 273 496 304 301 168 142 -152 -662
7067 -662 516 228 339 422 -270 -103 -626 -51 1015 793 796 -13 192 -210 -396 -402 -627 669 899 257 -557
7088 -557 29 -169 -183 230 -824 98 268 -179 -724 -167 -518 -246 492 60 1 53 117 -882 -681 -116 900
7109 900 449 541 213 -69 213 -622 22 155 59 858 -33 -256 -474 -212 -81 345 329 536 -52 794 -139
7130a39j16k28O72j15pK38l71o16J044o51L5N43m8o1J2p2m88J24N12K26k07N02
7152G89p86k4r6k38o3P42r1j45P43p3l70j432Q37M9K25K81M73q08mJ52o87q5J014
7175D03l58R04q33n87j97P25o85O88L08j50q2L23n89l02j36O05O67l83J37m07
7195E1k96J37K80m30P64m00J53K47m10o60J65l51J223K9M35k23n52q95M01N77
7215B45n0N42m61k77o4J89j033O50N93j59M11k90k88l90l19NR00p6L31j98K16
7236D77p38j72Q9J22N25r7M75l36j003n30L82J38P87k18N56K05l11j6n61J29k24
7257c21L33L0O00p65j278O62M97L72K44O7q5J3m99l23n20J287o34N56J66j45L09
7278E66l09o98M30L72l9Q15j288j39N34j081J195m23n46J138N74j046p03M14n43
$$ plain form
7130 -139 -255 -483 189 74 67 305 -66 -682 362 -289 -254 289 241 180 192 120 -368 -244 268 494 287 789
7152 789 3 -21 -117 -355 -418 324 233 88 831 758 388 -1044 -207 -158 67 348 821 13 9 161 -526 -611 403
7175 403 45 949 116 -471 -668 57 -628 60 368 218 136 459 -130 -432 -568 37 704 321 458 51
7195 51 -245 -108 172 -258 506 106 259 506 96 -564 -399 -750 473 502 937 714 162 -733 -332 245
7215 245 195 737 276 -1 -65 124 -909 -259 334 175 586 296 8 -382 -701 -696 204 128 459 261 477
7236 477 -261 -433 -344 -222 303 206 681 345 -658 -1188 -806 -668 119 -99 457 662 351 335 -226 -97 -321
7257 -321 12 42 642 -123 -1401 -739 -242 130 374 441 356 369 -130 -453 -973 314 -320 236 402 257 566
7278 566 257 -441 -11 361 322 1137 -151 -290 244 -837 358 -65 -611 527 1101 55 -648 -234 -777
7297g77R07k2K37j6n33M27l5n42n28J282L5K54R4l09o03j178J243k40J032o13
7317A15k18J72m40M62p34R00M3L98k23q95J44K7L47m98M37M57J12k73k08j029
7337i04o6M54P18N96J4o12n82N3O6J14k87J89N58L37q08J51o12k16J023N14o81
7358A9L37m09j64o7N06q37O96K38L64p70J18j074P09O98n0P40m32l51m09P4l92
7379d56r0L91P49K52n26q55L32l32O91j00M40J85n33l97L82J8p82N23O62l37O71
7400H88j486N68m64N16n42L43P68L24r02J16j110N83n3J18O98K39m9j273M38k49
7420e29L04N18m9m55N60K69j269O8J47M12Q3L92K62k83l15j077M42O79l43N0Q20
7441F86J27j091m74M90j32J16J427K3j744R26Rj621Q80P62j30k22L84l13l87J91
$$ plain form
7297 -777 130 108 345 329 -204 223 188 -354 -882 400 435 689 783 474 -129 -1307 -64 -304 728 115
7317 115 -103 69 -371 91 -643 257 300 698 475 -420 -276 -249 98 -400 37 494 606 333 125 -904
7337 -904 -970 -516 202 798 812 200 -382 -329 -263 -149 -436 -247 311 648 -160 -9 -621 -837 186 700 19
7358 19 356 -53 -217 -284 222 -615 81 319 683 -87 31 -1043 -334 364 314 1054 622 271 -138 -64 -456
7379 -456 -546 -155 594 846 320 -535 -203 -535 156 56 496 681 148 -249 133 151 -631 -108 554 217 888
7400 888 -598 -30 -494 22 -520 -177 591 915 13 129 -981 -398 -451 -333 365 604 555 -718 -280 -529
7420 -529 -225 293 244 -211 349 618 -651 -583 -436 -24 59 451 713 430 115 -962 -520 159 -184 -134 686
7441 686 813 -278 -752 -262 -394 -278 1149 1172 -572 354 363 -1258 -378 384 254 32 416 103 -284 -93
7461i3j08k40N74K25J40m06p06m9J068q17L16M06K66k52P21j075l1k27K04K96
7481B12J13J7K05k89r84O62L64m7N34o59L61m98q0O4k27M32L38M2m61k05o43O84
7503f5j21N17j46m48P64o90J25o6m68O74M14p15L52k38j94J5L1L97l27j62O71
7524C20L54r19k52l0k12J451m22j92P37j764Q23j4q6K88K51k62L62n56J19L86
7544C82r9o99Q09N33k73n33n60O00m8K55l61Q10j127L29J73q74OK46J128r54M31
7565A74n05Q06p46k1jJ21P44n30J68k28n07l8k26J268k95k00L69o01M6k86j72
7586f60M77J13N02m96K27j28k75n9k66J140K88j92j106K52r74J169m08R16j76
7605C44J32j018J24K50k16n8R09J61n10k19L0O3m77k75J390m1j69L71j081M46
$$ plain form
7461 -93 -201 -441 133 358 498 92 -614 -663 405 -412 -96 310 576 324 1045 -30 -61 -288 -84 212
7481 212 325 342 547 258 -726 -64 300 253 787 128 489 -9 -89 -25 -252 180 518 560 99 -106 -749 -65
7503 -65 -186 331 185 -263 501 -189 -64 -130 -598 76 490 -225 127 -111 -305 -290 -259 138 -189 -351 320
7524 320 674 -245 -497 -527 -739 712 290 98 835 -929 -106 -120 -206 82 333 71 433 -123 -4 382
7544 382 283 -416 393 926 653 120 -440 160 112 367 6 816 -311 18 191 -683 -677 -431 697 -257 174
7565 174 -331 475 -271 -292 -293 -172 572 42 210 -18 -525 -563 -789 479 184 -16 353 -248 -202 -488 -660
7586 -660 -183 -70 432 -64 163 35 -240 -299 -565 575 863 671 -435 -183 -1157 12 -396 520 344
7605 344 476 -542 -418 -168 -384 -442 467 628 118 -101 -71 -8 -485 -760 630 589 420 791 -290 156
7625A56k60j21o5Q26o08O20k53n1r55j11R42L4L34q84R04m01q24L16N24J79k80
7646B2K83m29K83p35J0K51M33j02k58R02l18l44r1o55mJ065m09J07O04j069l14
7667g68P87l50L86K66m78M05o01N82n62r3J117J93p21j56l57L58n02K43P28m22
7687E5R6n21M31q72L1N39K07N9m8M62k33k49J64o68K33L19N6L07m91k34L73j090
7709a074L90O46M25P32q0j252o47Q71j14J61L80J76k44l40o46N39L0Q43k08r8
7729D90J59o11n84J554j860J20R6P03M15K37m97l29R73j247K03n0j75J99k0J19
7749a05p66N22J20L84q8k98N68n70n3l9l50J019M42L05j270J77m32N8l15N7J278
7770F44n53K19l07q3o48K40Q03O47n10m41J64n24K44K65k65o4p1O91m54lk54m99
$$ plain form
7625 156 -104 -225 -290 536 -72 548 295 244 -711 -822 120 154 488 -396 508 107 -717 -401 123 302 22
7646 22 305 -124 159 -576 -566 -315 118 16 -242 660 342 -2 -93 -748 -752 313 -96 11 615 -454 -768
7667 -768 19 -331 55 321 -157 248 -353 229 -333 -426 691 884 163 7 -350 8 -494 -251 477 55
7687 55 151 -370 61 -811 -780 -241 -34 25 -23 439 206 -43 121 -547 -314 5 61 368 -123 -357 16 -1074
7709 -1074 -684 -38 387 1119 1039 -213 -860 11 -103 58 438 614 370 30 -616 -77 -47 796 588 490
7729 490 649 38 -546 1008 -852 -732 -636 67 482 719 222 -107 866 -381 -178 -228 -403 -204 -224 -105
7749 -105 -871 -349 -229 155 67 -231 337 -233 -286 -325 -675 344 786 1091 -179 -2 -434 -376 -691 -634 644
7770 644 91 310 3 -80 -728 -488 315 962 452 11 175 -349 -105 160 -105 -169 -240 451 -3 -6 -260 -759
7792g59L68L06K30J161j155l06m52l78R82k19J44R23j75q03j05j01LJ32K39K78
7812C13K93p58j17p52J232J04L13p13O25k4n03o20J51N93k53O38k8p82M69l21
7832a40j029K43P53N82l11n1M57o63k90J9L87K48o4J68qk39k97m66N63P37K2j01
7854E20l07l59M5K50k67K59P8P56q31j303J226r82O72j56N97j10J58m09J7l02
7874d48l6N77n6R5j90j26k77K07M77p7P80n24j08l67K15o71M79K93L92m69J76
7895C42kq94L82J36l87N63M62o08l7q9l44M53P08q61jK53L60o76k38J89o63L36
7917f16O65O14l64o50N91q16M04p0L1R42n52K67p50m29L87J11O8J07L73l60r7
7938a44o53M07L10L75k64M39L00j218N37m10l98M51Q58n96L82m49K48o69j96R19
$$ plain form
7792 -759 -391 -85 145 1306 151 -155 -607 -985 -3 -222 -78 845 670 -133 -238 -339 -336 -204 35 313
7812 313 606 -152 -269 -1021 211 315 628 -85 540 516 13 -607 -456 137 -116 522 494 -288 181 -140
7832 -140 -1169 -926 -173 409 98 47 504 -159 -449 -430 -43 205 141 309 301 62 -235 -701 -138 599 621 520
7854 520 213 -146 -101 149 -118 141 219 975 144 -1159 67 -915 -243 -399 198 88 246 -163 -146 -448
7874 -448 -484 93 37 132 -58 -184 -461 -254 223 146 926 402 294 -73 142 -529 -50 243 635 166 342
7895 342 340 -554 -172 -36 -423 140 602 -6 -43 -132 -476 -23 685 -176 -177 76 436 -240 -478 -289 -952 -616
7917 -616 49 663 299 -351 240 -576 -172 -242 -211 731 179 446 -304 -733 -346 -235 -167 -60 313 -47 -144
7938 -144 -797 -390 -80 295 31 470 770 -448 89 -321 -719 -268 590 -6 376 -73 175 -494 -690 229
7958B29M2P85m22p42o35k25M24J06J237q10L17J95r13J24K18n2R5O24l41j17l89
7979b50j4Q6L28k86K98L60l64K2l89L6L49j001J167K26m82k97j80K52p49P60N67
8000D39M8m64K31k59q1k44O16r7J77n0J85r41O45j099Q29lM76J89j066P09k66
8021b6q42Q11J30L33K25m49Q6m13l14L47L06K1j40O35j388R36q2j75J88o92K74
8042b29O15j35o64j63l90K56O31K12j02N71l48q21M88j22R4L12R20n91q01P37
8062D70m50k72n7P66k94K01r52R74p47N43o55O63R4j82m4L37l61k75L88o60N94
8083H1M05o4r46R42o57M60p74Q02J24m27l99J07J69J56j41L85n7J92k42j70j73
8104b27J31L36l77L03K4K94o36j83K44k17O23j82L99l85q37P80q80N78l51O16
$$ plain form
7958 229 271 1056 634 -108 -743 -968 -544 -438 799 -11 306 501 -412 -288 -70 -122 -27 597 256 139 -250
7979 -250 -264 -178 150 -136 162 522 158 180 -209 -173 176 -825 342 568 86 -211 -391 -139 -888 -128 439
8000 439 487 23 254 -5 -86 -330 286 189 366 316 501 -440 205 -894 -65 -68 408 597 -469 240 -26
8021 -26 -868 -57 73 406 631 182 268 -145 -459 -112 194 215 75 710 -678 258 176 1 189 -503 -229
8042 -229 386 251 -413 -576 -966 -710 -79 133 31 602 254 -567 -79 -201 -107 205 1125 534 -267 470
8062 470 20 -252 -309 457 163 364 -588 386 -361 182 -473 190 284 102 58 395 34 -241 147 -513 81
8083 81 486 422 -524 418 -239 221 -553 249 373 -54 -453 -346 -177 -21 -162 223 166 358 116 -54 -227
8104 -227 -96 240 -137 166 190 484 -152 -335 -91 -308 315 133 532 147 -690 90 -790 -212 -563 53
8124E3K53p96P41l29l35k79R4J459m1K7q79N9l23L73L47k68N93m04m96R8n02k05
8146g60K24J87J798j085K13p07ML16m06J26K80J95r42P21J39j38m11l6J52R82
8166H52o69N5r47N50m22P96j26K25K0k38o6n97M65O37q62J95R4M10o49J51p23
8187h49L02JM79o8
$$ plain form
8124 53 306 -490 251 -78 -413 -692 -598 861 820 847 -32 27 -296 77 424 156 749 345 -151 -53 -555 -760
8146 -760 -536 -349 1449 364 577 -130 -126 190 -216 -90 190 385 -557 164 303 165 -246 -282 -130 852
8166 852 183 238 -709 -159 -581 215 89 314 334 96 30 -567 -102 535 -327 -132 -38 372 -277 -126 -849
8187 -849 -547 -546 -67 -135
8191a35
$$ Imaginary data points
##PAGE= N=2
##DATA TABLE= (X++(I..I)), XYDATA
0@%%%%%%m0M0m0Q0q0Q2j17J55j91K31k59K99l55M35n01N71o70P61q76J013j147
27f09J309j480J668j894K122k378K669k967L310l684M085m539N027n575O177o830
43c589P576q388R300j0342J1508j2860J4431j6277J8501k1211K4634k9108L5201
56A9376m4092N8300q4718J50512o12962j340735M84247J014656R13999M63680
66A022263K17441m56482j063588j032081j65738O38901R84922Q29744L92611l65314
76A002679j009870j091034m32475M53883J031440R61202M09625k94820p89758
85B40872r45976o45140O6541Q71319J144735O45868k17016p88337q72174o22188
95a121496j34807N48409J054251R04876J08080p04981r85689p21484j95861M10969
$$ plain form
0 0 0 0 0 0 0 0 -40 0 -40 40 -40 42 -75 80 -111 120 -139 160 -195 240 -261 310 -360 401 -475 538 -609
27 -609 700 -780 888 -1006 1116 -1262 1407 -1560 1750 -1934 2151 -2388 2639 -2936 3241 -3589
43 -3589 3987 -4401 4899 -5443 6065 -6795 7636 -8641 9860 -11351 13283 -15825 19376
56 19376 -24716 33584 -51134 99378 -513584 -1854319 -1370072 -355416 558583 1022263
66 1022263 1239704 783222 -280366 -1312447 -1478185 -839284 145638 975382 1367993 1002679
76 1002679 -7191 -1098225 -1530700 -1076817 -45377 915825 1325450 1030630 240872
85 240872 -705104 -1350244 -1283703 -412384 732351 1378219 1161203 372866 -499308 -1121496
95 -1121496 -1256303 -707894 346357 1251233 1359313 654332 -331357 -1052841 -1248702 -837733
105h37733R15441R59840L54651n20753r96020q08089k57238K94505P18088Q96817
115G19509N89831j81787r00064j000329m71887K26587P07530Q55088O22362J8771
125A185611o82708j003037o85543L2639O64663Q78041O44784J21980m74152q75043
135a92765q10439k39528N01555R08262P53371K32321l43900p60401q44697m54347
145a250568K89081Q86403Q90481L50534k90519o83773p60751n26475K7987O81768
155c85832R59441N92581j33351o69798p73792n48125j08787M67599Q87856P72575
165A060367J18876n83259q54418o38467j59986L68871P58614P76686L19344l63113
175H03515q15715p58616k95855K67616O66790P60230M74693j26843p28952q86778
$$ plain form
105 -837733 77708 1037548 1392199 871446 -124574 -932663 -1189901 -895396 -177308 719509
115 719509 1309340 1127553 227489 -772840 -1244727 -1018140 -310610 544478 1166840 1185611
125 1185611 502903 -500134 -1185677 -1153038 -488375 389666 1034450 1156430 682278 -192765
135 -192765 -1003204 -1242732 -741177 167085 920456 1152777 808877 48476 -796221 -1250568
145 -1250568 -961487 -75084 815397 1165931 875412 191639 -569112 -1095587 -1067600 -385832
155 -385832 573609 1166190 1032839 363041 -410751 -958876 -1067663 -600064 287792 1060367
165 1060367 1179243 595984 -258434 -896901 -1056887 -688016 70598 847284 1166628 803515
175 803515 -12200 -770816 -1066671 -799055 -132265 627965 1102658 975815 246863 -639915
185f39915m65097K01595O50598P14056M88765N0070n05255q64547o74011j1619
195a055360O08950P80102N36278J12004l61442p39375p44972k49623M40120Q11309
205A37991O62741J97404k87141o35467p29357m24583K08666P62928Q05190L34380
215A032752k47922n96970o60560m68810l994N73359Q40505N41491q5157n71426
225C53268o94159n11867j09198M11503P77785O76917J21807m88815p47714n70812
235g81285j50502L01571O38188O91940L36187k84676p42297p03207k60066K40704
245g13443N70651O63412M43998q4629o34170p84461m22055J46537N48911O46713
255C81464M66252N3981m50248p52257n93552m8924M98047P02285N15908J15172
$$ plain form
185 -639915 -1105012 -903417 -252819 461237 950002 1000072 494817 -369730 -1043741 -1055360
195 -1055360 -446410 333692 869970 981974 620532 -118843 -863815 -1113438 -673318 137991
205 137991 800732 998136 710995 75528 -653829 -1078412 -869746 -106818 698372 1032752
215 1032752 784830 187860 -472700 -941510 -945504 -372145 468360 1009851 924694 353268
225 353268 -340891 -852758 -961956 -550453 227332 904249 1026056 537241 -210473 -781285
235 -781285 -931787 -630216 7972 699912 1036099 751423 9126 -694081 -954147 -713443
245 -713443 -142792 520620 964618 879989 245819 -538642 -960697 -814160 -265249 381464
255 381464 847716 901697 451449 -300808 -894360 -943284 -445237 257048 772956 888128
265H88128l26121o46658o52024k50366L45922P15887O21685K03292k55367n69589
275G4789o41441l80088J59317O45289P16116L39345j80098n32600o13467m27613
285h40451o358M85590P34043N16558l2324n14418o48329m51613q1377L39454O51519
$$ plain form
265 888128 562007 -84651 -736675 -987041 -641119 74768 696453 899745 644378 74789
275 74789 -566652 -946740 -787423 -142134 573982 913327 733229 200629 -412838 -840451
285 -840451 -846809 -361219 372824 889382 857058 342640 -305689 -757302 -838679 -499225 152294
$$ [...]
8191e89
##END NTUPLES=NMR FID
##END=
