##TITLE=1H_Pr 5-5-Pr
 CDCl3, 40 sc, 
 26.8.2019
##JCAMPDX= 6.0         $$ Bruker NMR JCAMP-DX V2.0
##DATA TYPE= NMR FID
##DATA CLASS= NTUPLES
##ORIGIN= UXNMR, Bruker Analytische Messtechnik GmbH
##OWNER= root
$$ XWIN-NMR		Version 3.5
$$ Mon Aug 26 15:42:50 2019 Russian Standard Time (UT+4h)  she@DPX200
##.OBSERVE FREQUENCY= 200.13155
##.OBSERVE NUCLEUS= ^1H
##.DELAY= (6, 6)
##.ACQUISITION MODE= SIMULTANEOUS
##.ACQUISITION SCHEME= undefined
##.AVERAGES= 40
##.DIGITISER RES= 18
##SPECTROMETER/DATA SYSTEM= spect
##.PULSE SEQUENCE= zg30
##.SOLVENT NAME= CDCl3
##.SHIFT REFERENCE= (INTERNAL, CDCl3, 0, 15.7039)
##AUDIT TRAIL= $$ (NUMBER, WHEN, WHO, WHERE, WHAT)
$$ ##TITLE= Audit trail, XWIN-NMR		Version 3.5
$$ ##JCAMPDX= 5.01
$$ ##ORIGIN= Bruker BioSpin GmbH
$$ ##OWNER= she
$$ F:/spectra/data/she/nmr/H-F/1/audita.txt
$$ ##AUDIT TRAIL=  $$ (NUMBER, WHEN, WHO, WHERE, WHAT)
(   1,<2019-08-26 15:41:23.90 +0400>,<she>,<DPX200>,
      <continue with go, POWCHK disabled, PULCHK disabled
       configuration hash MD5:
       00 E9 B6 7A A2 85 ED C7 34 08 36 98 17 FE 4E 26
       data hash MD5: 16K
       62 F9 A6 E4 3F DC AD 9A C5 6F 14 52 B1 1F 5F 6A>)
$$ ##END=
$$ 
$$ hash MD5
$$ 4A 8A C4 62 8D 36 2D BE F1 AE 1A 0B 66 82 F8 C3
##$RELAX= 
##$RELAX= 
##$RELAX= 
##$RELAX= 
##$RELAX= 
##$RELAX= 
$$ Bruker specific parameters
$$ --------------------------
##$DU= <F:/spectra>
##$EXPNO= 1
##$NAME= <H-F>
##$PROCNO= 1
##$TYPE= <nmr>
##$USER= <she>
##$AMP= (0..31)
100 100 100 100 100 100 100 100 100 100 100 100 100 100 100 100 100 100 
100 100 100 100 100 100 100 100 100 100 100 100 100 100 
##$AQSEQ= 0
##$AQ_mod= 1
##$AUNM= <au_zg>
##$AUTOPOS= <>
##$BF1= 200.13
##$BF2= 200.13
##$BF3= 200.13
##$BF4= 200.13
##$BF5= 200.13
##$BF6= 200.13
##$BF7= 200.13
##$BF8= 200.13
##$BYTORDA= 1
##$CFDGTYP= 0
##$CFRGTYP= 5
##$CHEMSTR= <none>
##$CNST= (0..31)
1 1 145 1 1 1 1 1 1 1 1 1 1 1 1 1 1 1 1 1 1 1 1 1 1 1 1 1 1 1 1 1 
##$CPDPRG= <>
##$CPDPRG1= <>
##$CPDPRG2= <>
##$CPDPRG3= <>
##$CPDPRG4= <mlev>
##$CPDPRG5= <mlev>
##$CPDPRG6= <mlev>
##$CPDPRG7= <mlev>
##$CPDPRG8= <mlev>
##$CPDPRGB= <>
##$CPDPRGT= <>
##$D= (0..31)
0 1.2 0 0 0 0 0 0 0 0 0 0.03 0 0 0 0 0 0 0 0 0 0 0 0 0 0 0 0 0 0 0 0 
##$DATE= 1566819559
##$DBL= (0..7)
120 120 120 120 120 120 120 120 
##$DBP= (0..7)
150 150 150 150 150 150 150 150 
##$DBP07= 0
##$DBPNAM0= <>
##$DBPNAM1= <>
##$DBPNAM2= <>
##$DBPNAM3= <>
##$DBPNAM4= <>
##$DBPNAM5= <>
##$DBPNAM6= <>
##$DBPNAM7= <>
##$DBPOAL= (0..7)
0.5 0.5 0.5 0.5 0.5 0.5 0.5 0.5 
##$DBPOFFS= (0..7)
0 0 0 0 0 0 0 0 
##$DE= 6
##$DECBNUC= <off>
##$DECIM= 24
##$DECNUC= <off>
##$DECSTAT= 4
##$DIGMOD= 1
##$DIGTYP= 9
##$DL= (0..7)
0 120 120 120 120 120 120 120 
##$DP= (0..7)
150 150 150 150 150 150 150 150 
##$DP07= 0
##$DPNAME0= <>
##$DPNAME1= <>
##$DPNAME2= <>
##$DPNAME3= <>
##$DPNAME4= <>
##$DPNAME5= <>
##$DPNAME6= <>
##$DPNAME7= <>
##$DPOAL= (0..7)
0.5 0.5 0.5 0.5 0.5 0.5 0.5 0.5 
##$DPOFFS= (0..7)
0 0 0 0 0 0 0 0 
##$DQDMODE= 0
##$DR= 18
##$DS= 0
##$DSLIST= <SSSSSSSSSSSSSSS>
$$ [...]
##$SUBNAM2= <"">
##$SUBNAM3= <"">
##$SUBNAM4= <"">
##$SUBNAM5= <"">
##$SUBNAM6= <"">
##$SUBNAM7= <"">
##$SUBNAM8= <"">
##$SUBNAM9= <"">
##$SW= 24.9336996594482
##$SWIBOX= (0..15)
0 0 2 0 0 0 0 0 0 0 0 0 0 0 0 0 
##$SW_h= 4990.01996007984
##$TD= 16384
##$TD0= 1
##$TE= 0
##$TE2= 300
##$TE3= 300
##$TEG= 300
##$TL= (0..7)
0 120 120 120 120 120 120 120 
##$TP= (0..7)
150 150 150 150 150 150 150 150 
##$TP07= 0
##$TPNAME0= <>
##$TPNAME1= <>
##$TPNAME2= <>
##$TPNAME3= <>
##$TPNAME4= <>
##$TPNAME5= <>
##$TPNAME6= <>
##$TPNAME7= <>
##$TPOAL= (0..7)
0.5 0.5 0.5 0.5 0.5 0.5 0.5 0.5 
##$TPOFFS= (0..7)
0 0 0 0 0 0 0 0 
##$TUNHIN= 0
##$TUNHOUT= 0
##$TUNXOUT= 0
##$USERA1= <user>
##$USERA2= <user>
##$USERA3= <user>
##$USERA4= <user>
##$USERA5= <user>
##$V9= 5
##$VALIST= <valist>
##$VCLIST= <CCCCCCCCCCCCCCC>
##$VD= 0
##$VDLIST= <DDDDDDDDDDDDDDD>
##$VPLIST= <PPPPPPPPPPPPPPP>
##$VTLIST= <TTTTTTTTTTTTTTT>
##$WBST= 1024
##$WBSW= 4
##$XGAIN= (0..3)
0 0 0 0 
##$XL= 0
##$YL= 0
##$YMAX_a= 265118
##$YMIN_a= -502137
##$ZGOPTNS= <>
##$ZL1= 120
##$ZL2= 120
##$ZL3= 120
##$ZL4= 120
##$ABSF1= 10
##$ABSF2= 0
##$ABSG= 5
##$ABSL= 3
##$ALPHA= 0
##$AQORDER= 0
##$ASSFAC= 0
##$ASSFACI= 0
##$ASSFACX= 0
##$ASSWID= 0
##$AUNMP= <proc_1d>
##$AZFE= 0.1
##$AZFW= 0.1
##$BCFW= 1
##$BC_mod= 2
##$BYTORDP= 1
##$COROFFS= 0
##$CY= 11.3945322036743
##$DATMOD= 1
##$DC= 2
##$DFILT= <>
##$DTYPP= 0
##$F1P= 20.1720416913024
##$F2P= 0.152960286110954
##$FCOR= 0.5
##$FTSIZE= 0
##$FT_mod= 4
##$GAMMA= 1
##$GB= 0.15
##$INTBC= 1
##$INTSCL= 1
##$ISEN= 128
##$LB= 0.24
##$LEV0= 0
##$LPBIN= 0
##$MAXI= 10000
##$MC2= 0
##$MEAN= 0
##$ME_mod= 0
##$MI= 1.114404
##$NCOEF= 0
##$NC_proc= 0
##$NLEV= 6
##$NOISF1= 3.799351
##$NOISF2= 2.8
##$NSP= 1
##$NTH_PI= 0
##$NZP= 0
##$OFFSET= 15.70392
##$PC= 1
##$PHC0= -9227.947
##$PHC1= 34.80096
##$PH_mod= 1
##$PKNL= yes
##$PPARMOD= 0
##$PSCAL= 0
##$PSIGN= 0
##$REVERSE= no
##$SF= 200.130013532006
##$SI= 16384
##$SIGF1= 3
##$SIGF2= 2
##$SINO= 400
##$SIOLD= 16384
##$SREGLST= <1H.CDCl3>
##$SSB= 0
##$STSI= 0
##$STSR= 0
##$SW_p= 3612.71676300578
##$SYMM= 0
##$S_DEV= 0
##$TDeff= 0
##$TDoff= 0
##$TI= <>
##$TILT= no
##$TM1= 0
##$TM2= 0
##$TOPLEV= 0
##$USERP1= <user>
##$USERP2= <user>
##$USERP3= <user>
##$USERP4= <user>
##$USERP5= <user>
##$WDW= 1
##$XDIM= 8192
##$YMAX_p= 0
##$YMIN_p= 0
$$ End of Bruker specific parameters
$$ ---------------------------------
##NTUPLES= NMR FID
##VAR_NAME=  TIME,          FID/REAL,        FID/IMAG
##SYMBOL=    X,             R,               I
##VAR_TYPE=  INDEPENDENT,   DEPENDENT,       DEPENDENT
##VAR_FORM=  AFFN,          ASDF,            ASDF
##VAR_DIM=   8192,          8192,            8192
##UNITS=     SECONDS,       ARBITRARY UNITS, ARBITRARY UNITS
##FACTOR=    0.0002004,     1,               1
##FIRST=     0,             0,               0
##LAST=      1.6414764,     0,               0
##MIN=       0,             -502137,         0
##MAX=       1.6414764,     265118,          0
$$ Real data points
##PAGE= N=1
##DATA TABLE= (X++(R..R)), XYDATA
0 0 0 0 0 0 0 0 0 0 1 -40 40 -40 40 -42 80 -80 101 -120 140 -160 200 -231 268 -305 349 -403 455 -518 590
29 590 -667 751 -839 945 -1057 1177 -1314 1462 -1624 1804 -2000 2212 -2451 2713 -3007 3329
45 3329 -3691 4098 -4565 5099 -5721 6447 -7325 8393 -9738 11483 -13863 17308 -22775
58 -22775 32828 -57583 265118 123151 -348911 -25144 260941 188067 -49610 21565 80256
69 80256 -772 -47579 113184 154576 4236 -113289 -21679 76756 93077 54624 4146 -71958
81 -71958 -51902 56711 87953 -21347 -69487 7880 53325 -16597 -52000 1521 39251 -166
93 -166 -40010 -38165 -7423 31758 43736 -21329 -90751 -44228 60903 54997 -28479 -29667 23964
106 23964 -5067 -51592 25172 108320 19942 -110859 -53669 98821 98911 -29116 -77675 -14396
118 -14396 29716 26959 25311 8752 -33423 -33796 15250 31469 752 -7915 -239 -23676 -32630
131 -32630 15698 38377 -23840 -69790 -17177 33722 -3325 -43148 -13959 9112 -26952 -45696
143 -45696 -8023 10621 -18130 -30881 -16890 -21426 -30174 -5168 10263 -25653 -46313 -6857
155 -6857 21404 -6559 -27233 -1678 10136 -16069 -17036 18260 22878 -13304 -21975 8520 20479
168 20479 1790 -2098 10493 10749 5213 10541 13923 9545 12845 18336 8087 -388 13577 27713
182 27713 15999 -626 4680 14878 14205 14930 19535 9795 -7179 3274 26949 22791 -3824 -5086
196 -5086 11549 11996 4643 9857 10846 -5022 -7001 18895 26911 363 -13172 8598 25022 11975
210 11975 35 5794 9624 6207 12902 18916 4199 -8328 7455 26365 18077 -523 -1197 6491
224 6491 12092 17044 17905 480 -11585 4855 26752 15992 -9517 -8364 6975 6623 2792 9903
238 9903 5332 -15792 -15719 11332 15704 -11975 -23034 -3564 5634 -7209 -13600 -6663 -9607 -16267
252 -16267 -5191 1913 -11328 -21685 -7316 3031 -11015 -19468 -6585 -1109 -9360 -7978 1328
265 1328 -6424 -19150 -5893 12640 3795 -15940 -9235 7945 5545 -2034 1694 4113 -5011 -3232
279 -3232 15020 15427 -6078 -10146 8677 14267 1516 -456 7366 2824 -3709 4017 13294 1895
293 1895 -8965 -1091 8579 892 -7430 -151 1715 -7230 -8060 858 -101 -9674 -7128 2028 -3296
308 -3296 -12911 -6929 1484 -4312 -12139 -6108 577 -5823 -9560 -2148 1510 -7790 -9296 1730 5491
323 5491 -4965 -4313 2932 2439 -3091 2267 8582 3088 -2437 4202 10078 6329 1462 5707 8829
338 8829 4531 3883 9828 9839 2827 2717 7581 7829 2290 4647 6829 2838 -1177 3255 5784 684
354 684 -2391 260 1686 -2140 -2699 817 -1267 -6493 -5957 -279 -2230 -6741 -6169 -2937 -5130 -6769
370 -6769 -2866 -2848 -5915 -5206 -2021 -2300 -4646 -4124 73 -1036 -3147 -1247 3141 1713 -800 1339
386 1339 4413 2557 2086 4506 5118 2820 4814 6991 6059 3245 4496 6679 3592 3750 6437 6626
402 6626 3164 2637 4618 4614 1171 814 2426 1172 -931 -939 1008 -281 -4182 -1901 -227 -4235 -5671
419 -5671 -3018 -3095 -6834 -6356 -3431 -3847 -7033 -8280 -4128 -3570 -6527 -5991 -3347 -3290 -6102 -4289 -960
436 -960 -3246 -4467 -1762 -273 -1605 -1527 946 399 -367 396 2936 2207 867 691 3395 4045 687
453 687 1886 3844 3163 1187 2294 2606 1043 255 1957 2473 -486 -1094 -359 261 -1341 -2270 -2226 -2133
471 -2133 -3353 -3267 -2829 -4269 -6330 -4771 -2550 -4191 -6583 -6868 -4143 -3461 -5150 -5023 -4841 -5155 -3549
488 -3549 -2188 -1825 -3404 -4482 -1676 1695 751 -2163 -382 2135 2513 2256 3287 3547 1978 2845 6783
505 6783 7282 4469 1095 5747 8460 5885 3461 5541 5987 4266 5639 7452 4640 1782 4156 7386
521 7386 4253 -905 1107 4766 3019 -685 1280 2902 -1062 -2806 1161 2164 -4402 -5377 898
536 898 2286 -4495 -5255 -1556 -1346 -3494 -2330 721 -3691 -6428 -615 4810 -786 -6637 -1190 3947
552 3947 789 -2685 1797 2886 -1892 30 6337 5779 -2393 -1834 6494 6694 377 352 4902 3684
568 3684 -322 3840 6817 -236 -3441 2945 6142 -1196 -4700 2816 4557 -3213 -6000 819 1606
583 1606 -5798 -4828 520 -2369 -8970 -4457 1313 -3367 -11629 -6534 -95 -3574 -7553 -4383 -3657 -8803
599 -8803 -6152 2801 -639 -11222 -9441 1961 3248 -5533 -6241 -395 -844 -3877 2069 5900 -1372
614 -1372 -7430 1840 10318 4148 -2506 1861 5627 2772 1855 7402 4133 -2139 1681 10309 6368
629 6368 -3425 474 9067 6606 -1635 41 5642 3753 -1427 2264 4221 -1113 -2510 4120 6192
644 6192 -2119 -5941 -173 2525 1007 -1598 -1607 -3664 -2790 4556 5873 -2798 -8840 -1534 7535 4303
660 4303 -2880 -2479 854 1855 3541 6998 2622 -5005 -2098 7904 10055 3069 -2138 564 4491
675 4491 5991 7108 5105 -771 -1485 6427 10648 4367 -1647 1234 6707 5307 1528 905 1427 764
691 764 154 2475 2101 -1013 -2192 -401 1050 -1699 -4158 -2641 -1384 -101 -2033 -5044 -4057 -642
707 -642 523 -3253 -6783 -6386 -1060 2121 -549 -6332 -5935 -1994 1022 1318 -823 -2869 -4852 -1466
723 -1466 4947 6269 -912 -6588 -2341 6167 6608 611 -1265 -636 1311 2873 6573 4294 -3704 -3069
739 -3069 5033 7871 1430 -2067 1091 1534 -809 214 4267 461 -5992 -3014 3293 1739 -4253
754 -4253 -4131 -6 -1836 -6376 -2389 725 -2357 -5773 -3302 -2796 -3509 -2755 219 -3579 -8094 -4522
770 -4522 3324 1394 -5795 -4873 -205 -946 -2115 3283 4130 -5007 -7418 4550 10038 1933 -4645 1514
786 1514 4634 2106 2718 7343 2766 -4780 180 10391 7698 -2256 -384 6156 3090 -928 5324
801 5324 8266 -1628 -6152 3587 8721 -682 -4154 2133 2279 -4962 -2730 5119 2110 -7318 -6079
816 -6079 1256 -669 -4150 -401 427 -7234 -8745 1328 5443 -4488 -9363 -1706 1401 -3382 -1525
831 -1525 3554 -1797 -9944 -3006 8940 4571 -6267 -3825 4977 1806 -367 4905 5374 -4415 -4281
846 -4281 7635 10886 -798 -4050 3680 5622 -350 2277 8355 2910 -5059 -584 9212 4100 -3544
861 -3544 503 4755 -987 -3710 3550 5191 -2346 -5716 783 2639 -3584 -2601 2553 -2604 -8374
876 -8374 -2069 5990 -796 -7897 -3868 2693 -2345 -4895 2336 2670 -6403 -7542 3994 5874 -3876
891 -3876 -5506 2012 2142 -2727 644 5664 310 -5777 1156 8265 2561 -2999 878 4848 851
906 851 -178 5778 4118 -1938 -2153 5207 5492 -1301 -607 3571 964 -2540 2306 4561 -979 -4780
922 -4780 -170 2949 -1530 -2889 1938 1186 -5320 -4238 2580 1860 -5157 -4511 1215 -1139 -4592 -1382
938 -1382 1963 -3004 -6494 -503 3417 -1479 -4369 -52 1088 -2181 -1798 2755 902 -3394 -2074
953 -2074 3627 2642 -2068 930 3688 604 -1006 3114 5200 180 -1424 3377 4720 538 -298 3656
969 3656 2301 -1636 612 4464 2061 -2296 -281 1998 -408 -1810 692 1383 -2003 -3175 307
984 307 684 -2712 -2508 -663 -1364 -3322 -1910 -87 -2997 -4310 -1978 522 -2351 -3894 -833 260
1000 260 -3160 -2299 301 598 -2776 -1360 1467 340 -1391 -187 2667 645 -1363 1310 3431 803
1016 803 -16 2195 2400 344 828 2916 1736 196 1255 3192 1473 -576 1296 2811 470 -890
1032 -890 895 1926 -1084 -1832 549 998 -1290 -2113 998 -508 -2332 -1532 728 -1384 -2774 -1662
1048 -1662 448 -2586 -2422 -487 -228 -1912 -2108 407 385 -1783 -1342 828 144 -1266 -732 2020 875
1065 875 -914 1295 2268 594 125 2533 2323 272 968 3180 2257 120 1562 2855 2481 -46 1801
1082 1801 2932 1192 -449 1407 2326 260 -343 827 344 -911 -327 956 -391 -2610 -1642 46
1098 46 -786 -2452 -1318 -23 -2281 -2730 -401 39 -2671 -2263 184 -251 -2291 -1829 -867 -694 -2237
1115 -2237 -873 755 -117 -682 378 902 -590 -624 935 2129 428 371 1794 502 72 369 1740
1132 1740 655 181 1084 2103 890 442 643 1729 916 729 666 545 -802 -407 1365 732 -1642 -943
1150 -943 132 -928 -1293 -1582 -335 -1797 -2107 -699 -110 -2273 -2989 -1687 -1088 -1919 -2149 -931 -1614
1167 -1614 -1327 -595 3 -372 -1910 401 841 -234 -1215 4 216 493 -292 1201 1081 386 1133 1228
1185 1228 1312 485 1258 2555 1795 646 1099 2330 910 1156 1641 1716 193 134 1505 1854 -112 -601
1203 -601 780 303 -353 -448 -419 -380 -1306 3 311 -1258 -1707 -1373 -258 -1456 -2415 -1551 -1787 -2236 -249
1222 -249 466 -1169 -1920 -1297 102 146 -1326 -718 -618 254 -575 62 603 -329 -278 520 1592 -201 -365
1241 -365 1056 1628 696 901 720 700 679 1017 1555 776 -31 948 1884 694 -289 174 1195 587 416 -65
1261 -65 376 -1275 -1406 -153 -500 -1992 -1869 -9 204 -1783 -2008 -905 -1016 -1957 -1003 -410 -1787 -3155
1279 -3155 -1204 394 -961 -1720 -1729 -110 -202 -608 -95 -433 -602 -917 755 748 -798 -38 1641 379 -298
1298 -298 976 2742 1356 55 1029 1668 1984 136 725 1459 564 -532 917 2532 297 -642 -472
1315 -472 1405 143 -458 461 -272 -1743 -642 1052 -468 -2189 -1593 -110 53 -1053 -464 -580 -1977
1332 -1977 -2419 -74 1105 -1739 -2810 -956 286 -285 -1910 -265 -189 -976 -489 1645 99 -1665
1348 -1665 219 2023 1028 -656 932 2321 701 -665 1454 2827 767 -149 1857 1635 -318 -351
1364 -351 1953 2060 -1138 -1728 841 807 204 -135 73 -336 -1968 1171 2071 -395 -2914 -890 1256
1381 1256 -413 -1751 -796 -867 -2169 -1145 1295 -123 -3207 -3002 323 924 -1242 -1137 -887 -1878 -1726
1398 -1726 637 1455 -1560 -2175 390 1549 31 -135 928 502 -1201 131 2952 1898 -932 -545
1414 -545 1547 1726 -91 432 2049 1155 -853 1442 1900 -315 -790 891 657 -522 154 1176 1236
1431 1236 -2780 -1275 1087 1007 -1365 -609 397 -1569 -1655 398 1166 -1626 -2942 -691 773 -319
1447 -319 -1721 -216 -741 -1531 -728 1340 461 -1814 -1459 1151 884 -438 497 170 -565 -635 1369 1825
1465 1825 -36 -815 844 1589 825 1167 1015 726 -470 723 1958 1804 -257 341 1736 924 690
1482 690 563 1084 -985 -127 609 1279 395 -1152 -699 -551 -255 17 162 -787 -2150 -1784 16 -663 -639
1501 -639 -1604 -1292 -796 -606 -49 -627 -1385 -1519 -613 657 -243 -863 -796 20 -215 -90 823 637 250 -94
1521 -94 388 1456 1345 717 -502 538 378 915 951 980 342 275 730 1285 1254 148 492 -10 141 769
1541 769 800 50 -1451 -1024 382 1000 -818 -580 -851 -296 -1269 181 -369 -1162 -2115 -578 441 -144
1559 -144 -1520 -498 -427 -945 -1167 -93 -430 -2037 -989 576 448 -209 -643 66 -575 -982 1085 1150
1577 1150 474 -836 245 1207 983 554 798 1321 -388 -197 1249 1062 -106 464 1032 857 -708 541
1595 541 786 -86 -599 286 1197 319 -1103 179 567 -819 -188 553 288 -1605 -1466 824 126 -1182
1613 -1182 -1200 -424 -373 -1785 -805 497 -735 -2416 -1136 968 -327 -1365 133 170 -643 -805 1705
1630 1705 1325 -858 -740 1484 1026 -281 -9 1333 55 -386 1113 2002 401 -818 492 1377 903
1647 903 -201 1223 895 -449 -841 1839 683 -659 -379 877 353 -1062 197 262 -927 -1515 -30
1664 -30 1158 -606 -682 41 416 -1108 -1852 231 -348 -1126 -1593 447 -144 -1109 -1289 727 -385 -852
1682 -852 -226 1433 -375 -1048 -18 973 333 -1045 1566 641 -1055 16 891 656 226 -127 1396
1699 1396 1035 -135 472 1110 325 -204 1119 1461 -392 -114 1209 687 -885 499 397 121 -835 478
1717 478 1112 -776 -1033 -438 296 -703 -805 193 -20 -352 -1749 -66 -225 -984 -1148 -269 -133 -1027 -522
1736 -522 66 309 -840 -224 208 -7 -369 279 496 -394 -875 1099 248 229 -288 821 633 -697 595
1755 595 1616 882 66 1071 1351 -108 80 888 -93 -98 -285 946 532 -537 -87 271 262 -933 -83
1774 -83 111 -660 -951 -519 -414 -267 -1150 -725 110 -462 -787 -472 117 -834 -422 -52 -432 -1617 7 467
1794 467 -180 -380 489 -72 -672 -373 406 611 -179 118 858 548 122 232 1639 396 -957 403 959
1813 959 393 -100 623 332 78 152 208 413 31 -774 194 746 -89 512 1020 470 -540 -152 209 -861
1833 -861 -451 -580 -464 -696 -730 -257 -782 -1408 -644 826 -184 -1187 -1284 988 -875 -781 434 578 -610
1852 -610 -749 31 411 -63 -65 -301 313 104 -963 -28 -160 289 1105 702 27 12 640 400 -375 408 631
1873 631 574 534 346 385 798 743 1293 391 375 -175 -605 390 -549 -716 241 149 -666 -792 -383 -85 -497 -337
1895 -337 96 206 -1086 -465 131 -105 -820 135 -93 -290 -643 -95 -110 -475 -455 -299 -68 72 -195 580
1915 580 372 -573 471 389 -169 -262 734 1065 -71 138 1003 1085 264 -107 1052 233 314 -119 1073 -193
1935 -193 -765 195 -144 379 -136 336 333 -237 -221 508 113 -439 118 208 237 -244 -340 -416 -856 -218 -662 -1059
1957 -1059 -75 -894 148 375 -884 -313 -170 -286 -1119 149 852 313 -478 336 723 -459 46 333
1975 333 146 55 -257 266 752 37 148 869 1006 393 213 306 403 349 38 957 -53 13 512 452 -203 -142
1997 -142 327 -188 -681 -1122 327 199 -304 -352 -457 -1002 -396 -838 597 282 -1770 -493 -302 175 -184
2016 -184 -552 -48 -851 -610 -316 897 -244 -179 11 131 -222 731 105 524 -772 -292 883 607 161
2035 161 455 -261 -61 -583 327 101 -873 -43 -201 1112 343 -57 443 170 -43 470 644 -448 -807
2054 -807 -804 17 -665 -80 -150 -411 -1078 -839 310 185 -564 -986 -43 37 328 -208 -134 -421 -852 -469 467
2075 467 -363 -880 -351 153 129 -865 -419 231 249 25 506 452 -429 -140 583 -18 -107 349 647 406 24
2096 24 367 674 598 332 424 647 33 -321 237 371 288 -56 -58 603 120 -55 -37 -91 -314 -293 -71 59 -1467
2119 -1467 -425 47 301 -460 -1101 375 -428 -872 -35 -74 -620 -398 -296 287 -93 -645 -451 125 -41
2138 -41 -344 741 474 -1073 -330 56 177 292 116 140 302 -281 58 711 383 -294 -236 458 920 309
2158 309 -44 954 -542 -126 606 709 -566 -750 250 182 269 -262 695 125 -576 -422 635 685 -563
2177 -563 -353 -203 -592 -1061 -100 18 -807 -333 -92 -134 -355 -1200 -538 -349 -966 298 564 230 -1815 -29
2197 -29 -61 498 -88 -300 887 500 -220 406 261 -130 -296 262 814 -66 -237 1336 316 -804 683
2216 683 538 -98 -862 317 586 656 -36 -235 202 -1169 -494 397 443 -417 -990 -873 355 -370 -559 -245
2236 -245 -397 -463 -270 123 452 -890 523 136 -624 -645 -87 -89 -156 -371 449 594 -907 -305 599 452 -240
2257 -240 43 265 583 24 928 757 248 346 73 874 332 287 839 1672 287 -448 232 899 161 -347
2277 -347 -327 -8 121 92 159 153 -163 -311 -142 -252 -201 441 -47 -218 -491 -812 -427 -525 -536 -745 39 40 -35 35
2301 35 298 -202 -643 192 1040 -917 -186 417 637 207 203 143 -380 18 395 245 29 707 -116 575 469
2322 469 228 237 599 5 323 262 410 -581 437 337 -42 -174 88 374 -519 60 252 -35 -740 -13 -411
2343 -411 -603 1051 255 -244 -51 41 14 -265 -483 310 7 -245 64 365 -340 307 -207 -530 -135 -65 102
2364 102 64 -260 -136 488 310 430 10 586 202 -93 117 511 298 -436 369 811 247 107 -451 -317
2384 -317 -1029 103 24 -520 -203 -1043 382 364 150 -30 1 -228 -401 323 -373 454 -614 -77 330 -794
2404 -794 100 205 -752 -414 23 3 -364 -423 220 146 -614 177 496 -170 -558 -256 156 563 483 -92 -231
2425 -231 -200 -443 -274 408 570 -27 68 439 -431 19 406 -178 -275 177 492 305 -271 -280 246 132 -203 268
2447 268 152 -627 -935 477 283 -18 -825 -76 -289 -273 -486 499 -404 -201 -203 604 204 -464 127 478 -246
2468 -246 195 -246 565 -618 -297 401 254 219 41 936 32 -744 -228 113 60 17 328 100 -541 -139 -230
2489 -230 1026 -62 434 767 152 -1010 482 23 452 210 -477 -634 -22 -413 87 245 -442 153 -113
2508 -113 78 -74 -377 454 272 -640 -822 -97 693 -91 -477 -232 -236 1 -266 107 356 409 493 262 -100
2529 -100 321 38 502 558 102 -88 -528 20 23 359 330 -301 -44 -340 -245 208 -214 64 213 587 628 -50
2551 -50 -696 120 245 128 270 327 -577 59 -124 469 553 -540 -261 488 335 -32 18 325 -305 -442 -555
2572 -555 -539 -223 271 -269 117 514 -206 -481 -34 -56 -401 -423 343 -87 38 8 -244 -514 -21 -119 -416 -384
2594 -384 328 -86 -755 111 -294 48 155 -57 250 564 -230 -13 190 -343 83 393 473 -162 -359 -212
2614 -212 -30 327 -390 -96 373 -652 -642 118 175 24 -83 -396 90 -400 -17 259 354 116 -323 688
2634 688 595 -705 -236 -522 -194 698 201 -221 -322 633 -618 -322 -417 225 551 339 443 165 -43 135
2654 135 -217 258 568 442 -247 69 -12 409 289 318 363 -288 863 155 381 -142 402 -110 152 591 113
2675 113 -116 170 471 444 93 -228 417 -298 266 150 -78 -160 -249 68 -729 -25 -389 84 -256 134 -64
2696 -64 116 96 -70 -645 -541 -403 -466 -3 353 639 -527 -122 440 18 -560 55 338 151 -98 -590 28
2717 28 347 -453 10 7 56 -50 462 749 231 -309 438 -297 3 329 11 1001 -680 247 -9 -232 -160
2738 -160 462 -188 -264 -472 -135 550 224 -778 -476 131 504 151 -281 -90 -612 -494 -367 -4 -462 673
2758 673 -15 177 -542 119 484 -207 372 -374 -159 -520 85 514 99 366 567 47 -335 590 -154 104
2778 104 175 100 348 704 496 -352 434 981 -161 -11 -71 -175 870 -148 220 -427 -496 -799 -515 250
2798 250 -151 25 334 -65 -179 -99 -694 -221 -230 -769 364 -418 -112 -210 -744 -25 56 -63 -329 58 264
2819 264 240 -77 -188 549 560 -586 254 599 436 678 478 -134 -92 -556 381 120 -865 103 513 596 -313
2840 -313 304 260 -472 291 -95 -472 630 575 -179 279 -71 -540 -107 -51 119 -315 808 -548 -521 -31
2860 -31 -65 999 -166 -309 -175 -120 -227 -151 -444 181 -328 -414 428 284 -53 614 -297 -627 -227 631 360
2881 360 -34 -306 170 -565 308 62 711 128 -64 -233 873 246 -1095 -460 -3 516 105 176 78 202
2901 202 -46 368 233 143 -899 125 -312 30 146 -395 182 71 -426 291 259 -252 -364 -1088 -44 113
2921 113 -259 -281 95 -144 -648 62 832 -536 124 383 -181 -277 -361 440 -225 105 278 -275 -231 95 -49
2942 -49 459 50 333 686 483 -284 -327 -80 834 -580 142 103 186 189 -226 1182 -284 -393 391 -825 660
2963 660 -333 -158 -14 -691 -59 -56 -56 -40 -520 208 -134 -122 55 -343 346 -322 79 323 197 -566 16 -241
2985 -241 145 402 48 -34 -253 -257 -609 -786 -726 -437 -243 31 -200 -173 -399 295 -133 -80 702 83 -358 242
3007 242 663 116 256 138 -18 105 -111 315 385 141 -27 200 -592 92 4 478 -51 0 -759 317 -255
3028 -255 -627 419 100 -125 -83 30 -621 -139 -90 460 -175 -127 474 272 -247 472 32 189 -81 -217 401
3049 401 219 -63 367 111 -432 -396 -196 563 80 389 -434 214 51 493 357 -324 -231 -86 -169 494 207
3070 207 350 254 -120 -105 -378 245 -83 121 -548 -233 -93 -412 519 -90 -143 -32 80 322 -433 7 -83
3091 -83 -298 -621 -591 -467 -227 -307 308 -1092 -995 -601 -1040 141 20 -603 219 -85 396 385 287 -62 56
3112 56 125 285 -296 239 -73 -2 231 -186 -123 540 604 466 -191 -322 -423 56 257 -497 -720 479 235
3133 235 -49 -342 339 -33 -529 -99 -850 -398 -150 -336 237 98 152 126 247 73 -42 381 263 -259 -184
3154 -184 -359 -502 -143 285 121 244 323 -194 -51 -250 -102 -296 625 345 -250 -163 -180 -306 127 164 -432
3175 -432 739 -279 529 -681 -156 -274 17 -162 -333 33 -130 504 79 -555 48 -291 85 145 290
3194 290 32 338 -151 620 96 -394 894 -201 -269 431 578 44 -37 231 189 -92 -19 -100 243 -965 187
3215 187 519 -295 -101 -419 -548 181 -349 -698 194 -116 511 -36 -139 -401 373 628 -201 54 123 66 147
3236 147 142 -154 -145 -289 702 -239 -840 208 -210 318 -348 -464 -77 622 -224 -320 -46 -295 -179 480 253
3257 253 -120 -413 -136 436 20 -211 56 -63 215 -75 24 -252 -181 -188 193 -437 221 25 157 -111 -605
3278 -605 23 159 -159 18 536 109 -151 554 24 215 -264 319 190 123 -410 -410 -16 210 500 91 -185
3299 -185 562 336 -538 -187 -332 -822 385 92 263 12 -703 58 361 289 -610 17 80 480 301 329 -228
3320 -228 119 289 -13 -428 -141 180 -122 -262 172 -364 -395 -134 124 704 350 -453 324 327 -511 -353 -257
3341 -257 -152 142 80 -43 90 288 689 -194 235 -104 -192 122 -391 -520 587 46 129 72 386 448 160
3362 160 -337 483 434 140 313 221 92 -77 198 -168 0 13 -74 -141 106 -598 299 148 52 -155 -32 589
3384 589 -310 239 552 153 125 118 -160 -851 -162 33 192 554 -87 338 80 -284 332 -56 396 32 -123
3405 -123 658 227 63 -103 -305 -408 -192 -478 546 -146 -199 -74 -73 -100 238 436 291 155 75 93 -245 -421
3427 -421 -42 -824 64 -206 -420 183 133 215 475 -2 212 202 -88 -6 -54 639 508 199 -238 -296 17 -156
3449 -156 -562 -221 -151 -883 -18 310 -384 126 68 349 336 -260 180 -105 108 -544 -23 -636 8 -314 -62
3470 -62 -90 253 32 -657 2 3 -759 -576 368 214 548 644 128 87 -361 486 84 -849 73 -61 -197 390
3492 390 -762 -256 448 -11 -321 -458 -617 -181 455 -137 50 265 582 -289 -419 -437 -180 -698 156 -30
3512 -30 136 -362 692 -429 135 92 155 -47 -294 63 -40 -240 -1064 199 -234 245 -210 -297 356 314 -44
3533 -44 206 -204 -72 -98 211 255 247 -122 29 -128 -496 -352 -866 54 -1 169 -634 -863 -98 65 -292 -794
3555 -794 -191 427 724 470 473 157 -394 -392 148 263 76 -131 -168 324 -690 -260 124 -63 266 33 -179
3576 -179 -671 231 -80 200 -43 12 903 381 -324 371 -17 -107 -209 -91 349 155 155 404 -107 -443 -44
3597 -44 -1163 198 638 120 -148 -1 175 -269 949 -59 -364 -114 -372 -1 -410 -471 -124 6 374
3616 374 47 174 353 356 296 -188 -213 41 236 555 358 1107 321 -211 -402 259 -30 102 -14 77 -370 579
3638 579 355 233 -345 -617 345 140 371 -40 -1155 207 117 675 -328 867 -693 61 98 186 -108
3657 -108 -584 -180 -847 118 -453 -31 204 -442 146 259 284 242 213 983 -25 299 -291 79 624 -271 -2
3678 -2 -5 -253 82 -839 545 -385 -594 -268 457 -8 74 102 -20 352 339 -136 263 -1 183 365 145 -626
3700 -626 20 -53 -182 102 -18 -144 266 609 360 193 364 -38 -716 161 241 708 -24 -56 -295 401 -148
3721 -148 116 41 -172 58 -390 392 -419 42 -92 126 -98 -5 -22 -453 -16 705 51 540 117 -939 294
3742 294 246 -549 -569 555 429 -77 -101 -204 -50 603 -21 -453 -462 210 651 193 135 -516 -410 437 -266 372
3764 372 155 399 -484 -31 189 -537 42 332 -806 260 94 116 -183 -1049 -558 -183 -1 -449 -195 -84
3784 -84 161 313 305 25 -347 93 200 -54 -45 -266 63 232 325 176 549 -68 -656 216 -280 -219 -96 176
3806 176 -30 323 -37 -8 -101 -67 340 275 -196 -293 176 -349 429 -631 -168 -513 32 232 123 -202 12
3827 12 -246 -449 -593 -292 -76 -3 93 -69 -237 443 -17 -353 -473 0 -87 42 860 -294 534 -153 -312
3848 -312 610 -743 261 -568 636 -232 90 -390 -261 564 682 53 -663 334 -444 -235 39 -623 -559
3867 -559 -181 244 -7 -294 -228 -15 290 150 41 -417 -454 112 -314 -504 20 260 -414 -224 -515 -185 -105
3888 -105 -96 9 93 -367 104 31 -1118 -430 49 -309 306 472 -613 122 -508 28 -210 515 -267 1202
3908 1202 729 -91 -159 282 -334 45 -97 226 381 162 -123 217 390 11 178 -689 -607 -525 243 157 -267
3929 -267 -59 -66 -341 -334 -392 -699 47 -509 -58 871 -197 -133 -154 -151 12 68 332 -612 -249 -101 319 -266 -209
3952 -209 -23 -97 -476 -755 -524 -25 -542 233 747 -605 282 344 11 199 -466 213 204 -375 -261 138 -334
3973 -334 -139 -279 103 -72 117 211 -560 409 -126 -479 136 -144 65 491 -222 307 -253 -289 -161 245 -266
3994 -266 821 865 -105 -42 346 -492 -123 -217 212 -174 -415 -26 -487 -136 596 -480 160 237 -144 527 475
4015 475 -255 -478 -411 -61 -608 -151 -69 561 -543 -153 550 -53 435 103 660 515 341 -247 -243 158 220
4036 220 267 -943 -107 -143 357 -268 -611 294 268 96 -45 -305 350 -14 428 -195 275 -114 -23 -115 94
4057 94 -7 -168 -378 -636 -335 -267 65 142 404 133 37 280 -228 -276 -149 -392 389 83 391 -542 -337 -259
4079 -259 276 -330 -5 132 161 -230 10 47 412 -260 -190 209 -684 684 262 -288 770 241 -71 -353
4099 -353 469 779 292 -396 -154 -398 -440 888 262 -84 219 -295 -311 -632 412 644 -160 232 473 482 70
4120 70 1043 402 232 -86 128 -382 360 -549 -733 -106 88 176 -511 -74 -189 -412 468 -504 719 1250
4140 1250 -145 -39 60 552 268 -25 320 210 -281 -179 -528 389 -44 104 381 314 -311 -430 -140 -360
4160 -360 386 254 -179 -477 -274 -68 -156 -459 -536 432 -43 -257 -283 -158 31 299 59 -466 361 446 -246
4181 -246 123 -512 -172 740 -217 173 -242 -395 -423 -139 41 295 595 532 -83 -505 866 212 962 22
4201 22 76 -230 286 217 -347 -99 151 21 482 -173 744 -204 -387 -484 38 154 305 -175 243 -48 201
4222 201 357 -1032 24 308 100 -254 495 -277 184 -108 112 -11 -176 109 32 -958 -336 427 -288 -413
4242 -413 -323 -104 693 702 -427 -66 -27 25 508 -412 -282 134 350 -566 -39 14 164 -196 -116 177 -562 552
4264 552 556 203 -814 -70 -553 -414 -153 282 228 -68 184 470 85 -89 -528 237 318 100 -361 -201 -113
4285 -113 493 -167 -185 -359 99 476 -253 34 817 -139 -400 57 -157 -362 -222 200 -355 -978 274 -84
4305 -84 180 -173 268 459 110 180 -147 181 438 49 436 -550 -33 412 480 132 77 85 -355 -310 -253 -330 -576
4328 -576 124 -234 164 85 903 -425 -482 301 -230 241 -2 -892 40 -52 377 86 -179 -4 -47 -79 -22 546
4350 546 293 50 -355 -301 420 -139 156 208 228 371 309 -494 -638 14 174 410 496 464 166 4 -37 239
4372 239 -313 -251 -605 68 296 -452 -220 -213 -404 758 -662 -388 -206 583 -522 -700 495 -286 235 -196
4392 -196 121 -418 1 -221 -259 193 -844 -84 -503 -220 -22 -235 -821 175 -49 506 -74 195 -177 192
4412 192 -392 -693 276 -277 -435 -302 -381 336 -341 205 -794 -14 -268 -426 -249 273 290 346 1019 -332 -116
4433 -116 -332 0 578 -184 296 -242 -449 -199 -212 524 -372 -11 -100 -698 -179 50 -184 -182 212 -77 -221
4454 -221 213 -689 474 533 198 -116 56 -535 -188 349 -384 -545 -170 -178 -1118 159 -70 -80 -349 -178 63
4475 63 337 211 -308 303 -182 -328 10 -359 -84 106 -446 -122 338 309 -419 -70 -594 347 269 -137 204
4496 204 25 331 -11 28 198 199 82 698 85 56 -215 -592 413 183 -435 -17 -103 413 1 163 152 -820
4518 -820 347 588 -153 76 637 -148 372 -611 -337 -203 -346 123 132 191 -156 43 14 -276 -191 -114 -98 185
4540 185 -103 -121 67 -96 -691 163 122 39 185 -57 -38 -166 -430 -140 399 -389 407 -345 -42 -283 -221 192
4562 192 147 349 31 -180 -124 357 280 559 205 -426 596 202 269 -9 -799 152 580 -573 271 407 -534
4583 -534 -389 124 -106 -11 -271 264 277 499 331 -267 131 -12 -71 -30 391 -447 220 377 223 172 -322 -87
4605 -87 69 -135 427 -79 32 -214 85 479 -100 -111 -295 11 1 -327 -645 346 -102 -3 -558 -716 -130
4626 -130 -690 11 -964 185 -91 -216 -499 -82 21 207 491 205 427 664 96 -346 175 -76 197 -189
4646 -189 -10 430 77 248 52 -75 110 188 -199 707 193 13 355 -733 451 338 -291 234 263 -315
4666 -315 331 -731 35 79 -91 -185 300 655 -338 -304 231 -43 404 477 -2 186 157 -68 516 308 -157
4687 -157 126 -81 437 -48 381 485 -15 203 -102 473 -138 -254 196 -85 330 -38 238 -271 -99 -65
4707 -65 -393 27 528 -390 219 232 379 -95 -498 -160 190 -330 256 116 -18 21 29 -237 478 417 -248 -160
4729 -160 55 -38 -43 21 563 151 -715 482 57 218 -60 311 7 317 532 290 491 308 -463 -153 -3
4750 -3 -299 -46 -238 242 520 -303 249 288 27 -39 129 -303 7 337 -327 -442 270 -515 165 -432 393
4771 393 948 669 441 -537 -201 -54 -125 126 -152 -205 42 -609 -388 -36 313 61 -334 95 -225 227 539
4792 539 364 -1 -386 243 171 122 663 -75 -597 129 128 64 34 -3 -237 -60 -142 0 -3 187 -221 -54 -10 -141
4816 -141 133 434 -119 -199 520 99 5 -287 13 390 -692 316 -318 332 -123 -224 227 345 218 9
4836 9 -263 -282 18 339 486 -393 633 231 160 -602 96 541 -451 485 435 425 -190 -17 639 144 -131 -292
4858 -292 306 52 -426 379 -116 110 -327 -180 -545 -723 146 58 -41 144 441 94 -134 -381 230 359 -160
4879 -160 -305 -227 349 -29 -716 605 -516 52 329 -568 -333 -11 284 -200 -574 153 -233 311 -50 425
4899 425 395 103 -653 -162 655 -769 605 472 -218 -692 173 -360 292 160 -42 -403 -83 143 191 17
4919 17 -128 138 -460 -109 388 21 578 622 616 180 436 -524 78 -256 -187 -146 -367 455 288 -133 -275 419
4941 419 -48 685 -280 -142 -40 325 -168 -234 -1174 93 -125 127 358 106 -69 142 114 -352 779 475
4961 475 440 195 -349 14 192 -58 -349 -133 137 -36 -94 507 -349 -243 92 158 360 261 -947 -163 367
4982 367 -498 47 -182 436 161 -450 -219 -120 -559 -314 -151 -173 -542 -105 301 -98 741 105 -154 -250 155
5003 155 109 1024 -94 142 -417 -7 41 -300 149 291 71 103 -376 169 330 422 -31 -189 -111 -368 -45
5024 -45 215 611 70 207 169 -296 -35 227 182 46 129 -221 228 -365 -296 576 -550 425 9 -226 87
5045 87 275 -99 -328 448 -228 524 -719 -276 -139 335 30 288 -462 278 740 -161 22 -177 135 -70
5065 -70 122 -181 -369 -156 -151 -143 109 701 278 -499 -193 -551 -185 34 -115 385 -317 494 -620 377 -502
5086 -502 -145 -109 -744 -58 630 167 -79 -145 -426 263 -5 -335 -69 711 225 622 133 4 546 -41 -452
5107 -452 -133 -402 -26 -30 178 130 431 164 -633 70 215 -627 -29 94 293 -408 -196 -448 161 -642 172
5128 172 -79 -240 68 -74 -20 176 -73 599 239 -704 6 558 -70 -396 -240 -179 -401 331 -263 -217 -75
5149 -75 -411 -153 -68 180 166 -20 -749 -183 187 287 -62 224 538 380 -445 146 -635 -371 -29 -160 172
5170 172 258 -243 -154 57 -278 335 86 -78 544 391 182 -904 142 -386 28 419 -45 165 97 -35
5190 -35 118 261 206 -642 -106 -247 -70 -171 -308 226 -347 -188 -719 202 217 -6 42 -332 -14 -240 389
5211 389 -103 -24 -14 -29 -329 320 -562 -289 565 -219 70 -245 386 229 266 -479 283 -187 -245 -206 -972 -15
5233 -15 -197 -130 65 -296 -6 219 -333 415 -437 211 -947 -712 238 -518 700 -36 -403 438 450 150
5253 150 410 9 -37 303 -522 294 586 78 -303 120 137 -100 781 -877 103 -59 104 -175 58 -722
5273 -722 -262 -118 -36 -669 135 -378 -148 407 231 -143 -39 215 -227 459 160 -382 -13 -726 -679 -588 294
5294 294 -309 -608 81 -191 416 -53 -159 -175 119 639 284 -178 192 426 -114 -38 79 194 -63 -216 114
5315 114 -918 111 266 -186 -285 -238 -91 -78 88 288 -560 -177 9 -255 -75 114 400 -166 -64 -6 -566
5336 -566 68 -139 -271 707 -107 661 47 -279 -165 -362 -117 82 278 -174 61 -201 -370 185 493 -396
5356 -396 345 -355 -677 16 -61 11 410 -121 -187 -462 431 -863 245 -284 198 247 30 -56 -356 690 -393
5377 -393 191 204 198 -42 480 -539 -170 52 -380 -239 182 -260 -376 241 104 -453 835 -269 -253 -229 133
5398 133 190 -96 442 -328 170 154 124 -210 416 205 61 -173 -97 -167 597 280 -51 -542 -36 156 -325 615
5420 615 -390 108 -572 -270 273 383 1227 136 469 -315 -43 65 -1 -222 -209 235 143 -311 -173 -16
5440 -16 329 816 287 404 3 -205 171 -138 -382 36 313 184 94 302 100 -323 -272 447 60 -146 511
5461 511 621 57 -192 -436 675 20 20 601 33 -41 250 -591 -256 -30 -220 -187 245 426 -189 -275 -501
5482 -501 -411 148 -102 -308 57 -475 73 360 225 90 315 272 -214 -983 553 35 120 205 113 -378 400
5503 400 -195 -843 76 258 -532 -107 674 473 182 -220 -440 203 39 -346 -278 427 286 269 26 311 578
5524 578 270 335 -186 2 -168 91 379 -485 -395 -131 -526 -300 300 -159 -469 -29 53 -512 663 -39 511
5545 511 122 150 274 -130 642 57 -632 82 533 618 -293 15 -393 184 714 -71 568 -160 -356 63 267
5566 267 610 447 39 -376 -119 714 59 -227 267 289 284 -77 -315 -457 252 234 -17 -381 -122 248 -202
5587 -202 503 -287 -172 51 109 210 558 751 -297 199 148 627 15 344 173 -503 178 32 -975 890
5607 890 -185 104 91 -19 -261 -394 96 483 279 -325 211 -107 547 164 580 -465 -117 89 21 241
5627 241 -691 317 512 -8 659 -390 157 528 -146 -54 768 246 119 212 120 331 226 184 -588 298 883
5648 883 103 227 -143 298 -220 266 -15 279 -415 -190 579 -18 86 194 729 -41 452 -546 -676 -9
5668 -9 250 -25 -142 251 -67 -581 159 -455 -689 220 174 -236 149 -182 -95 -318 160 35 -489 80 -507
5689 -507 -35 253 -3 -324 -599 63 -78 364 41 -341 887 175 144 -51 -126 -196 -357 -244 -472 -554 -86
5710 -86 -86 -587 -83 -101 655 -483 184 -360 -236 -65 350 -571 -104 -93 -409 -35 425 129 -397 36 230
5731 230 438 28 -282 405 -282 296 -500 -58 363 282 323 -442 685 315 -31 287 186 263 263 -123 -410
5752 -410 -110 -417 -469 -300 161 -43 81 -145 -594 194 -167 480 36 -423 42 602 296 411 -382 -518
5772 -518 -75 -426 -313 389 410 300 -73 -423 9 449 -86 154 112 331 -234 -294 -102 -246 -546 231 72
5793 72 199 515 484 -421 70 -301 -25 -185 440 327 -187 234 237 66 162 -200 41 151 -4 258 -494 -197
5815 -197 -307 211 306 -522 -537 -1035 -260 -566 -392 -436 40 237 287 122 -491 -156 342 -674 -294 -359 21
5836 21 186 -130 706 176 524 -306 263 284 33 431 493 -226 4 -55 464 149 -216 93 -199 171 -339
5857 -339 -4 -218 158 -186 -222 -219 -11 41 -298 349 397 51 515 381 126 97 644 -21 -194 283 -153 587
5879 587 -185 -598 -20 210 -132 135 123 106 67 -51 -67 -400 -312 -336 -504 311 -720 -526 72 -299 -17 -441
5901 -441 -351 -236 -58 8 326 -231 -105 480 196 115 -234 287 -1030 -329 -176 -363 194 183 -110 -425 -551
5922 -551 244 -848 -31 -489 70 -602 88 -57 -307 5 -316 -36 690 -128 82 280 -492 337 118 1036
5942 1036 -73 54 -471 60 90 576 463 555 381 -345 -112 -29 -242 -154 -498 -403 113 -1 -127 -283 -121
5963 -121 131 -409 349 354 -82 -10 121 -201 -470 -397 336 -382 -722 515 248 -2 -275 -254 -393 76 421
5984 421 -524 78 -189 -55 -18 325 820 -32 576 451 -237 -464 342 276 270 219 461 -65 353 -493 265 -202
6006 -202 -377 288 -114 524 17 537 326 -327 -87 -106 -306 -227 432 -251 442 1166 196 -678 140 -299 -255
6027 -255 -305 173 312 -107 191 122 -114 -332 -655 122 -261 250 -325 25 -444 -252 -274 -40 -192 -191 266 -169
6049 -169 -29 976 535 -551 120 134 69 97 -439 -181 506 -410 -188 332 -229 390 288 -82 215 -158
6069 -158 102 -247 300 -129 -71 235 -100 -535 -197 -419 -701 -531 91 194 -46 -51 -371 71 438 395 -83
6090 -83 348 -129 307 -119 139 -959 475 1226 239 343 -808 28 -406 229 467 258 -120 -76 -12 -52
6110 -52 153 -784 172 115 611 -192 -892 -136 -245 -274 -661 -249 -15 218 419 221 -435 238 -217 -145 -140 -218
6132 -218 -168 -354 -169 -890 573 -89 -530 -399 -80 -132 370 -255 49 -363 91 756 -261 -287 72 -107
6152 -107 -81 198 78 4 421 264 -464 -40 -150 -271 -370 -304 127 -111 79 25 39 -3 -170 -153 -289 -101 220
6175 220 120 -414 309 157 -359 679 -224 51 961 -255 -470 1297 155 -290 24 747 547 666 -232
6194 -232 453 -395 484 -304 -119 30 137 121 -14 334 293 22 455 -233 495 385 465 483 -18 -453 -141
6215 -141 120 37 -196 250 -96 64 -412 197 504 154 313 -318 125 -354 -215 -223 -289 328 -36 -243 745
6236 745 -393 24 -328 286 159 -177 -138 336 -345 124 -96 270 318 -446 -324 415 -364 -281 -58 351 -773
6257 -773 42 -553 131 -191 -226 -78 40 41 672 186 -123 381 -203 63 -535 71 290 7 -24 -353 8
6278 8 -876 -429 536 314 77 -121 -51 -550 -57 -62 -173 609 -311 977 -31 45 -170 -180 1143 46 -279
6299 -279 -344 -212 -391 657 252 143 -208 341 -322 -214 -190 491 288 -58 -287 -185 595 -83 706 -301
6319 -301 74 -296 -31 196 -237 -220 -523 127 194 -250 -399 -275 510 -941 -132 -204 -194 -122 12 -160 -634
6340 -634 -170 87 75 91 378 55 -336 294 283 296 175 -50 492 424 -179 -139 -420 -560 -467 -41 -77 -35 -371
6363 -371 -405 373 -302 -178 204 -91 108 68 -113 208 859 0 -683 31 204 -63 -22 652 178 -181 -160
6384 -160 -45 45 -93 -182 164 72 173 79 -46 -196 152 598 -18 540 -505 -84 -64 332 -111 -784 612
6405 612 4 -155 -251 -236 -550 -227 25 121 214 38 -308 166 86 163 276 563 382 -585 7 -99 -381 370
6427 370 241 -100 21 257 -293 22 -656 386 307 14 712 110 -287 -230 -208 -190 357 -32 245 214 -495
6448 -495 -12 216 149 -262 -324 -326 -186 411 -371 -482 -132 -132 -507 534 30 249 650 262 -96 663 212 -558
6470 -558 319 -205 43 302 -496 5 5 185 -266 -43 -372 520 -106 -45 352 -436 336 -456 156 298 -7
6491 -7 -262 172 515 362 382 -120 11 -256 245 -76 209 313 -266 -149 174 -2 722 -135 104 -398 -610
6512 -610 21 -740 -262 -610 -35 122 -81 -161 147 -90 10 428 -262 363 23 -294 153 137 -126 517 -227
6533 -227 794 -495 323 380 465 99 456 100 107 -192 544 -5 -431 -408 -374 474 -239 -94 184 32 -252
6554 -252 -34 -525 -209 -47 122 -387 -213 -582 118 374 -135 -736 238 -526 -529 365 -145 357 6 -440 -242
6575 -242 -749 -99 -410 375 -77 -115 380 383 -179 65 -554 -424 205 -458 -381 -123 253 115 -395 553 175
6596 175 -123 214 -157 -122 -286 -351 -98 163 122 -213 85 -25 165 288 1133 -160 -61 -298 74 131 558
6617 558 -648 148 679 -518 451 253 345 -419 257 500 -215 -558 234 -172 4 640 178 -151 -345 -153
6637 -153 -138 -119 -397 133 -233 -40 -121 348 -357 -721 -251 314 592 -575 522 770 118 230 -288 -597
6657 -597 272 -252 69 52 -24 -471 354 -437 -198 847 221 -363 267 172 59 -201 70 74 54 545 -37 -221
6679 -221 -354 284 -215 61 -59 176 -463 250 258 -18 -173 409 -455 320 215 83 570 -323 -123 253 57
6700 57 -26 -65 -469 25 608 -406 580 652 -261 407 -243 458 366 -173 -333 -104 -107 -455 -38 -166 -385 -216
6722 -216 -173 -312 -477 171 849 -747 -75 -593 -107 5 578 -134 -615 -131 545 251 639 438 158 193
6742 193 251 146 97 -126 -243 134 -65 164 -616 203 266 -133 -95 377 -120 25 165 -113 -48 -57 295 -736
6764 -736 -73 425 150 285 -149 359 151 407 47 -8 541 323 148 371 -522 -387 288 -462 -382 283 193
6785 193 -43 265 170 371 525 -564 -175 -231 -96 436 -580 -277 180 -421 -616 -185 -352 -497 -261 -229
6805 -229 -159 -575 362 280 52 309 -28 -309 15 255 28 -53 329 357 215 -353 -77 57 -368 -242 -230 -192
6827 -192 187 398 117 -48 -27 773 305 -235 312 -22 -846 -411 -449 -446 -370 104 41 20 -461 497 -920 556
6849 556 29 471 121 284 -397 -210 150 431 -34 -319 -703 211 423 -532 -109 -315 217 476 353 121
6869 121 440 -506 -418 -906 -232 -581 -84 -26 -364 612 188 -787 -623 -434 -380 320 20 -280 680 594 -502
6890 -502 -846 410 -32 -176 149 152 65 -786 22 -275 -223 -272 32 -195 144 457 -271 -268 -95 -144 679 -258
6912 -258 -494 101 264 -48 441 256 261 215 124 -55 -221 75 -207 260 899 -106 529 302 -12 -140 315
6933 315 -349 451 -174 295 -144 -417 390 -196 -619 221 73 -337 -514 304 -198 -37 -402 -206 416 656
6953 656 233 -385 -218 801 -320 137 -824 234 -18 -364 -165 250 250 -9 488 919 373 -211 -699 12
6973 12 -6 -170 -203 40 125 -195 123 -88 408 395 222 83 101 -271 223 -127 184 660 223 -22 -547 33
6995 33 151 421 -298 55 -68 40 324 -90 -65 -46 -637 -331 -57 -475 194 68 239 -549 98 767 608
7016 608 -596 387 -165 477 402 571 496 188 -419 318 382 -804 295 174 -152 -21 151 -394 -51 152
7036 152 -307 -138 191 452 -254 61 296 644 615 112 227 213 -91 -240 -844 31 496 -58 145 56 346
7057 346 379 249 305 228 147 -172 281 14 -78 -84 -347 137 -499 -242 400 -248 164 -53 -223 478 687 143
7079 143 491 -133 -156 136 52 336 550 -413 -61 562 -249 10 -35 -18 41 335 -144 -159 675 52 330 -192
7101 -192 229 -254 -541 394 -236 -17 -165 -556 756 43 -270 -10 -220 18 -10 -174 -419 311 511 -431
7121 -431 -236 90 -146 -78 309 -278 -167 -10 -387 160 -265 -989 647 66 342 106 -279 -137 206 -290
7141 -290 608 -354 -287 497 -460 -92 -235 5 484 -510 -3 -622 508 355 -172 -158 -444 337 141 264
7161 264 -433 23 614 246 229 364 194 6 150 268 -30 244 -329 490 -169 -885 -272 -468 -50 276
7181 276 -72 162 -247 -976 7 638 -747 -353 198 48 -55 -197 124 -92 95 -203 -367 -526 -461 -279
7201 -279 443 -722 300 114 -512 707 770 -340 -489 -330 536 -770 -38 -303 -139 256 -91 -177 -216
7220 -216 141 -519 -481 407 481 517 -469 160 -103 -266 -796 465 789 -89 527 179 -69 1 -7 -73 374 -548
7242 -548 104 324 -301 594 255 -506 -166 -100 65 121 -494 -612 -386 -198 -68 199 -6 15 -85 -17 172
7263 172 209 171 247 683 468 394 -189 599 317 -574 -288 -29 484 -284 237 986 26 434 77 935 -208
7284 -208 228 202 544 -153 -324 -288 454 -236 93 11 -824 -118 70 -361 -108 384 -524 -361 -166 228 293
7305 293 72 -94 84 249 -478 358 -9 -48 -99 186 5 575 533 699 83 254 -8 -182 362 -29 -519
7326 -519 220 -339 -492 -70 69 -41 240 -494 272 -257 314 -235 34 431 -112 -115 -596 409 -39 353
7346 353 -128 237 170 481 -150 -728 -455 -327 -338 48 76 230 16 -245 -87 289 153 243 65 -369 197
7367 197 686 -857 -91 -733 -491 215 -629 -256 -163 304 -284 280 115 116 141 -148 -27 197 231 280 215 489
7389 489 38 251 223 54 -111 73 354 515 286 32 273 -161 97 12 -296 -94 -107 -160 -78 335 -112 588
7411 588 -272 326 97 -204 -700 -460 -60 205 311 -693 109 308 -31 170 196 9 65 -29 -207 80 125
7432 125 20 177 -28 467 -238 -153 315 50 533 213 417 -323 455 -79 617 110 451 199 33 -100
7452 -100 -167 -500 36 -369 -845 549 162 219 606 -77 80 -283 -345 -888 138 -45 -441 114 -362 231
7472 231 109 -60 -120 -83 -551 -218 401 -126 518 122 244 -221 -267 72 -675 -100 -368 -836 -182 417 -441
7493 -441 -153 -264 -28 133 -493 -867 -201 211 178 -121 -9 229 116 -217 202 532 -64 139 347 142
7513 142 207 -58 855 270 305 -512 -239 -96 -61 -391 -306 934 453 -185 137 249 -172 -414 70 -827 -16
7534 -16 -628 311 -43 246 627 -390 -14 -473 73 103 -50 506 903 549 131 -384 239 292 732 -285
7554 -285 -40 -285 46 -15 641 1010 -439 -134 -335 -78 377 -140 42 148 276 265 178 362 419 564 391
7575 391 247 -503 45 -332 -2 -547 80 27 539 -195 -293 -874 -47 -287 61 -5 77 66 10 -467 180 -376
7597 -376 -304 -25 -393 840 346 -500 -49 29 235 -147 545 593 528 339 487 109 -188 -156 186 -376 -14
7618 -14 286 -404 416 -719 308 -300 -494 218 182 249 -132 25 591 -503 -73 239 152 -333 -145 -108 247
7639 247 38 934 259 272 -208 -384 308 -49 -204 40 -11 207 174 80 388 -224 273 115 -667 34 -3 -192
7661 -192 8 328 -471 -67 321 197 -515 -280 -632 922 829 -462 96 509 271 -370 178 332 -301 -643
7681 -643 412 886 80 -280 115 -285 91 187 145 -51 -491 148 -156 -127 -101 -6 167 -408 -351 -911 -325 -90
7703 -90 694 -54 566 87 -226 -244 -66 -340 -455 -46 -239 -141 385 -222 -795 343 59 119 406 -655 113
7724 113 389 468 -394 -270 837 -166 -135 110 -3 28 759 424 37 256 356 464 -246 40 242 1
7744 1 2 141 -486 -483 171 170 -101 437 -97 -451 -132 153 -12 -243 -178 22 -86 -411 -233 -635 480 -799
7766 -799 659 118 -202 522 -312 191 148 157 -203 232 -248 166 -356 245 -753 509 -84 -254 -154 95
7786 95 465 -268 186 133 -616 -223 -169 -840 448 283 141 259 314 -172 -92 359 -34 -148 -286 181 -515
7807 -515 293 -235 -117 -51 10 331 -139 -267 -18 234 703 217 333 -129 236 433 110 -600 74 -258 -163
7828 -163 627 -333 -259 599 -319 297 -5 401 114 -673 31 136 86 92 -594 -134 281 -116 67 -361 71
7849 71 -602 -296 389 -162 -194 -168 -519 -29 -220 362 106 -514 -215 989 -236 557 -640 7 -60 -108 21
7870 21 -58 -261 -435 1050 213 -353 110 103 289 155 -163 -141 -77 9 159 313 -47 549 141 239 -610 -68
7892 -68 -765 -927 74 220 -244 -146 41 404 -81 -64 -113 204 -230 -362 -537 -137 -12 -100 92 656 228
7913 228 222 270 267 -282 197 -26 33 387 -412 -751 -162 -577 161 139 196 517 -360 -116 -236 208 550 49 -160
7936 -160 316 91 325 28 383 214 -107 245 203 -39 -105 -237 798 -239 30 187 -32 -299 88 -17
7956 -17 549 -445 147 398 -24 386 -5 205 -606 -137 277 150 296 -119 252 609 193 -137 472 304
7976 304 12 -147 -455 142 615 -363 193 191 148 547 -548 765 -533 -445 -33 -158 93 -205 398 -224
7996 -224 -230 -179 245 245 -110 -39 -68 475 345 414 -200 12 -202 158 398 350 -64 -143 644 266 496 -456 -420 560
8020 560 -81 -213 -208 -293 -381 -200 478 -226 -96 319 -239 67 1 -295 11 485 -122 328 456 -116 -332 546
8042 546 -865 -647 310 -168 -284 803 -130 401 -216 162 -409 247 804 791 -340 -430 529 526 -221 122
8062 122 81 -609 -268 77 140 -197 -264 -632 -344 -164 943 145 -49 -71 -155 194 387 -4 -33 -139 12 143
8084 143 -31 -527 -377 310 220 -365 425 86 -295 150 489 -59 393 123 -643 171 394 52 -154 68
8104 68 -178 590 -211 -671 -57 -391 69 120 107 -129 -402 -450 -466 -104 -639 -266 39 -428 -134 731 300 210
8126 210 -382 -224 188 127 -318 470 -12 272 219 -425 -66 87 -62 175 656 -95 3 -80 -7 313 402 -330
8148 -330 -447 175 -215 19 -130 -221 -13 12 145 729 -568 382 230 -454 433 -269 -227 -211 -305 149 -173
8169 -173 162 -110 146 198 -450 -332 -157 -41 -470 416 -164 -73 -583 307 619 -326 -131 -507 -293 -102 67
8190 67 -561
8191e61
$$ Imaginary data points
##PAGE= N=2
##DATA TABLE= (X++(I..I)), XYDATA
0 0 0 0 0 0 0 0 0 0 0 0 0 0 -25 40 -40 40 -40 40 -58 80 -80 85 -116 120 -148 163 -189 211 -241 274 -305 343
32 343 -384 428 -477 533 -591 656 -728 806 -892 990 -1095 1209 -1342 1490 -1658 1849
48 1849 -2068 2329 -2638 3012 -3473 4067 -4858 5971 -7636 10423 -15954 31026 -146530 -502137
62 -502137 -92484 252964 94598 -192871 -120450 10732 -48375 -96294 35221 67528 -90356
73 -90356 -174497 -40122 76110 45791 -32143 -72127 -95661 -48490 52126 64212 -48988
84 -48988 -89223 4122 55944 -15231 -51756 10851 50012 3489 -33840 -9158 31605 50882
96 50882 40191 -15498 -54380 8799 103575 79495 -19712 -22636 44919 34793 -10157 43120
108 43120 102747 13709 -96271 -19609 125448 94641 -52625 -82419 14499 66447 37645
119 37645 11045 -4647 -29085 -18877 30205 39952 -3223 -20404 -4206 -10739 -16931 19219 32999
132 32999 -25710 -60528 339 49946 5877 -40637 -10069 20914 -9616 -29050 8823 28021
144 28021 -5298 -21901 -318 5737 -3746 12840 24509 -6385 -23129 17420 42904 8811
156 8811 -16691 9804 24740 8 -5528 25395 27011 -11227 -17379 17592 27871 2947 -5389
169 -5389 8130 10426 1192 3492 8262 2808 1535 4960 -2422 -9935 2188 13480 -20 -16886
183 -16886 -8711 6097 4261 -1314 567 -5744 -17574 -6033 15963 8339 -17654 -16203 6204
196 6204 8682 -2609 -80 4595 -6102 -6044 15524 20233 -5805 -16493 8404 24498 7434 -7979
210 -7979 1704 9686 5742 6965 11416 -538 -8956 7363 22674 11411 -9222 -6778 6833 10826
224 10826 9200 5793 -7512 -15095 3589 20984 6270 -19695 -14289 7363 7406 -2129 -220 -1788
238 -1788 -17006 -13165 12196 13307 -14847 -23022 1237 13108 -3312 -10871 -655 1148 -4376
251 -4376 2500 10471 -897 -9599 5458 16069 1187 -8270 6363 13419 3381 616 10075 5371
265 5371 -5105 6002 21289 10025 -9663 -952 16900 12108 -1347 749 6341 -955 -1655 12821
279 12821 10752 -10895 -14556 5874 11168 -5231 -9820 -829 -2501 -10693 -5261 2886 -7111 -18140
293 -18140 -8744 2401 -4841 -14896 -8147 -2667 -9498 -11767 -2282 -2049 -10989 -8032 1066 -2721 -11484
308 -11484 -4413 5104 -996 -8372 -1283 6537 365 -3803 3319 7597 -308 -1958 8700 11508 1485
323 1485 -301 8336 9212 2434 5194 10486 4952 -1281 4448 10226 4713 -1591 2477 5860 1204
338 1204 -844 3412 2878 -4309 -5509 1756 885 -5144 -5060 -517 -5524 -7837 -3563 -715 -6366 -9413
354 -9413 -4320 -2344 -5363 -6915 -3269 -4005 -7498 -4596 227 -458 -5613 -3093 582 -390 -1594 1345
370 1345 1947 -145 17 3737 5289 1788 2857 5532 4863 2729 4868 6924 6717 2804 3927 7089
386 7089 4908 3687 4442 4695 2577 2234 4246 3216 48 1503 2549 104 -1275 454 -104 -3115
402 -3115 -3979 -1414 -1171 -4810 -5581 -2899 -3037 -5780 -4587 -2250 -3603 -5672 -4432 -1527 -3107 -4985
418 -4985 -1718 -673 -3979 -2789 792 1780 -2152 -1630 2712 3531 933 1284 4493 4558 1832 2467 5460
435 5460 4332 2447 4140 6514 3873 3801 5491 4670 3181 3712 4749 2962 1056 992 3422 2103 -1337
452 -1337 -1599 627 -7 -2497 -2885 -2234 -3948 -4129 -4420 -4016 -6688 -6802 -5057 -4457 -5487 -6670 -5459
469 -5459 -5373 -6568 -6174 -5465 -5410 -6865 -5369 -3390 -3817 -6101 -5281 -1168 -1421 -2755 -2835 -1782 -349 -259
487 -259 495 909 393 -539 2372 4822 2307 -306 992 3427 2775 1814 2114 1738 -309 887 2837
504 2837 2924 -884 -3467 118 2406 -586 -3959 -2189 570 -2950 -2956 -1337 -2980 -6359 -3931 -652
520 -652 -2824 -7930 -5864 -2175 -3110 -6722 -5413 -1901 -4806 -5686 -2025 -609 -5135 -5998 17 2713
536 2713 -4271 -4910 971 2978 -418 47 2756 774 -1966 4021 6982 1797 -2896 2839 8567 3338
552 3338 -206 3478 5759 1401 1000 7254 5458 -3024 -1521 5955 5790 -1735 -3200 2071 997 -3605
568 -3605 -879 1986 -3412 -7706 -1017 1573 -5842 -9273 -1795 414 -7432 -9703 -2912 -921 -8418
583 -8418 -8025 -2507 -3306 -8705 -4572 1301 -3649 -10252 -5416 2854 -604 -6535 -3366 445 -3039 -1661
599 -1661 4805 2283 -7537 -4631 7494 6316 -3267 -4153 3637 3525 -429 2818 5780 -1344 -5760
614 -5760 2569 9352 1088 -5559 -508 4471 213 -1833 1793 -43 -5258 -2545 5014 459 -8179
629 -8179 -5164 3906 1044 -8326 -5848 741 147 -5812 -3326 -570 -4610 -5479 883 2432 -5232 -6753
645 -6753 -194 4130 -52 -2572 -1681 -1379 516 5225 6248 -1908 -5911 3215 11620 6650 -2525 -620
661 -620 4618 5819 5336 6869 2680 -2972 941 9510 10065 246 -2564 1789 5598 6203 4410 1276
677 1276 -2610 -1396 5533 7723 -385 -6327 -2161 3105 1540 -2814 -3138 -1388 -1838 -3100 -473 -1249
693 -1249 -4118 -4358 -2182 -743 -2339 -4090 -3187 -262 -1089 -2482 -4213 -2002 1087 1907 -2205 -4760
709 -4760 -2033 3583 4298 -189 -4291 -2298 3179 4673 2448 -872 -1261 -1477 1515 5841 4601 -2923
725 -2923 -6193 -153 6299 4154 -3552 -5420 -1544 -280 515 1735 -1687 -7867 -6641 1398 3037
740 3037 -4829 -8256 -4048 -1692 -3854 -4426 -1626 -4113 -8673 -5629 363 -936 -7115 -6759 -1062 -2313
756 -2313 -5616 -2065 1600 -2270 -5461 -1341 987 -155 -22 1900 -670 -3444 612 8386 5197
771 5197 -2682 -1854 5051 5128 2478 5325 6418 -896 -2500 8200 12011 2028 -5082 2229 7291 3216
787 3216 1998 5812 1038 -4822 631 9368 4931 -5744 -4491 4371 2206 -2652 237 3115 -4301
802 -4301 -8143 1641 5401 -3884 -7640 -295 928 -4812 -4106 3532 1414 -7317 -5416 3426 2296
817 2296 -3480 -1022 1326 -3569 -4431 5672 8421 -3283 -6800 2837 7123 1702 81 5862 909
832 909 -4931 1981 11861 5763 -6206 -2103 8179 6042 79 2883 3766 -3744 -3635 6414 7838
847 7838 -3603 -7170 2631 4512 -2491 -3243 4020 -1306 -8167 -3772 5567 45 -8449 -4305 1325
862 1325 -3107 -7087 37 1983 -6517 -8693 -350 1877 -4775 -5113 577 -1931 -7707 -1566 6156
877 6156 58 -8478 -2451 4648 428 -4169 2334 3300 -3867 -3934 6452 7048 -3502 -5046 4096 5398
893 5398 -191 224 4728 724 -4263 1570 7981 1444 -5040 -854 4712 -499 -2218 3303 1585
908 1585 -4764 -3825 2738 2610 -5234 -4195 1037 -958 -5052 -1546 1880 -2747 -6756 -1217 2228 -2936
924 -2936 -4979 93 591 -4760 -3740 3036 2062 -4863 -3103 2896 1393 -3328 306 3417 -229 -3117
940 -3117 1822 5140 576 -1664 1705 4259 687 1323 4880 3170 -1887 994 5452 2670 -1674
955 -1674 912 3946 1099 -1235 1947 3994 -834 -2294 1082 2231 -1818 -2939 1054 -4 -3345
970 -3345 -2310 1739 -985 -4126 -2816 764 -1756 -3633 -714 -29 -2741 -4092 -41 471 -2611 -2833
986 -2833 -707 -165 -2407 -968 1700 -767 -2615 432 2772 -96 -672 2062 2544 -267 -187 2998
1002 2998 3268 -13 762 4237 3597 -684 2076 3618 1853 -850 1616 2780 -103 -289 1157 1209
1018 1209 -808 -987 1577 -23 -1547 -1332 754 -1061 -3142 -792 211 -1948 -3346 -299 311 -2793
1034 -2793 -3694 -282 -319 -3229 -2443 -701 -1250 -2408 -1741 971 -1059 -2736 -548 960 -362 -1557
1050 -1557 1102 1267 -715 -577 2253 2151 -337 401 2005 1461 -186 427 2855 1114 -444 1743
1066 1743 2488 264 428 1588 999 -718 20 1353 948 -769 -382 1316 269 -2277 -1363 929 -1482
1083 -1482 -3226 -1105 285 -1432 -3000 -902 -1238 -2497 -2239 -391 -1498 -3038 -1651 259 -206 -2266
1099 -2266 -1626 693 -1653 -1631 321 789 -1274 -532 1159 2013 -255 148 856 1189 334 1142 2642 1099
1117 1099 171 1823 2369 829 1324 1830 2540 822 300 1610 1511 -542 897 1409 1244 -1703 536
1134 536 443 -277 -1853 -869 -197 -675 -1068 -1134 -258 -2005 -1885 -314 -1032 -2953 -2308 -123 -455 -1987 -629
1153 -629 -736 -1255 -1982 -414 -868 -1461 -1707 450 560 -665 -656 1032 654 -261 1739 1838 696 369 1642
1172 1642 2980 889 -130 1207 1506 731 -189 850 1425 1265 1459 1105 587 -76 406 1519 -24
1189 -24 -808 -328 671 -518 -1202 -227 84 -1619 -1740 -55 -371 -2543 -2021 -423 -543 -2226 -1409 -1112
1207 -1112 -1579 -1660 -804 15 -1590 -2298 -896 549 -563 -1205 -110 -380 129 345 469 313 -353 141
1225 141 1822 777 110 1241 1847 1254 345 1203 1281 1315 913 1424 1683 742 -147 1342 1825 540 -184
1244 -184 577 936 -151 -67 -220 -607 -578 416 932 -596 -1792 -1414 387 -363 -1195 -549 -1057 -661 -475
1263 -475 336 -741 -1372 -1517 421 -1 -692 -1044 72 725 -542 722 465 218 -1326 578 2199
1280 2199 657 -575 319 1977 1291 626 1052 1601 997 1580 1540 1150 202 905 891 1032 593 1067 1295
1299 1295 888 -112 374 858 31 -738 -188 260 -759 -1728 -607 -77 -798 -2476 -1411 377 -426 -1199
1317 -1199 -1495 -1471 -1672 -977 -146 -747 -2874 -2190 452 299 -1241 -1368 -196 -657 -1326 134 1547 -1259
1335 -1259 -2135 748 1822 171 -130 294 1305 593 795 2252 1003 -351 88 2102 1279 -891 409
1352 409 2289 554 -428 658 1642 16 -1397 731 987 -1253 -1495 1423 1696 -1942 -2576 -418 124
1369 124 -1035 -1477 -675 -1962 -2280 49 626 -1820 -3528 -750 1204 -754 -1301 -558 -586 -1660 -569
1386 -569 2114 52 -2040 -1474 2352 2228 -508 -549 723 115 333 2206 1915 9 -1069 1831 3272
1403 3272 93 -628 1116 1624 -501 217 2242 1825 -736 -181 1851 426 -923 -596 1349 58
1419 58 -1359 -210 1722 -752 -1845 -1010 -83 -1238 -710 98 -701 -2742 -1921 849 378 -2504 -1822
1436 -1822 120 -1039 -1519 -86 1328 -1185 -2320 -400 1791 529 -779 666 30 -793 466 2096
1452 2096 804 -1779 256 2137 2012 -145 220 1549 843 41 1772 2086 55 -1032 680 2042
1468 2042 167 77 234 485 -720 21 510 5 -1258 -1428 -207 -514 -931 -824 -972 -1122 -1158 279 756
1487 756 -1242 -1832 -1644 -889 -674 -902 -379 -901 -1180 -1009 140 664 -390 -1603 -102 -123 743 334 232
1506 232 -314 -1086 615 1234 1093 3 -59 1023 1583 782 1545 1770 190 -71 981 2052 584 34
1524 34 -497 37 224 299 1182 833 -490 -875 431 349 -573 -1137 -1265 -773 -403 -239 -277 -1213 -1440 -1389 144
1545 144 91 -724 -1275 -867 -753 244 -141 233 -1812 -1112 -534 1101 1063 -924 -363 22 317 620 808 161
1565 161 -224 -253 1151 1670 809 92 215 220 -179 640 1353 -71 -876 503 1660 778 -148 317 780 -175
1585 -175 -108 492 618 -535 -782 832 958 -965 -1066 -130 -562 -1160 -716 654 -754 -1499 -1211 -48
1603 -48 -1153 -1294 -523 -329 -1113 -740 1069 487 -527 -1419 1150 218 -905 588 1812 394 -1402
1620 -1402 986 2203 13 -619 652 802 -184 162 1293 921 -582 -605 1982 1537 -112 -164 850
1637 850 117 238 1112 1627 -189 -1443 329 1193 -6 -1711 66 668 -1218 -1158 494 342 -1863
1654 -1863 -1015 902 -462 -813 -845 513 -244 -1344 139 534 -1132 -1532 23 515 -700 -447 856
1671 856 205 -1125 -272 1182 1444 -695 647 1375 775 -994 234 1832 562 -782 1701 1613 268
1688 268 -359 1171 1258 -301 280 811 673 -675 437 1036 1126 -865 -269 659 -42 -1288 -163 396
1706 396 -1224 -1267 611 -180 -799 -258 847 -23 -1768 -680 -363 -67 -767 -831 -267 -910 -1650 686 575
1725 575 -407 -546 -22 628 -104 -385 514 711 -77 163 596 584 -625 373 1521 923 11 672 961 336
1745 336 -202 1524 1477 -512 -177 808 -158 -476 -250 808 -50 -1 -15 1265 -329 -1142 295 443 -481
1764 -481 -795 269 143 -325 -974 -86 -1011 -1419 -521 -850 -730 -915 -561 -316 -143 -808 -349 -536 -348 -472
1784 -472 934 105 -741 -103 666 451 310 -71 588 478 -275 971 1504 793 -130 1319 1332 454 -6
1803 -6 1468 565 330 458 796 717 -167 48 743 -137 -6 428 129 -683 -826 218 101 -810 -1298 -573
1823 -573 -60 -601 -342 -349 -467 -829 183 -18 -866 -395 -834 -868 -774 70 -205 377 -921 766 169 -171
1843 -171 -694 -28 708 -291 -76 599 1044 357 128 1371 632 -422 677 159 772 141 289 1044 -53
1862 -53 -194 531 605 321 -613 467 411 -467 -424 258 -160 -691 -14 -726 145 -574 -740 610 -686 -608 -166
1883 -166 187 206 -1321 -267 -272 -551 -512 -513 27 -253 40 677 355 -397 67 129 -112 -497 -178 262 549 89
1905 89 803 812 -258 54 1209 973 369 193 1008 547 396 -109 680 379 170 13 586 95 -14 -173
1925 -173 450 30 -858 80 475 -126 -455 402 -1120 -867 -274 -81 -324 -869 48 567 -762 -560 -201
1944 -201 -250 -628 -839 -172 264 -874 -574 -59 -292 -853 385 121 257 -612 -27 396 -457 228 992 447
1964 447 46 -101 510 398 -25 -50 299 26 239 643 868 -208 -314 678 585 -50 132 319 78 -909
1984 -909 -3 1043 -67 -1050 -529 115 -382 -329 -693 -38 -544 -306 -149 413 -609 -731 -393 124 -492
2003 -492 -618 382 -525 -459 -795 -438 -347 -420 -347 666 -99 -180 -94 582 -195 -212 115 992 96 102 975 394
2025 394 -294 686 1206 321 -34 372 233 63 184 99 516 114 132 624 121 -885 -57 225 618 248
2045 248 -576 -970 265 -625 -542 40 -269 -919 -597 22 -252 -847 -973 -642 -355 -690 -142 477 149 -689
2065 -689 -461 632 -240 -379 -130 772 300 -216 725 1057 -233 -65 1062 819 -79 902 448 -413 179
2084 179 1116 432 142 -52 182 708 -94 181 -15 451 -538 111 727 466 -842 -176 -357 59 -619 -412
2104 -412 296 -277 -1036 508 604 112 -118 -507 -807 -1263 -77 453 -208 -1032 -1035 404 -29 -844 -392 417
2124 417 201 -254 -40 308 -192 -183 524 973 624 0 -232 972 -322 228 68 876 -914 -453 164 414
2144 414 -15 -27 186 688 -143 376 1157 -454 -321 -12 643 -623 72 -79 -348 -55 -342 618 96 -269
2164 -269 -735 -53 -227 -751 -323 -348 -476 -1187 -55 -46 -421 -1186 -575 39 -610 -283 328 -440 -550 -335 640
2185 640 517 505 -871 409 -300 275 -111 -657 2 -68 379 839 840 -329 214 279 481 -198 1200 484
2205 484 -704 -560 656 1694 228 40 15 -487 -609 303 -358 -662 -578 -583 116 144 -766 -554 -5 -827
2225 -827 -1415 -121 229 -890 -854 -61 203 -331 -852 455 118 -776 140 980 122 -1362 66 7 1016
2244 1016 145 -195 21 -22 -121 1507 26 -241 526 834 530 826 518 625 542 -593 446 421 766 -868
2264 -868 233 620 -279 87 9 362 -831 -466 705 522 -92 -1356 -475 35 -766 -582 626 -270 -1069
2283 -1069 -895 -46 -270 -1013 -440 291 -492 -605 264 -333 -196 54 -249 426 412 78 31 -461 843 124
2303 124 137 469 41 -11 678 839 30 717 -524 287 -232 457 143 -210 -150 -526 226 53 551 -141 -460
2324 -460 -23 102 542 -234 -390 -442 -13 -11 -1214 -375 397 -383 -334 -248 -322 -7 188 182 -336 29 521 -433
2346 -433 -64 -1005 274 -421 407 -549 -528 155 -193 505 127 458 567 -481 -222 253 -40 -52 -3 -352
2366 -352 -214 385 503 752 236 125 58 -101 139 -161 290 150 -203 48 -218 -133 -101 -279 -333 35 345
2387 345 -862 146 -205 -353 -388 138 130 -850 506 -334 -253 -596 -659 147 166 -560 44 281 -495 -22 23
2408 23 -76 145 -280 166 68 -260 318 617 460 -228 116 -153 415 527 313 261 672 103 -187 717 856
2429 856 -116 468 -72 554 -304 -128 736 -415 130 321 -891 29 261 287 -243 -766 192 401 58 -940
2449 -940 -506 132 388 -857 397 215 -648 -289 -193 -940 -103 -700 280 190 -594 -419 -150 -564 164 42
2469 42 509 -34 212 244 165 226 -55 312 233 268 -96 862 -586 610 -177 122 251 176 -126 454 -14 209
2491 209 134 28 101 929 -230 129 -823 -17 361 -898 -67 -315 200 -118 171 -485 -873 -471 -765 440
2511 440 -51 113 -33 -132 119 -231 289 66 -22 -342 636 520 -249 -269 -425 -358 447 -19 373 -126 810
2532 810 605 880 461 913 109 630 241 -69 -464 390 307 312 35 459 -116 -34 575 111 -344 -89 477
2553 477 7 69 154 -213 100 -202 -231 -34 -154 -648 -614 741 -693 -178 -33 -283 -433 -132 -416 -479 -1056
2574 -1056 -315 -133 310 98 130 137 -281 -45 -30 331 57 131 354 569 -248 396 746 118 -531 -177 229
2595 229 962 -83 -99 988 347 -293 462 150 89 244 -247 954 -497 -68 137 180 -402 -239 -494 -309
2615 -309 -351 -276 492 337 -888 -573 -358 -433 142 189 -61 493 -400 -43 -405 449 -683 -540 -19 -658 -58
2636 -58 -156 3 22 455 -243 194 -157 394 425 533 903 591 61 58 -168 200 635 -32 -9 -390 -293 -46 -612
2659 -612 -336 -167 194 -243 -191 -285 -110 583 -462 -814 -60 -336 -98 -517 -507 -604 11 -839 231 -332 44
2680 44 -1031 90 -17 -322 -144 22 107 -477 406 -360 265 314 679 -586 -273 -216 134 447 33 -264
2700 -264 661 226 -4 35 467 -227 -441 523 15 -608 -520 -299 -45 -332 122 -58 -480 475 318 815 -228
2721 -228 -169 178 -414 -190 -243 -3 -160 2 -476 -29 251 280 185 -37 -79 -269 364 -24 448 -522 323 -511
2743 -511 -620 -464 24 185 -629 -283 192 239 -466 -373 6 -169 168 95 -135 -142 556 901 -359 122 -643
2764 -643 0 101 -63 -270 489 240 -802 -478 338 -134 -548 -50 -3 193 -232 641 414 -859 -504 -195
2784 -195 -159 -825 -253 -333 -815 -437 108 291 -390 -280 35 29 242 -30 759 375 94 -815 -160 -247 -337 -80
2806 -80 -179 -342 372 -75 402 16 -393 922 445 -39 -208 377 223 -93 -6 -315 -176 -41 53 -37 366
2827 366 -140 -17 479 60 615 -265 263 -195 88 87 173 -208 -392 104 269 -41 -197 330 -776 -627 -249
2848 -249 195 -105 207 -171 357 -100 392 147 514 129 -700 -188 523 -43 -51 743 64 -372 51 -34 -237
2869 -237 194 225 64 272 208 160 840 520 400 -92 338 -121 -402 344 316 594 -160 710 395 -588 307
2890 307 -135 119 -407 -13 -513 940 547 -580 617 -91 -432 -212 -63 161 -404 -188 -168 247 40
2909 40 136 -124 -296 -144 319 931 184 -267 32 -350 399 194 -6 859 -185 -38 836 215 -426 143
2929 143 -162 53 272 208 -149 306 -268 -220 774 187 -278 -366 420 -182 356 -7 -639 -561 -725 93 -221
2950 -221 -913 -481 -3 144 -477 -223 810 606 -801 -1075 -233 18 -230 -267 -122 -54 -541 -166 -241 340
2970 340 -169 147 -218 -309 84 70 -334 -196 -133 44 445 -259 846 -13 -386 422 370 -12 -103 368 262
2991 262 194 -414 -435 -100 296 -690 340 172 -115 133 38 383 206 -108 137 -332 220 268 -188 -454 113
3012 113 -107 188 23 -508 129 -87 618 -498 -119 202 306 283 27 -139 -383 -231 -6 -292 -623 -52
3032 -52 -119 282 125 -131 -20 546 -274 -536 89 -381 398 -389 -154 -106 67 -122 488 -237 -490 165 -301
3053 -301 221 -139 116 530 69 -115 157 -294 -69 -211 -411 -433 -500 -279 246 -354 -679 -119 -413 211 -192
3074 -192 -402 -292 289 -329 375 -187 330 -54 -107 -308 -788 -465 171 -89 -245 286 -111 71 29 539 -24
3095 -24 348 513 386 42 95 869 -42 566 261 376 627 417 515 -33 107 68 44 744 -141 44 200 742
3117 742 73 324 277 578 -61 -1128 -426 -137 336 -305 624 152 -76 -392 -243 -310 -974 -74 514 -663
3137 -663 22 -30 -104 -926 -626 -59 -226 -109 142 -679 -87 674 507 -171 -315 -323 504 299 610 -156 -139 -14
3159 -14 295 332 -47 -305 168 397 -294 539 -170 -217 -32 425 38 96 5 360 771 354 -122 85 309 -77
3181 -77 -930 526 -329 69 431 -281 121 20 399 -360 541 106 313 -239 834 186 -301 -508 -224 243
3201 243 -273 287 -402 -162 199 97 -221 151 77 398 -179 23 97 1075 -11 -552 3 -604 224 292 200
3222 200 730 -149 275 297 563 278 -61 -207 278 -101 -10 -500 -418 270 -520 477 357 -193 -542 -182 -44
3243 -44 266 -192 237 563 32 -267 -496 -422 -6 -917 -256 -391 -295 -184 -17 351 -502 204 75 -97 423
3264 423 146 -334 335 949 -114 211 741 619 351 -4 -346 83 314 342 497 -244 272 -54 -1063 -155
3284 -155 172 360 511 -133 -607 397 304 -300 -400 450 706 -676 -422 119 -82 37 -416 -124 350 322
3304 322 242 225 -145 -519 -263 -24 -129 -154 -341 -323 272 153 784 402 227 -231 296 -58 -11 -236 -265 -98
3326 -98 316 24 832 22 396 -254 277 45 -266 -36 -129 -41 20 -169 -342 124 -158 349 569 760 496
3347 496 -326 -62 -102 -128 176 -240 -86 -478 73 -38 -62 -302 -704 12 -982 -215 -112 -134 -133 -24 335 -226
3369 -226 702 310 527 592 -270 558 113 374 -79 968 262 517 481 -452 249 -166 383 231 110 -371
3389 -371 150 90 338 13 573 -137 339 163 -235 -156 188 -286 683 235 -937 -292 432 -304 401 243
3409 243 -171 57 -204 -136 21 -842 787 285 89 110 36 -191 -3 -627 -633 -224 -198 356 -467 44 -671 -228
3431 -228 588 179 90 333 -354 -565 -56 -45 220 -204 89 73 129 -451 -138 487 631 469 -69 131 645
3452 645 248 -46 -52 768 418 18 2 -455 -9 45 -52 311 -593 -803 -1148 141 -432 -345 -218 -191 283 63
3474 63 309 -283 378 185 -113 181 403 576 505 438 980 422 498 508 108 474 -629 98 -100 80 -822
3495 -822 67 -404 41 643 -235 -230 158 291 -369 177 -188 458 353 323 -526 -88 58 40 -708 1070 -449
3516 -449 270 236 -312 29 -402 208 533 528 55 -67 603 80 28 331 -3 410 396 -416 -106 -273 -217 427
3538 427 98 -214 -71 72 -65 361 296 547 -251 999 159 623 687 24 -353 23 -102 -426 -502 -164 -77
3559 -77 493 71 139 -119 -100 414 106 -405 14 120 239 169 344 304 246 -388 -147 -478 21 -85 21 -265
3581 -265 370 971 299 -546 406 -402 -192 455 -57 247 -448 287 321 -46 -375 6 276 172 -72 -230
3601 -230 -119 -458 96 77 267 -208 -399 -166 62 -20 -125 164 94 -686 -497 54 234 244 296 -26 -394 -440
3623 -440 20 -145 -1312 -297 71 338 -482 283 122 65 56 284 389 -244 95 -654 -411 828 -300 74
3643 74 -266 -148 -46 180 63 -111 -346 -121 212 621 70 -290 -298 -451 524 -16 135 332 -123 -264 290
3664 290 509 659 104 -685 213 437 339 86 -125 246 -200 178 -398 -601 201 130 -477 231 460 100 -93
3685 -93 -304 -407 -591 24 2 -47 -295 344 34 -296 -319 -87 109 946 566 -534 125 -178 359 295 36
3706 36 491 -265 485 -199 -196 211 176 -274 -123 -605 635 300 -109 330 -6 843 81 -44 -173 -467 -250
3727 -250 384 169 -6 -21 240 -451 -403 580 287 -116 585 -257 -297 430 -29 163 947 -246 -189 193 -175
3748 -175 -234 -115 28 256 474 422 525 190 -63 43 57 457 -245 -248 106 1192 -197 177 502 4 791
3769 791 -161 -614 -53 -190 -240 -71 -383 631 -167 37 32 265 -362 208 373 -275 465 229 174 374 96
3790 96 -47 -199 326 406 276 107 -238 358 213 142 -154 28 693 -88 49 116 -332 245 -91 686 -246
3811 -246 85 512 688 551 -36 -370 228 -275 -148 -160 48 177 72 45 81 -169 161 -399 75 -9 -336
3832 -336 211 -431 -167 43 -115 133 -38 177 -16 25 -62 642 -407 409 -881 -798 388 436 -11 -688
3852 -688 13 274 70 299 -107 -515 97 560 132 -208 74 -430 -606 44 305 88 332 391 -14 -80 160
3873 160 -262 153 -234 -359 -267 179 -299 -417 -351 -264 187 -71 363 -29 -394 300 112 507 59 454 31
3894 31 -22 106 84 -306 -17 815 -331 133 -122 -323 366 -462 -244 587 -448 354 106 -22 -92 -849 -75
3915 -75 675 477 84 -658 -277 187 -325 -31 635 -72 168 -617 158 -644 178 544 -345 -357 243 646 -15
3936 -15 249 371 27 308 -524 364 155 -123 4 306 312 478 604 315 -334 356 219 -512 625 -77 215
3957 215 -215 -353 -21 -158 -232 176 -80 -44 230 162 -424 -280 169 135 616 -282 -47 -161 156 399 -226
3978 -226 531 -654 -316 41 114 143 -392 -67 865 661 169 -123 -9 561 72 115 -14 205 -416 275 172
3999 172 205 -342 -412 158 151 1046 340 -89 -114 134 15 524 -290 189 72 309 -178 396 474 -49 75 -598
4021 -598 -16 1 102 311 -202 78 238 -55 -640 -27 409 -453 -136 140 103 -578 -625 -4 -59 -7 644 -1
4043 -1 322 406 50 700 -134 805 -252 305 333 -278 134 -252 -204 -184 258 -86 -4 -236 -470 -100 398 287
4065 287 704 378 151 -210 -616 -426 -149 -354 287 295 -751 473 501 566 156 77 -125 264 -13 328 -147
4086 -147 -21 120 7 101 -79 -174 -234 728 279 353 -209 -100 -289 107 33 -347 -416 154 -710 -613 -114 -316
4108 -316 -4 234 -26 411 63 -234 439 -154 13 -108 -86 436 -64 -592 205 231 5 -31 668 532 -302
4129 -302 204 -234 156 -884 -243 -48 411 -66 648 603 -599 -759 -55 498 532 -186 -399 -147 -260 -320
4149 -320 -267 -68 -63 -362 0 555 -197 2 414 -207 -877 19 -131 16 -459 -62 32 189 27 -370 205
4170 205 242 -143 -82 -293 270 311 346 227 576 -312 287 -564 73 50 252 319 -89 -252 358 20 -76 71
4192 71 -846 284 -546 190 -396 -140 -41 -73 182 -721 -114 -668 -418 -264 271 -262 -526 -211 87 223 -861
4213 -861 -153 -267 -141 -472 359 -407 326 -47 -93 54 169 332 89 -451 164 -244 555 -134 492 -135
4233 -135 -234 -70 -317 127 -406 -165 -261 -210 -391 -287 139 360 439 317 -438 481 298 64 335 611 207
4254 207 106 98 -21 -554 -424 109 -216 -282 -91 -61 0 -199 51 -166 865 -40 -514 -135 -279 -715 -383
4275 -383 -150 -139 -486 -424 -174 -398 360 398 -261 265 -330 31 100 443 -520 -107 276 -78 -119 -203 -337 451
4297 451 -221 -133 275 27 108 -584 -1193 -219 -234 96 780 124 -839 93 -62 -376 -207 163 8 -304 -563
4318 -563 56 231 236 462 -36 -389 20 149 -826 -377 52 477 -245 -252 -689 -179 77 261 63 7 -394 695
4340 695 123 -352 133 68 375 -356 625 -535 -137 -542 579 -360 -207 -299 129 116 313 95 -13 -453
4360 -453 -367 -152 -514 -207 -300 41 -448 101 268 402 -431 -212 255 447 -68 241 -249 -82 -350 432 237
4381 237 46 137 -126 -100 -285 -242 147 -181 764 -453 190 265 382 332 -641 -559 -33 -297 -457 796 18
4402 18 -260 -383 -88 -160 160 -440 269 -814 366 -847 -61 285 -94 465 449 19 -76 297 -221 -379
4422 -379 -220 -612 206 -373 -387 141 -416 36 125 160 155 51 606 -27 -788 106 -56 -319 -97 310 -316 -436
4444 -436 -17 165 -236 -204 21 -682 -372 268 -644 319 2 -13 386 321 75 -233 266 619 6 470 66
4465 66 -327 265 140 -136 -48 -18 155 -582 -279 224 -617 -159 -315 703 95 -469 117 -130 -523 -358 -29
4486 -29 -545 -20 273 -199 72 -382 354 37 84 617 -79 777 -500 -140 141 -403 42 52 260 -173 -243
4507 -243 4 142 350 -51 -305 -188 -182 475 88 -217 134 248 -149 34 94 673 -273 -154 142 454 210
4528 210 -284 -143 464 439 -323 105 -35 522 156 115 71 -171 159 -45 521 -166 -98 -58 -190 -20 -129 -455
4550 -455 -86 -69 -72 -50 872 -208 -95 -61 -1 260 -572 100 20 -767 76 -15 726 -167 237 -272 -29 -60 -205
4573 -205 -320 -223 -214 -55 571 254 -170 -166 -261 -400 264 -179 -478 -135 206 81 40 19 -66 23 423 -45 -697
4596 -697 225 -774 -1164 834 -293 -260 790 -203 -48 -380 -45 -83 -190 232 -500 200 -329 336 -392 175
4616 175 -38 178 119 -37 -91 -81 -48 28 36 57 -419 234 382 -329 -277 159 -293 -362 369 509 -232 -473 351
4639 351 -251 319 -272 158 37 -634 374 -382 137 271 523 456 237 268 -277 -196 -133 413 655 -137 212
4660 212 124 -12 248 -252 -214 -134 -97 10 -354 -4 460 -311 -764 -333 -151 -169 216 52 -86 761 -162 321
4682 321 393 226 -524 81 221 716 347 -719 -220 -10 578 -185 49 -267 -105 648 603 -157 -443 -212
4702 -212 102 137 346 242 -144 -159 -32 808 11 -31 44 -459 -302 29 -261 -287 -77 188 193 125 -692 815
4724 815 -806 -192 -270 -8 474 -120 0 388 -433 220 -330 -149 144 -229 179 658 -257 153 136 -460
4744 -460 -669 309 -170 -355 0 444 89 -453 22 296 -48 261 -212 -318 135 -485 327 -425 -345 -103
4764 -103 144 -165 -75 646 225 232 206 -140 66 -56 349 90 231 -358 -594 363 -375 326 -343 347 -507
4785 -507 233 -75 410 63 -34 -167 -588 -114 154 -260 -390 -158 -28 65 -198 173 -590 370 -76 239 -299
4806 -299 -277 -60 288 402 24 302 380 310 98 255 -144 464 -501 -329 -243 -20 134 471 -121 434 136
4827 136 -1075 295 -834 -348 -328 -42 -398 -262 -15 21 343 133 -373 -37 610 894 -263 -87 -36 161
4847 161 -2 -425 -41 -85 -215 -253 -216 -199 -515 -290 26 -384 -169 -710 279 404 -461 -167 261 499 191
4868 191 187 426 -684 -317 -246 -78 -313 -110 -203 -433 266 585 -365 388 -411 283 129 -484 -370 65 437
4889 437 -141 302 717 360 -159 -125 202 126 -121 -285 -463 -286 -31 6 42 762 40 -629 -159 423 842
4910 842 238 47 46 548 -829 -411 -455 -566 -97 -365 700 79 -33 68 224 33 -508 159 -314 -36
4930 -36 413 -78 -162 -49 130 -13 -55 116 -142 538 -11 126 -162 -183 494 554 -488 -519 -265 -680 351
4951 351 -330 644 426 467 -187 -100 109 260 337 330 244 741 -171 -596 -397 -230 348 199 -307 1045 210 738
4973 738 100 58 50 -293 218 -340 -174 362 -172 135 -5 61 -238 -317 501 152 78 -718 516 -875 -105
4994 -105 117 -265 -80 -179 -23 7 116 -92 294 -160 120 390 79 -245 -106 385 451 -4 -707 108 -186
5015 -186 -51 -680 43 -293 -171 -38 -450 474 148 161 675 -43 221 -87 -21 441 289 146 398 -379 -92
5036 -92 -164 150 -262 -543 200 373 123 -591 8 -148 206 513 56 -339 9 97 272 -341 672 -684
5056 -684 255 712 -97 418 376 -701 -264 61 -226 -330 340 -47 -361 -235 -13 -207 150 -52 -73 498
5076 498 352 88 -647 44 174 15 209 331 -315 175 367 384 82 1031 275 31 -189 645 78 -95
5096 -95 423 209 -113 567 287 567 -178 135 -503 -140 -127 -123 -206 -223 -398 170 173 -325 -350 -416 152 -431 115
5119 115 -247 309 240 -168 -363 372 -1000 475 709 248 262 388 59 -12 780 112 -14 191 -132 377
5139 377 -111 -39 -148 -31 27 175 -364 -278 -254 210 651 -134 172 735 -50 81 -145 116 -888 314 224
5160 224 -42 -233 -351 254 56 -477 318 -324 -878 203 -121 575 -667 2 -652 559 301 174 -693
5179 -693 -200 -462 430 -69 -152 4 -338 -790 566 71 358 100 -208 903 613 -281 -257 23 -515 -133
5199 -133 -144 33 492 312 1095 -223 -123 -44 -162 -386 278 62 270 -236 13 -26 -92 -261 72 59 -384
5220 -384 573 157 116 67 132 -185 161 -420 -191 -288 155 -411 -90 74 -37 -268 299 -757 -328 -307 -247 475
5242 475 483 -148 -270 -588 -249 171 65 -217 94 -140 4 -138 -539 -123 487 268 -3 684 -302 132 317
5263 317 -325 -129 573 -324 786 255 -733 -436 -198 -312 128 106 -252 218 -347 -804 -434 -344 221 -484
5283 -484 -223 -359 152 -73 120 732 -148 225 422 65 -255 248 150 116 46 248 -257 -193 -582 79 27 -221
5305 -221 275 130 -106 -232 2 289 641 438 -810 49 502 362 524 -385 -194 -501 473 -427 -17 -139
5325 -139 31 -164 -99 -131 -150 -273 -449 -276 53 -491 157 -345 26 -91 -519 -544 -190 40 -445 -296 39
5346 39 411 -325 729 -539 -42 -515 541 509 -64 -407 313 -228 -129 -248 396 -63 158 -123 -731 -10
5366 -10 -522 560 -370 117 98 -122 645 12 -297 338 86 167 234 49 740 -62 430 836 209 157 -188
5387 -188 -197 -79 -79 -45 93 5 285 703 -355 496 176 -76 -385 -5 161 -163 -91 -248 77 53 -165 135
5409 135 70 -273 292 -474 597 -140 69 135 113 -61 375 125 -84 447 -124 -94 364 166 667 -63 -357
5430 -357 -329 201 518 -166 -1278 207 442 -124 118 526 -536 310 278 67 203 12 477 -110 501 249
5450 249 323 -332 16 -185 64 71 167 64 -89 -61 -645 -22 76 98 -803 365 -266 342 -377 -235 214 -457
5472 -457 -119 -248 273 367 457 312 591 -426 504 -395 275 135 -94 28 757 11 -340 360 -148 875
5492 875 203 -23 81 168 116 490 -279 309 -44 -302 -245 -5 264 331 -31 -290 92 -72 -147 285 330 204
5514 204 718 40 -139 320 -176 243 -297 606 -72 -651 -32 -391 -613 -283 165 -54 -451 13 543 491
5534 491 134 126 495 -787 -190 -3 173 115 226 -263 374 183 316 380 -281 -1 -179 172 -67 -884 -340
5555 -340 508 21 327 271 742 263 62 663 -34 -232 217 331 -191 -168 23 162 59 -332 177 -708 -68
5576 -68 -235 411 378 -401 -239 271 -511 -127 343 591 283 -228 -624 -710 217 -736 -268 259 157 -465 -1
5597 -1 -43 334 -40 46 301 -3 -200 -94 432 324 -191 250 -280 -205 -59 -214 38 527 940 144 5 -88
5619 -88 -273 83 -199 753 -194 295 -269 -1034 444 952 -43 -93 62 182 624 -120 65 -98 799 -13
5639 -13 -161 579 247 97 -642 -284 -227 -13 -274 396 -18 -788 131 196 -559 -93 -143 13 -1 -183 212 740
5661 740 135 159 -278 216 512 -133 358 346 -107 -488 284 -516 506 319 292 -624 -176 -346 -249 420 739
5682 739 -136 -345 161 -19 -232 -568 774 -110 -39 -505 -76 -550 -235 295 -394 -438 255 -67 -190 -299
5702 -299 658 111 86 -362 -1141 48 -1203 -112 -835 7 537 706 -47 65 -164 31 352 151 507
5721 507 76 47 331 29 -48 419 42 340 -360 183 72 294 -324 1129 -453 464 65 150 -35 -153
5741 -153 -146 -389 993 140 -258 97 -325 554 470 -139 -271 308 116 -177 -32 -152 53 -864 -65 -430 18
5762 18 -268 -195 -225 116 403 -492 521 90 116 104 256 95 551 467 -229 554 -542 -111 -25 -137 269 -473
5784 -473 82 91 -461 -396 131 -342 -352 -37 -315 -24 78 308 -110 -925 429 -550 -195 902 -241 -161 188
5805 188 -481 -55 124 96 -566 246 154 363 -507 -556 565 185 -127 108 76 110 -188 -287 108 -324 -35 385
5827 385 -6 198 262 543 -68 146 -350 168 599 -540 -9 118 382 25 -95 553 55 -350 -247 36
5847 36 -14 298 838 -190 266 -156 23 84 -304 229 -403 672 -131 339 -314 -351 -321 -517 -464 -752 420
5868 420 47 -492 32 -303 -106 446 -78 -467 305 -41 -711 -148 -364 352 348 304 -569 123 -298 120 -112
5889 -112 507 -22 168 38 46 664 530 593 236 -36 -196 199 -368 -168 -107 -571 223 824 -316 -38 -305
5910 -305 -338 170 268 197 65 -339 -36 251 -275 -58 376 -802 -42 -240 -831 280 -50 -324 193 -370
5930 -370 170 31 -60 -473 -476 373 133 -498 611 -343 -429 723 -624 -30 -143 -445 -511 -32 -178 -40 646
5951 646 -254 -706 433 320 245 -307 -369 180 -121 435 53 529 -371 537 -571 259 -416 547 1174 287
5971 287 -17 177 -228 -20 91 -113 -162 213 -57 231 -252 413 -341 -15 -11 9 894 -178 -94 -68 -371 291
5993 291 455 -160 186 -285 -491 97 -245 35 356 -56 708 79 400 -67 -91 -477 -689 392 -23 402
6013 402 -357 271 514 -94 -221 -60 230 159 188 -260 -644 151 -263 48 -57 127 -134 -437 -408 -335 -315 425
6035 425 -821 192 65 -266 292 805 -51 122 392 612 22 -145 25 -194 -648 226 771 428 128
6054 128 -339 -415 223 67 -309 -601 -296 -297 117 28 -201 -447 327 422 -155 -424 72 -89 159 -520 947
6075 947 382 -86 -186 -101 -765 -426 751 -325 -204 -272 419 102 539 -479 -249 -81 41 12 418 -415
6095 -415 -435 -133 17 -151 -90 -287 -77 -230 -204 -325 -40 163 185 285 -779 -275 423 -310 242 104 5
6116 5 -262 -147 -505 128 -483 267 54 -138 494 55 -241 -46 -125 -257 59 879 183 562 46 -178 185
6137 185 -39 -158 -521 240 273 -420 -275 448 635 -174 354 -773 219 -179 503 -286 -586 203 -77 431
6157 431 116 -244 624 86 -320 426 627 182 -88 231 158 -52 -354 -86 -82 214 57 -330 196 21 -255
6178 -255 302 247 945 -707 512 215 342 -117 -404 358 186 112 307 220 -335 276 -396 563 -860 -134
6198 -134 412 -315 -243 282 -366 -1 38 64 -763 27 -234 -20 542 115 -485 1045 -21 -187 -43 -801
6218 -801 -164 258 513 -160 -257 -7 348 -80 35 441 -673 -438 -167 328 -220 -299 -478 453 464 -406 -411
6239 -411 48 32 -86 60 231 195 -191 -857 1136 204 347 -52 -257 17 -305 -7 -281 279 -250 -474
6259 -474 -214 -583 383 104 149 -39 -432 -337 180 160 358 30 104 -257 556 599 223 -14 -39 395 299 581
6281 581 -19 254 -299 120 167 -256 -136 -346 -441 -583 -86 -243 -455 -280 347 -316 152 -369 -174 -555 74
6302 74 -215 -134 303 124 132 -35 184 366 281 63 -124 -192 344 -214 -56 -12 545 -343 244 -551 -110 -174 50
6325 50 23 -156 -71 -476 240 906 401 -292 135 -51 422 394 269 -301 413 -92 73 323 -39 -241 291
6346 291 -496 -659 -405 370 -239 -167 -539 -50 37 -252 -6 98 -92 0 344 -160 7 -101 -311 -517 -114
6367 -114 -128 -467 -207 83 333 189 -352 579 513 -322 -498 41 303 -244 526 324 -41 -592 287 -151 761
6388 761 304 110 322 177 579 -601 266 50 -715 2 -524 65 -524 131 -594 -107 387 -93 -230 -90
6408 -90 521 -178 -79 -260 215 -411 -334 874 120 112 -127 -64 -472 -261 417 60 -32 434 229 701 228 -191
6430 -191 -257 -445 3 -360 270 -193 -385 227 278 -193 -233 177 220 -357 365 481 205 6 56 1076 81
6451 81 -133 -134 133 36 -8 164 256 -424 416 220 53 173 -219 -766 256 290 201 102 -4 -230 109 464 27
6474 27 -136 26 -59 -547 349 434 437 69 -425 93 -801 -519 -160 -284 104 122 487 -232 37 36 -492 -40 225
6497 225 -703 -470 365 196 506 -184 686 -285 146 188 -410 -93 -126 505 595 299 -639 515 103 475 -357
6518 -357 178 -347 474 -652 54 379 332 -634 -28 -434 367 477 207 -112 -238 -105 -648 -222 29 -489
6538 -489 -250 -70 -691 162 -620 77 -102 675 132 -135 775 317 571 -318 -24 66 240 -257 -221 2 -204
6559 -204 -161 35 -287 618 -92 -354 -219 -152 16 356 -2 -83 -611 -53 278 392 -73 168 157 -102 -395
6580 -395 438 665 193 38 306 83 -18 139 -569 111 169 -645 -1077 -140 -178 167 189 -288 28 143 -127
6601 -127 -159 -658 -158 -18 -124 -359 278 -185 -65 695 -87 109 -139 1078 -72 -246 -347 1106 -9
6620 -9 387 -350 108 692 228 14 -983 -169 -173 350 93 -133 -365 354 383 493 274 369 92 268 30 -278
6642 -278 271 -148 393 -543 239 -157 447 548 -316 3 292 9 -297 -383 180 -487 102 358 182 563
6662 563 148 -62 294 -326 8 -150 -53 908 -328 -163 220 -493 357 474 45 48 20 104 -221 -268 -269 271
6684 271 422 329 -228 2 -68 136 -625 346 -634 -44 851 87 473 239 478 248 139 -112 -195 -343 -234
6705 -234 321 203 619 425 171 -148 628 -488 -447 575 346 126 177 -352 -322 -207 -538 -128 -466 1
6725 1 176 -4 917 48 -227 645 35 39 118 -84 -674 -546 217 -46 186 454 -6 -306 -238 -402 -571 24
6747 24 -500 269 447 -111 -324 -301 121 248 -289 -334 -51 -352 -88 77 69 -247 265 -759 -373 601 28
6768 28 -715 195 -339 57 111 -173 739 -64 -688 661 -29 -482 -230 237 75 47 -41 257 -24 -29 164 943
6790 943 158 360 461 -23 -971 315 406 25 263 -362 341 -187 620 -205 8 -391 -592 -135 70 342
6810 342 361 659 656 -303 192 -357 -75 -281 86 166 344 254 75 582 45 -674 283 241 284 -623 631 874
6832 874 -125 242 150 537 -188 -311 524 -631 -228 329 122 695 232 -27 212 -320 587 -387 157 -421
6852 -421 103 632 85 -355 -145 271 286 257 229 124 39 -384 60 271 -162 -183 154 -555 240 863 -208
6873 -208 586 -204 11 -27 203 199 247 41 -274 -250 -425 75 106 193 -367 173 387 -181 -130 86 671 -56 -645
6896 -645 181 -551 265 -193 106 112 -327 -97 -46 -274 -752 330 505 -227 -655 -808 -753 -332 259 86 -209
6917 -209 475 482 585 188 356 760 -543 163 -561 -228 -128 -553 -97 -86 32 261 262 402 287 -321 440
6938 440 583 -598 269 -118 -200 -6 204 213 -13 214 -656 -800 152 124 -13 895 315 125 -582 25 -404
6959 -404 -231 284 446 -403 -240 -434 -229 -187 -296 261 -603 229 456 191 442 535 -67 129 389 -232 -309
6980 -309 -314 -17 -318 -18 -424 189 343 754 -113 -89 -183 -276 -354 -189 81 -251 482 -177 -8 -217 -334 -351
7002 -351 784 263 -61 874 825 -104 -83 231 380 361 36 91 48 -118 32 -50 -138 -576 884 400 360 -49
7024 -49 -111 576 -70 -374 212 -36 -494 230 252 225 687 -223 24 255 -574 217 -286 -184 -24 697 270
7045 270 158 -75 385 218 -945 184 -414 42 -6 214 -195 476 295 151 302 -261 -664 -417 -649 -152
7065 -152 -52 -114 725 -279 -158 -329 387 -657 -75 321 425 -64 -116 223 -187 151 88 330 541 -264
7085 -264 -231 395 -761 -236 -65 -641 -451 -6 103 477 38 -363 12 -96 -244 -525 530 7 209 -280
7105 -280 -172 -862 -154 431 -151 -46 68 375 162 -219 -64 -83 828 -147 218 -328 -96 379 321 1 -117
7126 -117 143 156 567 287 69 -89 -54 -152 -160 256 -130 -251 111 439 70 -180 353 -174 290 -137 -111 42
7148 42 34 131 -184 104 -114 329 -235 255 -540 431 -862 -220 344 401 -224 -96 -292 120 7 -132 -398
7169 -398 -256 145 559 -498 818 -295 -10 -536 390 -139 352 628 -209 275 182 102 14 -442 -80 -310
7189 -310 -252 479 -709 -615 -387 -544 -153 -379 76 154 -221 -407 -851 -52 563 -96 411 347 -213 -242 -402
7210 -402 -228 576 69 -389 67 -124 428 651 -340 206 -323 -234 -177 206 -113 -47 240 690 -280 130 -372
7231 -372 -232 -2 150 308 -505 93 -613 2 -185 39 -120 30 41 -286 461 194 -292 345 -344 178
7251 178 250 -679 686 470 -242 500 224 -111 -67 294 -864 -263 -386 -255 -340 131 -597 431 -622 -828
7271 -828 539 -86 401 -745 157 868 -172 231 14 537 -517 351 -135 115 49 6 -131 120 -120
7290 -120 22 -530 261 77 79 290 -102 -118 -132 221 -345 492 -77 299 -136 -115 -334 -23 -800 129 -50 -88
7312 -88 349 249 -55 293 -448 89 -54 -579 -138 -65 199 -100 425 -512 214 -378 8 71 -515 670 110
7333 110 395 317 483 350 -117 -370 104 312 812 -174 -149 93 -183 -112 -211 22 -133 185 -413 -56 18 -88
7355 -88 78 -423 -336 -128 4 46 515 -779 442 435 109 414 -778 -272 133 1 -69 -54 -37 138 590 236
7377 236 133 387 313 80 -16 410 196 212 -55 -153 -173 68 150 -52 -341 359 -31 -18 -112 -185 407 -359 -95
7400 -95 99 437 -63 424 342 -30 169 166 -273 -460 295 282 -604 -354 -410 -119 -34 333 446 53 229 -527
7422 -527 -460 136 216 283 -158 245 -257 -592 325 -260 110 -171 -275 461 -433 -88 178 -69 873 524 428
7443 428 393 -188 572 60 -358 658 105 38 125 -29 -321 -36 194 -208 367 -225 700 283 479 21 44
7464 44 -39 308 641 -344 371 287 -375 23 132 -517 121 -16 -458 -299 144 423 152 -450 -129 227 -366
7485 -366 -47 273 422 -580 -65 188 444 -611 94 506 -60 -632 262 482 -66 -62 -77 34 230 235 -152
7506 -152 175 4 -457 -416 226 83 39 196 588 50 370 338 -322 -171 -185 43 -364 801 -807 171 -60
7527 -60 -447 94 -588 101 463 486 -882 213 -98 -143 -200 -175 -180 -97 389 -102 73 6 79 65 -87 190 -623
7550 -623 -151 200 368 -36 -518 146 34 -522 204 301 -126 186 555 181 249 -286 175 248 33 -164 -247
7571 -247 61 -188 -95 848 235 433 21 143 355 -359 187 97 249 -250 -227 378 166 382 -130 465 -24
7592 -24 -206 121 704 -399 241 568 -109 27 2 -317 -336 13 -705 -430 231 -266 234 -56 906 131 -492
7613 -492 -55 -404 -177 393 -419 -106 77 -43 -85 -459 -27 -690 -386 -240 -52 -240 -417 263 54 -195
7633 -195 70 -152 250 -133 -257 -122 452 -297 342 276 40 -400 431 287 -154 171 -521 -367 -235 46
7653 46 -226 -164 354 -713 432 1087 419 -135 210 812 65 -5 -31 -47 -308 218 -268 453 -280 -100 795
7674 795 465 709 -126 -137 220 93 -81 26 617 124 266 -211 104 -303 367 -382 -193 -258 -346 -263 -249 543
7696 543 -35 -242 491 180 576 -402 312 192 -17 -91 338 447 68 -22 -173 -318 518 -25 -186 -106 198
7717 198 843 30 -24 -447 513 53 172 205 463 216 573 278 -461 295 237 -61 66 133 75 24 -154 254
7739 254 580 -3 86 -139 889 261 35 -165 326 343 393 446 482 79 -40 99 239 364 -166 17 -571
7760 -571 -373 -76 -493 -421 798 298 523 172 -498 354 115 534 226 47 191 -296 -133 159 -85 -92 -150
7781 -150 -141 -738 -362 398 122 583 78 -9 9 -214 -216 26 -335 56 -94 -114 -241 -577 -257 498 -45 -345
7803 -345 418 495 741 167 -230 131 -254 -643 -533 -563 -300 527 -313 190 -231 5 -694 40 -100 -289 -169
7824 -169 -625 128 -87 -334 -143 -134 229 -325 589 322 -504 -60 372 498 -673 -23 287 -25 -54 -433 339
7845 339 155 360 28 -10 17 211 -164 67 173 239 260 -39 402 104 -89 156 -419 248 -62 -66 -249 119
7867 119 -446 330 -830 334 -5 -476 -185 -347 -31 326 -289 -81 204 -430 -215 -534 218 -533 71
7886 71 -421 1058 147 48 -235 -99 -108 -60 385 -68 -392 384 -245 -204 -285 -219 122 -106 320 -31 289 150
7908 150 195 -146 619 291 246 90 -550 262 301 372 -115 -32 461 -521 708 418 -414 -63 -531 382 -376
7929 -376 98 -91 -835 -55 -80 443 -333 -87 75 643 -591 -469 200 161 -160 -583 -141 -235 301 -226 -204
7950 -204 333 601 -479 -358 -35 203 -64 -184 -254 -412 332 -628 274 -40 330 -212 -279 -538 -129 443
7970 443 58 167 -442 705 -117 -272 -281 -239 170 -504 -87 -679 -190 -408 208 -236 -21 225 -160 439 338
7991 338 176 -141 268 -175 -98 -172 370 -588 165 -286 741 -381 -102 254 222 228 -160 -269 149 -114 -166
8012 -166 -15 262 -165 -38 -37 -123 94 15 453 -680 414 -73 535 -263 206 -568 39 -97 -136 -291 -105
8033 -105 -386 -607 -720 -530 -220 -513 257 212 -391 236 7 -5 -235 -191 432 -255 64 101 -47 249 -207
8054 -207 18 -213 -411 -294 -102 594 578 -240 86 287 92 -13 -335 658 607 601 471 286 153 69 7 167
8076 167 -46 -53 -42 -486 464 186 -204 -264 -418 525 -810 -140 166 36 -211 644 143 98 890 -139 632
8097 632 -476 26 -4 -133 431 333 -1236 -385 659 13 666 413 247 54 -1022 465 446 -739 -1051
8116 -1051 414 -191 40 -875 -89 187 339 455 437 366 35 -291 -165 -481 764 838 249 -191 -173 -344
8136 -344 -540 -121 413 -107 -111 322 614 256 -102 -193 222 190 287 173 97 690 143 481 525 -421 153 1
8158 1 308 41 101 -426 -57 494 778 81 339 298 117 344 683 564 363 -553 -273 3 381 405 271 278
8180 278 -44 -408 -431 536 210 -186 -263 -104 -11 60 -55
8191e5
##END NTUPLES=NMR FID
##END=
