##TITLE=1H_Pr 5-5-HCl
 D2O, 8 sc, 
 29.1.2020
##JCAMPDX= 6.0         $$ Bruker NMR JCAMP-DX V2.0
##DATA TYPE= NMR FID
##DATA CLASS= NTUPLES
##ORIGIN= UXNMR, Bruker Analytische Messtechnik GmbH
##OWNER= root
$$ XWIN-NMR		Version 3.5
$$ Wed Jan 29 16:39:14 2020 Russian Standard Time (UT+4h)  she@DPX200
##.OBSERVE FREQUENCY= 200.1315
##.OBSERVE NUCLEUS= ^1H
##.DELAY= (6, 6)
##.ACQUISITION MODE= SIMULTANEOUS
##.ACQUISITION SCHEME= undefined
##.AVERAGES= 8
##.DIGITISER RES= 18
##SPECTROMETER/DATA SYSTEM= spect
##.PULSE SEQUENCE= zg30
##.SOLVENT NAME= D2O
##.SHIFT REFERENCE= (INTERNAL, D2O, 0, 15.7039)
##AUDIT TRAIL= $$ (NUMBER, WHEN, WHO, WHERE, WHAT)
$$ ##TITLE= Audit trail, XWIN-NMR		Version 3.5
$$ ##JCAMPDX= 5.01
$$ ##ORIGIN= Bruker BioSpin GmbH
$$ ##OWNER= she
$$ F:/spectra/data/she/nmr/H-F/1/audita.txt
$$ ##AUDIT TRAIL=  $$ (NUMBER, WHEN, WHO, WHERE, WHAT)
(   1,<2020-01-29 16:38:10.60 +0400>,<she>,<DPX200>,
      <created by zg, POWCHK disabled, PULCHK disabled
       configuration hash MD5:
       00 E9 B6 7A A2 85 ED C7 34 08 36 98 17 FE 4E 26
       data hash MD5: 16K
       7C 83 7F 0F A4 A6 9E C9 7C 02 BB 72 DC FA 97 60>)
$$ ##END=
$$ 
$$ hash MD5
$$ AC 8C FC 11 2E 74 49 C0 46 A2 D0 16 50 BF CB 1D
##$RELAX= 
##$RELAX= 
##$RELAX= 
##$RELAX= 
##$RELAX= 
##$RELAX= 
$$ Bruker specific parameters
$$ --------------------------
##$DU= <F:/spectra>
##$EXPNO= 1
##$NAME= <H-F>
##$PROCNO= 1
##$TYPE= <nmr>
##$USER= <she>
##$AMP= (0..31)
100 100 100 100 100 100 100 100 100 100 100 100 100 100 100 100 100 100 
100 100 100 100 100 100 100 100 100 100 100 100 100 100 
##$AQSEQ= 0
##$AQ_mod= 1
##$AUNM= <au_zg>
##$AUTOPOS= <>
##$BF1= 200.13
##$BF2= 200.13
##$BF3= 200.13
##$BF4= 200.13
##$BF5= 200.13
##$BF6= 200.13
##$BF7= 200.13
##$BF8= 200.13
##$BYTORDA= 1
##$CFDGTYP= 0
##$CFRGTYP= 5
##$CHEMSTR= <none>
##$CNST= (0..31)
1 1 145 1 1 1 1 1 1 1 1 1 1 1 1 1 1 1 1 1 1 1 1 1 1 1 1 1 1 1 1 1 
##$CPDPRG= <>
##$CPDPRG1= <>
##$CPDPRG2= <>
##$CPDPRG3= <>
##$CPDPRG4= <mlev>
##$CPDPRG5= <mlev>
##$CPDPRG6= <mlev>
##$CPDPRG7= <mlev>
##$CPDPRG8= <mlev>
##$CPDPRGB= <>
##$CPDPRGT= <>
##$D= (0..31)
0 1.2 0 0 0 0 0 0 0 0.06 0 0.03 0 0 0 0 0.0002 0 0 0 0 0 0 0 0 0 0 0 0 
0 0 0 
##$DATE= 1580301489
##$DBL= (0..7)
120 120 120 120 120 120 120 120 
##$DBP= (0..7)
150 150 150 150 150 150 150 150 
##$DBP07= 0
##$DBPNAM0= <>
##$DBPNAM1= <>
##$DBPNAM2= <>
##$DBPNAM3= <>
##$DBPNAM4= <>
##$DBPNAM5= <>
##$DBPNAM6= <>
##$DBPNAM7= <>
##$DBPOAL= (0..7)
0.5 0.5 0.5 0.5 0.5 0.5 0.5 0.5 
##$DBPOFFS= (0..7)
0 0 0 0 0 0 0 0 
##$DE= 6
##$DECBNUC= <off>
##$DECIM= 24
##$DECNUC= <off>
##$DECSTAT= 4
##$DIGMOD= 1
##$DIGTYP= 9
##$DL= (0..7)
0 120 120 120 120 120 120 120 
##$DP= (0..7)
150 150 150 150 150 150 150 150 
##$DP07= 0
##$DPNAME0= <>
##$DPNAME1= <>
##$DPNAME2= <>
##$DPNAME3= <>
##$DPNAME4= <>
##$DPNAME5= <>
##$DPNAME6= <>
##$DPNAME7= <>
##$DPOAL= (0..7)
0.5 0.5 0.5 0.5 0.5 0.5 0.5 0.5 
##$DPOFFS= (0..7)
0 0 0 0 0 0 0 0 
##$DQDMODE= 0
##$DR= 18
##$DS= 0
##$DSLIST= <SSSSSSSSSSSSSSS>
##$DSPFIRM= 0
$$ [...]
##$SUBNAM2= <"">
##$SUBNAM3= <"">
##$SUBNAM4= <"">
##$SUBNAM5= <"">
##$SUBNAM6= <"">
##$SUBNAM7= <"">
##$SUBNAM8= <"">
##$SUBNAM9= <"">
##$SW= 24.9337058887773
##$SWIBOX= (0..15)
0 0 2 0 0 0 0 0 0 0 0 0 0 0 0 0 
##$SW_h= 4990.01996007984
##$TD= 16384
##$TD0= 1
##$TE= 0
##$TE2= 300
##$TE3= 300
##$TEG= 300
##$TL= (0..7)
0 120 120 120 120 120 120 120 
##$TP= (0..7)
150 150 150 150 150 150 150 150 
##$TP07= 0
##$TPNAME0= <>
##$TPNAME1= <>
##$TPNAME2= <>
##$TPNAME3= <>
##$TPNAME4= <>
##$TPNAME5= <>
##$TPNAME6= <>
##$TPNAME7= <>
##$TPOAL= (0..7)
0.5 0.5 0.5 0.5 0.5 0.5 0.5 0.5 
##$TPOFFS= (0..7)
0 0 0 0 0 0 0 0 
##$TUNHIN= 0
##$TUNHOUT= 0
##$TUNXOUT= 0
##$USERA1= <user>
##$USERA2= <user>
##$USERA3= <user>
##$USERA4= <user>
##$USERA5= <user>
##$V9= 5
##$VALIST= <valist>
##$VCLIST= <CCCCCCCCCCCCCCC>
##$VD= 0
##$VDLIST= <DDDDDDDDDDDDDDD>
##$VPLIST= <PPPPPPPPPPPPPPP>
##$VTLIST= <TTTTTTTTTTTTTTT>
##$WBST= 1024
##$WBSW= 4
##$XGAIN= (0..3)
0 0 0 0 
##$XL= 0
##$YL= 0
##$YMAX_a= 344484
##$YMIN_a= -234177
##$ZGOPTNS= <>
##$ZL1= 120
##$ZL2= 120
##$ZL3= 120
##$ZL4= 120
##$ABSF1= 10
##$ABSF2= 0
##$ABSG= 5
##$ABSL= 3
##$ALPHA= 0
##$AQORDER= 0
##$ASSFAC= 0
##$ASSFACI= 0
##$ASSFACX= 0
##$ASSWID= 0
##$AUNMP= <proc_1d>
##$AZFE= 0.1
##$AZFW= 0.1
##$BCFW= 1
##$BC_mod= 2
##$BYTORDP= 1
##$COROFFS= 0
##$CY= 11.3945322036743
##$DATMOD= 1
##$DC= 2
##$DFILT= <>
##$DTYPP= 0
##$F1P= 16.9975609425685
##$F2P= -3.02152046262296
##$FCOR= 0.5
##$FTSIZE= 0
##$FT_mod= 4
##$GAMMA= 1
##$GB= 0.15
##$INTBC= 1
##$INTSCL= 1
##$ISEN= 128
##$LB= 0.24
##$LEV0= 0
##$LPBIN= 0
##$MAXI= 10000
##$MC2= 0
##$MEAN= 0
##$ME_mod= 0
##$MI= 1.114404
##$NCOEF= 0
##$NC_proc= 0
##$NLEV= 6
##$NOISF1= 3.799351
##$NOISF2= 2.8
##$NSP= 1
##$NTH_PI= 0
##$NZP= 0
##$OFFSET= 15.70392
##$PC= 1
##$PHC0= -9814.944
##$PHC1= 50.80081
##$PH_mod= 1
##$PKNL= yes
##$PPARMOD= 0
##$PSCAL= 0
##$PSIGN= 0
##$REVERSE= no
##$SF= 200.130013532006
##$SI= 16384
##$SIGF1= 3
##$SIGF2= 2
##$SINO= 400
##$SIOLD= 16384
##$SREGLST= <1H.CDCl3>
##$SSB= 0
##$STSI= 0
##$STSR= 0
##$SW_p= 3612.71676300578
##$SYMM= 0
##$S_DEV= 0
##$TDeff= 0
##$TDoff= 0
##$TI= <>
##$TILT= no
##$TM1= 0
##$TM2= 0
##$TOPLEV= 0
##$USERP1= <user>
##$USERP2= <user>
##$USERP3= <user>
##$USERP4= <user>
##$USERP5= <user>
##$WDW= 1
##$XDIM= 8192
##$YMAX_p= 0
##$YMIN_p= 0
$$ End of Bruker specific parameters
$$ ---------------------------------
##NTUPLES= NMR FID
##VAR_NAME=  TIME,          FID/REAL,        FID/IMAG
##SYMBOL=    X,             R,               I
##VAR_TYPE=  INDEPENDENT,   DEPENDENT,       DEPENDENT
##VAR_FORM=  AFFN,          ASDF,            ASDF
##VAR_DIM=   8192,          8192,            8192
##UNITS=     SECONDS,       ARBITRARY UNITS, ARBITRARY UNITS
##FACTOR=    0.0002004,     1,               1
##FIRST=     0,             0,               0
##LAST=      1.6414764,     0,               0
##MIN=       0,             -234177,         0
##MAX=       1.6414764,     344484,          0
$$ Real data points
##PAGE= N=1
##DATA TABLE= (X++(R..R)), XYDATA
0@%%%%%%%OqJ0j6J6k0K8l4M0m8N8o7P9r6J11j29J49j71J97k24K57k93L29l73M20
$$ 0 0 0 0 0 0 0 0 6 -2 8 -8 8 -12 16 -18 22 -26 32 -35 44 -52 59 -70 79 -92 105 -119 138 -155 174 -199 221
32B21m71N30n90O58p33Q14r06J004j115J236j366J513j674J854k058K286k549
$$ 221 -250 280 -310 348 -385 429 -477 527 -588 648 -718 795 -879 975 -1083 1203 -1346
49a346K853l206L624m128M752n545O598q067J0274j4027K2051p0199J20031J92852
$$ -1346 1507 -1699 1925 -2203 2549 -2996 3602 -4465 5809 -8218 13833 -56366 63665 256517
63B56517m2321r7609j20703j07530r7008J5568J09500J32842Q0233M6712j3314
$$ 256517 214196 116587 -4116 -111646 -208654 -193086 -83586 49256 129489 176201 162887
74A62887r9079j62786j11347J150J00065J37963J32823O6148m4245j49494j69845
$$ 162887 63808 -98978 -210325 -209175 -109110 28853 161676 227824 183579 34085 -135760
85a35760r8417K6970J31969J62735J03652K056q3537j16829j02581n4884O345
$$ -135760 -234177 -207207 -75238 87497 191149 193205 109668 -7161 -109742 -164626 -158281
96a58281O8040J14609J21368O1030m7444j35462j44058q3225P708J01315J61443
$$ -158281 -90241 24368 145736 206766 159322 23860 -120198 -203423 -195715 -94400 67043
107F7043J31473J4217j02432j37819j04680m8520K2316R9145J32329Q5669J163
$$ 67043 198516 212733 110301 -27518 -132198 -180718 -158402 -59257 73072 158741 159904
118A59904o0155r1549j05049p8768J239R2737J34861J09193L2936o4459j36578
$$ 159904 99749 8200 -96849 -175617 -174378 -81641 53220 162413 195349 130890 -5688
129e688j36343o1313M1832J17635J35444Q3072r429q5624j06557q5697m3995J8632
$$ -5688 -142031 -203344 -161512 -43877 91567 174639 165210 79586 -26971 -112668 -156663 -138031
141a38031Q6938J16191Q0869J2071n0536r9373j18469p3855K4699J09274J27876
$$ -138031 -51093 65098 145967 158038 107502 8129 -110340 -184195 -159496 -50222 77654
152G7654Q9111J5351p5591j39155j19087k6569O4024J00970R4360O0718J636o4481
$$ 77654 166765 182116 106525 -32630 -151717 -178286 -114262 -13292 81068 141786 143422 78941
164G8941r8065q5335m3728J4375P9658J18216R0598J0686p0477j15121j08377
$$ 78941 -19124 -104459 -148187 -133812 -54154 64062 154660 165346 94869 -20252 -128629
175a28629m8659L9891J10004J19045O9796q990q4056j16775q5530j4567M9432
$$ -128629 -177288 -137397 -27393 91652 161448 152458 68402 -48373 -133903 -148470 -99038
186i9038Q0638Q4740O1500O743n7032r3708q9817n0983J8566R5429J27010P9515
$$ -99038 -18400 66340 127840 134583 77551 -16157 -105974 -156957 -138391 -42962 84048 163563
198A63563j1092q3601j10656r2526k9953N4805J08903R6111M1468j7515o4242
$$ 163563 152471 68870 -41786 -134312 -164265 -109460 -557 95554 137022 119507 55265
209E5265r0583p7158k3690L7225P5838Q6186O7468J1316o2092j07286r6123l6860
$$ 55265 -35318 -112476 -136166 -98941 -23103 63083 130551 141867 79775 -27511 -123634 -160494
221a60494M1649J04889J14202N8461k6898q7174j00367o9770j0293N3688Q7195
$$ -160494 -118845 -13956 100246 158707 131809 44635 -55732 -125502 -135795 -82107 5088
232E088P5518L7280o343n1452q5661q2173l1762L4826Q3228R7687O8698k764q2022
$$ 5088 80606 117886 111543 60091 -25570 -107743 -139505 -104679 -21451 76236 144934 142170 60148
245F0148j14748q1363j1318N7375R9005R2995L7001l5607p7418p7441n3290j3201
$$ 60148 -54600 -135963 -147281 -89906 9099 102094 139095 103488 26070 -51371 -104661 -117862
257a17862L6486P4468P7796M7702r68n5772r5095q8381k7568N1207R9713R6793
$$ -117862 -81376 -6908 70888 118590 117622 61850 -33245 -121626 -149194 -97987 1726 98519
269I8519M8057k6913q9522j00439n7571O186N7467Q0925P1242K7977k4265o0201
$$ 98519 146576 119663 30141 -70298 -127869 -121683 -64216 16709 87951 115928 91663 31462
281C1462p0374n9095k4074L3233Q2551Q9284N0883j2961p4117j04402p7565l638
$$ 31462 -38912 -98007 -122081 -88848 -6297 82987 133870 120909 46792 -57610 -135175 -138813
293a38813O9719R7693P5296K3933l5860p7601p9452m2794N691M3333O6555O8254
$$ -138813 -69094 28599 103895 127828 91968 14367 -65085 -107879 -102188 -58855 7700 75954
305G5954L8452j4493o1635q1659o8146j9097M8287R6260Q9999L4208l5694q5132
$$ 75954 114406 99913 38278 -43381 -111527 -130624 -82337 13923 103922 138130 102436 17304
317A7304r1915n2521J4650O7639Q0550N6043J5121k8587o1626o8899m6036n540
$$ 17304 -74611 -127132 -112482 -44843 35707 91750 106871 78284 16658 -52241 -98277 -103817
329a03817L7829P2073P7689M2114k2718p6768r1472o0054J562O5718R6118P2529
$$ -103817 -65988 6085 83774 125888 103170 26402 -65070 -125124 -123562 -57844 38274 110803
341A10803J0946m7054p6323p0376l5019J4590N3878O5823N2184K2236j9260n9993
$$ 110803 121749 74695 -1628 -72004 -107023 -92433 -38555 27268 79452 101688 82428 22435
353B2435p6088n4751l656N0609Q4770P8190K7935m1778q6543q3320l8762K0687
$$ 22435 -53653 -108404 -112060 -61451 23319 101509 129444 87666 1123 -82197 -120959 -100272
365a00272O7425P9905N1818J536m1007o1218n8764l5083M939M5872O7573O1149
$$ -100272 -32847 47058 98876 100412 59405 -1813 -60577 -95660 -90721 -44849 22724 83873
377H3873K6844k5421p1308q4142m9541J1936O6907Q7009O3209O160n2723p9944
$$ 83873 110717 85296 13988 -70154 -119695 -107759 -40852 46157 109366 115526 62803 -17141
389a7141o4306k1583K3743N6525O3137M3990P457k9933n6486o3153m2622L228
$$ -17141 -81447 -103030 -79287 -22762 40375 84365 91822 61889 5403 -57750 -100372 -97144
401i7144N3161P8562O4615J7108m2127q1966p8265l1385K9648P1045P4046M2249
$$ -97144 -43983 34579 99194 116302 74175 -7791 -86056 -117441 -87793 -16748 57298 99547
413I9547n840m7503o4112n1010k0896J5427M6750O0909N0013J4833l1293o6095
$$ 99547 93707 46204 -17908 -68918 -89814 -74387 -27637 33272 83285 98118 66825 730
425G30p1559m0472J6065O6336Q2698N3724k429n4654p7636o0041j4098L3861O0562
$$ 730 -70829 -111301 -95236 -28900 53798 107522 105093 50439 -27197 -87238 -101336 -67475 -6913
438f913N7618L3189k810l6298n5077n3054k8933J1426N1039O9731N4500Q906m4881
$$ -6913 50705 83894 81084 44786 -10291 -63345 -92278 -80852 -29813 39918 94418 103324 58443
451E8443p6562o8848k4467L2782P2313P0757L5166j5093n2938o2302m4295j0199
$$ 58443 -18119 -86967 -111434 -78652 -6339 64418 99584 84491 31553 -30749 -75044 -85243
463h5243K5421M8507N3689L7542M876l4284o1196o1574k9132K1214O3488P4459
$$ -85243 -59822 -11315 42374 79916 84792 50508 -10688 -72262 -101394 -80180 -16692 57767
475E7767M5422p542n6863p4791n3337o997L9725O2377N4258K4152j3344m1966
$$ 57767 103189 95647 38784 -36007 -89344 -96341 -56616 5761 60019 84171 70827 28861
487B8861n2051m2556j6853J7594M8813O1505M4417J433m5784p1494o0280j6790
$$ 28861 -23190 -65746 -82599 -65005 -16192 45313 89730 91163 45379 -26115 -86395 -103185
499a03185L6988O9665O5704K6808k0069n5084o1840l8883p46L3389M9376M6746
$$ -103185 -66197 3468 69172 95980 75911 20827 -41013 -79896 -80642 -47253 2123 48869
511D8869K6775m459l7506n4997n0464k0184K2835O0383O8501L8281j3700n7961
$$ 48869 75644 71185 33679 -21318 -71782 -91966 -69131 -8748 59753 98034 84334 26373
523B6373p0261m7019p46M4163O3235M9228J5437j9972m4463n0303l5517n828K4906
$$ 26373 -43888 -90907 -91653 -47490 15745 64973 80410 60438 15975 -34328 -69845 -75673 -50767
536e0767M7417N1457L4353m387m5290o5196n1905r944L7004O7475O2536K2398
$$ -50767 -3350 48107 82460 78073 32783 -32413 -84318 -94262 -57258 10217 72753 95151
548I5151k7734n8290n7045l1769N920L8099N1345M0519J5772j2336l6529n0920
$$ 95151 67417 9127 -47918 -79687 -73767 -35668 15677 56196 71968 59632 23103 -27817
560b7817m2548j1233K8293N6014N8025L1557j5807n7861o6827m0079N246M5070
$$ -27817 -70365 -81598 -53305 2709 60734 92291 76484 18623 -48204 -88283 -83037 -37967
572c7967O1668M7259R844k8850m8250m5506k6390J321K9862M5868M2730K2605
$$ -37967 23701 70960 80804 51954 3704 -41802 -68192 -66871 -37009 8859 51589 74194
584G4194q810m0946n9396m7417n049M1555O4327N3734J7166k9149o0140n6543
$$ 74194 65384 24438 -34958 -82375 -87424 -45869 18458 72192 89358 60209 69 -56474
596e6474k3956J4276M0203M8085L7140R906k1253m0870m3485l0920m101K8963
$$ -56474 -80430 -66154 -25951 22134 59274 69180 47927 7057 -36428 -67348 -71449 -42486
608d2486N2615N0088K2066j6892n2277o3423l8788J0482N1640O0742L8918L700
$$ -42486 10129 60217 82283 65391 13114 -50309 -89097 -78615 -26975 33767 72685 76385
620G6385l1694n1221m3415j6424J1224L0571M0697L8538J7069j7137m2992n0253
$$ 76385 44691 -6530 -49945 -66369 -55145 -24574 16123 54661 71730 54593 11601 -38652
632c8652l5302k016L9158O2149M9242R865l2358n6217n3709k3055J9880M8721
$$ -38652 -73954 -75970 -36812 25337 74579 84444 52086 -4131 -57840 -80895 -61015 -12294
644a2294M8103K6580Q24k4144m0231m0534k1864M672K8696M6046M4600J7752k3235
$$ -12294 35809 62389 63213 39069 -1162 -41696 -63560 -58888 -30192 15854 60454 78206 54971
657E4971n2942n4946k9999J1402M9651O0967L6158n154l6694m8306l9692j4363
$$ 54971 2029 -52917 -82916 -71514 -21863 39104 75262 70108 33414 -14892 -54584 -68947
669f8947J7665L8362L8833K6499Q221j7186m1935m7118k6426O817L6933N3585
$$ -68947 -51282 -12920 25913 52412 60633 43447 1512 -45606 -72032 -65215 -28282 25303
681B5303M5110R122l6362n9557m6953j3759K1752M7624M8728K4315r391l0446
$$ 25303 70413 79535 43173 -16384 -63337 -77096 -55344 -7720 41008 65323 55932 25486
693B5486l6695l2877j7906Q962L4280M3325L3846J0046k2703n0047n1285k2301
$$ 25486 -11209 -44086 -61992 -53030 -18750 24575 58421 68467 45764 -4283 -55568 -77869
705g7869J7454M7192N3143L4826m544m2533n3051l3435l550K1483L6431L8529
$$ -77869 -60415 -13223 39920 74746 70202 27669 -25382 -58817 -62367 -40884 -4453 34076
717C4076K2223l094k2552l4952l8464k5079Q888M2080N1236L3714J372l3246n4439
$$ 34076 56299 53205 30653 -4299 -42763 -67842 -58954 -16874 34362 68076 69448 36202 -18237
730a8237m6809r423K8395M7031M2561K1343r152l7306m2802k6293m281J4367L0219
$$ -18237 -65046 -74469 -46074 957 43518 64861 55709 18403 -24399 -50692 -54973 -40606 -10387
743a0387L8167K8742K426k6111m3293m3144k1040J8579N0523N1228K5094j0441
$$ -10387 27780 56522 58948 32837 -10456 -53600 -74640 -56061 -5538 45690 70784 60343
755F0343l9765n0396l4020J328K9927L8009L1290J7740m718k8747l8608k9504
$$ 60343 20578 -29818 -63838 -62510 -32583 5426 36716 54456 49738 20991 -17617 -47121
767d7121j0476J1735L4963M6536L1638m662l7283m7962l8291r728K8424N1370
$$ -47121 -57597 -45862 -10899 35637 67275 62613 25330 -22632 -60923 -70651 -42227 9143
779I143M2763J2647j7365l5360l9148k5806Q37K3199L1893K9545K1358P73k8199
$$ 9143 51906 64553 47188 11828 -27320 -53126 -52289 -29090 2803 32348 53706 54479 26280
792B6280m3986l6349j0028K0058M4138M8583K3643j6987m3656m4984k6759J524
$$ 26280 -17706 -54055 -64083 -44025 113 48696 72339 55352 11696 -33288 -60047 -58523
804e8523L0287M3295L1796O353j4530k6607l2676k7502n895J9855L3881L5235
$$ -58523 -28236 15059 46855 53208 38678 12071 -20605 -48107 -54002 -34147 -266 34969
816C4969K5227k434l6008n1186l4528M80L0468M5565M0596J2113k3219m0990l5681
$$ 34969 60196 57762 21754 -29432 -63960 -63480 -33012 12553 53149 65262 42043 1053 -34628
829c4628j7222L892K3868L4794K8746J0003q671k4371l5764l2412q053K4156M1878
$$ -34628 -51850 -47958 -24090 10704 39450 49453 40782 16411 -19353 -51765 -59818 -35662 6216
842F216L9779J9559j3274m3199m8657k3864J0733L3078L8616K9712N524k0281
$$ 6216 45995 65554 52280 9081 -39576 -63440 -52707 -19629 18987 48699 54223 33942
854C3942l3123k8647j6569j744J8375L5258L3954J4132j0242l1065m1527l3022
$$ 33942 819 -27828 -44397 -46141 -27766 7492 41446 55578 45336 14271 -27256 -60278
866f0278j11L3898M6329L2920P476k0914m1552l8726j4220J3918K7869K9585K3895
$$ -60278 -60389 -26491 19838 52758 60234 39320 -2232 -40958 -55178 -41260 -13391 16194 40089
879D0089Q495j3910k9401l0654k1683m199K1064M1267L8479J1856k0038l8839
$$ 40089 48584 34674 5273 -25381 -47064 -51263 -30199 11068 49547 61403 41365 2526
891B526m1643k2955J0813L8263M0482K2022j314k0644l1753l0321j2382Q823K1516
$$ 2526 -39117 -62072 -51259 -12996 27486 49508 48194 27550 -4203 -34524 -46906 -38083 -16567
904a6567K7540K7408J3792j2711l4461l7291k2946J983K9778M6094L4219J013
$$ -16567 10973 38381 52173 39462 5001 -32290 -55236 -53253 -23475 22619 56838 57851
916E7851k8114l9429l2216j1831J4146L3866L1362J6076o91j4246k6499k9950
$$ 57851 29737 -9692 -41908 -53739 -39593 -5727 25635 41711 41020 26774 275 -29675
928b9675j7398M520K2685L3395L1994J2478k0225m1885l8174j5464J2467L4883
$$ -29675 -47073 -42553 -19868 13527 45521 57999 37774 -4111 -42285 -57749 -45282 -10399
940a0399M1048K3733p154k8289l1620k3083q692R868K5885K8704J8763M676j2064
$$ -10399 30649 54382 47228 18939 -12681 -35764 -44456 -34588 -8703 20001 38764 43440 31376
953C1376k9461l5545k0164Q517L0821L8200K8989K781k8212m2845l0629m733J8028
$$ 31376 1915 -33630 -53794 -45277 -14456 23744 52733 55514 27302 -15543 -46172 -50905 -32877
966c2877L0839L1041J6085o294k1097k5179k2269j3209M616K5165L3352K3967
$$ -32877 -2038 29003 45088 38794 17697 -7482 -29751 -42960 -38344 -13179 20173 44140
978D4140N181j8432l6279l7643j4538J7710L7322L5170J8761o151k9306l5304
$$ 44140 49321 30889 -5390 -43033 -57571 -39861 -2539 32631 51392 45241 15935 -19369
990a9369k1490l66J4491K3113K5822J7539l37j7717k6725k7215j6425O854L1749
$$ -19369 -40859 -41225 -26734 -3621 22201 39740 39403 21686 -5039 -32254 -48679 -41825 -10076
1003a0076L8271K3246k861k7194l8531l0353m077K3472L4076K6641J0446p450
$$ -10076 28195 51441 48580 21386 -17145 -47498 -51575 -28103 5973 32614 43060 35610
1015C5610k2867k8175j8799m009R530K1471K8495K2245J245k2224l3332l0062
$$ 35610 12743 -15432 -34231 -38240 -28710 -7239 21256 43501 44746 22522 -10810 -40872
1027d0872j1413J5575L7351L6919J4229j2351k9558l2127k0898J363K1267K7114
$$ -40872 -52285 -36710 641 37560 51789 39438 9880 -22247 -43145 -41782 -20515 6599
1039F599K0333J0485l303j7950k7758k3293p801J0408K6797L3918K1881n185k9795
$$ 6599 26932 37417 34114 16164 -11594 -34887 -42688 -32280 -5483 28435 50316 45131 15336
1052A5336l6858k4614j727K2066L5350K8699O137j4599k4890k4110j6463r43J4790
$$ 15336 -21522 -46136 -47863 -25797 9553 38252 44389 29790 4900 -19210 -35673 -36616 -21826
1065b1826K3335K2583J4755l30k0563l3069k6583n821J7994L3798L2928J4138
$$ -21826 1509 24092 38847 38517 17954 -15115 -41698 -47519 -29525 4273 37201 51339
1077E1339j4259l3140l1715j4997M675K1307K7648K1083N035r943j8946k2458
$$ 51339 37080 3940 -27775 -42772 -38097 -16790 10858 31941 36976 27033 8087 -14371
1089a4371j9449n807J3625K7376K8344J5624n282k7519l6733k3341L327K5305
$$ -14371 -33820 -39627 -26002 1374 29718 45342 40060 12541 -24192 -47533 -44206 -18901
1101a8901L2802K4951N224j6913k8582k3667j0183L788J5028K2884K1325R405
$$ -18901 13901 38852 44076 27163 -1419 -25086 -35269 -31481 -16453 6431 27756 37161
1113C7161o076k0014k7526k2892m487J9249L3712K9030R393j4380l1371l2387
$$ 37161 31085 11071 -16455 -39347 -43834 -24585 9127 38157 47550 33170 1799 -30588
1125c0588j4504R965K5469K5978J7069K331j3015k1489k0981j2788n73J3172K4995
$$ -30588 -45092 -35127 -9658 16320 33389 35720 22705 1216 -19765 -32553 -33126 -19954 5041
1138E041K5700J2148r528k6635l1360k0685L341K6597L3931K2067M74j8302k7839
$$ 5041 30741 42889 33361 6726 -24634 -45319 -41978 -15381 18550 40617 41091 22789 -5050
1151e050k3605q113R380J9067K0376J6226N683p890k1187k4448j7182o61J8008
$$ -5050 -28655 -36768 -27388 -8321 12055 28281 33964 26074 4887 -19561 -36743 -37404 -19396
1164a9396L0675K7586O537j7168l1621k8332j1703J0978K6736K7428J4109l093
$$ -19396 11279 38865 45402 28234 -3387 -31719 -43422 -32444 -5708 21720 35829 32736
1176C2736j5480k0823j9259r729M341J6026K1854K0507Q709j0153k6592k8729
$$ 32736 17256 -3567 -22826 -32555 -28214 -12188 9666 30173 38882 28729 2137 -26592
1188b6592j5906N695K5458L1813K1383j801k1883k8846k0687m482J1311K0910
$$ -26592 -42498 -36803 -11345 20468 41851 40050 18167 -10679 -31366 -35848 -24537 -3627
1200c627K1168J2016K71j0621j9319k1672j3482K474J9433K7192K2732M978j7069
$$ -3627 17541 29557 29828 19207 -112 -21784 -35266 -32792 -13359 13833 36565 41543 24474
1213B4474l1059k7183q544J2956K7229K6423J2926n846j9663k1887j5246m803
$$ 24474 -6585 -33768 -42312 -29356 -2127 24296 37222 31376 11713 -10174 -25420 -30223
1225c0223O911J6621K0290J6081L988j1404k3843k5455j3309P840K5097K9823
$$ -30223 -23312 -6691 13599 29680 33668 22264 -1579 -27034 -40343 -32503 -7406 22417
1237B2417J8114k888k2564k9078j9917j715J5250K2332J9257Q912l132j3696j8718
$$ 22417 40531 37643 15079 -13999 -33916 -35631 -20381 1951 21208 30120 26988 13292 -5426
1250e426j7416r314N051J8339K5059J9025J804j7599k8646k4375p184J4349K7586
$$ -5426 -22842 -32156 -27105 -8766 16293 35318 37122 19523 -9123 -33498 -40682 -26333 1253
1263A253K5505J0536q306k1355k2235j3541p49J0524J7227J7764J1701Q89j2472
$$ 1253 26758 37294 28988 7633 -14602 -28143 -28892 -18368 -1141 16623 28324 29213 16741
1276A6741k1993k2004j0331R344K4584K7595J5357m897k3223k8451j7871Q65J6844
$$ 16741 -5252 -27256 -37587 -28243 -3659 23936 39293 34396 11173 -17278 -35149 -34284 -17440
1289a7440K3211J8453O137p138j5793j7756j3882m888O994J8195K1896J5323o69
$$ -17440 5771 24224 30361 23223 7430 -10326 -24208 -29096 -22102 -3907 17989 33312 32643
1302C2643j7438k6600k2156m843J5949K7438K3981P951j0919k2491k2018j1199
$$ 32643 15205 -11395 -33551 -38394 -22445 4993 28974 36925 26006 3515 -18503 -29702
1314b9702K714J3114J7576J5800Q156k907j3823j9636j7759p556J0020K3741K5372
$$ -29702 -26988 -13874 3702 19502 27658 24751 10928 -8708 -26467 -34023 -24003 -262 25110
1327B5110J2675o933k2935k7014j6908K804J9458K4378J6253K970r682j7831j6914
$$ 25110 37785 30852 7917 -19097 -36005 -33201 -13743 10635 26888 29858 20176 2345 -14569
1340a4569j0367l32R033J6783J8588J2700l335j7904k4613j8410l082J6162K7318
$$ -14569 -24936 -25268 -16235 548 19136 31836 28501 10597 -14016 -32426 -35508 -19346 7972
1353G972K2829N200j3266k2803k1163r952N796J6230J8098J2739M196n311j4406
$$ 7972 30801 36001 22735 -68 -21231 -31183 -25387 -9157 8941 21680 25876 20565 6159
1366F159j8206j4337k770J0512K1307K2928J0962q840k3674k5521j3914M719J9754
$$ 6159 -12047 -26384 -29154 -18642 2665 25593 36555 27715 4041 -21480 -35394 -30675 -10921
1379a0921K4615J5689m60j3195j7827j5477q070K492J1953J6473J4637P999m086
$$ -10921 13694 29383 28923 15728 -2099 -17576 -25646 -23154 -11201 5272 19909 27908 23822
1392B3822j6909k3049j5742M09J6309K4916K0802N066j4769k5026k0178o431P967
$$ 23822 6913 -16136 -31878 -31469 -15160 9756 30558 35624 20855 -4171 -24349 -30780 -22813
1405b2813J7124J8769J1656l84r317j4089j4743j1542q32J2071K0889J8095P483
$$ -22813 -5689 13080 24736 24352 15035 946 -13797 -25339 -26171 -14100 6789 24884 32367
1418C2367q458k2220k4855j1929P489K1064K2505J4304j304j5384k0623j3984
$$ 32367 23909 1689 -23166 -35095 -27606 -6542 15963 30267 28963 13579 -7044 -21028
1430b1028l738N309J2737J5909J2982L424p420j5623j8837j3736P98J7917K4478
$$ -21028 -24766 -19457 -6720 9189 22171 25595 18175 2552 -16285 -30021 -29223 -11306 13172
1443A3172J7193J850j4277k4020k0568n114J1561J9302J6957Q717j665j1549j5979
$$ 13172 30365 32215 17938 -6082 -26650 -31764 -20203 -901 16056 24773 23108 11559 -4420
1456d420j2979o163K126J1311J8811J6806M246j0913k0514k1071j0828O921K2665
$$ -4420 -17399 -23562 -21436 -10125 8686 25492 29738 18825 -1689 -22760 -33588 -26667 -4002
1469d002K3542J1095m906j5617j9748j4391j659J0222J4722J2723Q888K273q264
$$ -4002 19540 30635 25729 10112 -9636 -24027 -25686 -15464 -742 11981 20869 23142 14878
1482A4878j6758j6661q736L156J5463K2600J6677p3j6888k3029j6894m274J1638
$$ 14878 -1880 -18541 -27277 -24121 -8658 13942 30619 30546 13658 -9371 -26265 -30539 -18901
1495a8901K1457J8005N353o593j1904j4458j2466l466O075J2854J4658J2458M070
$$ -18901 2556 20561 25914 19321 7417 -7041 -19507 -22973 -16898 -4044 10614 23072 27142
1508B7142j0802k1038j9207o588Q321J9972K2169J2132o359j9892j9366j0832
$$ 27142 16340 -4698 -23905 -30493 -22172 -2200 19969 32101 25742 5850 -13516 -24348
1520b4348K21J0738J6125J3690N181l287q555j3880j4457p436N974J6201J8715
$$ -24348 -24127 -13389 2736 16426 21607 18320 9765 -4115 -18572 -26008 -20034 -3833 14882
1533A4882J2991L74j6194k3864j6635m93J3754J9551J7199N705q560j6468j3941
$$ 14882 27873 28247 12053 -11811 -28446 -28939 -15185 4366 21565 27270 18710 2242 -11699
1546a1699p758j211O600J3303J4778Q741j304j0129j7168j7743o198J0880K0871
$$ -11699 -19457 -20668 -14068 -765 14013 22754 21450 11321 -5847 -23590 -29788 -18908 1963
1559A963J9321Q179n835j8957k1140j0418M516J3418J4457J1929M542n259j2218
$$ 1963 21284 29463 23628 4671 -16469 -26887 -22371 -8953 5504 17433 21975 16716 4498
1572D498j2834r542m599N480J5575J9100R570l552j5454k0364j5984n06J5684
$$ 4498 -8336 -17878 -22477 -16997 -1422 17678 27248 23696 8242 -12122 -28106 -28612 -12928
1585a2928K1781J4463K215q852j6117j5895o823M285R663J0901J1637P701k866
$$ -12928 8853 23316 25531 16679 562 -15333 -22156 -17871 -8208 2693 14330 22031 19165
1598A9165j2217j6209j2445m113Q912K0245J9609O575r485j8599j8404j0008L795
$$ 19165 6948 -9261 -21706 -25819 -16907 3338 22947 29522 20037 1438 -16966 -26974 -23179
1611b3179J6099J7862R342j77o589j1691j3525q103R08P968J2368J4646R484l824
$$ -23179 -7080 10782 20124 19947 13358 1667 -11858 -19961 -19053 -11085 1283 15929 25413 21589
1625B1589j7295j8835j1850J128J3480K1323J5803N74j2619j6682j2848n674L960
$$ 21589 4294 -14541 -26391 -25263 -11783 9540 25343 25917 13298 -3384 -16232 -21906 -17946
1638a7946J2138J4007Q084K481l381j0868j5600j1668J59J0960J6480J6441O997
$$ -17946 -5808 8199 16283 18764 15383 4515 -11085 -22753 -22594 -11634 4846 21287 28284
1651B8284r179k0677j8255n962N808J4992J7306J0569k327j1447j2049r646n626
$$ 28284 19105 -1572 -19827 -25789 -19981 -4989 12317 22886 20559 9112 -2937 -12583 -18209
1664a8209M04R216J4230J1723M596l643j4395j9336j1993M291J6145J8554J2881
$$ -18209 -17805 -8589 5641 17364 21960 18317 3922 -15414 -27407 -23116 -6971 11583 24464
1677B4464J012j2625j9614j3566j558P932J1467J2112Q445J92p809j0243j1340
$$ 24464 25476 12851 -6763 -20329 -21887 -13955 -2488 9624 18069 18261 10452 209 -11131
1690a1131r056p29J1154J7796J4005K788r075j7852j8718o965R258J7730J5154
$$ -11131 -20187 -20916 -9762 8034 22039 24827 15752 -2100 -20818 -27783 -18525 -795 14359
1703A4359P635k553j1444j4908r561j356M692Q167J1899J1004K755p247j3928
$$ 14359 21994 19441 7997 -6911 -16472 -17828 -13136 -4969 6930 17934 20689 13442 -486
1716d86j4230r483K297J5757K0311J1341k847j2901j7013j3770k258J0983J4780
$$ -486 -14716 -24199 -21902 -6145 14166 25507 22660 9759 -7254 -21024 -23282 -12299 2481
1729B481J0488M389j139p708j2445j0171m471K439R501J5028J3466K238j1705
$$ 2481 12969 17358 16219 8511 -3934 -14105 -18576 -16137 -6636 8392 21858 24096 12391
1742A2391j8112j4175n134P531J7543J7566O061o769j2668j2446r233j039P505
$$ 12391 -5721 -19896 -25030 -17499 44 17610 23671 16902 4234 -8212 -17445 -18484 -10979
1755a0979J1227R375O471J958o282j4510j4064n854M850J4027J7466J1700k678
$$ -10979 248 9623 16094 18052 11770 -2740 -16804 -22658 -17808 -3781 13685 25385 22707
1768B2707j5827j8122j0077n7R642J5436J2500K667n869q770r832q862l822M878
$$ 22707 6880 -11242 -21319 -21376 -11734 3702 16202 18869 13000 4230 -5602 -14464 -18286 -13408
1782a3408J1112J2525Q927J504r454j7677j5428k086J0065J6024J5573O265o763
$$ -13408 -2296 10229 19156 20660 11206 -6471 -21899 -23985 -13920 2104 17677 23942 17179
1795A7179j5819j3929n783K044P562J1274J0253M045k919p140j0994j1843n335
$$ 17179 1360 -12569 -18352 -16308 -8746 2528 12781 16826 13907 6767 -4227 -16070 -21405
1808b1405O244J4677J5354Q094k920j3950j7920j1332K448J2657J4774R789K406
$$ -21405 -15161 -484 14870 22964 20044 6094 -11826 -23158 -20710 -8053 6721 16510 18916
1821A8916o224j2067j0735m760p9M180J0454J2084P274j898j0157j4354j3035
$$ 18916 12692 625 -10110 -14870 -14949 -10769 -315 11769 19043 17145 6988 -7366 -20401
1834b0401k592J0510J7696J3902L231p448j4602j4323o203M427J1186J0459O997
$$ -20401 -22993 -12483 5213 19115 22346 14898 296 -14027 -20230 -15803 -4617 5842 12839
1847A2839L181l486r225j0892p941k736N685J3138J5118P354n802j4670j5397
$$ 12839 16020 12534 3309 -7583 -15524 -18260 -12575 563 15681 23035 17233 2563 -12834
1860a2834r589J945J3320J6577R424p06q237j1389j0205m510K706P727Q914Q455
$$ -12834 -22423 -20478 -7158 9419 18843 18137 9900 -1489 -11694 -16204 -13498 -5771 3143 11598
1874A1598N919k032j0814j4029j0109m85R369J6457J3973K858r797j5794j2453
$$ 11598 17517 15485 4671 -9358 -19467 -19952 -10583 5874 19847 22705 12908 -2886 -15339
1887a5339m329N118J1806J2106O162j434n116q380r638o533R3O845J1733J1599
$$ -15339 -19668 -14550 -2744 9362 15524 14090 8974 594 -9044 -15577 -15484 -8639 3094 14693
1901A4693O162n139j4607j5686p223L869J2781J5247R836j646j0546j2673q598
$$ 14693 20855 15716 1109 -14577 -21800 -17931 -5150 10097 19933 18287 7741 -4932 -13530
1914a3530k040L692P929R806P233J740l380q682j2840q981R20J0685J4807J1757
$$ -13530 -15570 -11878 -3949 5857 13090 14830 11450 2768 -10072 -19053 -18133 -7448 7359 19116
1928A9116K144r175j6593j2914k886P685J2025J1415N269j793p935r712o789l777
$$ 19116 21260 12085 -4508 -17422 -20308 -12623 -598 10817 16086 14293 6358 -3354 -10143 -13920
1942a3920M15P129J1731R805L108n720j2824j4124p422M998J4298J4711P633k205
$$ -13920 -13505 -6376 5355 15160 18268 12548 -276 -14400 -21822 -16824 -2526 12185 19818 17613
1956A7613j1172j3423q548k08O480Q645Q357N722R07n784r336r888o435J316R583
$$ 17613 6441 -6982 -15530 -15738 -9258 -613 7744 13466 14373 8589 -747 -10635 -17070 -15754 -6171
1971f171J4812J0645J64r813j5281j2180k256Q111J4018J1161L156l622q633r223
$$ -6171 8641 19286 19450 9637 -5644 -17824 -20080 -11969 2049 13210 16366 12744 4111 -5112
1985e112o975j765L729P035R417Q315J884o365j2607j2217n462M955J3614J4949
$$ -5112 -12087 -13852 -10123 -3088 6329 14644 16528 10163 -2444 -14661 -20123 -15168 -1554 13395
1999A3395O997m353j1873j3044p697Q07P990J0274P767K956j751n607q887q160
$$ 13395 20392 16039 4166 -8878 -16575 -15768 -7778 2496 10263 13219 11468 5861 -3026 -11186
2013a1186m266K739R363J2446R351l17j0163j5533j0083j487Q364J4121J1261
$$ -11186 -15452 -12713 -3350 9096 18447 18130 7967 -7566 -17649 -19136 -10772 3349 14610
2026A4610K945o091j0135r231m950R5M819P791Q398N592K84o320j1471j0794m613
$$ 14610 17555 11464 1329 -7902 -12852 -12757 -7938 -147 8251 13843 14127 7807 -3664 -14458 -19071
2041a9071O353J3021J3439O223m576j2913j3464o603K683R260J0462O974J762
$$ -19071 -12718 303 13742 19965 15389 2476 -10988 -17591 -14908 -5648 4814 11788 13550
2054A3550l695p145p913o733j922L491R259J1173P443j491j0067j4052r948m14
$$ 13550 9855 2710 -5203 -11936 -13858 -10367 -1108 10065 17508 16017 5950 -8102 -18050 -18464
2068a8464R062J4448J0772J804p234j1323r391l686K339O306Q106O711L513j012
$$ -18464 -9402 5046 15818 17622 10388 -935 -10326 -14012 -11673 -5367 2739 9450 12963 11951
2082A1951o870j0496q986k431O106J2524J2473M986n453j2959j2901n711L092
$$ 11951 5081 -5415 -14401 -16832 -10726 1798 14271 19257 13804 845 -12056 -17767 -14675
2095a4675J0328J1187O816n4n936p642p125m696o09M625Q603R520N643k122r785
$$ -14675 -4347 6840 13656 13602 7666 24 -7101 -11797 -12406 -7781 822 10342 15985 13863 4078
2110D078j3151r158Q89J0171J3711J0000P43q086j2118q795k672L786P625Q095
$$ 4078 -9073 -18231 -17342 -7171 6540 16540 17283 9197 -2921 -11716 -14388 -10602 -2977 5118
2124E118N545J753l464o629q741p490j380O708J1876J0929M056n691j2966j2536
$$ 5118 10663 12416 8952 2323 -6418 -13908 -15288 -8580 3296 14225 18281 12590 -376 -12912
2138a2912n455N278J1098J0723N710j403o629r177o342k707J694N203Q022P913
$$ -12912 -18367 -13089 -1991 8732 14442 13039 6410 -2767 -9109 -11816 -10122 -4919 3103 11016
2152A1016L569l267r253j1587p580J228J0257J3711Q678l67q526j2472q725j925
$$ 11016 14585 11318 2065 -9522 -17102 -15874 -5617 8094 16772 16405 7879 -4593 -13318 -15243
2166a5243O018Q952P105M229L98m122p645p654m833m9O228J0902J0433K455o832
$$ -15243 -9225 -273 6832 11061 11459 7337 -308 -7962 -12795 -12844 -6616 4286 14719 17174 10342
2181A0342j2525j1237m313M802J1912J1823M604l220q034q502o144j832L829O386
$$ 10342 -2183 -13420 -17733 -12931 -1019 10804 15408 12188 4154 -4348 -10492 -12324 -8495 -2109
2195b109O763N898K776l976r546j0107n507K114R405J2758Q559o82j0398j2106
$$ -2109 4654 10552 13328 9352 -194 -10301 -15808 -13694 -4289 8469 17028 16346 5948 -6158
2209f158p905q39O542R941P895K899k682n356o308o657l960K082O714R217P914
$$ -6158 -14063 -14902 -8360 1581 9476 12375 9693 4337 -1971 -8628 -12588 -10506 -3792 5425 13339
2224A3339J994n948j2694j0914k851O433J0922J1134M964m129r853r084m572K28
$$ 13339 15333 9385 -3309 -14223 -17074 -10641 281 11415 16379 12250 2397 -6687 -11259 -11031
2238a1031M006P172O554M065J80m102p853r391n244L680R842J1309P149j194r990
$$ -11031 -7025 147 6701 10766 10946 6844 -1009 -10400 -15644 -11964 -2122 9187 16336 15142 5152
2253E152j2750q035J414P928R095P709J982l239p418o760m399j594J996O728R261
$$ 5152 -7598 -15633 -14219 -6291 2804 10513 12495 9256 1838 -4922 -9321 -10915 -8919 -2191 7070
2268G070N878O3o525j0345r656l437O996J2565R866L272m672r878r899m554K472
$$ 7070 12948 13011 6486 -3859 -13515 -16952 -9956 2609 12475 15747 11075 1197 -8702 -13256 -10784
2283a0784O540O286N687L061r30n716p654o506l180K610R407J1674N571l044r503
$$ -10784 -4244 2042 7729 10790 9860 4144 -3510 -10016 -13196 -10586 -1179 10495 16066 13022 3519
2298C519j1195p672N13R268J1172O714j1m700p386o792l806O43M154N603O806
$$ 3519 -7676 -15348 -14835 -5567 5605 12319 12308 7608 222 -6570 -10376 -9733 -5579 24 6830
2313F830N797l46p238j0658p580j733O038J1640J0944K762o885j0520q358l892
$$ 6830 12627 12281 5043 -5615 -13195 -14928 -8890 2750 13694 16456 9571 -949 -9307 -13199
2327a3199K525P642P920M188M51k252m676p338n836j235M371P796R069N579k112
$$ -13199 -10674 -3032 4888 9076 9527 7275 2599 -4739 -10575 -11810 -7439 357 9426 15005 12893
2342A2893j0862j1527n730J917Q699J0655P258m99o806q055n354k994J367M913
$$ 12893 2031 -9496 -15226 -13309 -4610 6045 13303 12804 5998 -2057 -7411 -10405 -9038 -4125
2356d125P236M992K496r17n753r530p966k32P219J0494Q744K975n911j1761r428
$$ -4125 3111 8103 10599 9682 3929 -5601 -13567 -13799 -6580 3914 12658 15633 9722 -2039 -11467
2371a1467k188M581P182P693M936m48n202n709m647m199j116M483Q544P792K982
$$ -11467 -13655 -9074 -1892 5801 10737 10289 5087 -622 -5269 -9468 -10584 -6101 2443 10235 13217
2386A3217k982q547j0992o353L063R958R983N558n45o772r312o624j05L467M745
$$ 13217 10235 1688 -9304 -15657 -12594 -2636 7347 12905 12360 5588 -3724 -10348 -10453 -6986 -2241
2401b241N775N508J405l357o363o883n549j108P097J0883Q110P91o299j0015r317
$$ -2241 3534 9042 10447 7090 727 -6156 -11705 -12813 -5716 5167 13277 14068 7769 -2246 -11563
2416a1563k964N768R455P171K548j181m832o428n666j464J240L473P041P520K657
$$ -11563 -14527 -8759 696 7867 10415 9234 4402 -2026 -7692 -9156 -7916 -4443 2598 10118 12775
2431A2775m601r131q218n262K499R618J1100N746l131p893q103n841q23N195O988
$$ 12775 8174 -957 -9175 -14437 -11938 -2320 8780 14526 11395 3502 -4601 -10442 -11265 -6070 918
2446I18M976J968R05k738o303p023l892J181N551R370Q058J321p895j1044p518
$$ 918 5894 7862 8767 6029 -274 -7297 -11189 -10008 -4457 4913 12971 14292 6397 -4647 -12165
2461a2165j205N110R251Q961J959l998o468n190m417j282K864N404N640M133J886
$$ -12165 -13370 -8260 991 9952 11911 7913 1445 -3745 -8162 -9444 -6580 -1176 4464 8597 10483
2476A0483l144q637r270l502M286Q686R597N726k568r307r697m177J295M816P123
$$ 10483 7339 -1298 -10568 -14070 -9784 -1098 8499 14225 11657 2350 -7347 -11524 -10229 -5413 1710
2491A710N708J743k034m402m370n517l805J995P460P882N235O73o006j1199q284
$$ 1710 7418 9161 7127 2725 -1645 -7162 -10967 -8972 -1512 6370 11605 12278 6272 -4927 -13211
2506a3211J24O652Q987P546K162m105p892o736k067Q52K626M832O116L594l69
$$ -13211 -13087 -6435 2552 10098 12260 8155 263 -6473 -8540 -7688 -5062 -230 5886 9480 9111
2521I111m102o779q024l476M076R987R068L482k974q208r592n455K795P282O601
$$ 9111 5009 -1770 -9794 -13270 -9194 793 9861 13343 10369 2161 -7431 -12886 -10091 -2809 3792
2536C792M590N52k295n197n357l296j336J513N636Q161N317j555o597q920p120
$$ 3792 8382 8934 6639 1442 -3915 -7211 -8547 -7034 -1398 6763 12080 10525 3928 -4992 -12112
2551a2112j288O986J0563P055L48n181o970o809k715K348N438M321M006K787n01
$$ -12112 -13400 -6414 4149 11204 11552 6371 -599 -7408 -10123 -7775 -2337 1984 5990 8777 8276
2566H276m892p206n539j536L161Q483R449L781m563r260q335m151K067P629Q589
$$ 8276 3384 -3822 -9361 -10897 -7736 747 10196 13977 9414 154 -8181 -12332 -10265 -2636 5953
2581E953L809j290l573n076m442l429J10L608N128N594M424p20p249r428n498
$$ 5953 9762 8472 4899 -177 -4619 -8048 -7938 -4330 798 6392 10816 10096 2847 -6581 -12079
2596a2079P42O459R225P577L72o369q791n173j442K740M943N802L223K8j339m003
$$ -12079 -11337 -4878 4347 11924 12296 5927 -2864 -8037 -9479 -6739 -1796 4006 7229 7257 5918 1915
2612A915n868n462q64M619P955O977L256l725r424r147k926M016P407P127M530
$$ 1915 -3953 -9415 -10279 -5660 2295 9272 12528 8803 -621 -9768 -12694 -8678 -1271 5856 10386
2627A0386j184n894n919l369j475M97L761N395N085J910j685n199q606o020J268
$$ 10386 9202 3308 -2611 -5980 -7455 -6958 -3197 2198 7283 9193 7508 2309 -6297 -12317 -11049
2642a1049P414R394N635l9n783q787o754l49M806N786M568L128n28l332m534m795
$$ -11049 -3635 5759 11394 11355 5572 -3215 -9969 -10318 -5512 274 4842 7970 7442 4110 -424 -5219
2658e219k772r23M254P522O905J531m368p800q314l933M122Q984P965K467j887
$$ -5219 -7991 -8914 -4660 2862 9767 11298 6930 -870 -9184 -13117 -8995 -11 7954 10421 8534
2673H534n937o293m079j16L229L313M343L951J927k573o220o518m181O75O560
$$ 8534 2597 -3696 -7775 -7891 -4662 -1349 2994 6945 8872 6299 79 -6439 -10620 -9945 -3385
2688c385R351O095j167o772q165n919o74N238P153N130R51j556l451m409m552
$$ -3385 5966 12061 10894 4122 -4043 -9962 -10636 -5398 1755 6885 7836 6280 2829 -1580 -6132
2703f132j831R43M214N920O016J570m351q562o996k376L549Q262Q106K889k992
$$ -6132 -7963 -7020 -2806 3114 9130 10700 6349 -2213 -9209 -11585 -8036 226 8332 11221 8229
2718H229p149n974l395M47L371M995L818K599O7k177n380o397l300K094O230P713
$$ 8229 1080 -4894 -8289 -7842 -4471 524 4342 6941 7008 4831 -549 -6946 -10246 -8152 -1922 5791
2734E791N462m80p196q955n473Q21N547P015N358Q80l214m600m207k724j129J513
$$ 5791 11253 10773 3577 -5378 -10851 -10030 -4483 2532 7890 8770 5556 956 -3251 -5975 -7104 -5591
2750e591M437N437M195O46l555q133p259j732M487Q585O919K881l497p626o634
$$ -5591 -1154 4283 8478 9124 5569 -2564 -9823 -11555 -7068 1517 8436 11317 7820 194 -6440
2765f440k581J942M209M352L849J749j186l150m544m576k599J572O169P999M227
$$ -6440 -9021 -7079 -2870 1482 5331 7080 5894 2744 -1800 -6376 -8975 -7403 -1234 6765 10992
2780A0992j699o511q445n568J093O220P457N104j41l536n405m473j782O91K097
$$ 10992 9293 2782 -5663 -11231 -10138 -3918 3539 8643 8502 4966 -439 -4912 -6694 -6003 -3906
2795c906L799M938L107J61m425o822o204j377M624Q050P298J985m230p631o261
$$ -3906 -107 4831 7938 8099 3674 -3148 -9352 -10729 -6105 1945 9243 11228 6998 -633 -6894
2810f894k479K219N420N286K615N7j853l512l967l602r96K131N347O671L590j530
$$ -6894 -9373 -7154 -1734 3552 6167 6224 4371 859 -3108 -6710 -7706 -5575 -228 6443 10033 8503
2826H503o714q085m531J401O338P971M576q00m689n621m153r15J344L032L854
$$ 8503 1789 -6296 -10827 -9426 -3088 4883 9459 8659 3970 -1651 -5804 -6719 -5375 -2343 1511
2841A511L161K420m27m342o207m835q11M426P670O967J205m491p659o645j846
$$ 1511 4672 7092 6665 2323 -3884 -8719 -9530 -5104 2566 9533 10738 6247 -1412 -8057 -9903
2856i903L546N566N370K459o39l077l556l724k243o00K953N036M942L196k039
$$ -9903 -6357 -791 4579 7038 6399 3322 -234 -3958 -6201 -6801 -3848 1188 6130 9326 7287
2871G287o333p376m344K085O285P992M389j366n515n923l880n64K541L790L770
$$ 7287 954 -6422 -10766 -8681 -2396 5596 9985 8619 3104 -2819 -6699 -7263 -4722 -932 2838
2886B838K673P81j114l861n423m269j40M519O932O575J024n019p618o024j720
$$ 2838 5511 6292 5178 1317 -4106 -8375 -8515 -3996 2936 9511 10535 5516 -2102 -8126 -9846
2901i846L671O712N479J680j532l818l853l340j159P73K707M414M534J978j902
$$ -9846 -6175 537 6016 7696 6164 2346 -1507 -4847 -6006 -5233 -2526 1888 6422 8400 6498
2916F498o033p137l454K128O566P483M097j519n918o922l416K82L273M455L683
$$ 6498 465 -6672 -10126 -7998 -1432 6051 10148 8629 2711 -4211 -7627 -7345 -4072 383 4066
2931D066J756k50k133l446m234l253J01M437O266N382Q68m691p639n922j065M125
$$ 4066 5822 5572 3439 -7 -4241 -7494 -7393 -2956 3310 8692 9560 4869 -2770 -8692 -9757 -5632
2947e632O894N462J736k443n209m235k055o4J004L164M340L242Q45j954n787n606
$$ -5632 1262 6724 8460 6017 808 -3427 -5482 -5546 -4542 -1378 2962 6204 7049 5095 -692 -6298
2963f298l519K278O754P287L227j974n496p038l487J000M304M728L060R75j098
$$ -6298 -9817 -7539 -785 6502 9729 7755 2259 -4779 -8266 -7266 -2962 1766 4826 5801 4703
2978D703k511l768k923j801j08M824N604M228J68m330o926n677j152M900O950
$$ 4703 2192 -1576 -4499 -6300 -6408 -1584 4020 8248 8416 4086 -2840 -8517 -9669 -4769 2181
2993B181N313P65l086n010m116k377J171K448K749L247K648K24k709n019m698
$$ 2181 7494 8259 5173 163 -3953 -6330 -5159 -2711 38 3285 5933 6157 3448 -1571 -6269
3008f269k355J978O339O834L346k558o201o132l726J203N196N413L181k41k183
$$ -6269 -8624 -6646 -307 6527 9873 7315 1114 -5018 -8744 -7541 -2345 3068 6249 6008 3825
3023C825l166l136k836o69J915L272M351M357l3m734o891m819l37M400O892N678
$$ 3825 659 -2477 -5313 -5982 -4067 -795 3556 7913 7880 3146 -3745 -8564 -8901 -4501 2391 8069
3039H069O62m184n692m068r86R20L426L611K592R96l05k280m647m534j637K790
$$ 8069 8731 4547 -1145 -5213 -6199 -5279 -1853 1758 4350 5346 5041 2761 -1886 -6420 -8057 -5267
3055e267N722N866L152k104o891o878k636K343N151N419L051p57l090l710k868
$$ -5267 455 6321 9473 7369 478 -6400 -9036 -6693 -1542 3877 6928 6171 3081 -629 -3497
3070c497j428m69K093L900L867K451n24l745o365m952J57N395O315M556P30l750
$$ -3497 -4925 -5394 -3301 599 4466 6917 6393 2648 -3717 -8669 -8512 -3117 3198 7754 8484 4734
3086D734o637m655p08L179L242L129K339M54j640k558l400l269j048K237O073
$$ 4734 -1903 -6558 -7266 -4087 -845 2284 4623 5077 3437 879 -2521 -5790 -6838 -4601 1472
3101A472N430J650k644n578o450l280K471O356N186K404p09l593m441l043m41
$$ 1472 6902 8552 5908 330 -6120 -9400 -6929 -573 4613 7017 6308 2715 -1726 -4769 -5210
3116e210J316J893K770L598K554j335m799m814l525o88M966O863N047l90m604
$$ -5210 -3894 -2001 769 4367 6921 5586 787 -4027 -7552 -8240 -3274 3589 8636 8246 3642
3131C642n747m474q93L220N089K956J008l80j364l164l189j919j79K145M575N035
$$ 3642 -2105 -6579 -7472 -4252 837 3793 4801 4421 3057 -107 -3296 -5215 -5394 -3249 1326 6361
3147F361K310l168o431n518k099K137N593O731J922k154m730l490k510o87K218
$$ 6361 8671 5503 -928 -6446 -8545 -6408 -815 5916 7838 5684 954 -2536 -5046 -5733 -3515
3162c515L294K408K010J197q89l768n214k896P52M307O026M379O9m945o338m422
$$ -3515 -221 2187 4197 5394 4505 737 -4477 -7373 -6621 -2314 3712 8091 8160 3215 -3123 -7545
3178g545M46L300M524M141R72k015k639k160k212k093L14L287L960L326J443k007
$$ -7545 -7099 -3799 725 4866 5838 3823 1184 -976 -3188 -5281 -4967 -1680 2280 5606 7049 5042
3194E042n852o338j614L434N663N357K338k000n235n045j377R33J986K989K851
$$ 5042 -810 -7148 -8762 -5328 335 5692 8030 6030 795 -4250 -5627 -4694 -2708 281 3132
3209C132J626l54j559k806m066k959O83M727N990L412q29l940o410m603J40M693
$$ 3132 4758 4404 2845 39 -4027 -6986 -6303 -1576 4414 7826 6997 3057 -3353 -7956 -7816 -3123
3225c123N221L131P13k183l465k966j324k35M71K158M112L638J24k942m529n023
$$ -3123 2098 5229 5942 3759 294 -2672 -3996 -4231 -3760 -1602 2510 6148 6272 3330 -1199 -6222
3241f222j968K734O469N195J538k614m407n058k399J595L938L048J650P44Mk285
$$ -6222 -8190 -5456 1013 6208 7746 5132 725 -4333 -6732 -5137 -1199 1849 3499 4243 4247 1962
3257A962l470k599j486O71L618N684L492r51m856n690l680J64M255N887L450p61
$$ 1962 -1508 -4107 -5593 -4922 -1304 4380 7872 6921 2065 -3625 -7305 -7141 -2886 3001 6451 5690
3273E690k847l231k862j285M19K063J973K776K656N92l009n130m354n22K514N296
$$ 5690 2843 -388 -3250 -4535 -4116 -2053 -80 2696 5352 5944 2935 -2195 -6549 -7071 -4557 739
3289G39N832J794l610n610m207j378J871L620M208J619r17j587j402k703k717
$$ 739 6571 8365 4755 -855 -5062 -6440 -4569 -949 3259 4878 3961 2374 972 -1731 -4448
3304d448j062K038L516M050K630k05m864o177l367J252M397N155L831j75l995
$$ -4448 -5510 -3472 44 4094 6724 6519 1655 -4522 -7889 -6637 -2240 2915 6746 6571 2576
3319B576m571k559K77Q24J975K698K174R89l16k127l678m396j010L631N108M451
$$ 2576 -1995 -4554 -4277 -3453 -1478 1220 3394 4383 4067 1940 -1738 -6134 -7144 -3513 1595 6046
3335F046J603k512n924m928j600L057M306L407J723n46k731k805j486j412o78
$$ 6046 7649 5137 -787 -5715 -7315 -4258 48 3455 5178 4632 1901 -904 -2390 -3802 -4480
3350d480J128L788M162J596j239l775n134l685Q28N648N236K784j067l360m526
$$ -4480 -3352 436 4598 6194 4955 1180 -3954 -7639 -6811 -1163 4073 6857 5790 2430 -2096
3365b096l147J10K439K412K178J725R98j128k612l331k734q69K405N839M407L43
$$ -2096 -5243 -5133 -2694 -282 1896 3621 4619 3491 879 -2452 -5186 -6055 -3650 2189 6596 6939
3381F939l023n348m079j798K863N191L849M05j167k388k919k081o77Q03J738K362
$$ 6939 3916 -1432 -5511 -7309 -4446 745 4594 4999 3832 1444 -1475 -3556 -4233 -3430 -1692 670
3397F70L302K206j765m472m312k522R10M344N891L317j778m026m540k637m7K678
$$ 670 3972 6178 4413 -59 -4371 -6893 -5983 -1639 4252 7569 5791 1765 -2775 -5412 -5459 -2781
3413b781L830J979M53k51p04k385l054j958J52K433M175M195R19l116o066m020
$$ -2781 1049 3028 3481 3230 2526 141 -2913 -4871 -4719 -2286 1889 6084 7003 3887 -2179 -6199
3429f199k41K539M968L877J485k599l751k276j389m08J077K487K190K085N80m95
$$ -6199 -6440 -3901 1067 4944 6429 3830 79 -2197 -3586 -3994 -2917 -430 1760 3845 4425 3930
3445C930l856m675k141J674M625M594K705r65m650n050k443J302L320L324J591
$$ 3930 74 -4601 -6742 -5068 -443 4151 6856 5891 1241 -3809 -6252 -4950 -1630 1694 3285
3460C285J207j537k085k191j506j625k8K997M262K659M52k703n079m545q84M183
$$ 3285 4492 2955 870 -1321 -2827 -4452 -4480 -1483 2779 5438 5890 3187 -1892 -6437 -7321 -3138
3476c138M777L497R31k360l784l471j070J601J401J510K346J515K47j698l069
$$ -3138 1639 5136 6067 3707 -77 -3548 -4618 -3017 -1616 -106 2240 3755 4002 2304 -765
3491g65l379k004J180M575N419K262k072m377m800k800J436L714M077J816k91
$$ -765 -4144 -6148 -4968 -393 5026 7288 5216 839 -3961 -6761 -5325 -1611 2466 4282 3991
3506C991j447k096k661j059l32O45K025L500K927J0l495m441l666n80L319N062
$$ 3991 2544 448 -2213 -3272 -3604 -2959 -934 2566 5493 5503 2008 -2433 -6099 -6679 -3360 1702
3522A702M175O77l814l787k712j163J290L044J863J565L65J50j560l241k604j465
$$ 1702 5877 6554 2740 -1047 -3759 -4922 -3632 -588 1275 2840 3205 3355 1795 -1446 -4050 -5515
3538e515J602L904M806K141j833m889m601k066J453L772M558J866r68k345k478
$$ -5515 -3913 -9 4797 6938 5105 216 -4385 -6451 -4998 -1226 3332 5198 4230 1885 -593
3553e93j706j338J46J610J981K598K132j40k958m400l375k95L587M847L718L40
$$ -593 -2299 -3637 -3491 -1881 100 2698 4830 4690 1732 -2668 -6043 -6338 -2751 2096 5814 6154
3569F154k933m793l154l50K107K839K393J083k05o64j694k267k238r89J236M293
$$ 6154 3221 -1572 -4726 -5076 -2969 -130 2263 3346 3141 2477 783 -1484 -3722 -4711 -3475 818
3585H18L591J875j506m770m694k070J979M339M160J806j164k994k990j724J92
$$ 818 4409 6284 4778 8 -4686 -6756 -4777 -438 3722 5528 4364 1370 -1620 -3344 -3152
3600c152Q76P22K186K081J666m94k609l572l268J4L325N075K931L43l314m606
$$ -3152 -2276 -1554 632 2713 4379 3885 1276 -2296 -5564 -5550 -2225 2850 5781 6124 2810 -1796
3616a796l518J90K647L097K408P66q28j240j987j838j487j49J438L587L128J626
$$ -1796 -5314 -5124 -2477 620 3028 3794 2966 1726 -261 -2099 -3586 -3735 -2297 1290 4418 6044
3632F044k131m001m801j668J987M434M213J817j756l290l257j481K69J766J749
$$ 6044 3913 -88 -4889 -6557 -4570 -136 4077 5894 4138 848 -2409 -3890 -3621 -1855 -106
3647a06J515J532N26o45k296l199k532M20K729N119K732N0l713m645l061N23K457
$$ -106 1409 2941 3467 2822 526 -2673 -5205 -4785 -2056 3063 5795 5845 2132 -2513 -5574 -5051 -2594
3664b594L768K824r6j163k264j691j214q64M52J191K875K705J294j845m184m117
$$ -2594 1174 3998 3902 2739 475 -1216 -2430 -3294 -2842 -1651 1224 3929 5223 3378 -806 -4923
3680d923j196K000M466M093J613k089l700l259j542J006K391J936J421R35k68
$$ -4923 -6119 -4119 347 4440 6053 3964 264 -2995 -4537 -3531 -1140 796 2217 3152 2884
3695B884p14k291k660j926K08L017M305L099o81l526m716k875M02L535L652K653
$$ 2884 2170 -121 -2781 -4707 -4499 -1482 2823 5922 5241 1715 -3001 -5876 -5474 -1939 1713 4366
3711D366m00j907k200j979o04Q4O63J264K137K618L16j503m038l380j233K090
$$ 4366 3966 2059 -141 -2120 -2724 -2640 -1977 -713 1424 4042 4358 2855 -1183 -4563 -5796 -3706
3727c706M379L809J573k415m164l019j086J142K506K682J325J78r25j077j995
$$ -3706 673 4482 6055 3640 -524 -3543 -4629 -3487 -981 1701 3026 3204 2279 1202 -793
3742g93k304j080M66K953L730K708l63l906m514k702Q93L266M167K022N3k710
$$ -793 -3097 -4177 -3711 -758 2972 5680 5317 1411 -3103 -5805 -4912 -1646 2521 4543 4596 1886
3758A886k902j610m94L70J322J621J991J266qj329l267l490r25K384M519L472
$$ 1886 -1016 -2626 -3120 -2750 -1428 193 2184 3450 3442 2113 -1154 -4644 -5569 -3185 1334 4806
3774D806J172k105m748l267j123K078K992K320J210l35j379j549j304j468r97
$$ 4806 5978 3873 -875 -4142 -5265 -3187 -195 2125 3335 3000 1621 72 -1232 -2700 -3697
3789c697Q27K735L610J543o48l261m186k790P91L953L796K657n57k834l385k245
$$ -3697 -2870 -135 3475 5018 4370 1109 -3077 -5867 -5076 -1123 2673 5330 4773 1939 -1446 -3691
3805c691J71J483J544J565J164J152n40j676k581k607r37K250L721L691Q19k284
$$ -3691 -3520 -2037 -493 1072 2236 3388 2848 1172 -1409 -4016 -4953 -2703 1018 4709 5528 3244
3821C244l915l838q59K078L410K593J205r18j446k389j286o73J7R72J889L050
$$ 3244 -671 -4509 -5368 -3290 120 2713 3918 3000 1554 -835 -2121 -2794 -2777 -1805 84 3134
3837C134J637r05l352l598k314N92L455M519K478r86l591k922j572k86J895K167
$$ 3134 4771 3866 514 -3084 -5398 -4806 -1351 3168 5646 4660 1069 -1853 -3425 -3711 -1816 351
3853C51J578Q12j75l5k104k610j577k10J661L879L364R18l034m246l365l15J705
$$ 351 1929 2741 2566 2531 427 -2183 -3760 -3970 -2309 1570 4934 5852 2818 -1428 -4793 -5108 -3403
3870c403M059K889R72j900k327j350j066m91K65J619J678J974J091p15l055l616
$$ -3403 656 3545 4517 2617 290 -1060 -2126 -2617 -2352 -733 945 2919 4010 3295 240 -3376
3886c376k134J437L364M002J822m67l844l747j326Q08K207J963K078k9m21j022
$$ -3376 -5510 -4073 -709 3293 5115 4648 804 -2943 -4269 -3461 -1254 709 2787 2758 2337 1315
3902A315j433j814j736j63K099L470K742M07k344l998l496o16L003L878K533Q10
$$ 1315 -118 -1932 -3668 -3831 -1732 1738 4480 4887 2543 -1455 -4951 -5567 -2564 1314 3847 4657
3918D657j615k963k359o83Q56O11J031J673J505P18j280k328k937k203J062M197
$$ 4657 3042 79 -2280 -2963 -2107 -1496 -465 1208 2713 3431 2151 -177 -3114 -5317 -4255 -58
3934e8L637J903j584k931l570k279J309K599K873O82L65q63j345j692j316o58
$$ -58 3579 5482 3898 967 -2603 -4882 -3573 -974 1899 2581 2946 2083 738 -954 -2270 -2928
3950b928k1J722K942K752Q3k700l722l065l07K248M548K969m5k188k766k186q55
$$ -2928 -2949 -1227 1715 4467 4550 1850 -1872 -4937 -5244 -2996 1552 4521 4476 2288 -478 -2664 -3519
3967c519Q65J763J586N99J360N28j221k563k995o32R50K984L956J972j480m020
$$ -3519 -2654 -891 695 1294 2654 3182 1961 -602 -3597 -4229 -3279 -295 3661 5633 4153 133
3983A33l341j724J135K770L380J613j035j961r79j361r71n75J068J384J917K254
$$ 133 -3208 -4932 -3797 -1027 2353 3966 2931 970 -9 -1370 -2341 -2916 -1848 -464 1453 3707
3999C707N77k623l765k755L85K426L460L048M58k344m188j931L16J009J641J950
$$ 3707 4284 1661 -2104 -4859 -4474 -2048 1412 4460 4918 2574 -1614 -3545 -3229 -2220 -579 1371
4015A371J026k83k89j011j661k453j114J404L259L307J510j323l534l978j259
$$ 1371 2397 2114 1825 814 -847 -3300 -4414 -3010 249 3556 5066 3743 209 -3769 -5028
4030e028J587L265K509J890q95k449k040j091K45k62P61J558J975J316l96j388
$$ -5028 -3441 -176 2333 4223 3328 879 -1161 -2252 -2007 -2269 -1508 50 2025 3341 2945 1557
4046A557l313l221O7L144M320J830j12k088l400k680q6K238K307J300L05K21p24
$$ 1557 -1756 -4977 -4910 -1766 2554 4384 4272 2184 -1216 -3896 -3982 -1744 563 1863 2168 2389 1665
4063A665j621j008j465j131Q85K973L673O32j262l350l658j705J188M292L168
$$ 1665 44 -964 -2429 -3560 -2675 298 3971 4603 3341 -9 -3667 -5372 -4184 108 3276
4078C276J049j672j928j999j442m2J367R40R27J459J354n09k171k587k247J07
$$ 3276 4325 2653 725 -1274 -2716 -2758 -1391 -451 476 1935 3289 2780 609 -1978 -4225 -4118
4094d118K234L994K814l31k675l824j904l77J808L408J827j60r68q13j193j361
$$ -4118 -1884 2110 4924 4593 1918 -1906 -3810 -4187 -2379 1029 2856 2696 1728 915 -278 -1639
4110a639j103J78R22K219K360J508j465l596l223p67J188L583L027J399j334l269
$$ -1639 -2742 -2564 -1642 577 2937 4445 2980 -616 -3839 -4606 -3418 165 3192 4591 3257 -12
4126a2j725j198K42J165J871J153P25L0m11j392k839j455L75K541L068K581k38
$$ -12 -1737 -2935 -2693 -1528 343 1496 2221 2251 1840 448 -2391 -3846 -3471 -930 2138 4719 4481
4143D481k476m126k509R06K274K490K058K93j313k160q66l86q12j85J264K224
$$ 4481 2005 -2121 -4630 -3724 -1450 1040 3098 3391 2078 -82 -948 -1334 -2146 -2331 -1067 1157
4159A157J676Q77j278k793l543j291K253L373K950R93j026l345k814p13J129J727
$$ 1157 2833 3710 2432 -361 -3904 -5195 -2942 431 3381 4374 3348 3 -2811 -3524 -2395 -668
4175f68J146J102Q27k64r80j484j566j500m5K314L798J655k81k880l128k681K71
$$ -668 478 1580 2407 2143 1163 -321 -1887 -3387 -3432 -1118 2680 4335 4054 1174 -1954 -4635 -4364
4192d364L100L233J615m33j444j839j766m20O93M40M07J686K128K15j669k256
$$ -4364 -1264 1969 3584 3151 1707 -132 -1898 -2318 -1625 -1185 -778 908 3036 3251 1582 -674
4208f74k534j226J118M007L316O76k069k908k520j233J023K776J696N65p7l48
$$ -674 -3208 -4434 -3316 691 4007 4683 2614 -294 -2814 -4047 -3024 -248 1448 2013 1936 1588
4224A588p49j425j480r38N20J596K958K353l59l099l955j285K85K564L401K025
$$ 1588 839 -586 -2066 -3004 -2484 -888 2070 4423 4064 965 -2990 -4275 -3990 -1426 1975 4000
4240D000o72k101k325o38m09M14O40J519R25O32R71j403k761k430l79J804L054
$$ 4000 3328 1227 -1098 -1736 -2145 -1731 -1091 428 1353 1985 2956 1553 -1208 -3638 -4017 -2213 841
4257H41K772J023j776l882k377n14J391K429J947R97r42q18j203o90j192o88O78
$$ 841 3613 4636 2860 -1022 -3399 -3913 -2522 -93 1854 2851 1909 1091 -112 -802 -1994 -2682 -2004
4274b004K147J978J452j38k134l785k258J252K297L158K160k78k865k501j453
$$ -2004 143 2121 3573 3435 1301 -2484 -4742 -3490 -1193 1965 4125 3847 982 -1519 -2972
4289b972L06J422Q52J232J015N45n58q62j674k541o70J876L013K398J088j836
$$ -2972 -2666 -1244 -392 840 1855 2400 1842 980 -694 -3235 -3905 -2029 984 3382 4470 2634
4305B634l132l172n72K287K432J899K57n05j396j701m44m09Q6N71J116K358J387
$$ 2634 -498 -3670 -4242 -1955 477 2376 2633 2128 732 -969 -1413 -1822 -1736 -1165 -49 2309 3696
4322C696j058k066k705k110L96K920L732J278n21l111k000j531M72J695J766M79
$$ 3696 2638 572 -2133 -4243 -3847 -927 2805 4083 3562 451 -1549 -3080 -2608 -913 853 1332
4338A332M61K23n14r93k030j091m41J061K824L016M67k259l288k260q68J871L287
$$ 1332 1793 2016 1502 509 -1521 -2612 -3053 -1992 832 3848 4315 2056 -1232 -3492 -4360 -2489 798
4355G98K380K01j681j692j460l68J03M85P57Q66J456J377o40k600k442j517M67
$$ 798 3178 3379 1698 6 -1454 -1822 -1719 -1234 -477 389 1845 3222 2582 -18 -2460 -3977 -3510
4372c510K619L076K495r92l176k755j232N93J929J879Q23L63o09p36j031j193
$$ -3510 -891 2185 4680 3688 512 -2243 -3475 -2882 -953 926 1749 2112 1503 767 -264 -1457
4388a457j104K85Q45K709J966O73j787l232k606l48J960K865K366L89j457k749
$$ -1457 -2561 -2276 -1431 1278 3244 3917 2130 -1102 -3708 -4056 -2096 769 3135 3524 2067 -682
4404f82j373j41O43N69P54J301Q33N86n88j618k595j601R19K775K892J450q66
$$ -682 -2055 -2196 -1553 -984 -230 1071 1904 2490 1902 284 -2311 -3912 -2993 -218 2674 4124 3258
4421C258l028k705j537J041K305K205Q69l8r31j326j078k07n37l88J230J986K215
$$ 3258 230 -2475 -4012 -2971 -666 1539 2408 2370 1439 113 -965 -1172 -1709 -2097 -867 1119 3334
4438C334r9j557l156k092l49K173L147K093L65j921k645j370n52R30J152R30Q39
$$ 3334 3235 1678 -1478 -3570 -3919 -1746 1401 3494 3859 1938 -707 -2077 -2629 -1699 -547 383 1222
4455A222O49K57q90j695j686j035L42K469K974J438j013l058k702j153J087K264
$$ 1222 1871 2128 1238 -457 -2143 -3178 -2836 -367 2607 4045 3032 -26 -2728 -3881 -2794 -530
4471e30K436R01p08j015j440q48m21J2J48J543J346J527J55j593l321j612p14
$$ -530 1906 2807 2099 1084 -356 -1204 -1625 -1613 -1465 78 1424 2951 3106 1513 -1808 -3420 -4134
4488d134K084L585K061q5j675k475k331L17R93J448J069Q85o4l32p70j064j735
$$ -4134 -2050 1535 3596 3511 1836 -639 -2970 -2653 -1660 -212 857 1742 1678 1346 576 -488 -2223
4505b223m89N09K250K619J074p11k848k804j288R36K760K313J187r11j720j386
$$ -2223 -2712 -2203 47 2666 3740 3029 181 -2623 -3911 -2975 -215 2098 3285 2374 654 -732
4521g32r25p4L07M04J000J481J107Kj500k536k220K72J789K995K462l01j997k575
$$ -732 -1657 -1731 -1424 -1020 -20 1461 2568 2570 1070 -1466 -3686 -3414 -1625 1370 3832 3531 1534 -1041
4539a041k144J17J628K051Q26M42m27m96p38j089j007m74O27K017K198J320j093
$$ -1041 -3185 -3068 -1440 611 1437 1879 1452 956 218 -871 -1878 -2352 -1725 292 2490 3810 2717
4556B717k880k708j032J147K900K391R64j068k257j314q02J19O90P35J181M86
$$ 2717 -163 -2871 -3903 -2756 144 2535 3499 2431 174 -1140 -1942 -1823 -1133 -398 783 1269
4572A269O53Q8j220k247j660p1J825K752K614o8k552k814k032L68J652K317J066
$$ 1269 1922 2010 790 -1457 -3117 -3188 -1363 1389 4003 3935 1383 -1431 -3463 -3095 -1443 874 1940
4589A940J81p82r20j091l67q76j14P34J633J810J024q14k529k704q77J236K751
$$ 1940 2121 1339 419 -672 -1039 -1915 -2029 -1295 338 2148 3172 2358 -171 -2875 -3752 -2516 235
4606B35K390P37r52k466j658n65M44R70J486M05O33J13m29p64j851j807M8K184
$$ 235 2625 3362 2410 -56 -1714 -2279 -1835 -865 621 1026 1659 1772 1343 579 -1272 -3079 -3031 -847
4624h47K402K011j62k060k794j956K77J963K820Q46k53p44j506r38l66k85J13
$$ -847 1555 3566 3404 1344 -1450 -3406 -3129 -1166 1654 2500 2247 1503 -3 -941 -1307 -1592 -1479
4641a479N47J817J427K46n87k208k480j164J202K884K538O56j300j978k424n51
$$ -1479 -932 885 2312 2558 1971 -237 -2717 -3881 -2679 205 2743 3399 2099 121 -2303 -2854
4657b854P67K094R57R4L19N8l54j167j183j143lJ661K041J934J36k314k897j649
$$ -2854 -2087 7 964 1058 1377 1435 1081 -86 -1269 -2412 -2415 -754 1287 3221 3357 1043 -1854 -3503
4675c503M45J821K828J501p90j471j257j034k74K70O82M70J391P92O47q15k245
$$ -3503 -3058 -1237 1591 3092 2302 831 -426 -1460 -1734 -1464 -782 -312 1079 1871 2518 1703 -542
4692e42j973p22J222K075K788J168j684k810k038l75J099J562J671O92l81p70
$$ -542 -2515 -3237 -2015 60 2848 4016 2332 -478 -2516 -2891 -1792 -230 1441 2133 1752 982
4708I82n97o33j216q32K14J915J640J730Q4j890l144k057Q65J999K621J359k54
$$ 982 385 -248 -1464 -2296 -2082 -167 1473 3203 3287 1397 -1747 -3804 -2939 -940 1681 3040 2786
4725B786j943k097p13J90P03M88P60J062O18o7k65j756k134j005J355K737K071
$$ 2786 843 -1254 -1967 -1777 -1074 -586 174 1236 1854 1787 1522 -234 -2368 -3373 -2018 719 2790
4742B790R35j674k236k499o80J654J899J383K73l80r71q76k05l79l92l08J421
$$ 2790 3725 2051 -185 -2684 -3364 -1710 189 1572 1845 1465 494 -382 -587 -966 -1358 -1666 -245
4759b45J793J234j91k049k035j876J10K367L172J052p44j581k106j135K14J063
$$ -245 1548 2782 2591 542 -1493 -3369 -3259 -892 2280 3332 2588 1007 -1099 -2234 -2020 -957
4775i57J114L74M62N98j25q09j168j491o86P33K629K058R78j949k552j802n17
$$ -957 157 531 993 1591 1466 657 -511 -2002 -2688 -1955 674 2732 3710 1761 -791 -2593 -3110
4792c110J214K395J788m01o61o63q63j040l48L61L95J073J103J383q3k054k362
$$ -3110 -1896 499 2287 1886 1225 562 -301 -1341 -1689 -1328 -933 140 1243 2626 2543 489 -1873
4809a873r65K87J772K564J670n47k666j743p51J01J288J444O41j27J41k1o75j142
$$ -1873 -2838 -2551 -779 1785 3455 2908 242 -1501 -2252 -2151 -863 581 1222 1095 1236 1215 540 -602
4827f02j602m62J421J856J634J178j356l122j946J63J297J985J713K39q63j999
$$ -602 -2204 -2666 -1245 611 2245 3423 2067 -1055 -3001 -2838 -1541 444 2157 2396 1533 -466
4843d66q62K77N0%M12J471M28O59L15j543k541j479M63K517K132J239j74k357
$$ -466 -1328 -1051 -1001 -1001 -589 882 1310 1969 2284 741 -1800 -3279 -2816 -299 1833 3072 2898 541
4861E41k487j076R50J473J015J279J44o51o97q67m58o98o78J116J963J700J01
$$ 541 -1946 -3022 -2072 -599 416 1695 1839 1188 491 -376 -834 -1532 -2210 -1094 869 2569 2670
4878B670j092k566j915o74K080K431J121L62j026j512j676j36P00N60O81K73J289
$$ 2670 1578 -988 -2903 -3577 -1497 934 2055 2417 1391 -121 -1797 -1933 -1233 -673 8 281 1570
4895A570J47l97j328j549j056l06K511K666J122p98k197j958j468O91K052J771
$$ 1570 1717 1320 -8 -1557 -2613 -2919 -408 2258 3380 2582 385 -1573 -3041 -2350 -298 1473
4911A473L73n61o35o80n60n33l00l0O60J439J600P22j750k145j717m95J261K632
$$ 1473 1846 1285 650 -30 -590 -1123 -1423 -1453 -793 646 2246 2968 1218 -927 -2644 -3139 -1878 754
4929G54K229l6j747j750r62j80K57J280P61K08K19K70j80j296j607p01O13J130
$$ 754 2983 2947 1200 -550 -1512 -1692 -1435 -155 606 814 1033 1303 1123 -173 -1780 -2481 -1868 -738
4947g38K220J761m35k751k108o89O81J584J930R85n87j433j044n76K58p00M28
$$ -738 1482 3243 2808 57 -2051 -2740 -2059 -475 1455 2440 1853 420 -624 -1200 -942 -1642 -1214
4964a214R04J113J050M51j213j964j892k33J738K084J834L37j475k536j419M79
$$ -1214 -310 803 1853 2304 1091 -873 -2765 -2998 -1260 824 2658 2995 1520 -1016 -2435 -1956
4980a956J154R51L81O51J51l88o65m60j117r59L67J856K078Q64o94j806k562j421
$$ -1956 -802 149 530 1181 1332 944 279 -181 -1298 -2257 -1890 -34 2044 2908 2214 408 -2154 -3575
4998c575J492K106J723N31n69j411j269l95J99L08M66K48R53R62K16j292j310
$$ -3575 -2083 23 1746 2277 1708 297 -972 -1367 -1168 -860 -394 -146 807 1769 1985 693 -617
5015f17k029k53J650K492J745l97j557j798j607j28J609J406Q45k75N6m31o84
$$ -617 -2646 -2899 -1249 1243 2988 2591 1034 -764 -2371 -2499 -890 516 1361 1086 1142 711 27
5032B7p07l28o65qJ474K044R69q89k087k057p92O18K148K321O62j206j313j443
$$ 27 -680 -1008 -1673 -1681 -207 1837 2806 1917 -170 -2227 -3019 -2401 -253 2068 2730 1524 211 -1232
5050a232m85J03J137L91N56Q5J038J70j258j624r65j25R68K126J743L80j975k266
$$ -1232 -1717 -1614 -477 -86 470 555 1593 1763 505 -1119 -2084 -2209 -1241 885 2628 3008 1033 -1233
5068a233j235j44J508J715R91o2p25o89K8q71m43j18L58J173J287Q08j02k544
$$ -1233 -2468 -2612 -1104 611 1602 1540 815 126 154 -717 -1160 -1278 -920 253 1540 2348 2246 -298
5086b98j992n04O70K173J878J051q74k104j625j57M34O99R30N41J72n8j36l73
$$ -298 -2290 -2794 -2124 49 1927 2978 2104 0 -1625 -1782 -1348 -649 281 822 994 936 800 427
5104D27j131j160n78J911J673J361L18j592k607j612L14J616J931J091m55n29
$$ 427 -704 -1864 -2442 -531 1142 2503 2821 1229 -1378 -2990 -2676 -1060 871 1962 1507 978
5120I78j034o76K45l84NP5J188J331L10l86j670j745j200Q27K311J916O58r70
$$ 978 -56 -732 -487 -871 -866 -791 397 1728 2038 1652 -18 -1763 -2963 -2136 175 2091 2749 1779
5138A779j817j743l27M73J506O96L62m1j64j52n80p99q25r7Q93J962J610m22j134
$$ 1779 -38 -1781 -2108 -1635 -129 567 929 888 724 572 -8 -807 -1632 -1729 -836 1126 2736 2314 1180
5157A180k527j385K44J551K166J040m32j431q40p87j24P91K38J90O06P45N87n18
$$ 1180 -1347 -2732 -2488 -937 1229 2269 1837 406 -434 -1221 -1345 -554 -316 -126 480 1225 1812 1294
5175A294j397j644n38K59J972K113P56j288j773j656o62J069J562Q74O91o97m44
$$ 1294 -103 -1747 -2285 -2026 -54 2059 2815 1527 -246 -1902 -2564 -1495 67 941 1632 935 491
5192D91j37o65n65m54L9R21J471J336l26r73k466j453M86J460J898J265l19j327
$$ 491 354 -311 -876 -1330 -1291 -370 1101 2437 2111 1138 -1328 -2781 -2295 -835 1063 2328 2009 682
5210F82j250q39K87J75J034LN84M52K73m58j137j522o30P99J933J925K74q12j968
$$ 682 -568 -1407 -1120 -945 89 92 676 1128 1401 943 -194 -1716 -2346 -1547 386 2311 2585 1773 -195
5229a95k092k01P93J783J092O62p71p41m15o69pl54l3J050J107R72J88j223k330
$$ -195 -2287 -2488 -1695 88 1180 1842 1071 330 -85 -754 -761 -1115 -1148 -98 1009 1981 2169 946 -1384
5248a384j208K4J912K325O59r3j606j401j063N85P12M76P34K70P6k39o3r03j218
$$ -1384 -2592 -2568 -656 1669 2328 2235 629 -772 -1835 -1250 -538 -62 672 942 1018 779 716 -187 -1405
5267a405o66P46J640J636O16p61j916j982n45J093J677J390K18o74j086l61n19
$$ -1405 -2071 -1325 315 1951 2567 1806 -110 -2092 -2637 -1544 133 1523 1741 1067 -19 -380 -899
5284h99m9o5K29N46J287P01k41j303j411j189K08J660K010R23k66j605j880p61
$$ -899 -948 -1013 -784 -238 1049 1750 1509 206 -1205 -2394 -2186 -526 1484 2407 2141 536 -1344 -2105
5302b105L58J217R26N72J81m29m41K7j110n32m71Q63J371J255O80p35k046j911
$$ -2105 -1747 -530 396 968 1149 720 279 306 -804 -1336 -1807 -944 427 1682 2362 1627 -419 -2330
5320b330l15J283J930J475j42o71j066r89m10K44N18R6L30J100L12j2q37j472
$$ -2330 -2645 -1362 568 2043 1901 1230 164 -825 -1235 -991 -473 -377 -47 1053 1365 1353 516 -956
5338i56r66K2J430J904J385q34j577j962n39P7J723R21K82j02n53j95j31p31k87
$$ -956 -1922 -1900 -470 1434 2819 1985 408 -1554 -2093 -2016 -293 628 910 808 255 60 -71 -802 -1089
5357a089n12O72R83J896O08j243j731j707n50J239J789J493L79j112j672p06K39
$$ -1089 -1601 -929 54 1950 2558 1315 -416 -2123 -2673 -1434 355 1848 2227 1115 -557 -1263 -1024
5374a024K56O98J14J94K20Q08j26r10j355q12m6J458K016J231l44k105j882l68
$$ -1024 -768 -70 44 238 458 1266 1140 230 -1125 -1937 -1983 -525 1491 2722 2378 273 -1609 -1977
5392a977K34J060J752M02l61p85n76M9n14k32j26O35R45Q24N29o40j996j237m12
$$ -1977 -1743 -683 1069 1471 1110 325 -251 -202 -716 -948 -1074 -439 506 1330 1859 1219 -777 -2014 -2426
5411b426J257J951J153K91j060j840p39M6O89P62M30k0M14k89K1m20j192q80J33
$$ -2426 -1169 782 1935 2226 1166 -674 -1413 -1367 -678 84 514 494 908 619 640 220 -972 -1852 -1719
5430a719J677J468J037r7j796j848j482J169J465J360N48k17q44j194m24J99J15
$$ -1719 -42 1426 2463 2366 570 -1278 -2760 -1591 -126 1234 1782 1565 721 -473 -897 -698 -583
5447e83k70M20Q91R76j31m39j043j807k93J338J694J514p0j216j572j376J19J048
$$ -583 -853 -433 458 1434 1303 864 -179 -1986 -2279 -941 753 2267 2197 981 -591 -1967 -1848 -800
5465h00J054N73j25l7J93n80p28l88m50j49J220J668J012q93j515j391q52J40
$$ -800 254 827 702 665 858 278 -450 -838 -1288 -1437 -217 1451 2463 1570 55 -1336 -2188 -2048
5483b048K112J347M61l93j372n58k59l6P2N75k73P76P21L15o52j407r08m55R25
$$ -2048 64 1411 1872 1479 107 -451 -710 -746 -674 -99 -372 404 1125 1440 788 -619 -1527 -1982 -1057
5502a057J945J128K00j372j645j198n3J389J401L38K8o55k88j17l23o75k7k4P37
$$ -1057 888 2016 2216 844 -801 -1999 -2052 -663 738 1076 1104 449 161 44 -279 -954 -981 -1005 -268
5521b68J243R54R3j877j937n12P17J122J757O76m96j453j155j11N05L42P50J42
$$ -268 975 1929 2022 145 -1792 -2304 -1587 -465 1292 1968 1472 19 -1136 -1247 -742 -400 350 492
5539D92M2L33L68n77j114j325j05J197J523J105O44j131k481r19J09J180J239
$$ 492 534 867 1235 658 -456 -1781 -1886 -689 834 1939 2583 1452 -1029 -1948 -1839 -659 580
5556E80O99o2l35j212k90J56m7m10o1J096J181L97k70j116j931n52L06J769J423
$$ 580 1279 1217 882 -330 -620 -464 -511 -921 -982 114 1295 1692 1422 306 -1625 -2177 -1871 -102 1321
5575A321Q37p36j306j449l02N53R64N25PN57j15j18o42p17q72l51O99J866J315
$$ 1321 2158 1422 116 -1333 -1635 -1082 -118 407 414 971 856 738 96 -621 -1493 -1844 -1145 721 2036
5594B036r8j174j350j292j77J274J779O92k25q19q13o47LK27M4R6L53J155O45
$$ 2036 1938 764 -586 -1878 -2055 -781 998 1690 1465 646 -167 -814 -811 -584 -540 -444 -91 1064 1709
5613A709k25j589j004j076O11J427J899L91j070j127j158m17M99J118R14j85k61
$$ 1709 1484 -105 -1109 -2185 -1574 -147 1752 2143 1073 -54 -1212 -1629 -1130 -12 902 717 456
5630D56k8M7k84q19n51k9N88J234J354L50j698j709r08J21R47J593J060m5j325
$$ 456 428 475 191 -628 -1179 -1208 -620 614 1968 2318 620 -1089 -1997 -1876 -929 664 1724 1679 354
5649C54j034k67K97j40L28L28M26K19O64n9j116j374n06L98J172J720P56o07j645
$$ 354 -680 -947 -650 -790 -462 -134 292 511 1175 1116 0 -1374 -1880 -1482 -310 1410 2166 1559 -86
5668h6j482r8R18P49Q06J22k31n65l0k47k96q54L13P00J173N66K91r14j535j553
$$ -86 -1568 -1666 -748 1 807 929 698 133 103 -144 -440 -1294 -981 -281 892 1458 1749 835 -700 -2253
5688b253K76J470J486Q77j02r72j579k31L57N30Q7O3M83L39l5K00p22j340o86
$$ -2253 -1977 -507 979 1856 1754 782 -797 -1028 -671 -141 -54 9 492 831 796 996 274 -1066 -1752
5707a752L04J606J373O97j098j322j626j24Q22J573P68k19j46o07l88m59K78k32
$$ -1752 -1448 158 1531 2228 1130 -192 -1818 -1942 -1120 453 1221 1002 856 249 -139 -598 -320 -552
5725e52k42K62J118R46J92j232j248j054k03J099K152R09l38j451j088o46M04
$$ -552 -794 -532 586 1532 1724 492 -756 -1810 -2013 -914 1238 2147 1809 358 -730 -1376 -972
5742i72L95Q49K80k56N74n0o19n42n08m22O8R54J470J034q87j700j221k00O20
$$ -972 -577 272 552 296 870 820 201 -341 -849 -1271 -1203 -249 1221 2255 1368 -332 -1553 -1753 -1133
5761a133J212J566k74q35o21l40J09m10J57q0N83O56M67N24j158j141j108K23
$$ -1133 79 1645 1371 536 -85 -425 -316 -726 -569 -649 -66 590 1057 1581 423 -718 -1826 -1603
5779a603J165J143J780q50j243j677j07M97N83J008j47K58m59K45q2n64q19k72
$$ -1603 -438 705 2485 1635 392 -1285 -1392 -895 -312 696 549 807 348 593 511 -53 -872 -1144
5797a144J60J218R18O53m84j325k003J34J076J340R09K8n84j175o26Q1M41Q0K25
$$ -1144 -984 234 1152 1805 1321 -4 -2007 -1873 -797 543 1452 1480 896 -279 -905 -824 -383 -303 -78
5816g8K79M67ML33n76j209q13n6J256J376R49n47j096j135r25N50J026Q24K01
$$ -78 201 668 672 1005 429 -780 -1593 -1649 -393 983 1932 1385 289 -846 -1771 -1221 -195 629 830
5835H30o1l38l75m47k7j56n89M70R31R59N20n73j399j352n25Q94J924J082l98
$$ 830 769 431 56 -391 -418 -574 -1163 -693 238 1197 1717 1144 -255 -1607 -2132 -1238 686 1768 1370
5854A370p31q38r26j54R97M98k16K52L14L39l07n60p79p39rJ082J486R67n38j117
$$ 1370 639 -199 -1125 -1279 -282 216 0 252 566 905 598 38 -741 -1480 -1489 -407 1079 2046 1508 391
5874C91j279r56K96J390J175M01m34j035l24j01J16j27K1J29L96P73P51o58j394
$$ 391 -888 -1844 -1548 -158 1017 1418 984 -51 -375 -476 -360 -487 -466 -337 59 832 1583 925 -469
5893d69j038k12M91J484J483Q5j025j422k21K9J96M07O59J1k65Q4J74m09n96j071
$$ -469 -1507 -1719 -1228 256 1739 1824 799 -623 -844 -815 -619 -212 447 458 193 277 451 42 -554 -1625
5913a625L59J018J163Q80j33j388j655l90M98J082Q43Q60m11j003l46k23K21k11
$$ -1625 -1266 -248 915 1795 1662 274 -1381 -1771 -1273 -191 652 1512 1101 98 -248 -471 -250 -461
5931d61J39L15K06Q23m7j0j186j315j18P54J308J161M02r43j359j001p4R93O80
$$ -461 -322 -7 199 1022 975 965 -221 -1536 -1654 -900 408 1569 1971 1028 -331 -1332 -1406 -413 267
5950B67M76j27O1n21q2m9l98p85k9P84J697O83n29j285j239q65O96J249J026L75
$$ 267 743 616 677 156 74 25 -373 -1158 -1187 -403 1294 1977 1448 163 -1076 -1941 -1245 4 1030 1405
5970A405k83r66j045QL06L93J55l0K61P04R5m43j024r15k08Q14J011J410J70j008
$$ 1405 1122 156 -889 -881 -575 -182 -27 -57 204 908 1003 560 -464 -1379 -1587 -773 238 1648 1818 810
5990H10j327q87K38P28J298k25K12m60k51j78k22j70l17oO20R57N60k3j168j048
$$ 810 -517 -1404 -1166 -438 860 635 847 387 136 -42 -264 -434 -751 -757 -137 820 1380 1357 189 -859
6010h59q80K71J330J355K65l50j100o55n39N05P24M6K61P0M4N20o09m63r69n04
$$ -859 -1739 -1468 -138 1217 1482 1132 32 -623 -1162 -657 67 113 374 444 488 1008 399 -64 -1033 -1537
6030a537O32J296J099M81r12j633j192M66Q81R58O74p0r37l09k49R4j42j28J73
$$ -1537 -905 391 1490 1971 1059 -574 -1766 -1300 -419 539 1213 1143 206 -103 -352 -258 -400 -528 -355
6049c55O25N93M14j7j171j116n26L30J252J113O76n90j251q00m65J055L62L09
$$ -355 270 863 1277 1260 89 -1027 -1553 -1223 29 1142 1818 1228 -23 -823 -1288 -233 129 438
6067D38O3l05K21L51o50j69j025l62O61J234R52L25q07j546p85j0P85J375M05
$$ 438 501 196 417 768 118 -51 -1076 -1438 -777 457 1409 1734 927 -619 -1404 -1414 -629 746 1151
6086A151k38m95r87l7L63l34J25J52M31L78L60J53p99j283p20M82J424Q80P46
$$ 1151 913 418 -569 -606 -243 -577 -452 -300 131 509 869 1022 223 -1060 -1780 -1298 126 1006 1752
6105A752q50j082n36q17P19P27Q04k76K34l51j63j30n87o6n90P72J077O39L31
$$ 1752 902 -180 -716 -1533 -814 -87 717 441 675 324 161 31 -556 -622 -1212 -440 637 1276 1607
6124A607q64j544p24l5J253J272L39j78r79l74o23J87M25j6M80j84L34K48J66
$$ 1607 743 -801 -1525 -1560 -307 965 1304 1126 147 -227 -850 -663 -238 -254 226 42 376 624 790
6143G90o89j061l26J02J313J034M82n73j136j289k01Q99Q69M31J36q5k81o64J39
$$ 790 101 -960 -1286 -1184 129 1163 1645 1072 -64 -1353 -1554 -655 214 645 781 696 415 -249 -110
6162a10m1l79o2Q7R62J245m40o04j183j122j1J255J420N40l23r81q53n06M60M69
$$ -110 -151 -530 -592 -505 457 1702 1262 658 -525 -1647 -1658 -403 1017 1557 1234 253 -600 -1106 -646 -177
6182a77O2N60l41M87J36l60K5j160l62j01J312J086M36n29j568o15l70N65R94
$$ -177 -115 445 104 591 727 367 392 -768 -1130 -1231 81 1167 1603 1074 -494 -1109 -1479 -914 80
6201H0Q39J87r92J30m81j7r4Pk4J51N82O40J73q51j147l85jQ20J183O25k94j064
$$ 80 919 1106 114 244 -237 -254 -348 -341 -365 -214 368 1008 1181 330 -817 -1202 -1203 -383 800 1425 1131 67
6223F7j070j76O53K60N29k7K69k96p3N92o99o49o71N45M88J641L20m95j065j857
$$ 67 -1003 -1179 -526 -266 263 236 505 209 136 728 29 -620 -1291 -746 -258 1383 1703 1208 143 -1714
6243a714K93M27J253Q68N4o18o82m97R8K35k60O7L99L98L29M08n23j118j071L49
$$ -1714 -1421 -994 259 1127 1181 563 -119 -616 -518 -283 -543 -476 -77 321 650 1058 535 -583 -1654 -1305
6263a305R28J258P50m61r10j317l96O61O70L59R7O1Pk92O3j77o21m04J45J100
$$ -1305 -377 881 1631 1170 260 -1057 -1453 -792 -122 237 334 395 402 110 173 -4 -625 -1029 -884 216
6283B16O73N03n54j098o86n54P99J394N71j00p78m75m29N5K28L16l04L13J49M74
$$ 216 889 1392 838 -260 -946 -1500 -701 693 1264 1164 386 -89 -518 -463 -235 81 -223 90 239 713
6303G13J47p15n80n08l52Q84R99Q98j22j012j086m98J52P13J207n2j51p12O6k12
$$ 713 860 145 -435 -943 -1295 -411 588 1486 1364 352 -734 -1232 -1080 -367 840 788 637 -75 -9 -221
6323b21l23J17k94RQ89Q02L15p07p95j081k25O07J072Q88P9n16j035m96P0K58
$$ -221 -544 -427 -721 -712 177 979 1294 587 -208 -1289 -1514 -907 165 1053 1132 616 -419 -915 -845 -587
6343e87Q94k09J29O0K04K55m85j167j72j29P92P52J204n3j044j336n50M63Q03
$$ -587 307 98 227 287 491 746 261 -906 -1078 -1207 -415 337 1541 1488 444 -892 -1442 -979 -176
6362a76Q84K33k93o41k33j34J09Jk11J79N46O48J02j40j402p13m64J011J085Q46
$$ -176 708 941 648 7 -226 -360 -251 -250 -461 -282 264 912 1014 874 -528 -1241 -1705 -694 391 1237
6382A237L20q15j306p47M74O92N89k51L58m3k45p1J27o98n17l24J090J032L74
$$ 1237 1557 742 -564 -1311 -837 -145 444 193 551 508 263 192 319 -379 -896 -1220 -130 902 1276
6401A276J40p47j497p87N28R40Q52L86m41m07k73o61K70M63j76k08L34O18K14
$$ 1276 1416 669 -828 -1615 -1087 -147 705 1091 650 243 -30 -691 -421 42 -134 -342 -8 610 824
6420H24q7n47j010o38O83J363P25R3p01q61o15l68P90N82K23k65j40L02j50k30
$$ 824 737 190 -820 -1458 -775 588 1313 1406 705 -156 -771 -1139 -349 233 456 191 51 353 203 -27
6440b7m21J26l43J43J338J64K5p91j209j66J73R36J260J99p99n87n49J66q0N96
$$ -27 -448 -322 -665 -522 816 980 1005 214 -995 -1161 -988 -52 1208 1407 608 21 -528 -362 -442 154
6460A54J08j35k04M99N06k92o80p66q2L59P16J138L52j080j310m13K22N51P71
$$ 154 262 127 -77 422 928 636 -44 -810 -892 -533 183 1321 1673 593 -717 -1130 -908 -357 414
6479D14M43j11o10k04N4j40m28j70L69n8P77P74j88k99j477o04P57J022O76L58
$$ 414 857 746 136 -68 -14 -154 -582 -752 -383 -441 336 1110 922 623 -854 -1458 -701 321 997 1355
6499A355n14p48r77K47M20J30O8k2L06J34k9P6n40r18J3Q00M91Q69J40n83j290
$$ 1355 841 93 -884 -637 -217 -87 -19 -41 265 399 370 446 -94 -1012 -999 -199 292 1161 1301 718 -572
6520e72r50O82N82P75K52K14n90r18K61l5N18o61k80P30N37M74p0q31r88k76M4
$$ -572 -1522 -840 -258 517 769 983 393 -525 -264 -299 219 -442 -722 8 545 1019 949 118 -870 -1146 -1102
6541a102J208R28J70j57q73j024j73M83N77M38l71L09j49L6j46k63m81k36P4J144
$$ -1102 106 1034 1204 1047 174 -850 -1023 -540 37 475 104 413 264 300 154 -109 -590 -826 -752 392
6561C92P72K38r96p76q28j87R01J157M46n53m16k48k27j04K94L5M9l40N53N96
$$ 392 1164 1402 406 -370 -1198 -1385 -484 673 1119 566 150 -98 -325 -429 -135 -100 -51 -391 162 758
6581G58q7o79o93k04j3Q75J368mk99j168p67j50M23P41N81k93j59m72K66L20q53
$$ 758 671 -8 -701 -905 -918 -43 1325 1321 1022 -146 -913 -1063 -640 101 682 389 230 -242 24 344 -509
6602e09j65K54p8P09P42K57n06j390q72O18M36J182M53m21n39o88P1R1K42J55
$$ -509 -674 -420 -498 211 953 1210 704 -686 -1558 -940 -504 678 1131 710 171 -517 -446 -355 -113 42
6622D2pLL41J52J38m69r20n28P60L11J169L50k17j084j099j31O77M62P15R4l19
$$ 42 35 38 379 531 669 200 -720 -1248 -488 -177 992 1342 1125 41 -1058 -1189 -512 -50 665 759 440
6643D40m67N3l0ok42n32N32N71N47Mm84p14p53j43J038Q97M71j22n86o42p75N49
$$ 440 -27 26 -4 -10 -252 -784 -252 319 866 870 386 -328 -1081 -1224 -186 711 1182 1060 474 -168 -943 -394
6665c94M68K77k68l1L82j30J09k88o45p25N38N79R71J20m23n46r86m95Q02Q79
$$ -394 74 351 83 52 434 304 413 125 -520 -1245 -707 -128 843 963 540 -6 -992 -1487 -685 194
6685A94R18l49n30j65m12K46j47pL8P5J32N72N13r76n07p46J89M58J095N96m1
$$ 194 1112 763 233 68 -344 -98 -245 -252 -214 -139 -7 565 1078 102 -405 -1151 -962 -504 591 1187 1146
6706A146p07p54n91K50O52J39J67q2k51K35k7q5l92n31N52J6R57P42m14j288o82
$$ 1146 439 -315 -906 -656 -4 135 302 220 -31 204 177 92 -300 -831 -279 -263 694 1436 1022 -266 -948
6727i48j63K97R82O76K15p54p13k34M55J38k36K25j66M87K22L56k89r24o32P9
$$ -948 -1111 -814 168 844 1059 305 -408 -642 -187 -49 -285 -60 -226 261 483 839 550 -374 -1006 -927
6747i27K81J117N82j33o48q40l89J51O97L48J21L09n36k24N88l84n65l93M09L81
$$ -927 -646 471 1053 920 272 -568 -957 -806 -109 239 360 669 133 -91 497 113 -452 -845 -436 -55
6767e5R30l6j72r24r25j38P10R67M96M38q11o38m74J71L17M1J27J0J54K90k18
$$ -55 875 839 667 -257 -1182 -1320 -610 357 853 1291 480 -158 -632 -461 -144 -103 24 34 188 478 260
6788B60K43q38o55r1P02J250J4J48q63r59k36L70O13M01K63j95p46L55l18L54
$$ 260 503 -335 -990 -1081 -379 871 885 1033 170 -789 -1025 -655 -42 359 622 427 -319 36 -282 72
6808G2o9m79M1L99O37K60m69m58o56n51O78Q98R38j47o72n87l95j45J80P13j49
$$ 72 3 -476 -435 -36 601 861 392 -66 -722 -1273 -595 303 1241 1094 422 -165 -560 -705 -525 188 39
6829C9j29J09J55L71j62q10n23mM33R71P37j11j084p08k37R8Q32O03K70k99p87
$$ 39 -90 19 174 545 383 -427 -950 -954 -521 450 1187 1076 -8 -716 -953 -855 -23 580 850 551 -236
6850b36k10K32J59J00m11K13L74K87L14j65l34j328j56O97R35M23J47n53j018
$$ -236 -446 -214 -55 45 -366 -153 221 508 822 657 323 -1005 -1161 -464 471 894 1041 488 -530
6869e30m65N43K25M42J35J5j36J7j89J64m46m17k26M57P94M47J27j007n67l77
$$ -530 -995 -452 -227 215 350 365 229 246 57 221 -225 -642 -868 -411 383 830 957 -50 -617 -994
6889i94K77N50Q91O7l61n99m29J39K29J10j83j92N85M12K31j22n54r08j90K33
$$ -994 -717 -167 724 791 430 -169 -598 -459 -230 -120 -303 -495 90 502 733 611 57 -851 -1041 -808
6909h08P67R62J16l12j120l34J4J69P70O40o30j99j41P0R5j81k80p2J38Q53K18
$$ -808 -41 921 1037 725 -395 -729 -715 -546 224 864 234 35 -106 -36 59 -122 -402 -474 -336 517 735
6930G35J61p43p15n38K66Q27M07L57J41r92l34M3L16P4j57J53J14J69J03J06m59
$$ 735 896 153 -562 -1100 -834 -7 400 757 898 -94 -428 -385 -69 5 -152 1 115 284 387 493 34
6951C4r64p8L47J149M84N0m24j046k93l10M87J019K57j67m14m43L2N10p32O0J87
$$ 34 -930 -1008 -661 488 972 1022 598 -448 -741 -1051 -564 455 712 545 131 -312 -280 230 -502 -442 -255
6972b55K78K24O69j39l31q98n76p3J225P68P5k12p62p38L32R2L38J49k16J27p3
$$ -255 23 247 916 777 446 -452 -1028 -1101 124 892 967 755 -7 -745 -413 -321 17 166 -50 77 4
6993DK47K25m25m72j69k31J152O85J17n82q38o07j06J019O24K35l11m89k78k05
$$ 4 251 476 51 -421 -590 -821 331 1016 1133 551 -287 -894 -1000 19 643 878 567 78 -200 -405
7013d05M60n8k2k5j92P52J61j68l71n00n02K2O19Q92L43l79r62k99R7K15L99M12
$$ -405 55 -3 -25 -50 -242 510 671 503 132 -368 -870 -848 -229 663 1006 627 -335 -634 -537 -322 77 489
7035D89j21k34j21P6M38o06l73k60J17N85Q57J17o26o89n34pN81P42M55l01k83
$$ 489 368 134 13 89 527 -79 -452 -712 -595 -10 847 964 338 -351 -885 -892 -311 431 886 585 302
7056C02n65j00J98J00K08l1k32K77M93j37o35o10j86K61P04O20O41p56p03j054
$$ 302 -263 -363 -165 -65 143 112 -120 157 650 513 -122 -732 -918 -657 47 667 1308 552 -151 -1205
7076a205K51L69O64N09k44L2m73K48k55K57n50l11K10N91Q26j7k28j023r37M53
$$ -1205 -954 -585 79 588 344 376 -97 151 -104 153 -397 -708 -498 93 919 902 674 -349 -1286 -833
7096h33O26M97O50k66k56q07n4n7L25M56m73R6K51o8J82l27k23m83J24Q84O23
$$ -833 -207 290 940 674 418 -389 -443 -500 -175 281 -192 -96 155 87 269 -58 -281 -764 -640 244 867
7117H67J59l94q63m07m74N35P86L55P0o93K34m22J4O5N3l82J1P59L91K66m46o01
$$ 867 1026 632 -231 -638 -1112 -577 209 564 634 -59 175 -247 -233 -168 -115 -497 -486 273 664 930 484 -117
7139a17p74k37R10R74R4J6q64l66l98L85N18J21l59k15N33J40q0m94k25k07J25
$$ -117 -891 -1128 -218 756 850 866 2 -364 -762 -377 141 262 -97 -312 221 361 281 -213 -438 -645 -520
7160e20O80J91O99k51j016l91l47O57P08L02J73q15l54M5k9J59k16J44P3J74L22
$$ -520 160 351 1050 799 -217 -608 -955 -298 410 712 885 70 -284 -239 -268 -109 -325 -181 -108 66 388
7181C88L12l96o29n64M6L80P73P94q4r24p11j93L25L76K48K66j35j43Pj40J15
$$ 388 700 304 -325 -889 -843 -463 310 1104 1020 96 -615 -808 -483 -107 141 407 272 129 136 -4 111
7202A11n11k87R5O85N77L62m02q14o97p1O65O99M92j39n15l81J02m18M18j9k08
$$ 111 -400 -687 -592 93 670 1032 630 -184 -881 -952 -287 412 904 765 250 -131 -29 -447 -29 -48 -256
7223b56L47L19k9J00o5m00o20q4L96Q10N55m68l60o50n75O36L42K91K26o93K31
$$ -256 91 410 381 481 416 16 -604 -688 -292 518 1073 605 245 -405 -980 -344 -2 289 515 -178 53
7244E3l49K58M07m00m67J29J9O17M28j15o70o94j62M61O51M72L31q59k47n66j10
$$ 53 -296 -38 369 -31 -498 -369 -350 267 695 580 -90 -784 -946 -485 166 638 969 110 -137 -703 -813
7265h13O85L94j6p10O56L19l14J86o64k86N0K22O20Q67j86r15n73j33o6Q03K99
$$ -813 -128 266 250 -460 196 515 201 387 -277 -563 -513 -291 329 1196 1010 95 -478 -611 -677 126 425
7286D25K48l11m67P7L4j42Kj65O0L5N66K11J54p21o82j95L23O63O05L31o34r58
$$ 425 673 362 -105 -28 6 -136 -134 -299 -239 -204 362 573 727 6 -676 -871 -548 115 720 1051 417 -541
7308e41L9J43L37J60J22j67n3K36J54p7k66p07L1M90L31N54J88j027l18k38K21
$$ -541 -502 -359 -22 138 260 93 40 276 430 353 87 -620 -589 -99 232 786 974 -53 -371 -609 -388
7329c88J45Q21J15m03j90o25J9L84L62l85R5K09K03OJ07p54l44p5J21Q81N11J21
$$ -388 -243 578 693 290 100 -525 -506 -122 240 -145 -50 159 362 368 475 -279 -623 -698 -577 304 815 936
7351I36n22n37n18m7M35J56K42p7l48K94K55m16no1l19M26O27J92Lm78o94n09
$$ 936 414 -123 -641 -688 -253 -97 145 68 -280 14 269 -147 -152 -213 -532 -106 521 713 716 238 -456 -965
7373i65nR98P16j54j49m49m26l3J34N11k03l47J74N25L83m19m35m01l20M82M74
$$ -965 -970 28 744 590 441 -8 -434 -467 -333 178 -25 -372 -198 327 710 291 -144 -545 -865 -383 91
7394I1P79j92n38k75m69K26k0Q81j37j97k11M7j36K55k98k02R7P0P08L24j17o76
$$ 91 870 678 140 -135 -604 -378 -398 483 346 149 -62 -15 -151 104 -194 -396 -299 -229 479 803 686 10
7416A0p47J87l22R98N18L17o11p92K1k06L01K60n7L21J02q4O9l5l08n39l6L4P10
$$ 10 -737 -550 -872 126 644 961 350 -442 -421 -627 -326 -66 -123 198 300 216 285 250 -58 -597 -633 -599 111
7439A11N55K60p78m79o20L38K17O54N13m84n1k37k17L48m90J57k77M07M07K80
$$ 111 666 926 148 -331 -951 -613 -396 258 771 287 236 -1 -218 130 -360 -203 -480 -73 334 614
7459F14J36n84o56l45J21R11J39N75n69p01k9j54P9O21K2j28K63k26K04l2l30
$$ 614 750 166 -490 -835 -714 197 336 911 342 -359 -388 -542 -463 158 180 52 315 89 293 261 -69
7480f9n65J63j64P82M72J61k56p91l13J6L30N36K15j82l17j32l58N22k45J73l48
$$ -69 -634 -471 -635 147 619 780 524 -267 -580 -564 -234 302 517 335 18 -114 -472 50 -195 -22 -370
7501c70K49M52J46n4m91l13l56K00K49J059O8m51n41m84J05Q6N26J84Q7p0k30
$$ -370 -121 331 477 423 -68 -381 -737 -537 -288 771 839 388 -153 -637 -532 -446 80 264 351 281 51
7522E1L9J02j41l38m95M89K27R57k05l03p39m08R6K29J099n3L4o96n70K50K86
$$ 51 90 192 51 -287 -782 -293 -66 891 686 383 -356 -764 -668 -439 660 607 641 -55 -625 -375 -89
7543h9K09k70Q0Q2J43K94L30o57n84k15J12L24Q66p2q6o27o29L3N86J51P48k09
$$ -89 120 -150 -70 12 155 449 779 122 -462 -677 -565 -241 625 553 467 -160 -789 -756 -170 -19 729 520
7565E20j41m70k11J06L03l24k03p1L33M23J06K70j070k39M8L23O69M79j21p13
$$ 520 379 -91 -302 -196 107 -217 -420 -491 -158 265 371 641 -429 -668 -620 -297 372 851 730 17
7585A7o29k3K40O11j45j81L06j51P4K58j72m20o35K31O07O02K66j35q17m77k75
$$ 17 -612 -635 -395 216 71 -110 196 45 119 377 205 -215 -850 -619 -12 590 856 721 -96 -573 -848
7606h48Q03M28K84l59L8p06L93j08J92k09m49J99L28M39J44j21o59o85R2N49O30
$$ -848 -45 383 667 308 346 -360 33 -75 117 -92 -541 -342 -14 425 569 448 -211 -896 -804 -255 375
7627C75P07n32k85n22l92N00M90j63p8J17l2m7N6k68J59o87j02O96M47O3N00j059
$$ 375 1082 550 265 -257 -649 -149 341 178 100 217 185 138 194 -74 85 -602 -704 -8 439 502 1002 -57
7649e7n25j50K86N47M28L5m36m70J87%j33N7J00j40L60M11M9k27m14l73N3M08
$$ -57 -582 -732 -446 101 529 564 128 -342 -155 -155 -288 -231 -131 -271 89 500 549 322 -92 -465 -412 -4
7671dJ82O26K1p70k78m25K15M71K60j41j07M1N4j7l1j59k75m2M13M99K70k10n44
$$ -4 178 804 825 55 -223 -648 -433 38 298 157 50 91 145 128 97 -62 -337 -379 34 533 803 593 49
7694D9n50m85O43O36L53J6m39o06K29j30K03K6M6j27j22N15K16j50n63p07J35
$$ 49 -501 -986 -343 293 646 662 223 -383 -154 -284 -81 -55 -9 -136 -258 257 473 323 -240 -947 -812
7715h12N78M82L82J09r28j54m69J16O11O54k63k93R4l12J34L9K14l92j22J01M76
$$ -812 -234 248 630 739 -189 -343 -812 -696 -85 569 306 13 107 -205 -71 -32 182 -210 -332 -231 245
7736B45K46K43n67p74l58N36O33N86p4m41k94n57R3K94L19j54j1M7K37k3j4K32
$$ 245 491 734 167 -607 -965 -429 204 790 716 275 -19 -576 -483 -189 130 -24 -35 12 249 226 212 444
7758D44j272L86K97L22N01m4m90p60L4l4O38L66J18l28k41l7J4P3m7l96K13P2
$$ 444 -828 -442 -145 177 678 634 144 -616 -582 -616 22 388 506 178 -63 -100 -86 -13 -60 -456 -243 -171
7780a71P03k7Rn19n92j33K06O81P04kq41l06o1PJ24O77m76j53p7J34K95j38j22
$$ -171 532 505 514 -5 -597 -730 -524 157 861 859 18 -288 -349 -342 -218 459 -17 -170 -247 -113 182 44 -78
7803g8k20q3L60M42m8j30j36n01m04K86L51P11j09j06k87j13J8k8k6j26j73L84
$$ -78 -298 -381 -21 421 373 243 107 -394 -798 -512 -161 550 441 335 48 -65 -47 -75 -101 -227 -400 -16
7825a6M65m1O5n08j45o33K49N73J024j96l92q78k18K83L7O31p2Lj04j22J58n9
$$ -16 449 408 473 -35 -180 -813 -564 9 1033 837 445 -433 -651 -368 -331 300 228 231 127 5 163 104
7847A04J99p29J58l1O00K34M1k43o28m82K06O37K93M03n01k42k70J6l5N87n16
$$ 104 303 -426 -268 -299 301 535 576 333 -295 -777 -571 66 359 762 261 19 -251 -235 -270 317 -199
7868a99N28o01M93J00k71j73l40R5j09M32O29Q1l82m22n16K4Q43J07lk2j77k77
$$ -199 329 -272 221 321 50 -123 -463 -368 -477 -45 584 665 283 -139 -655 -631 212 319 316 294 117 -160
7890a60K06K6j40K4k80K02K94L37p0J0q27l19M11M04K95J96k52m21m66j65P22
$$ -160 46 72 -68 -44 -324 -122 172 509 439 449 -378 -697 -286 118 413 609 357 -64 -530 -695 27
7911B7L00l09M9O6M4P2p8l50k23K6j05R18N3l2j33l58o16J86M82J08M03k35j94
$$ 27 327 18 67 133 177 249 171 -179 -402 -376 -481 437 490 458 325 -33 -649 -463 19 127 530 295 101
7934A01m2l75K61K44n22m0Q2N57L12l06k15m24l34L14M04P76p7k41l21m21l61
$$ 101 59 -316 -55 189 -333 -373 -291 266 578 272 57 -367 -701 -387 17 793 716 475 154 -267 -628
7955f28M86P9K39P2l97K52J00k98Nj98j70kN66M98Nm65k92n26j58P76L11L43K4
$$ -628 -142 -63 176 248 -149 103 203 -95 -90 -288 -458 -460 106 604 609 144 -148 -674 -832 -56 255 598 622
7978F22r70K14Rk8K42P0l11j7N4P68k92n5o55m87M61J78N27M09k92p44m68M92
$$ 622 -348 -134 -125 -153 89 159 -152 -169 -115 653 361 306 -349 -836 -375 -197 330 739 447 -297 -765 -273
8000b73L33j28%L03k56r7k3M42j27l20q2j80M05M97K54n09m93l19m7M18M84J58
$$ -273 60 -68 -68 235 -21 -118 -141 301 174 -146 -228 -408 -3 494 748 239 -254 -573 -620 -202 282 440
8022D40l5k57q79K34L30J10K37m19M07n8k5K56l37k45m50J04N77K63M52j03o64
$$ 440 405 148 -731 -497 -167 -57 180 -239 168 110 85 341 4 -241 -691 -587 -10 253 705 602 -62
8043f2n53q4N22L72j0L32k62o03M85j69L31n25k84L51J61N23k74M4m05o50p6O13
$$ -62 -615 -699 -177 195 185 517 255 -348 137 -32 299 -226 -510 -159 2 525 251 295 -110 -760 -836 -223
8065b23P47k33K26n43l32K19R9M6L19k39l16L45o3K89k39m25j57J15K96K40K91
$$ -223 524 291 517 -26 -358 -139 -40 6 325 86 -230 115 52 341 102 -323 -480 -365 -69 171 462
8086D62J85q67n27K98OM15O12j35l56N2k03K91l09k7k37R0J18M51K52l17o50j47
$$ 462 647 -220 -747 -449 -443 -28 584 449 93 145 -58 233 -76 -103 -340 -250 -132 319 571 254 -396 -543
8108e43O5m0P47K60j77m25m21J88N7N1P54k49n09K48J91M01n85m06J74l40N99
$$ -543 -478 -518 229 489 312 -113 -534 -346 -289 -238 516 267 -242 6 197 598 13 -393 -219 -559 40
8129D0J85M32k14o42l96q6L51L28J67L5j4o61P6L50J71k19R8K5Q6L6K09k74j15
$$ 40 225 657 443 -199 -595 -681 -330 -2 165 200 186 -475 -399 -49 122 -97 1 26 112 148 357 83 -32
8152c2q13L02L80M44K51O9m68n27k55K01M87O32m02m11J50q1K72j31k04k64lL17
$$ -32 -845 -543 -163 281 532 601 133 -394 -649 -448 39 671 269 -142 8 -73 199 68 -136 -400 -403 -86
8174h6O01j41J07m79m99l42M89M90L54J17o75j78J79Q8j28J51r1
$$ -86 515 374 481 2 -497 -839 -350 140 494 611 -64 -242 -63 25 -103 48 -43
8191d3
$$ Imaginary data points
##PAGE= N=2
##DATA TABLE= (X++(I..I)), XYDATA
0@%%%%%%Qj6J6j8K3l1L9m7O0p2Q5j02J19j43J68j96K30k62L00l46L94m49N09n76
$$ 0 0 0 0 0 0 0 8 -8 8 -10 13 -18 21 -26 34 -38 47 -55 64 -79 89 -107 123 -139 161 -185 209 -240 269 -307
30c07O49p27Q18r17J024j141J269j410J564j734J924k132K361k614K893l209L564
$$ -307 342 -385 433 -484 540 -601 668 -742 822 -912 1012 -1120 1241 -1373 1520 -1689 1875
47A875l967M429m960N587o335P245q384R856j1846J4698j9162K7222m6376J75600
$$ 1875 -2092 2337 -2623 2964 -3371 3874 -4510 5346 -6500 8198 -10964 16258 -30118 145482
61A45482J99002k21684j69157j13801j0296J4171J14147J43490J00977j4772o2489
$$ 145482 344484 122800 -46357 -160158 -170454 -156283 -42136 101354 202331 187559 125070
72A25070r7780j15258j06143L777J15969J60668J06988K9034o5190j39197j61910
$$ 125070 27290 -87968 -194111 -190334 -74365 86303 193291 222325 157135 17938 -143972
83a43972q7417L6356J45440J68154J04755j4845j13363j43827j00839k7207M5710
$$ -143972 -231389 -195033 -49593 118561 223316 208471 95108 -48719 -149558 -176765 -131055
94a31055R1489J06466Q6288L2582n2235j30008j44558p1258L7862J17617J43834
$$ -131055 -39566 66900 153188 185770 133535 3527 -141031 -212289 -174427 -56810 87024
105H7024J12352J6570j06693j66986j18544j5220O3998J05142J18417Q2192q723
$$ 87024 199376 215946 109253 -57733 -176277 -191497 -127499 -22357 96060 178252 169529
116A69529r4477j15220q3328l7907K0235R0146J29855R7924J0808p9480j33788
$$ 169529 75052 -40168 -123496 -161403 -141168 -51022 78833 176757 187565 108085 -25703
127b5703j26054n1707N6076J31778J35680P3069k2735j05559j28309q2410q921
$$ -25703 -151757 -203464 -147388 -15610 120070 193139 170404 64845 -63464 -145874 -154795
138a54795M9859Q8825J04475P2505n543p9114j06221r1586m8006K8297J09502
$$ -154795 -104936 -16111 88364 160869 155326 76212 -30009 -121595 -169601 -141304 -31802
149c1802J34535P8169j3314q8719j27467j12966l0620P7895J32097J02080L3714
$$ -31802 102733 180902 167588 78869 -48598 -161564 -192184 -114289 17808 119888 153602
160A53602k7640p6355j01299p8910j8633M3579Q3928R9268P4688K114q1699j22064
$$ 153602 125962 49607 -51692 -130602 -149235 -105656 -21728 77540 152228 154342 72643 -49421
172d9421r5769k8553N2036J13324J19243O0222k8384r6288j17130q2248m973P2920
$$ -49421 -145190 -173743 -121707 -8383 110860 171082 142698 46410 -70720 -152968 -157941 -85021
184h5021J03725Q0686L4121j6465o6041r4338p8347k4050L8253Q8993J10607P4905
$$ -85021 18704 99390 133511 117046 51005 -43333 -121680 -145730 -107477 -18484 92123 167028
196A67028j4340r9667j21397p9254q366O2468J11625J04034L5366m4467q7166
$$ 167028 152688 53021 -68376 -147630 -155996 -93528 18097 122131 157497 113030 25864
207B5864q7570o0262r493N2824Q9831Q0925M0618j0993o4165j00416q7142k3474
$$ 25864 -61706 -121968 -131461 -78637 11194 92119 132737 121744 57579 -42837 -129979 -153453
219a53453N5050J05318J05747N2535l4411j02957j09923o0459R245O7724R5538
$$ -153453 -98403 6915 112662 165197 130786 27829 -82094 -142553 -133308 -65584 29954
230B9954P7632K2050l5453o8331p5420o2755j8440M5036R0121Q8934M7298j5917
$$ 29954 107586 129636 94183 25852 -49568 -112323 -130763 -85727 4394 93328 140626 124709
242A24709p9600j11899q0769m53P4600J04677Q5547K8424m4858r4597q8770m0146
$$ 124709 45109 -66790 -147559 -148012 -73412 31265 116812 145236 100378 5781 -82989 -123135
254a23135J4140N3148P4874O9809L2087k2306o5119q3393p0155j8249N4495J03707
$$ -123135 -108995 -55847 19027 88836 120923 98617 33498 -49895 -120050 -138299 -83804 19903
266A9903R4179L4837l8839r3484j02133n6326J9556P7877R0063O2197J3713m0147
$$ 19903 114082 148919 110080 16596 -85537 -141863 -122307 -44430 45633 107830 121543 81396
278H1396p4860p2247m0198J436M2313P5867P9476L9315k6598p9347r4832o6400
$$ 81396 6536 -65711 -105909 -104473 -62160 13707 93183 132498 105900 26553 -68279 -134679
290a34679M23P4716J07344P6897R155n2955q5717p9619l6570K3426O4448P1389
$$ -134679 -134256 -59540 47804 124701 133856 80901 -4816 -84435 -121005 -97579 -33131 38258
302C8258N2528J8657k6276o6893p8392n1370j412N2290Q8958Q3979K8862m5935
$$ 38258 90786 109443 83167 16274 -62118 -113488 -114900 -62610 26348 110327 139189 93254
314I3254r3222r0221m3731K3249P8400R0635N4341l422m8878o8899o3264l3077
$$ 93254 32 -90189 -133920 -110671 -32271 58364 112705 109283 60405 -8494 -71758 -104835
326a04835J2684N2019O9107O0950K6254k7863p7501q7900n0469J3540P0340R4690
$$ -104835 -92151 -40132 28975 89925 116179 88316 10815 -77085 -127554 -114014 -43674 51016
338E1016P0019N837o1019q8792o9776k1940K9652O5529P1021M3618J101l6373
$$ 51016 121035 126872 65853 -22939 -92715 -114655 -85003 -19474 51547 95165 96266 59893
350E9893o0378o5420m1499Q013N7396Q1076O6237J7832m4823q9191q4135l2509
$$ 59893 -485 -65905 -107404 -99391 -41995 39081 105318 123150 78327 -10864 -94999 -127508
362a27508L3899P7251Q1627M7156r666n7475p1881n3634j7356K1078N3865O5081
$$ -127508 -93609 -16358 65269 112425 102759 45284 -26597 -80231 -97587 -76509 -22644 42437
374D2437M9003R993l5359o8714p4272m1257J8665P2502Q7005N6235k523n9674
$$ 42437 91440 101433 66074 -2640 -76912 -118169 -99504 -27002 60003 116238 113715 54041
386E4041q6265o5993j2650M0575O8598O3128L3793q257m4293o0985n2449k5099
$$ 54041 -32224 -98217 -110867 -70292 -1694 61434 95227 86970 42677 -18308 -70757 -95856
398i5856J4629N4862P3208N5282O413m8680q0503p3083k6002L7086P9301P7304
$$ -95856 -81227 -26365 46843 102125 108538 59858 -20645 -93728 -119730 -82644 -3343 73961
410G3961L6276j8676n9518p0393m7696o127L2762N4859N5816L5959M50l9433o4802
$$ 73961 110237 91561 32043 -38350 -86046 -92173 -59411 -4552 51264 87223 87673 48240 -16562
423a6562o0870k8496K2929O7243P9185M8579r846o2674q0943n7876n895M5316
$$ -16562 -77432 -105928 -82999 -15756 63429 112008 102162 39488 -41455 -99331 -105226 -59910
435e9910P0983N9601K2479j8994m8463n6519m3267j3326K3822N3096O2189M2895
$$ -59910 11073 70674 93153 74159 25696 -30823 -74090 -87416 -63594 -10498 51691 94586
447I4586l88m8690p4936o2711j7200L9141P5984P1720L0307k5559o3661o7749
$$ 94586 94198 45508 -29428 -92139 -109339 -70198 5786 77506 107813 82254 18593 -49156
459d9156l9573L223L9360N6191M8908K3904j0004m1092n8132n0376j7914K7418
$$ -49156 -88729 -85506 -46146 10045 58953 82857 72853 31761 -26371 -76747 -94661 -67243
471f7243O3774O9714L8268j4613o1290p6256n0635N24M9637P0319N4497J4370
$$ -67243 -3469 66245 104513 89900 28610 -47646 -98281 -97757 -48120 22199 76696 91066
483I1066k6958n2774n4012l3170j101K9483N0290N2011L2134p270m8367o7686
$$ 91066 64108 11334 -42678 -75848 -76949 -47466 2824 54835 86969 79699 31332 -36354
495c6354n3824r237M1972P1845O5119K1983l0158o3557o3753l3919J0061M5170
$$ -36354 -90178 -99415 -57443 14402 79521 101504 71346 7789 -55964 -89883 -79822 -34652
507c4652N7124M2335J3298j8816m3635n1712l8833p984L0052N8071N9799L1478
$$ -34652 22472 64807 78105 59289 15654 -36058 -74891 -82875 -52823 5248 65047 96525
519I6525j8318o1109p1131m2731P148N1339O8096M9836P189l3684n4059m9387
$$ 96525 78207 17098 -54033 -96764 -89616 -38277 29819 79655 86844 53160 -899 -50286
531e0286k5593O040L5906M9889M3077J9787j3251m5734o0563m4076k809M2138
$$ -50286 -75879 -69839 -33933 15956 59033 78820 65569 19835 -40728 -84804 -87613 -45475
543d5475O6668N7720J8372l2884o5810o1612k5178J7609M7773N4643L7683M401
$$ -45475 21193 78913 97285 64401 -1409 -63021 -88199 -70590 -22817 31826 69509 73910
555G3910k7188m3077m4796k9509k100L3100N5497N0732K1145k1005n6585o5627
$$ 73910 46722 3645 -41151 -70660 -72760 -39660 15837 66569 87714 66709 10124 -55503
567e5503l7373J1822N3539O4183M3632L273l7493n7447m6901j6450J5709L8099
$$ -55503 -92876 -81054 -27515 36668 80300 83573 46080 -11367 -58268 -74718 -59009 -20910
579b0910M5964L6116J0103k0678m2771n0059l6875o77M2451O5609N1299R462l5267
$$ -20910 25054 61170 71273 50595 7824 -42235 -79110 -79787 -37336 28273 79572 89034 53767
592E3767o1975n7863k1873K4283N2589N1277K9343j011l0247m6240m1598j8589
$$ 53767 -8208 -66071 -87944 -63661 -11072 40205 69548 68537 38290 -7950 -49548 -68137
604f8137Q875L2929M8426M3089J3840k5016n2723n5676l2739J1793N4168O5865
$$ -68137 -59262 -26333 22093 65182 79022 54006 1283 -54393 -87132 -75339 -21171 44694
616D4694L8954o189m1900n4679m3095j1578K4032M2651M0556K6059N087k2560
$$ 44694 83648 77459 35559 -19120 -62215 -73793 -49761 -7110 33446 59505 64592 42032
628D2032m4235m6411k4899Q303L9253N6887M5630O464l9091o0403n0362j6860
$$ 42032 -2203 -48614 -73513 -65210 -25957 30930 76560 83024 43933 -16470 -66832 -83692
640h3692K4683N3885N4225K4336j2943l6313m2052l4260j3332J5299L6311M2363
$$ -83692 -59009 -5124 49101 73437 60494 24181 -17871 -52131 -65463 -50164 -13853 28510
652B8510L1913Q569k4460n1870n1979k2848J8026N0541N9150L5905q744m7010
$$ 28510 60423 68992 44532 -7338 -59317 -82165 -64139 -13598 45552 81457 72713 25703
664B5703n5553l5709m249K5263M4535M2165J9056p568k6323l8070l8217k1044
$$ 25703 -29850 -65559 -69808 -44545 -10 42155 61211 53643 27320 -10750 -48967 -70011
676g0011J3569M2764M9109L4170L789l4958o0409m9058r158L2094N2238M7035
$$ -70011 -56442 -13678 35431 69601 73390 38432 -21977 -71035 -80193 -48099 4139 51174
688E1174K1554j5335m2375m3789k6203l121J6783L5306M0917K6340j664k8611
$$ 51174 72728 57393 15018 -28771 -54974 -58095 -41312 -6006 34911 61251 59587 30976
700C0976m4387m4575j8548K1110N1595N2149K7030r793m3245n7123l6826L739
$$ 30976 -13411 -57986 -76534 -55424 -3829 48320 75350 65557 22312 -34811 -71637 -67898
712f7898L4772M3475L4088J4976j1212l2445l7790k7262j0784J2129L8420M9269
$$ -67898 -33126 10349 44437 59413 48201 15756 -22034 -49296 -60080 -47951 -9531 39738
724C9738L0158o642l8490n1219m1170q779L2709N4709M4376J2902j8555l9847
$$ 39738 69896 63254 24764 -26455 -67625 -76404 -43695 11014 55390 68292 49737 9890
736I890m4586k6645M690K8509L4985L0177J8638m249k9877m2338l4752j1466J9857
$$ 9890 -34696 -61341 -56651 -28142 6843 37020 55658 51409 21532 -20806 -55558 -67024 -47167
749d7167M7167N1646K3709j7721m5830m9065l0759L426L7236M7626L1062N069
$$ -47167 0 51646 75355 57634 11804 -37261 -68020 -64594 -27358 20268 51330 56399
761E6399j6017l0533l6830k6638r13K2845L4985L6087K3956n408l9216n0756l2938
$$ 56399 40382 9849 -26981 -53619 -54532 -31687 3298 39385 63341 57933 18717 -32039 -64977
774f4977r39L0396M9965M4478J1538k6222m5058l8556j9114O676L0365L8586K6752
$$ -64977 -65916 -35520 14445 58923 70461 44239 -819 -39375 -58489 -51813 -21448 17138 43890
787D3890P194j0645k6251l8297l2337n054K6720M3402M1264J9718j6922m7381
$$ 43890 51084 40439 14188 -24109 -56446 -61500 -34780 8622 49886 69604 52682 5301
$$ [...]
8191a0
##END NTUPLES=NMR FID
##END=
