##TITLE=1H_Pr 5-5-Carb
 DMSO, 8 sc, 
 29.1.2020
##JCAMPDX= 6.0         $$ Bruker NMR JCAMP-DX V2.0
##DATA TYPE= NMR FID
##DATA CLASS= NTUPLES
##ORIGIN= UXNMR, Bruker Analytische Messtechnik GmbH
##OWNER= root
$$ XWIN-NMR		Version 3.5
$$ Wed Jan 29 14:37:05 2020 Russian Standard Time (UT+4h)  she@DPX200
##.OBSERVE FREQUENCY= 200.1315
##.OBSERVE NUCLEUS= ^1H
##.DELAY= (6, 6)
##.ACQUISITION MODE= SIMULTANEOUS
##.ACQUISITION SCHEME= undefined
##.AVERAGES= 8
##.DIGITISER RES= 18
##SPECTROMETER/DATA SYSTEM= spect
##.PULSE SEQUENCE= zg30
##.SOLVENT NAME= CDCl3
##.SHIFT REFERENCE= (INTERNAL, CDCl3, 0, 15.7039)
##AUDIT TRAIL= $$ (NUMBER, WHEN, WHO, WHERE, WHAT)
$$ ##TITLE= Audit trail, XWIN-NMR		Version 3.5
$$ ##JCAMPDX= 5.01
$$ ##ORIGIN= Bruker BioSpin GmbH
$$ ##OWNER= she
$$ F:/spectra/data/she/nmr/H-F/1/audita.txt
$$ ##AUDIT TRAIL=  $$ (NUMBER, WHEN, WHO, WHERE, WHAT)
(   1,<2020-01-29 14:36:07.50 +0400>,<she>,<DPX200>,
      <created by zg, POWCHK disabled, PULCHK disabled
       configuration hash MD5:
       00 E9 B6 7A A2 85 ED C7 34 08 36 98 17 FE 4E 26
       data hash MD5: 16K
       71 85 91 D7 34 E7 DD 90 AC B4 A7 B2 94 8F 09 F9>)
$$ ##END=
$$ 
$$ hash MD5
$$ 18 56 84 8D 47 A8 02 1A 90 59 F8 57 7B 52 58 C5
##$RELAX= 
##$RELAX= 
##$RELAX= 
##$RELAX= 
##$RELAX= 
##$RELAX= 
$$ Bruker specific parameters
$$ --------------------------
##$DU= <F:/spectra>
##$EXPNO= 1
##$NAME= <H-F>
##$PROCNO= 1
##$TYPE= <nmr>
##$USER= <she>
##$AMP= (0..31)
100 100 100 100 100 100 100 100 100 100 100 100 100 100 100 100 100 100 
100 100 100 100 100 100 100 100 100 100 100 100 100 100 
##$AQSEQ= 0
##$AQ_mod= 1
##$AUNM= <au_zg>
##$AUTOPOS= <>
##$BF1= 200.13
##$BF2= 200.13
##$BF3= 200.13
##$BF4= 200.13
##$BF5= 200.13
##$BF6= 200.13
##$BF7= 200.13
##$BF8= 200.13
##$BYTORDA= 1
##$CFDGTYP= 0
##$CFRGTYP= 5
##$CHEMSTR= <none>
##$CNST= (0..31)
1 1 145 1 1 1 1 1 1 1 1 1 1 1 1 1 1 1 1 1 1 1 1 1 1 1 1 1 1 1 1 1 
##$CPDPRG= <>
##$CPDPRG1= <>
##$CPDPRG2= <>
##$CPDPRG3= <>
##$CPDPRG4= <mlev>
##$CPDPRG5= <mlev>
##$CPDPRG6= <mlev>
##$CPDPRG7= <mlev>
##$CPDPRG8= <mlev>
##$CPDPRGB= <>
##$CPDPRGT= <>
##$D= (0..31)
0 1.2 0 0 0 0 0 0 0 0.06 0 0.03 0 0 0 0 0.0002 0 0 0 0 0 0 0 0 0 0 0 0 
0 0 0 
##$DATE= 1580294166
##$DBL= (0..7)
120 120 120 120 120 120 120 120 
##$DBP= (0..7)
150 150 150 150 150 150 150 150 
##$DBP07= 0
##$DBPNAM0= <>
##$DBPNAM1= <>
##$DBPNAM2= <>
##$DBPNAM3= <>
##$DBPNAM4= <>
##$DBPNAM5= <>
##$DBPNAM6= <>
##$DBPNAM7= <>
##$DBPOAL= (0..7)
0.5 0.5 0.5 0.5 0.5 0.5 0.5 0.5 
##$DBPOFFS= (0..7)
0 0 0 0 0 0 0 0 
##$DE= 6
##$DECBNUC= <off>
##$DECIM= 24
##$DECNUC= <off>
##$DECSTAT= 4
##$DIGMOD= 1
##$DIGTYP= 9
##$DL= (0..7)
0 120 120 120 120 120 120 120 
##$DP= (0..7)
150 150 150 150 150 150 150 150 
##$DP07= 0
##$DPNAME0= <>
##$DPNAME1= <>
##$DPNAME2= <>
##$DPNAME3= <>
##$DPNAME4= <>
##$DPNAME5= <>
##$DPNAME6= <>
##$DPNAME7= <>
##$DPOAL= (0..7)
0.5 0.5 0.5 0.5 0.5 0.5 0.5 0.5 
##$DPOFFS= (0..7)
0 0 0 0 0 0 0 0 
##$DQDMODE= 0
##$DR= 18
##$DS= 0
##$DSLIST= <SSSSSSSSSSSSSSS>
$$ [...]
##$SUBNAM2= <"">
##$SUBNAM3= <"">
##$SUBNAM4= <"">
##$SUBNAM5= <"">
##$SUBNAM6= <"">
##$SUBNAM7= <"">
##$SUBNAM8= <"">
##$SUBNAM9= <"">
##$SW= 24.9337058887773
##$SWIBOX= (0..15)
0 0 2 0 0 0 0 0 0 0 0 0 0 0 0 0 
##$SW_h= 4990.01996007984
##$TD= 16384
##$TD0= 1
##$TE= 0
##$TE2= 300
##$TE3= 300
##$TEG= 300
##$TL= (0..7)
0 120 120 120 120 120 120 120 
##$TP= (0..7)
150 150 150 150 150 150 150 150 
##$TP07= 0
##$TPNAME0= <>
##$TPNAME1= <>
##$TPNAME2= <>
##$TPNAME3= <>
##$TPNAME4= <>
##$TPNAME5= <>
##$TPNAME6= <>
##$TPNAME7= <>
##$TPOAL= (0..7)
0.5 0.5 0.5 0.5 0.5 0.5 0.5 0.5 
##$TPOFFS= (0..7)
0 0 0 0 0 0 0 0 
##$TUNHIN= 0
##$TUNHOUT= 0
##$TUNXOUT= 0
##$USERA1= <user>
##$USERA2= <user>
##$USERA3= <user>
##$USERA4= <user>
##$USERA5= <user>
##$V9= 5
##$VALIST= <valist>
##$VCLIST= <CCCCCCCCCCCCCCC>
##$VD= 0
##$VDLIST= <DDDDDDDDDDDDDDD>
##$VPLIST= <PPPPPPPPPPPPPPP>
##$VTLIST= <TTTTTTTTTTTTTTT>
##$WBST= 1024
##$WBSW= 4
##$XGAIN= (0..3)
0 0 0 0 
##$XL= 0
##$YL= 0
##$YMAX_a= 292922
##$YMIN_a= -99869
##$ZGOPTNS= <>
##$ZL1= 120
##$ZL2= 120
##$ZL3= 120
##$ZL4= 120
##$ABSF1= 10
##$ABSF2= 0
##$ABSG= 5
##$ABSL= 3
##$ALPHA= 0
##$AQORDER= 0
##$ASSFAC= 0
##$ASSFACI= 0
##$ASSFACX= 0
##$ASSWID= 0
##$AUNMP= <proc_1d>
##$AZFE= 0.1
##$AZFW= 0.1
##$BCFW= 1
##$BC_mod= 2
##$BYTORDP= 1
##$COROFFS= 0
##$CY= 11.3945322036743
##$DATMOD= 1
##$DC= 2
##$DFILT= <>
##$DTYPP= 0
##$F1P= 16.9975609425685
##$F2P= -3.02152046262296
##$FCOR= 0.5
##$FTSIZE= 0
##$FT_mod= 4
##$GAMMA= 1
##$GB= 0.15
##$INTBC= 1
##$INTSCL= 1
##$ISEN= 128
##$LB= 0.24
##$LEV0= 0
##$LPBIN= 0
##$MAXI= 10000
##$MC2= 0
##$MEAN= 0
##$ME_mod= 0
##$MI= 1.114404
##$NCOEF= 0
##$NC_proc= 0
##$NLEV= 6
##$NOISF1= 3.799351
##$NOISF2= 2.8
##$NSP= 1
##$NTH_PI= 0
##$NZP= 0
##$OFFSET= 15.70392
##$PC= 1
##$PHC0= -9793.252
##$PHC1= 23.40081
##$PH_mod= 1
##$PKNL= yes
##$PPARMOD= 0
##$PSCAL= 0
##$PSIGN= 0
##$REVERSE= no
##$SF= 200.130013532006
##$SI= 16384
##$SIGF1= 3
##$SIGF2= 2
##$SINO= 400
##$SIOLD= 16384
##$SREGLST= <1H.CDCl3>
##$SSB= 0
##$STSI= 0
##$STSR= 0
##$SW_p= 3612.71676300578
##$SYMM= 0
##$S_DEV= 0
##$TDeff= 0
##$TDoff= 0
##$TI= <>
##$TILT= no
##$TM1= 0
##$TM2= 0
##$TOPLEV= 0
##$USERP1= <user>
##$USERP2= <user>
##$USERP3= <user>
##$USERP4= <user>
##$USERP5= <user>
##$WDW= 1
##$XDIM= 8192
##$YMAX_p= 0
##$YMIN_p= 0
$$ End of Bruker specific parameters
$$ ---------------------------------
##NTUPLES= NMR FID
##VAR_NAME=  TIME,          FID/REAL,        FID/IMAG
##SYMBOL=    X,             R,               I
##VAR_TYPE=  INDEPENDENT,   DEPENDENT,       DEPENDENT
##VAR_FORM=  AFFN,          ASDF,            ASDF
##VAR_DIM=   8192,          8192,            8192
##UNITS=     SECONDS,       ARBITRARY UNITS, ARBITRARY UNITS
##FACTOR=    0.0002004,     1,               1
##FIRST=     0,             0,               0
##LAST=      1.6414764,     0,               0
##MIN=       0,             -99869,          0
##MAX=       1.6414764,     292922,          0
$$ Real data points
##PAGE= N=1
##DATA TABLE= (X++(R..R)), XYDATA
$$ plain form
0 0 0 0 0 0 0 0 0 5 -8 8 -8 8 -16 16 -16 24 -27 32 -40 48 -56 64 -73 86 -97 113 -128 145 -166 186 -210
31 -210 237 -266 298 -333 372 -413 458 -509 565 -624 690 -765 848 -938 1041 -1157 1287 -1433
49 -1433 1608 -1813 2055 -2350 2719 -3196 3839 -4758 6191 -8744 14703 -61071 58202 200653
63 200653 53362 -77649 -90470 -34109 -48690 -52458 -5180 43144 7839 -30091 -10928 20059
75 20059 -21989 -63528 -21270 63861 65903 -4773 -43634 -10886 14465 -955 -14561 6387
87 6387 18436 988 -14350 -7396 -10384 -30902 -27269 13568 30016 -12452 -56407 -39151 8504
100 8504 16792 -10336 -17740 2282 5736 -14914 -15351 15066 29154 1611 -25065 -9323 25202
113 25202 27397 1071 -8775 7820 16685 726 -9666 9416 30229 12021 -29279 -34657 11128
$$ packed form
0@%%%%%%%Nj3J6j6J6k4L2l2M0n1N9p2Q8j04J20j37J59j83K10k41K73l11L52l96
31b10M47n03N64o31P05p85Q71r67J074j189J314j455J613j786J979k198K444k720
49a433L041l421L868m405N069n915P035q597J0949j4935K3447p5774J19273J42451
63B00653j47291j31011j2821N6361j4581l768M7278M8324l5305l7930J9163L0987
75B0059m2048m1539M2258Q5131K042p0676l8861L2748K5351j5420j3606K0948
87F387J2049j7448j5338O954k988k0518L633M0837J6448m2468m3955J7256M7655
100H504Q288k7128p404K0022L454k0650m37L0417J4088k7543k6676J5742L4525
113B5202K195k6326r846J6595Q865j5959j0392J9082K0813j8208m1300n378M5785
$$ plain form
126 11128 48501 26381 -25335 -36274 3101 37466 27955 26 -7906 69 4837 9562 21989
139 21989 25631 5280 -13199 -752 26571 27777 2188 -11183 794 9786 -84 -8103 -530
152 -530 4342 -7020 -15651 -6717 1769 -5761 -15976 -10367 -1776 -8910 -20115 -14245 -832 -3038
166 -3038 -13055 -9427 355 -6779 -22102 -11978 14853 12241 -26299 -45308 -12741 24920 12148
179 12148 -29835 -41033 -14533 5866 -1707 -14356 -16577 -19315 -25745 -18929 856 4621 -16538
192 -16538 -32715 -18934 4634 6632 -8744 -16407 -10410 -5707 -5923 -5383 -3037 -5691 -10202 -8670
206 -8670 -2543 -2529 -8361 -9029 -3272 -2935 -11098 -15962 -10847 -2771 -3212 -9361 -12286 -9683 -5705 -1813
222 -1813 1139 -921 -8382 -11645 -3800 6955 5567 -5755 -9681 779 10643 7210 -3914 -4434
$$ packed form
126A1128L7373k2120n1716j0939L9375L4365r511k7929p932P975M768M725J2427
139B1989L642k0351j8479J2447K7323J206k5589j3371J1977Q992r870q019P573
152e30M872j1362q631Q934Q486p530j0215N609Q591p134j1205N870J3413k206
166c038j0017L628R782p134j5323J0124K6831k612l8540j9009L2567L7661j2772
179A2148m1983j1198K6500K0399p573j2649k221k738o430O816J9785L765k1159
192a6538j6177J3781K3568J998j5376p663N997M703k16N40K346k654m511J532
206h670O127J4n832o68N757L37q163m864N115Q076m41o149k925K603L978L892
222a813K952k060p461l263P845J0755j388j1322l926J0460R864l433j1124n20
$$ plain form
236 -4434 5055 11296 3265 -8061 -7985 3547 11812 6053 -6143 -10332 -794 11686 12869 1649
250 1649 -9373 -8003 3700 12492 9050 -1519 -7400 -1861 8758 12889 7385 -1435 -3166 2106
264 2106 7007 5568 541 -2879 -1934 386 1499 1294 128 -546 -1334 -1227 -956 -1250 -2270 -3322 -3477
281 -3477 -2011 -402 -1123 -2279 -1862 1039 3428 1801 -2847 -4357 -1334 2969 2679 -2515 -5469 -2366
297 -2366 2996 3627 -153 -3576 -2970 -137 6 -1955 -4064 -3378 -1536 -1523 -2745 -2985 -953 1934 1481
314 1481 -2109 -4466 -2169 1952 2248 -1954 -4932 -3057 1596 4008 1609 -1955 -2293 319 2386 875
330 875 -2681 -3486 -1216 872 -349 -2421 -1453 1711 2435 56 -1860 -1239 869 1252 -426 -2628 -2170
347 -2170 770 2686 1583 -910 -878 1949 3274 1211 -1582 -1469 865 2391 286 -1314 -790 2539
$$ packed form
236d434R489O241q031j1326P6J1532Q265n759j2196m189R538J2480J183j1220
250A649j1022J370J1703Q792l442j0569n881N539J0619M131n504q820j731N272
264B106M901j439n027l420R45K320J113k05j166o74p88J07K71k94j020j052j55
281c477J466J609p21j156M17K901K389j627m648j510L023M303k90n194k954L103
297b366N362O31l780l423O06K833J43j961k109O86J842J3j222k40K032K887m53
314A481l590k357K297M121K96m202k978J875M653K412k399l564l38K612K067j511
330H75l556q05K270K088j221k072R68L164P24k379j916O21K108L83j678k202M58
347b170K940J916j103k493L2K827J325k063k793J13K334J526k105j600N24L329
$$ plain form
363 2539 3815 2120 78 -15 1694 2525 1629 -882 -1585 518 2385 1894 120 -121 1893 3337 1773
380 1773 -411 -738 1094 1736 351 -1428 -738 1754 3326 2183 569 664 2245 3403 2266 76
396 76 -594 1023 2431 2193 637 477 1675 3585 2659 366 -673 501 1789 307 -1532 -1687 -330
413 -330 1162 1040 -155 -524 792 2182 1587 -509 -1328 -473 1039 1017 -263 -779 570 2671 2422 493
431 493 -756 229 764 -336 -2335 -3103 -1826 -986 -1466 -2097 -2460 -1329 -645 -1144 -2367 -3032 -2384 -1575
449 -1575 -1828 -3094 -2521 -505 673 101 -1292 -714 1154 1590 267 -1866 -2162 -1039 419 -201 -1997
466 -1997 -2744 -680 1016 446 -2166 -3519 -1858 79 -817 -3263 -3507 -1903 588 1233 -2 -875 321
483 321 2214 2621 1561 283 343 1377 2759 1991 1142 1668 2750 3186 2148 1323 1301 1824 777 -345
$$ packed form
363B539J276j695k042r3J709Q31q96k511p03K103J867m91j774k41K014J444j564
380A773k184l27J832O42j385j779O90K492J572j143j614R5J581J158j137k190
396G6o70J617J408k38j556j60J198J910r26k293j039J174J288j482j839j55J357
413c30J492j22j195l69J316J390n95k096q19Q55J512k2j280n16J349K101k49j929
431D93j249R85N35j100j999p68J277Q40m80o31l63J131O84m99j223o65O48Q09
449a575k53j266N73K016J178n72j393N78J868M36j323k133k96J123J458o20j796
466a997p47K064J696n70k612j353J661J937q96k446k44J604K491O45j235q73J196
483C21J893M07j060j278O0J034J382p68q49N26J082M36j038q25k2N23j047j122
$$ plain form
501 -345 -716 322 872 867 338 303 1281 2561 2991 1603 682 1543 2943 3048 1611 1007 2815 4446 3986
520 3986 2494 1971 3286 3598 2453 351 -686 411 1179 905 -969 -1774 -823 1187 1510 -547 -2055
537 -2055 -2167 -431 745 -272 -1730 -1610 -18 2307 2335 1024 -265 333 1591 1970 725 -1094 -2281
554 -2281 -1522 388 909 -943 -2959 -2862 -913 897 -318 -2709 -4545 -4015 -1265 223 -482 -2816 -3636
571 -3636 -1254 2923 4510 1550 -2744 -2542 2244 6023 3653 -1738 -3902 806 6418 6197 457 -3092
587 -3092 -419 4313 5203 976 -2805 -2694 1067 3789 3172 464 -486 1452 4514 6031 3993 1035
603 1035 1091 3985 5923 5738 3053 2342 4461 6926 6873 4682 3529 4138 5163 4970 3308 1191 1438
620 1438 3402 4444 2594 841 2032 4455 4953 2552 928 1728 3814 3573 2486 1969 3302 3416
$$ packed form
501c45l71J038N50nn29l5R78J280M30j388r21Q61J400J05j437o04J808J631m60
520C986j492n23J315L12j145k102j037J097P68k74j874q05R51K010L23k057j508
537b055j12J736J176j017j458J20J592K325K8j311j289N98J258L79j245j819j187
554b281P59J910N21j852k016R7J949J810j215k391j836N30K750J488p05k334q20
571c636K382M177J587k960m294K02M786L779k370n391k164M708N612k21n740l549
587c092K673M732Q90m227l781J11L761K722o17k708r50J938L062J517k038k958
603A035N6K894J938j85k685p11K119K465n3k191j153O09J025j93j662k117K47
620A438J964J042j850j753J191K423M98k401j624Q00K086k41j087n17J333J14
$$ plain form
636 3416 3210 4332 6108 4319 341 116 4432 6700 2284 -3747 -2966 2580 5149 1435 -3176 -3332
652 -3332 253 1458 132 -2422 -3740 -3673 -2218 218 646 -1650 -3210 -2163 1407 2688 172 -2245
668 -2245 -2694 -1475 -40 267 -360 -2960 -4006 -1502 1193 624 -3214 -5363 -3624 -1299 -2220 -4159
684 -4159 -3900 -3584 -3955 -4111 -1112 1505 -704 -4797 -4729 832 4383 703 -4909 -4829 1059 5218 2925
701 2925 -1871 -2372 1440 3773 2716 131 -1160 -1271 -1013 174 1853 1048 -1515 -2607 256 3932
717 3932 3132 -686 -2281 634 3856 3469 778 -421 1780 4437 4804 3430 2428 2943 4200 4577
733 4577 3119 1351 1820 3224 3474 1759 412 1400 3589 3112 1183 56 1384 1798 1187 994 1365
750 1365 735 -509 748 4352 5499 1789 -2373 30 6194 7015 641 -4440 -1800 5068 6010 1278
$$ packed form
636C416k06J122J776j789l978k25M316K268m416o031P81N546K569l714m611j56
652c332L585J205j326k554j318O7J455K436M28k296j560J047L570J281k516k417
668b245m49J219J435L07o27k600j046K504K695n69l838k149J739K325r21j939
684d159K59L16l71j56K999K617k209m093O8N561L551l680n612Q0N888M159k293
701B925m796n01L812K333j057k585j291j11K58J187J679q05k563j092K863L676
717C932q00l818j595K915L222l87k691j199K201K657L67j374j002N15J257L77
733D577j458j768M69J404K50j715j347R88K189m77j929j127J328M14o11j93L71
750A365o30j244J257L604J147l710m162K403O164Q21o374n081K640O868R42m732
$$ plain form
766 1278 -2917 -1676 2220 3693 2173 -904 -2773 -2725 -638 1556 966 -2959 -4839 -1765 2765 3475
782 3475 -343 -4088 -3260 1018 3003 1022 -2743 -3858 -1187 2326 3185 -330 -3135 -1839 1098 1973
798 1973 -402 -2759 -2798 -1331 -1067 -1153 -1028 -1181 -2005 -2348 -803 815 -105 -2340 -3131 -1086 734 -368
816 -368 -1841 -1600 453 1214 214 -252 392 1120 20 -1586 -1358 -8 664 -576 -1689 -1088 414
833 414 999 21 -958 -1094 -807 -389 -405 -909 -1408 -995 -520 340 765 537 -243 -321 -49 619 662 -478 -1508
854 -1508 -1228 259 1087 32 -830 -602 68 562 -76 -963 -1015 -1207 -1461 -1798 -541 41 -333 -913 -1227
873 -1227 114 1092 294 -1474 -1807 -870 134 197 -943 -1315 -1038 156 848 513 -751 -1350 -1382 -122
891 -122 52 -907 -1989 -1998 -801 524 637 -402 -1708 -845 227 366 -271 -1797 -2182 -1062 508 491
$$ packed form
766A278m195J241L896J473j520l077j869M8K087K194n90l925j880L074M530P10
782C475l818l745Q28M278J985j981l765j115K671L513Q59l515k805J296K937Q75
798A973k375k357l9J467K64q6J25j53q24l43J545J618r20k235p91K045J820j102
816c68j473K41K053P61j000m66O44P28j100j606K28J350O72j240j113O01J502
833D14N85r78r79j36K87M18j6n04m99M13M75Q60M25k28p80p8K72O68M3j140j030
854a508K80J487Q28j055q62K28O70M94o38q87n2j92k54l37J257N82l74n80l14
873a227J341R78p98j768l33R37J004O3j140l72K77J194O92l35j264n99l2J260
891a22J74r59j082rJ197J325J13j039j306Q63J072J39o37j526l85J120J570j7
$$ plain form
909 491 -679 -989 -422 593 862 -127 -572 -925 -649 -430 -229 -108 -351 -472 -318 805 678 -33 -588
928 -588 -541 -101 -268 -662 -790 -76 47 210 278 364 496 571 340 -128 -13 -885 -360 -242 -25 -322 -86 383
950 383 431 682 413 -32 22 313 -329 -619 -555 -423 7 570 821 57 -109 217 827 462 -400 -646 -649 215
972 215 139 -23 68 342 254 739 529 464 63 -239 76 414 -80 -65 414 629 966 887 1087 779 677 312
994 312 452 323 203 -156 -30 37 312 459 365 696 529 701 424 376 148 -345 197 336 863 642 390
1015 390 511 1034 1195 1045 263 29 70 157 59 -165 4 -11 448 606 415 85 -149 103 -57 -222 -732
1036 -732 -277 -302 265 279 462 229 420 604 497 181 -374 -305 -180 370 -343 -321 111 246 94 225 70
1057 70 81 -282 -641 -407 -569 -910 -982 -508 178 44 -94 244 432 -22 -168 -12 -15 -403 -179 -29 207 299
$$ packed form
909D91j170l10N67J015K69r89m45l53K76K19K01J21k43j21J54J123j27p11n55
928e88M7M40j67l94j28P14J23J63O8Q6J32P5k31m68J15q72N25J18K17k97K36M69
950C83M8K51k69m45N4K91o42k90O4J32M30N63K51p64j66L26O10l65q62k46lQ64
972B15p6j62R1K74q8M85k10o5m01l02L15L38m94J5M79K15L37p9K00l08j02l65
994C12J40j29j20l59J26O7K75J47r4L31j67J72k77m8k28m93N42J39N27k21k52
1015C90J21N23J61j50p82k34M1Q7r8k24J69j5M59J58j91l30k34K52j60j65n10
1036g32M55k5N67J4J83k33J91J84j07l16n55O9J25N50p13K2M32J35j52J31j55
1057G0J1l63l59K34j62l41p2M74O86j34j38L38J88m54j46J56ll88K24J50K36R2
$$ plain form
1079 299 366 696 944 723 40 23 -58 54 -330 -377 -378 -339 240 69 578 499 623 328 450 298 18 -241 251
1102 251 183 832 610 657 814 954 1145 673 860 653 368 217 -12 180 294 145 316 605 411 206 361
1123 361 -121 -323 -667 -136 -188 -115 -337 28 430 487 543 657 460 111 264 111 242 86 -318 -354 447 444
1145 444 409 78 -157 301 212 -580 -1075 -1068 -1086 -64 -584 -545 -570 -511 -4 38 -50 -604 -819 -291 0 -226 -385
1168 -385 -747 -213 547 623 88 105 -221 110 382 -44 -901 -1066 -396 96 -121 -165 -448 -52 204 505 302
1189 302 -406 -512 -101 297 552 59 -26 391 1240 1467 1012 319 311 532 994 569 176 -64 48 525 1087
1210 1087 868 610 78 548 846 615 19 -426 -267 369 597 609 134 443 818 1272 1437 678 430 -165
1230 -165 697 840 673 -124 355 595 1023 820 710 24 -9 312 531 -262 -503 -831 -258 618 527 224 -173
$$ packed form
1079B99O7L30K48k21o83j7q1J12l84m7jL9N79j71N09p9J24k95J22j52k80k59M92
1102B51o8O49k22M7J57J40J91m72J87k07k85j51k29J92J14j49J71K89j94k05J55
1123C61m82k02l44N31n2P3k22L65M02N7N6J14j97l49J53j53J31j56m04l6Q01l
1145D44l5l31k35M58q9p92m95Pj8J022n20L9k5N9N07M2q8n54k15N28K91k26j59
1168c85l62N34P60P6n35J7l26L31K72m26q57j65O70M92k17m4k83L96K56L01k03
1189C02p08j06M11L98K55m93q5M17Q49K27m55o93qK21M62m25l93k40J12M77N62
1210A087k19k58n32M70K98k31n96m45J59O36K28J2m75L09L75M54J65p59k48n95
1230a65Q62J43j67p97M79K40M28k03j10o86l3L21K19p93k41l28N73Q76r1l03l97
$$ plain form
1251 -173 354 724 783 39 -555 -661 -11 255 -14 -240 -232 298 579 689 266 -340 -634 -329 -180 -395 -728
1272 -728 -1064 -599 194 534 -114 -786 -1078 24 553 238 -758 -1030 -939 788 897 122 -739 -120 837 1410
1292 1410 1060 -539 -985 -106 304 458 -103 -537 -259 342 1319 999 -318 -912 -244 852 1082 -226
1310 -226 -967 -813 629 1704 1076 143 210 565 1304 900 468 -278 -412 274 685 857 531 205 224 549
1330 549 783 323 95 -217 -6 294 409 127 -339 -1 1057 717 161 -161 316 620 678 -162 -140 89
1350 89 229 373 530 381 430 585 604 714 -17 -247 -569 -150 108 -48 -521 -93 -279 892 642 -117 -449
1371 -449 -390 330 310 91 -631 -651 191 870 673 167 109 371 402 593 197 -55 -591 -622 -48 492 546 150
1393 150 -166 216 945 902 69 -836 -717 307 862 248 -223 -492 173 1159 1178 462 193 -172 465 930
$$ packed form
1251a73N27L70N9p44n94j06O50K66k69k26QN30K81J10m23o06k94L05J49k15l33
1272g28l36M65P93L40o48o72k92J102N29l15r96k72R1J727J09p75q61O19R57N73
1292A410l50j599m46Q79M10J54n61m34K78O01R77l20j317n94O68J096K30j308
1310b26p41J54J442J075o28r33O7L55P39m04m32p46j34O86M11J72l26l26J9L25
1330E49K34m60k28l12K11L00J15k82m66L38J058l40n56l22M77L04N8q40K2K29
1350H9J40J44J57j49M9J55J9J10p31k30l22M19K58j56m73M28j86J171k50p59l32
1371d49N9P20k0k19p22k0Q42O79j97n06n8K62L1J91l96k52n36l1N74N40N4l96
1393A50l16L82P29m3q33r05J19J024N55o14m71k69O65R86J9p16k69l65O37M65
$$ plain form
1413 930 893 15 -777 -283 494 1217 1278 155 -480 530 1424 897 -349 -988 -300 665 400 239 -48 118
1433 118 668 700 560 146 -57 42 353 309 342 321 99 208 442 521 479 365 -96 129 165 -109 -142 -341 -2
1456 -2 354 323 -249 -135 530 666 115 -648 -504 0 318 -109 -224 -211 142 494 523 297 8 -524 -145 83
1478 83 -186 -552 -477 21 670 453 -4 -412 -442 243 548 96 -805 -1053 -553 400 607 -132 -296 -92 506
1499 506 571 -27 -53 -594 -431 -294 -175 107 -264 -586 -320 498 540 431 -181 -288 -310 -13 -100 -241 -724 -399
1521 -399 66 45 338 123 -213 -214 -20 221 69 -85 -220 -201 -115 369 39 17 63 268 159 74 -84 -250 -212
1544 -212 -82 -317 -348 -237 191 134 299 160 519 66 -183 -307 -94 -361 -28 -198 -118 -44 156 334 172
1565 172 -51 -228 28 19 -117 -155 -122 4 171 213 261 287 -20 327 31 11 -160 -107 -196 -172 -221 9 494 156
$$ packed form
1413I30l7q78p92M94P77P23O1j123o35J010Q94n27j246o39O88R65k65j61k87J66
1433A18N50L2j40m14k03R9L11m4L3k1k22J09K34P9m2j14m61K25L6k74l3j99L39
1456bL56l1n72J14O65J36n51p63J44N04L18m27j15J3L53L52K9k26k89n32L79K28
1478H3k69l66P5M98O49k17m57m08l0O85L05m52r01k48N00R53K07p39j64K04N98
1499E06O5n98k6n41J63J37J19K82l71l22K66Q18M2j09o12j07k2K97q7j41m83L25
1521c99M65k1K93k15l36jJ94K41j52j54j35J9Q6M84l30k2M6K05j09q5j58j66L8
1544b12J30k35l1J11M28n7J65j39L59m53k49j24K13k67L33j70Q0P4K00J78j62
1565A72k23j77K56rj36l8L3J26J67M2M8K6l07L47k96k0j71N3q9K4m9K30M85l38
$$ plain form
1589 156 -274 264 9 287 343 -268 -432 -581 -282 -15 12 4 -1 503 302 312 210 -46 -322 -375 -121 -21 -358
1612 -358 -118 411 178 257 173 377 39 -301 -392 -228 -145 -527 -214 23 232 35 651 84 19 80 -83 -133
1634 -133 -49 82 -225 -227 263 431 115 331 87 -18 398 101 -167 -340 -357 92 -107 -21 -232 -95 179 339
1656 339 248 177 -37 85 -126 -95 -70 -226 282 34 550 382 329 223 332 114 -16 -209 210 -183 3 90
1678 90 299 340 188 476 434 103 296 -3 86 -298 -320 -213 184 -46 359 130 61 251 11 100 -90 -51 -94
1701 -94 -300 -118 412 188 367 428 263 239 72 -59 -92 -192 -100 -181 -18 87 -146 234 737 447 157 23
1723 23 18 -42 -149 -305 -339 -195 -69 104 173 162 503 365 135 160 -455 -553 -191 -128 -2 293 -143 279 168
1746 168 384 108 139 -68 -278 -46 -32 83 53 117 300 708 336 79 166 72 91 -41 -176 -253 -146 25 247
$$ packed form
1589A56m30N38k55K78N6o11j64j49K99K67K7qnN04k01J0j02k56k76n3K54J00l37
1612c58K40N29k33P9q4K04l38l40r1J64Q3l82L13K37K09j97O16n67o5O1j63n0
1634a33Q4J31l07kM90J68l16K16k44j05M16k97k68j73j7M49j99Q6k11J37K74J60
1656C39r1p1k14J22k11L1K5j56N08k48N16j68n3j06J09k18j30j93M19l93J86Q7
1678I0K09M1j52K88m2l31J93k99Q9l84k2J07L97k30M05k29o9J90k40Q9j90L9m3
1701i4k06J82N30k24J79O1j65k4j67j31l3j00R2q1J63J05k33L80N03k90k90j34
1723B3no0j07j56l4J44J26J73O9j1L41j38k30K5o15r8L62O3J26K95m36M22j11
1746A68K16k76L1k07k10K32J4J15l0O4J83M08l72k57Q7r4J9j32j35p7J07J71K22
$$ plain form
1769 247 -33 140 249 263 372 -153 -64 -59 -184 -156 -69 -163 437 22 516 479 228 -172 222 224 248 117 -152 -9
1793 -9 -214 -12 26 486 378 178 -141 178 101 203 160 -493 -251 88 180 -218 -12 170 308 249 115 214 -10
1816 -10 -224 -235 -149 3 -16 241 146 233 288 146 184 354 144 -85 -200 -177 41 -14 153 341 340 -58 262 218
1840 218 111 -297 -170 -355 -202 245 196 190 94 362 103 394 88 40 -163 -149 -118 -135 151 -165 66 247 367
1863 367 373 440 -101 -116 -176 -20 -162 -411 -111 70 5 -120 134 -19 451 364 118 -136 -223 -135 74 -82 190
1886 190 65 186 232 697 232 -19 147 -238 20 -109 105 -380 -221 142 -47 446 194 -79 33 -71
1906 -71 -102 -136 -487 -198 -5 160 325 129 -180 126 230 222 79 -187 -294 -64 -26 -262 19 82 384 324 272
1929 272 272 -126 -219 -76 215 -6 -418 -259 -204 167 444 270 101 91 543 191 -24 -338 -371 -276 -34 -60 -134
$$ packed form
1769B47k80J73J09J4J09n25Q9Nj25K8Q7r4O00m15M94l7k51m00L94KK4j31k69J43
1793ik05K02L8M60j08k00l19L19p7J02m3o53K42L39R2l98K06J82J38n9j34R9k24
1816a0k14j1Q6J52j9K57r5Q7N5j42L8J70k10k29j15K3K18n5J67J88jl98L20m4
1840B18j07m08J27j85J53M47m9or6K68k59K91l06m8k03J4L1j7K86l16K31J81J20
1863C67OO7n41j5o0J56j42k49L00J81o5j25K54j53M70q7k46k54q7Q8K09j56K72
1886A90j25J21M6M65m65k51J66l85K58j29K14m85J59L63j89M93k52k73J12j04
1906g1l1l4l51K89J93J65J65j96l09L06J04qj43k66j07K30L8k36K81O3L02o0n2
1929B72%l98r3J43K91k21m12J59N5L71K77j74j69j0M52l52k15l14l3R5K42k6p4
$$ plain form
1952 -134 -48 257 484 -44 134 -124 -325 156 -180 4 -134 -14 352 139 481 415 423 -146 -108 -149 162 -296
1974 -296 -226 -37 96 13 144 55 300 23 214 239 -86 -234 -281 -31 -9 -167 -119 -253 198 533 179 153 -170
1997 -170 -240 24 187 -141 -418 -375 567 486 239 223 97 191 430 30 -269 -363 -87 -213 137 -131 36 104
2019 104 2 271 245 -75 -173 -237 -154 -285 -220 -51 56 214 217 320 183 121 73 -248 76 60 -385 -516 -101
2042 -101 153 -38 104 36 101 224 -200 225 -145 -80 -203 -166 -109 -86 174 29 82 351 395 33 -48 -127 -267
2065 -267 32 -113 -309 -106 197 447 -195 260 -107 41 49 -19 -318 -201 199 -38 118 19 -113 300 562
2086 562 449 84 -37 -46 -51 71 77 -27 36 44 298 105 -23 134 -30 -276 -92 -280 81 -9 -47 298 120 134
2110 134 378 10 151 -179 23 241 153 -537 -370 135 246 76 131 242 -110 61 112 22 -45 -73 -224 50
$$ packed form
1952a34Q6L05K27n28J78k58k01M81l36J84j38J20L66k13L42o6Qn69L8m1L11m58
1974b96P0J89J33q3J31q9K45k77J91K5l25j48m7K50K2j58M8j34M51L35l54k6l23
1997a70p0K64J63l28k77M3R42q1k47j6j26R4K39m00k99r4K76j26L50k68J67O8
2019A04j02K69k6l20r8o4Q3j31O5J69J07J58LJ03j37o2m8l21L24j6m45j31M15
2042a01K54j91J42o8O5J23m24M25l70O5j23L7N7K3K60j45N3K69M4l62q1p9j40
2065b67K99j45j96K03L03K50o42M55l67J48Qo8k99J17M00k37J56r9j32M13K62
2086E62j13l65j21rnJ22Oj04O3QK54j93j28J57j64k46J84j88L61r0l8L45j78J4
2110A34K44l68J41l30K02K18q8o90J67N05J11j70N5J11l52J71N1r0o7k8j51K74
$$ plain form
2132 50 -162 -51 179 417 -17 138 -203 60 -72 10 22 -281 -91 -92 15 -83 337 68 -226 166 -8 -35
2154 -35 92 -147 -531 -596 -126 133 90 98 96 289 114 271 37 -147 -158 -449 -83 31 -176 -30 130 -140 290
2177 290 -17 -9 -215 176 -117 -108 -318 -200 76 283 -19 239 356 373 116 -293 -507 -317 -66 250 -48 64
2199 64 -279 -163 145 -233 164 -81 71 9 -158 -160 -108 180 128 263 157 165 149 31 58 -43 -113 8 86 -70
2223 -70 -91 32 91 98 66 -4 270 232 -79 -42 -216 3 220 115 174 1 190 523 204 273 274 15 -40 -114 -157
2248 -157 -118 83 12 466 49 112 -67 427 17 55 -334 -124 -306 -386 -190 65 241 85 179 192 -120 45
2270 45 208 109 -197 -276 -107 16 112 63 172 82 317 406 14 79 -250 -334 -324 -358 -375 -246 151 99 128 59 108
2295 108 250 -110 -344 80 -120 -327 -280 -196 -227 125 -56 -24 16 30 133 31 -244 -278 -317 -318 -238 239 103 124
$$ packed form
2132E0k12J11K30K38m34J55l41K63j32Q2J2l03J90jJ07r8M20k69k94L92j74k7
2154c5J27k39l84o5M70K59m3QkJ93j75J57k34j84j1k91L66J14k07J46J60k70M30
2177B90l07Qk06L91k93Rk10J18K76K07l02K58J17J7k57m09k14J90K51L16k98J12
2199F4l43J16L08l78L97k45J52o2j67kN2K88n2J35j06Qj6j18K7j01p0J21P8j56
2223g0k1J23N9Pl2p0K74l8l11L7j74K19K17j05N9j73J89L33l19O9Jk59n5p4m3
2248a57L9K01p1M54m17O3j79M94m10L8l89K10j82q0J96K55J76j56R4J3l12J65
2270D5J63r9l06p9J69J23R6m9J09r0K35Q9l92O5l29q4J0l4j7J29L97n2K9o9M9
2295A08J42l60k34M24k00k07M7Q4l1L52j81L2M0J4J03j02k75l4l9jQ0M77j36K1
$$ plain form
2319 124 381 478 70 -60 -308 29 -40 -298 -154 -267 106 40 394 279 35 110 -34 21 -77 85 111 -37
2341 -37 554 185 -135 182 561 275 109 -160 28 145 -76 -282 -381 -4 269 271 87 194 497 486 302 6
2363 6 190 -106 -299 253 217 -116 348 344 213 212 201 60 176 -201 -208 -140 -194 -107 78 369 58 581 158 291
2387 291 -3 -121 -221 51 -99 -1 -240 -84 557 8 485 121 101 87 87 -115 -396 -238 -379 -155 170 -28
2409 -28 -278 225 418 -85 -181 -143 -177 -243 -317 -258 -41 -41 -126 -49 -28 147 8 -38 71 -639 -405 -42 0 -178 -248
2434 -248 84 -55 -3 -22 -72 -219 -65 -214 112 -279 77 -34 155 25 23 416 -27 233 -294 -250 -305 -88
2456 -88 170 -115 -282 -110 177 264 -67 242 272 341 227 -55 -144 -86 295 88 59 -65 411 333 44 164 -304
2479 -304 -26 -30 9 -81 -419 -326 -86 72 91 117 -74 67 364 -311 -381 -230 28 105 -190 -69 -77 192 232 53
$$ packed form
2319A24K57R7m08j30k48L37o9k58J44j13L73o6L54j15k44P5j44N5r8J62K6j48
2341c7N91l69l20L17L79k86j66k69J88J17k21k06r9L77K73Kj84J07L03j1j84k96
2363FJ84k96j93N52l6l33M64mj31jj1j41J16l77pO8n4Q7J85K91l11N23m23J33
2387B91k94j18j00K72j50R8k39J56O41n49M77l64k0j4%k02k81J58j41K24L25j98
2409b8k50N03J93n03r6L8l4o6p4N9K17%q5P7K1J75j39m6J09p10K34L63M2j78p0
2434b48L32j39N2j9n0j47J54j49L26l91L56j11J89j30kL93m43K60n27M4n5K17
2456h8K58k85j67J72K87Q7l31L09L0O9j14k82q9N8L81k07k9j24M76p8k89J20m68
2479c04K78mL9r0l38R3K40J58J9K6j91J41K97o75p0J51K58P7k95J21qK69M0j79
$$ plain form
2503 53 -539 160 15 -188 -297 2 -302 4 30 -186 -39 -51 115 233 -26 -413 141 -126 -24 -304 -479
2524 -479 -212 204 285 246 -190 -293 -184 160 -254 -257 -289 -100 -3 114 -120 47 210 6 0 158 143 84 45 26
2548 26 69 -186 108 285 271 80 106 15 295 147 -61 -14 83 115 -119 27 62 426 321 400 -283 -153 101
2571 101 249 -42 -80 -49 -15 478 372 43 97 299 275 -8 -23 -76 288 187 -16 24 -217 -161 122 52 -86
2594 -86 -257 -110 237 -15 -83 -78 -52 83 -109 31 160 -45 304 -28 32 9 -206 173 340 -105 -425 67
2616 67 303 38 -119 -62 35 250 48 -279 -42 34 183 -137 -86 -136 -82 101 106 -38 33 64 -230 43 -102 -572
2640 -572 32 463 297 -353 -278 115 493 9 -298 -438 67 -21 69 -157 -340 181 391 344 12 175 168 125
2662 125 150 -1 -171 -105 -90 334 -112 18 -107 237 268 -248 -156 -110 -181 -235 -244 -229 -177 107 117 78 139 281 60
$$ packed form
2503E3n92O99j45k03j09K99l04L06K6k16J47j2J66J18k59l87N54k67J02k80j75
2524d79K67M16Q1l9m36j03J09L44m14ll2J89R7J17k34J67J63k04oJ58j5n9l9j9
2548B6M3k55K94J77j4j91K6r1K80j48k08M7R7L2k34J46L5L64j05P9o83J30K54
2571A01J48k91l8L1L4M93j06l29N4K02k4k83j5n3L64j01k03M0k41N6K83p0j38
2594h6j71J47L47k52o8NK6J35j92J40J29k05L49l32O0k3k15L79J67m45l20M92
2616F7K36k65j57N7R7K15k02l27K37P6J49l20N1n0N4J83Nj44P1L1k94K73j45m70
2640e72O04M31j66o50P5L93L78m84l07j40N05q8R0k26j83N21K10m7l32J63pm3
2662A25K5j51j70O6J5M24m46J30j25L44L1n16R2M6p1n4rJ5N2K84J0l9O1J42k21
$$ plain form
2687 60 176 191 -255 105 112 200 -315 -118 131 174 256 -156 40 105 286 -188 -5 -307 -282 251 495 192 99
2710 99 -29 244 292 -400 -419 -289 -241 136 -165 -122 157 269 99 47 -232 -251 196 10 27 -478 -135 -85 -131
2733 -131 283 -128 78 -13 327 211 111 -392 -7 372 97 71 -93 133 293 -91 18 81 233 -196 -95
2754 -95 -426 -182 310 -37 181 -32 -278 -13 363 82 -111 -73 -76 -123 -303 -182 36 -173 258 144 -123 -54
2776 -54 57 142 87 -11 -195 -262 -1 -144 -23 -119 -82 330 22 -91 3 -58 -165 -147 -474 -185 7 1 113 43
2800 43 -141 78 134 51 164 -218 -156 13 -215 -364 -194 42 567 63 242 -166 322 -16 -140 -398 -50
2821 -50 138 70 -56 -92 -140 270 396 70 -90 -73 193 259 34 -293 -48 -125 246 179 186 276 -34 415 39 110
2845 110 -192 73 4 -270 156 121 171 183 322 109 54 47 156 158 -87 -257 125 134 303 167 48 72 453 373
$$ packed form
2687F0J16J5m46L60PQ8n15J97K49M3Q2m12J96O5J81m74J83l02K5N33K44l03r3
2710I9j28K73M8o92j9J30M8L77l01M3K79J12j70n2k79j9M47j86J7n05L43N0m6
2733a31M14m11K06r1L40j16j00n03L85L79k75k6j64K26J60l84J09O3J52m29J01
2754i5l31K44M92l47K18k13k46K65L76k81j93L8lm7j80J21K18k09M31j14k67O9
2776e4J11Q5n5r8j84o7K61j43J21r6L7M12l08j13R4o1j07J8l27K89J92oJ12p0
2800D3j84K19N6q3J13l82O2J69k28j49J70K36N25n04J79m08M88l38j24k58L48
2821e0J88o8j26l6m8M10J26l26j60J7K66O6k25l27K45p7L71o7PR0l10M49l76P1
2845A10l02K65o9k74M26l5N0J2J39k13n5pJ09Kk45j70L82RJ69j36j19K4L81q0
$$ plain form
2869 373 -246 4 -62 86 142 -152 92 12 192 227 71 135 85 78 -45 -171 -105 -204 -153 -78 -93 -47 147 235 32
2894 32 -142 0 44 -99 23 -520 -110 46 30 321 -122 11 -75 408 -46 -228 -248 -104 -123 -50 -196 -492
2916 -492 -36 -8 56 -1 -175 -115 72 18 -184 -135 -142 -43 -194 126 62 309 14 132 -98 -238 -73 131 -107
2939 -107 -212 -478 34 268 294 222 -122 0 180 103 78 -86 -22 -4 20 75 -105 -32 148 179 460 12 271
2962 271 120 178 145 -229 177 418 348 228 -4 147 306 327 85 -180 -167 29 -87 127 -210 123 -28 167
2984 167 176 56 -23 157 -4 -77 -148 -212 131 50 243 -194 198 131 148 -309 -186 -43 85 158 -138 -9 -15 184
3008 184 439 -59 164 126 138 66 192 -289 -112 368 155 -29 392 -297 -20 37 175 150 -115 66 203 -113
3030 -113 -61 -242 -47 187 271 105 175 -60 -97 -38 -188 254 218 205 -83 -132 -138 424 241 95 -40 87 491
$$ packed form
2869C73o19K50o6J48N6k94K44q0J80L5j56O4n0pj23j26O6r9N1P5j5M6J94Q8k03
2894C2j74J42M4j43J22n43M10J56j6K91m43J33q6M83m54j82k0J44j9P3j46k96
2916d92M56K8O4n7j74O0J87n4k02M9pR9j51L20o4K47k95J18k30j40J65K04k38
2939a07j05k66N12K34K6p2l44J22J80p7k5j64O4J8K4N5j80P3J80L1K81m48K59
2962B71j51N8l3l74M06K41p0j20k32J51J59K1k42k65J3J96j16K14l37L33j51J95
2984A67Rj20p9J80j61p3p1o4L43q1J93m37L92o7J7m57J23J43J28P3k96J29oJ99
3008A84K55m98K23l8J2p2J26m81J77M80k13j84M21o89K77N7J38k5k65J81J37l16
3030a13N2j81J95K34Q4j66P0k35l7N9j50M42l6j3k88m9oN62j83j46j35J27M04
$$ plain form
3053 491 17 -182 -319 -136 278 186 216 -2 76 317 145 183 143 53 -29 -136 -62 51 126 139 -27 552 -27
3076 -27 -103 -233 107 71 86 -61 134 -6 -95 21 -204 70 40 -73 0 -275 -166 -260 -237 -115 -490 2 10 222
3100 222 -56 -20 159 228 -285 -151 -359 -160 -259 25 -153 -190 -11 252 49 228 -180 -201 -341 -50 -28 -187
3122 -187 -72 -271 -51 -195 -101 -136 -50 -52 -226 -291 -236 -363 -20 -84 -391 -74 56 130 206 259 -324 179 -59 -404
3146 -404 -48 -59 211 -51 95 144 200 83 231 25 -67 78 -150 -168 -115 133 312 345 -48 -38 298 284 86
3169 86 49 304 -15 112 -149 -84 286 342 81 216 173 21 3 108 21 -189 -122 145 20 -1 106 259 -9
3192 -9 74 400 31 -271 -222 -88 49 -40 -145 -213 116 124 48 226 -49 151 -132 -269 42 124 91 -76 -213 -121
3216 -121 -88 140 -68 -61 84 -243 -215 -78 -254 -261 -156 19 322 457 -94 86 15 -186 -36 -101 112 -57 -42
$$ packed form
3053D91m74j99j37J83M14r2L0k18P8K41j72L8m0r0q2j07P4J13P5J3j66N79n79
3076b7p6j30L40l6J5j47J95j40q9J16k25K74l0j13P3k75J09r4K3J22l75M92QK12
3100B22k78L6J79O9n13J34k08J99r9K84j78l7J79K63k03J79m08k1j40K91K2j59
3122a87J15j99K20j44R4l5Q6kj74o5N5j27L43o4l07L17J30P4P6N3n83N03k38l45
3146d04L56j1K70k62J46M9N6j17J48k06r2J45k28j8N3K48J79L3l93J0L36j4j98
3169H6l7K55l19J27k61O5L70N6k61J35m3j52j8J05q7k10O7K67j25k1J07J53k68
3192iQ3L26l69l02M9J34J37q9j05o8L29Qp6J78k75K00k83j37L11Q2l3j67j37R2
3216a21L3K28k08PJ45l27K8J37j76pJ05J75L03J35n51J80p1k01J50o5K13j69J5
$$ plain form
3239 -42 174 75 -53 112 161 193 -278 149 -8 71 -454 105 -108 150 433 -155 -48 -200 32 -144 338 118
3261 118 -322 54 115 10 -63 -245 -34 168 116 54 195 -29 35 -62 -115 -8 110 50 26 36 -113 132 5
3284 5 352 -28 51 21 42 74 -122 -125 -193 42 273 167 -70 -57 94 177 103 -286 -201 58 24 -177 -122 41 -131
3309 -131 327 39 165 276 196 116 -70 125 -133 -23 70 268 58 75 132 -4 46 44 -73 -9 -165 -161 -432 -21
3333 -21 32 318 -185 94 -177 101 109 190 -67 -260 -179 135 53 -235 342 210 -157 -53 -99 -372 -139 -157 63
3356 63 -195 -160 25 7 14 -55 -75 331 15 -115 -264 -75 -476 -30 -125 152 167 -86 193 158 -110 231 -63
3379 -63 -39 -224 47 -273 111 181 -73 145 133 105 13 -219 -85 19 -329 -108 1 -43 136 155 413 -101 -290
3402 -290 155 -24 -142 -7 128 -177 116 -40 30 74 127 -72 -150 83 -94 41 -69 -31 -38 122 44 166 126
$$ packed form
3239d2K16r9j28J65M9L2m71M27j57P9n25N59k13K58K83n88J07j52K32j76M82k20
3261A18m40L76O1j05p3j82K11K02n2o2J41k24O4r7n3J07J18o0k4J0j49K45j27
3284EL47l80P9l0K1L2j96lo8K35K31j06k37J3J51Q3p4l89Q5K59l4k01N5J63j72
3309a31M58k88J26J11q0q0j86J95k58J10R3J98k10J7N7j36N0kj17O4j56Mk71M11
3333b1N3K86n03K79k71K78QQ1k57j93Q1L14q2k88N77j32l67J04m6k73K33j8K20
3356F3k58L5J85j8Po9k0M06l16j30j49J89m01M46r5K77J5k53K79l5k68L41k94
3379f3K4j85K71l20L84P0k54K18j2k8r2k32J34J04l48K21J09m4J79J9K58n14j89
3402b90M45j79j18J35J35l05K93j56P0M4N3j99p8K33j77J35j10L8pJ60p8J22m0
$$ plain form
3425 126 79 236 -151 50 -196 130 -16 -126 -152 -105 228 -140 -58 -74 -60 101 180 53 -71 -150 -67 81 28
3448 28 -15 61 -64 130 167 -78 355 -2 -54 -87 -56 -60 187 46 -5 286 1 73 106 -168 63 -65 43 -128
3472 -128 -220 -178 111 -1 98 159 130 -19 -39 -162 129 37 -36 -543 -34 -256 9 218 308 54 -41 360 59
3495 59 8 -5 -155 -148 -104 -205 -280 -134 -21 -100 186 79 32 -127 -138 -174 -281 -255 115 241 24 -164 -86 -58 252
3520 252 -150 -81 -305 -202 -166 -33 -18 -86 317 -80 62 419 72 225 -217 -278 -114 203 -405 -4 12 174
3542 174 213 237 57 186 124 209 -43 148 186 -395 -93 -18 -69 24 0 53 261 -143 44 -14 -22 -81 176 -67 157
3567 157 258 202 -215 109 58 -20 20 86 -298 102 -22 -267 -13 -323 -127 -147 133 -158 -193 -278 -296 -139 -202
3590 -202 -238 -252 -59 -69 275 311 -137 60 -143 -71 -116 -283 87 -384 -11 -153 -21 -2 144 205 96 125 50
$$ packed form
3425A26m7J57l87K01k46L26j46j10k6M7L33l68Q2j6J4J61P9j27j24p9Q3J48n3
3448B8m3P6j25J94L7k45M33l57n2l3L1mK47j41n1K91k85P2L3k74K31j28J08j71
3472a28r2M2K89j12R9O1k9j49k0j23K91r2p3n07N09k22K65K09R0k54r5M01l01
3495E9n1j3j50PM4j01p5J46J13p9K86j07m7j59j1l6j07K6L70J26k17j88P8K8L10
3520B52m02O9k24J03L6J33J5o8M03l97J42L57l47J53m42o1J64L17o08M01J6J62
3542A74L9K4j80J29o2Q5k52J91L8n81L02P5n1R3k4N3K08m04J87n8qn9K57k43K24
3567A57J01n6m17L24n1p8M0O6l84M00j24k45K54l10J96k0K80k91l5q5j8J57o3
3590b02l6j4J93j0L44L6m48J97k03P2m5j67L70m71L73j42J32J9J46O1j09K9p5
$$ plain form
3613 50 7 16 57 -29 -162 130 41 -237 145 -64 72 -43 251 90 -108 -211 -70 183 142 148 71 78 38 109 -89
3638 -89 -103 157 -255 -178 -1 16 147 274 -34 33 305 51 -3 57 -117 84 -58 -14 -2 344 187 51 213
3661 213 -1 224 32 298 -42 -135 98 -66 56 191 98 148 -85 -190 216 432 125 46 108 159 -160 23
3683 23 -9 188 217 190 27 -214 59 -162 -58 -225 -91 69 -1 184 107 150 353 131 182 326 189 -78 -205
3706 -205 -337 -268 -178 -176 -334 -418 217 -152 30 -102 -162 -298 -45 90 61 -8 121 82 -314 -31 181 -116 38
3729 38 -276 3 -194 -95 -255 -181 -113 88 90 123 -63 79 124 -129 -94 -166 -24 101 -69 -247 38 207 90
3752 90 293 -97 0 -63 -111 1 87 -54 -70 51 -178 131 -133 147 90 -99 112 -37 -73 -323 432 -44 -108
3775 -108 13 284 232 -99 254 121 -34 51 114 -42 -57 40 -23 156 275 112 395 284 -39 -72 27 -323 50
$$ packed form
3613E0m3RM1q6j33K92q9k78L82k09J36j15K94j61j98j03J41K53m1Op7Pm0P1j98
3638h9j4K60m12P7J77J7J31J27l08O7K72k54n4O0j74K01j42M4J2L46j57j36J62
3661B13k14K25j92K66l40r3K33j64J22J35r3N0k33j05M06K16l07p9O2N1l19J83
3683B3l2J97K9k7j63k41K73k21J04j67J34J60p0J85p7M3K03k22N1J44j37k67j27
3706b05j32O9R0Kj58q4O35l69J82j32o0j36K53J35k9o9J29l9l96K83K12k97J54
3729C8l14K79j97R9j60P4O8K01KL3j86J42M5k53L5p2J42J25j70j78K85J69j17
3752I0K03l90R7o3m8J12Q6j41j6J21k29L09k64K80n7j89K11j49l6k50P55m76o4
3775a08J21K71n2l31L53j33j55Q5O3j56j5R7o3J79J19j63K83j11l23l3R9l50L73
$$ plain form
3798 50 -19 -165 -83 -165 141 128 129 -82 117 -12 -153 -87 -18 -100 -21 232 -87 -137 272 103 -60 128 78 -148
3822 -148 122 -203 -103 97 -90 -149 171 98 -81 -31 -63 -7 95 252 104 -179 -130 175 35 9 59 -66 122
3845 122 415 69 -362 -2 -295 47 208 -88 169 157 160 139 211 77 36 -85 -3 -292 -22 -176 -139 135 39
3868 39 -17 31 94 -32 -94 21 38 53 -58 -111 48 28 182 89 -186 -39 23 -9 -137 -79 46 -5 132 -30 108
3893 108 379 139 225 140 -150 33 -32 -158 -37 -100 -15 132 61 -35 77 164 349 146 -6 68 236 259 -80
3916 -80 -206 -8 -86 -226 199 55 268 4 110 -128 -319 -239 74 -44 -235 197 364 203 -161 152 384
3937 384 81 -83 246 149 -122 -135 -127 -69 15 124 161 360 277 304 32 181 -171 -337 154 89 -93 -12 -40 135
3961 135 -156 -161 1 125 50 49 90 128 -378 -15 -53 -68 309 75 -62 107 -58 255 -163 -190 -28 -202 32
$$ packed form
3798E0o9j46Q2q2L06j3Jk11J99j29j41O6O9q2P9K53l19n0M09j69j63J88n0k26
3822a48K70l25J00K00j87n9L20p3j79N0l2N6J02J57j48k83M9L05j40k6N0j25J88
3845A22K93l46m31L60k93L42J61k96K57j2Lk1P2j34m1j21Q2k89K70j54L7K74r6
3868C9n6M8O3j26o2J15J7J5j11n3J59k0J54r3k75J47O2l2j28N8J25n1J37j62J38
3893A08K71k40Q6q5k90J83o5j26J21o3Q5J47p1r6J12Q7J85k03j52P4J68K3l39
3916h0j26J98p8j40M25j44K13k64J06k38j91Q0L13j18j91M32J67j61l64L13K32
3937C84l03j64L29r7k71j3QN8Q4J09L7J99q3K7k72J49l52j66M91o5j82Q1k8J75
3961A35k91nJ62J24p5jM1L8n06L63l8j5L77k34j37J69j65L13m18k7J62j74K34
$$ plain form
3984 32 187 12 74 30 120 163 11 -153 -245 -142 -189 25 100 392 217 115 -19 218 141 32 -214 -39 -70
4007 -70 58 -221 -269 51 93 -85 -22 -67 -191 -220 1 -154 219 61 114 91 -22 -64 233 98 124 25 66 -178
4031 -178 79 -262 -116 201 -115 236 173 -115 266 -106 215 9 -8 -125 -341 178 -255 100 394 177 178
4052 178 212 -55 62 13 -94 51 -337 -163 178 41 -140 -112 108 42 -9 -87 15 -86 -89 -115 -137 -141 -73 106
4076 106 -78 104 -1 -31 125 18 66 174 57 -57 81 -160 190 -102 11 125 187 -22 108 -8 -314
4097 -314 -192 16 114 -197 -154 45 22 -135 223 55 259 112 86 189 -61 -224 147 22 259 147 93 -60
4119 -60 103 52 -44 -168 -106 40 -121 -40 62 -18 173 80 142 -46 -10 -265 16 321 -362 -64 -117 -163 156 -110
4143 -110 211 213 143 69 20 238 -169 -54 -196 64 -90 341 208 109 43 167 204 -37 73 4 -615 -64 8
$$ packed form
3984C2J55j75O2m4R0M3j52j64r2J03m7K14P5K92j75j02j34K37p7j09k46J75l1
4007g0J28k79m8L20M2j78O3m5j24k9K21j55L73j58N3k3j13m2K97j35K6r9M1k44
4031a78K57l41J46L17l16L51o3k88L81l72L21k06j7j17k16N19m33L55K94k17J
4052A78L4k67J17m9j07J45l88J74L41j37j81K8K20o6n1p8J02j01lk6k2mO8J79
4076A06j84J82j05l0J56j07M8J08j17j14J38k41L50k92J13J14O2k09J30j16l06
4097c14J22K08R8l11M3J99k3j57L58j68K04j47k6J03k50j63L71j25K37j12n4j53
4119f0J63n1r6j24O2J46j61Q1J02q0J91r3O2j88L6k55K81L05o83K98n3m6L19k66
4143a10L21Kp0p4m9K18m07J15j42K60j54M31j33r9o6J24L7k41J10o9o19N51P2
$$ plain form
4166 8 320 94 110 32 80 -179 75 -63 -31 52 -202 39 -77 52 154 137 -71 243 -261 -338 -388 25 -274
4189 -274 -68 148 173 37 165 51 154 60 -60 60 -307 -86 41 -129 -262 108 -180 202 82 214 43
4210 43 -176 -39 -279 -38 83 -219 -103 -15 187 -15 42 25 -171 -25 -205 229 29 186 3 -57 55 69
4232 69 63 -303 157 -170 -137 -387 -30 -12 -137 35 -64 -258 -258 47 57 -46 62 -17 -143 -168 -89 -49 130 -4
4256 -4 -113 143 52 230 -1 -125 -99 81 -109 65 172 -159 -81 -97 -211 147 -115 228 22 104 -46 -125 71
4279 71 50 -67 71 188 219 348 167 58 141 -238 -68 -121 -43 -175 -305 215 109 168 -94 6 280 221 213
4302 213 -75 -288 -211 223 146 -166 -164 196 -38 189 234 -205 -168 122 -303 367 -82 -72 -155 -159 -6 -207 188
4325 188 226 84 103 246 -193 -25 -25 102 41 168 -56 32 271 5 -107 -30 146 -31 -65 172 -160 262 62
$$ packed form
4166HL12k26J6p8M8k59K54j38L2Q3k54K41j16J29J02j7k08L14n04p7n0M13k99
4189b74K06K16K5j36J28j14J03r4j20J20l67K21J27j70j33L70k88L82j20J32j71
4210D3k19J37k40K41J21l02J16Q8K02k02N7j7j96J46j80M34k00J57j83o0J12J4
4232F9ol66M60l27L3k50L57J8j25J72r9j94%L05J0j03J08p9j26k5P9M0J79j34
4256dj09K56r1J78k31j24K6J80j90J74J07l31P8j6j14L58k62L43k06Q2j50p9J96
4279G1k1j17J38J17L1J29j81j09Q3l79J70n3P8j32j30N20j06N9k62J00K74n9q
4302B13k88k13P7M34p7l12KL60k34K27M5m39L7K90m25O70m49J0q3mJ53k01L95
4325A88L8j42J9J43m39J68%J27o1J27k24Q8K39k66j12P7J76j77l4K37l32M22k00
$$ plain form
4348 62 -28 -150 74 28 173 77 17 -169 -39 -163 130 71 4 -13 152 -118 -82 -326 -194 -92 88 -33 -7
4371 -7 -69 9 146 26 20 98 170 -144 209 155 96 9 -166 105 -151 -158 -21 -220 -38 64 149 9 90 8 -116
4396 -116 270 29 -40 10 115 258 109 121 57 123 72 131 -131 -67 28 172 -126 -98 -412 162 89 -207 -154 -140
4420 -140 15 7 -193 -120 -54 -105 -403 119 335 -157 112 212 -116 0 -135 10 -138 -47 -10 16 66 160 -21
4443 -21 -93 -44 -271 48 -18 -406 -12 49 128 30 -186 15 25 -168 -89 -311 -86 -42 28 0 150 345 -30 134
4467 134 22 -100 97 148 415 30 -17 -118 48 132 -140 -114 -30 -71 -37 156 -39 -41 79 117 -185 71 -304
4490 -304 -89 -106 188 58 122 -162 43 11 -54 -317 -282 -144 -9 47 216 169 101 1 180 100 119 -6 -166
4513 -166 -314 145 -1 -200 184 113 38 186 -97 -157 66 -80 -158 -82 64 -105 -17 38 -41 424 31 33 33 52
$$ packed form
4348F2r0j22K24m6J45r6o0j86J30j24K93n9o7j7J65k70L6k44J32J02J80j21K6
4371go2P8J37j20oP8P2l14L53n4n9q7j75K71k56pJ37j99J82J02Q5j40Q1q2j24
4396a16L86k41o9N0J05J43j49J2o4O6n1N9k62O4R5J44k98K8l14N74p3k96N3J4
4420a40J55qk00P3O6n1k98N22K16m92K69J00l28J16j35J45j48R1L7K6N0R4j81
4443b1p2M9k27L19o6l88L94O1P9r8k16K01J0j93P9k22K25M4P0k8J50J95l75J64
4467A34j12j22J97N1K67l85m7j01J66Q4k72K6Q4m1L4J93j95kJ20L8l02K56l75
4490c04K15j7K94j30O4k84K05l2o5k63L5J38J35N6J69m7o8j00J79q0J9j25j60
4513a66j48M59j46j99L84p1p5J48k83o0K23j46p8P6J46j69Q8N5p9M65l93K%J9
$$ plain form
4537 52 -13 125 28 -73 -74 -127 -24 -202 -52 247 91 317 51 261 -26 113 -217 29 81 -39 -60 262 84
4560 84 -98 17 -71 135 -231 -65 92 38 -42 2 338 229 214 188 -101 -171 -79 -23 165 71 -84 81 71 -110
4584 -110 112 -129 14 -183 23 64 -153 -112 -88 -124 -84 1 29 331 -109 -139 -211 124 73 -226 -170 -221 -24 -59
4608 -59 -571 135 -266 -248 -140 28 148 -127 21 -147 -136 -63 -129 -44 88 140 168 -64 204 158 -81 172 -81
4631 -81 -86 -100 -86 -361 149 139 -302 41 112 89 -47 -261 100 -336 -133 -113 -50 211 45 -187 -81 -275 76
4654 76 -165 -262 -192 8 -21 -84 -136 -7 255 303 -44 -23 -95 10 -52 -146 83 -133 -174 175 -112 -375 26 -7
4678 -7 -110 97 -202 -59 -35 51 -215 -186 60 37 189 -234 97 -60 70 206 -113 -118 -14 -214 95 148 -28
4701 -28 -25 -13 21 -173 97 61 225 -53 177 81 -30 -69 -143 240 79 -86 141 34 90 -9 -149 62 86 77 20
$$ packed form
4537E2o5J38r7j01jn3J03j78J50K99j56K26k66K10k87J39l30K46N2j20k1L22j78
4560H4j82J15q8K06l66J66J57n4q0M4L36j09j5k6k89p0R2N6J88r4j55J65j0j81
4584a10K22k41J43j97K06M1k17M1K4l6M0Q5K8L02m40l0p2L35n1k99N6n1J97l5
4608e9n12P06m01J8J08J68J20k75J48j68J1P3o6Q5J32N2K8k32K68m6k39K53k53
4631h1nj4J4k75N10j0m41L43P1k3j36k14L61m36K03K0O3K61j66k32J06j94L51
4654G6k41r7P0K00k9o3n2J29K62M8l47K1p2J05o2r4K29k16m1L49k87k63M01l3
4678gj03K07k99J43K4Q6k66K9K46k3J52m23L31j57J30J36l19nJ04k00L09N3j76
4701b8LJ2L4j94K70l6J64k78K30r6j11l9p4L83j61j65K27j07N6r9j40K11K4rn7
$$ plain form
4726 20 76 83 89 115 450 -191 212 -46 -378 -156 31 -133 318 -125 230 39 29 -32 20 -266 -328 113 -60 121
4750 121 -195 -223 111 235 -206 101 -56 271 -68 141 -17 -141 89 -133 173 -36 -11 215 -30 -183 77
4771 77 221 223 -126 -213 -127 378 56 -345 -37 210 158 62 305 -230 -35 -169 205 -113 -57 68 149 57 50 257
4795 257 126 -76 -67 241 62 82 -22 -320 -35 -145 226 -96 -215 64 -31 90 45 349 22 -131 -162 60
4817 60 20 33 1 308 -262 157 -151 85 -107 74 -175 -216 -74 180 86 -47 113 -272 37 -106 85 291
4839 291 76 26 -271 80 206 60 58 261 149 103 163 -146 -146 -326 -315 -181 -129 -120 -129 95 -65 41 40 -54 -149 -97
4865 -97 -224 -224 -472 -102 -149 -91 -139 12 91 -101 180 145 92 -412 83 123 -129 -334 123 -257 238 119 85 -64
4889 -64 -46 296 17 -200 -115 149 -135 -42 -109 147 29 -23 -140 0 1 146 -198 -207 -85 -166 -55 -2 -17 42 -186
$$ packed form
4726B0N6POK6L35o41M03k58l32K22J87j64M51m43L55j91j0o1N2k86o2M41j73J81
4750A21l16k8L34J24m41L07j57L27l39K09j58j24K30k22L06k09K5K26k45j53K60
4771G7J44Kl49q7Q6N05l22m01L08K47n2r6K43n35J95j34L74l18N6J25Q1r2pK07
4795B57j31k02RL08j79K0j04k98K85j10L71l22j19K79r5J21m5L04l27j53l1K22
4817F0m0J3l2L07n70M19l08K36j92J81k49m1J42K54r4j33J60l85L09j43J91K06
4839B91k15n0k97L51J26j46kK03j12m6O0l09%j80J1J34N2RrK24j60J06jr4r5N2
4865i7j27%k48L70m7N8m8J51P9j92K81l5n3n04M95M0k52k05M57l80M95j19l4j49
4889f4J8L42k79k17Q5K64k84R3o7K56j18n2j17J40JJ45l44rJ22q1J11N3j5N9k28
$$ plain form
4914 -186 -25 20 17 16 -57 -66 -21 12 -61 9 27 93 59 27 197 -65 -151 62 176 73 -45 152 30 -87 -316 -160
4940 -160 -61 -96 -88 7 -186 -78 138 29 22 -47 -201 124 20 -75 98 -379 41 174 -204 28 -47 4 62 -14
4964 -14 -24 193 -222 -22 -8 -44 -127 -1 -39 -77 72 297 127 -138 113 -207 378 -5 50 -1 152 257 128
4987 128 -105 23 -93 35 -140 -165 125 -335 13 -199 -296 -102 196 215 29 98 34 243 104 107 -133 -107 258
5010 258 -188 150 -170 54 -71 51 -9 202 -17 31 -1 206 81 206 92 -97 -118 146 26 -60 97 -42
5032 -42 -224 -128 -141 -7 -183 66 192 88 66 -119 124 -107 -79 -58 -34 -80 45 -242 -68 157 -101 -74 328
5055 328 -91 -222 -19 -315 144 216 -99 -14 -104 95 111 -73 -43 -62 47 -154 79 -39 -95 -196 -286 -24 -23
5078 -23 -83 259 2 -61 18 -228 -22 -234 -2 -124 42 -37 -61 -4 -196 179 152 102 -344 -255 -13 -28 190 70
$$ packed form
4914a86J61M5ljp3rM5L3p3P0J8O6l4l2J70k62q6K13J14j03j18J97j22j17k29J56
4940a60R9l5QR5j93J08K16j09po9j54L25j04r5J73m77M20J33l78K32p5N1N8p6
4964a4j0K17m15K00J4l6q3J26l8l8J49K25j70k65K51l20N85l83N5n1J53J05j29
4987A28k33J28j16J28j75k5K90m60L48k12r7J94K98J9j86O9o4K09j39Lk40K6L65
5010B58m46L38l20K24j25J22o0K11k19M8l2K07j25J25j14j89k1K64j20q6J57j39
5032d2j82R6j3J34j76K49J26j04k2j85K43k31K8K1K4m6J25k87J74K25k58K7M02
5055C28m19j31K03k96M59P2l15Q5r0J99J6j84L0j9J09k01K33j18n6j01r0K62J
5078b3o0L42k57o3P9k46K06k12K32j22J66p9k4N7j92L75k7n0m46Q9K42j5K18j20
$$ plain form
5102 70 -45 54 -339 143 215 93 -224 -54 -142 -166 -281 -166 -182 -30 -4 -200 18 165 -122 -109 -70 -14 -126
5125 -126 -39 -322 -264 -85 -165 223 -19 139 181 183 46 -79 -10 -109 -197 112 -158 36 5 -19 196 129 -15 -127
5149 -127 -26 60 -131 -32 -45 129 -84 15 239 36 -109 19 -114 147 2 -93 -206 127 202 208 -234 200 178
5172 178 -67 265 265 30 -96 156 -135 27 -79 227 -227 -31 -155 173 122 73 326 -181 -170 -48 -389 45
5194 45 28 145 -225 94 154 -278 -190 51 27 -338 -119 -68 90 110 -90 163 62 -14 -7 26 -310 22 126 16
5218 16 44 -149 -64 -134 118 280 -157 177 91 -159 -52 -269 -35 -233 -143 153 -274 -126 300 -87 89 60
5240 60 -97 261 124 160 -122 21 -241 -118 23 -22 -169 -9 -239 -337 -166 47 -85 -111 151 65 -39 150
5262 150 30 120 32 184 -92 21 -253 -12 -67 32 44 -78 -17 83 -16 -48 25 263 -190 27 -9 14 178 109
$$ packed form
5102G0j15R9l93M82P2j22l17J70q8k4j15J15j6J52K6j96K18J47k87J3L9N6j12
5125a26Q7k83N8J79q0L88k42J58M2Kj37j25O9r9q8L09k70J94l1k4K15o7j44j12
5149a27J01Q6j91R9j3J74k13R9K24k03j45J28j33K61j45r5j13L33P5Om42M34k2
5172A78k45L32%k35j26K52k91J62j06L06m54J96j24L28n1m9K53n07J1J22l41M34
5194D5j7J17l70L19O0m32Q8K41k4l65K19N1J58K0k00K53j01p6PL3l36L32J04j10
5218A6K8j93Q5p0K52J62m37L34q6k50J07k17K34j98R0K96m27J48M26l87J76k9
5240F0j57L58j37L6k82J43k62J23J41m5j47J60k30r8J71K13j32k6K62q6j04J89
5262A50j20R0q8J52k76J13k74K41n5R9J2j22O1J00r9l2P3K38m53K17l6K3J64o9
$$ plain form
5286 109 275 223 139 301 350 79 208 61 -38 -64 -256 63 16 56 -12 0 26 57 -92 150 248 28 -175 -247
5310 -247 75 145 -135 130 -109 -49 -52 -211 -99 93 -38 -14 22 61 53 11 133 14 23 283 -3 -51 253 39
5334 39 -107 256 105 -19 61 0 319 -48 70 -242 3 -46 -15 243 21 -111 60 202 133 140 -93 -28 370
5357 370 67 8 63 49 -166 38 132 -316 -31 -75 162 128 -188 -94 -36 -28 -62 -215 41 -376 -2 -92 -13 -6 230
5382 230 139 -247 -337 80 21 79 -154 16 -181 173 53 46 206 149 -36 -260 -121 -33 -2 242 -49 -97 -31 -115
5406 -115 55 -53 147 65 20 135 163 11 -152 -131 -125 301 284 -43 85 -107 -53 106 163 -242 101 -197 -132
5429 -132 102 176 191 40 -162 71 22 117 83 -237 -288 -11 -81 25 -157 -90 16 -81 116 -80 -23 90 -84
5452 -84 124 -227 9 33 144 94 88 -380 -100 230 -261 -137 165 -181 229 159 264 101 65 -206 179 5
$$ packed form
5286A09J66n2q4J62M9k71J29j47r9k6j92L19m7M0o8J2K6L1j49K42R8k20k03p2
5310b47L22P0k80K65k39O0lj59J12J92j31K4L6L9qm2J22j19RK60k86m8L04k14
5334C9j46L63j51j24Q0o1L19l67J18l12K45m9L1K58k22j32J71J42o9Pk33O5L98
5357C70l03n9N5j4k15K04R4m48K85m4K37l4l16R4N8Ql4j53K56m17L74r0P9PK36
5382B30r1l86r0M17n9N8k33J70j97L54j20pJ60n7j85k24J39Q8L1K44k91m8O6q4
5406a15J70j08K00q2m5J15K8j52j63K1OM26j7l27J28j92N4J59N7m05L43k98O5
5429a32K34P4J5j51k02K33m9R5l4l20n1K77p0J06j82O7J06r7J97j96N7J13j74
5452h4K08l51K36K4J11n0om68K80L30m91J24L02l46M10p0J05j63l6k71L85j74
$$ plain form
5474 5 2 -270 123 -81 -43 -154 -152 -2 0 127 295 98 -16 -55 -130 -163 200 -426 -192 42 -160 269 259 133
5498 133 25 -56 24 177 -30 -15 -469 -141 188 47 -55 -12 -57 220 -73 136 -93 -151 -52 0 -34 116 -110
5521 -110 106 -15 99 -353 -166 49 -228 -37 -119 52 -101 -196 -11 -56 -328 -127 115 -211 94 49 66 31
5543 31 83 127 -137 81 77 113 -152 231 168 220 18 -45 168 29 -91 249 -183 -79 140 150 264 -181 -173 4
5567 4 190 -65 -84 28 -97 347 -122 -10 1 36 285 -34 -25 -328 -28 -289 -183 3 81 200 0 215 123
5590 123 -164 -163 188 77 164 -164 22 -205 117 -134 274 -212 49 116 -26 17 -273 -185 63 8 -211 -242 -61
5613 -61 175 -42 81 -25 316 82 -267 -224 -13 -187 -12 66 -11 68 17 -155 -25 -14 166 -9 55 -122 34
5636 34 -233 -70 -5 61 -103 -191 41 98 -56 244 -346 -117 -101 37 244 4 94 60 -84 237 294 -67 101
$$ packed form
5474Elk72L93k04L8j11KJ50KJ27J68j97j14l9p5l3L63o26K34K34k02M29j0j26
5498A33j08q1Q0J53k07J5m54L28L29j41j02M3m5K77k93K09k29n8R9N2l4J50k26
5521a10K16j21J14m52J87K15k77J91q2J71j53r5J85m5k72K01K42l26L05m5J7l5
5543C1N2M4k64K18mL6k65L83o3N2k02o3K13j39j20L40m32J04K19J0J14m45QJ77
5567DJ86k55j9J12j25M44m69J12J1L5K49l19Rl03L00k61J06J86P8J19k00K15r2
5590A23k87JL51j11Q7l28J86k27L22k51M08m86K61O7j42M3k90Q8K48n5k19l1J81
5613f1K36k17J23j06L41k34l49M3K11j74J75P8p7P9n1j72J30J1J80j75O4j77J56
5636C4k67J63O5O6j64q8K32N7j54L00n90K29J6J38K07k40R0l4j44L21N7l61J68
$$ plain form
5659 101 121 143 -320 -91 -298 195 -146 -142 -128 -219 32 -47 -221 -64 200 110 -55 -166 63 229 239 80 -204
5682 -204 97 278 228 -20 -172 29 -43 87 -27 -129 -1 106 -225 -314 30 5 5 124 -3 83 60 3 -138
5705 -138 -290 -210 136 241 133 202 160 -116 41 -81 -66 -40 -62 103 116 144 19 -81 -181 127 -186 51 -150
5728 -150 135 -40 47 -24 189 55 115 383 223 -87 34 -7 -5 -57 10 -70 169 54 -11 293 156 -102 -73 -145
5752 -145 18 42 -223 55 -163 56 -224 18 19 156 -20 57 201 76 -150 -74 -81 -78 329 -85 -65 121 -74
5775 -74 182 -14 -71 -134 79 121 302 -194 25 -46 -239 28 -85 139 -276 40 37 104 263 37 24 235 186
5798 186 -23 -129 94 -186 39 106 0 -100 -296 77 145 -46 -122 57 -170 51 53 100 -270 28 -119 -107
5820 -107 254 -67 -69 -87 -43 -9 -53 20 -1 236 -188 -229 -119 -136 174 152 -87 -267 29 -117 -198 213 -2 -55
$$ packed form
5659A01K0K2m63K29k07M93l41MJ4r1K51p9j74J57K64r0j65j11K29J66J0j59k84
5682b04L01J81n0k48j52K01p2J30j14j02J28J07l31q9L44k5%J19j27Q6k3n7j41
5705a38j52Q0L46J05j08O9m2k76J57j22J5K6k2J65J3K8j25j00j00L08l13K37k01
5728a50K85j75Q7p1K13j34O0K68j60l10J21m1Kn2O7q0K39j15o5L04j37k58K9p2
5752a45J63K4k65K78k18K19k80K42JJ37j76P7J44j25k26P6pLM07m14K0J86j95
5775g4K56j96n7o3K13M2J81m96K19p1j93K67j13K24m15L16lO7J59k26j3K11m9
5798A86k09j06K23k80K25O7j06j00j96L73O8j91p6J79k27K21KM7l70K98j47J2
5820a07L61l21kj8M4L4m4P3k1K37m24m1J10j7L10k2k39j80K96j46q1M11k15n3
$$ plain form
5844 -55 -40 -89 -254 253 36 84 -30 -98 129 105 86 -140 -124 -82 145 -79 -6 185 16 -115 197 -12 -25 -162
5868 -162 325 -156 -19 148 -23 99 130 -38 -88 -38 80 174 -20 -247 -27 -159 0 -289 125 151 -43 131
5890 131 -93 -79 -14 59 -50 206 188 -82 -153 43 20 -29 -162 116 -153 238 -50 105 196 -327 -66 47 -158
5913 -158 -141 -129 268 136 234 94 223 -16 41 15 -44 50 -46 98 43 -240 -31 -165 -196 -147 -19 139 -100 139
5937 139 -229 127 187 -170 -88 103 -128 -109 129 -61 19 -157 362 322 -50 52 -72 -165 -220 -220 -234 174 -230
5960 -230 -93 -220 -34 77 56 -9 -79 -26 -276 184 104 2 -65 124 93 -138 -47 46 57 22 75 -95 -158 -160 -211
5985 -211 60 -80 -117 173 -370 -170 167 41 -230 263 -146 -70 -222 -289 -169 134 27 -254 152 -198 53
6006 53 -144 -199 -20 -157 72 231 46 109 -339 34 31 114 -225 78 -89 -348 18 83 -138 -79 -47 1 -106
$$ packed form
5844e5J5m9j65N07k17M8j14o8K27k4j9k26J6M2K27k24P3J91j69j31L12k09j3j37
5868a62M87m81J37J67j71J22L1j68n0N0J18R4j94k27K20j32J59k89M14K6j94J74
5890A31k24J4O5P3j09K56j8k70p1J96k3m9j33K78k69L91k88J55R1n23K61J13k05
5913a58J7J2L97j32R8j40J29k39N7k6n9R4r6J44n5k83K09j34l1M9J28J58k39K39
5937A39l68L56O0l57Q2J91k31J9K38j90Q0j76N19m0l72J02j24r3n5%j4M08m04
5960b30J37j27J86J11k1o5p0N3k50M60q0j02o7J89l1k31R1R3J1l5N3j70o3kn1
5985b11K71j40l7K90n43K00L37j26k71M93m09P6j52o7J20L03j07k81M06l50K51
6006E3j97n5J79j37K29J59j85O3m48L73lQ3l39L03j67k59L66O5k21N9L2M8j07
$$ plain form
6029 -106 156 -318 35 121 189 265 -32 236 -47 -171 -272 83 -69 191 -44 -65 65 128 12 61 299 -14
6051 -14 242 180 9 149 43 -74 -50 41 224 94 86 -158 34 7 178 -148 -31 -101 42 14 37 2 -58 148
6075 148 87 -161 -6 -50 -37 96 14 15 166 82 -138 174 -29 -355 168 -243 13 -229 208 23 -87 -31 -102
6098 -102 -189 150 157 -125 -52 25 -122 -40 -49 -65 12 117 68 259 150 121 107 -171 38 -71 -76 -115 12 16 -9 -7 111
6125 111 -44 166 196 -231 -132 -38 -134 94 -51 29 149 -323 -71 191 -179 -10 403 -88 163 249 -134 19
6147 19 229 69 260 -177 481 85 238 -258 -41 230 -132 -66 307 64 14 -16 -24 -437 66 -26 -34 205 164
6170 164 138 125 -190 -228 -78 111 88 -164 191 -6 147 92 284 74 245 104 -27 -281 -75 -100 106 -91
6192 -91 -258 -141 -188 -292 312 127 229 -198 -63 -21 -23 213 -35 -232 -28 -30 -55 294 16 -106 -99 178 221 85
$$ packed form
6029a06K62m74L53Q6O8P6k97K68k83j24j01L55j52K60k35k1J30O3j16M9K38l13
6051a4K56o2j71J40j06j17K4R1J83j30qk44J92k7J71l26J17p0J43k8K3l5o0K06
6075A48o1k48J55m4J3J33q2JJ51q4k20L12k03l26N23m11K56k42M37j85j10N6p1
6098a02q7L39Pk82P3P7j47Q2rj6P7J05m9J91j09k9j4k78K09j09nl9J27Mk5KJ18
6125A11j55K10L0m27R9R4r6K28j45Q0J20m72K52K62l70J69M13m91K51Q6l83J53
6147A9K10j60J91m37O58l96J53m96K17K71l62O6L73k43n0l0qm13N03r2qK39m1
6170A64k6j3l15l8J50J89k3k52L55j97J53n5J92k10J71j41j31k54K06k5K06j97
6192i1j67J17m7j04O04j85J02m27J35M2kK36k48j97K04kk5L49k78j22PK77M3j36
$$ plain form
6216 85 -125 79 -204 -397 159 121 138 102 -60 -84 -135 75 -50 31 13 -61 -141 150 -13 -297 -10 -39 -165 58
6240 58 -94 79 103 -167 65 -180 76 113 -6 -189 151 44 -202 62 -296 -362 120 -55 -158 -204 -63 185
6262 185 -40 -35 -34 -163 296 132 -18 -142 -292 10 -232 140 -86 -320 -243 -225 -57 -48 168 30 42 175 193
6285 193 -131 178 470 -195 180 84 315 458 73 -30 172 245 -57 -86 127 75 10 -50 -215 -162 147 105 93
6308 93 -355 -36 -185 -51 -1 -20 88 303 -41 -33 -29 -309 -37 57 104 -170 -68 -62 -7 234 -251 29 80 -235
6332 -235 -87 -324 -69 91 -14 -234 -55 222 69 -140 11 -7 28 -137 -52 198 41 29 -337 -117 -111 -97
6354 -97 243 -136 16 60 18 130 70 401 71 -171 -281 -10 41 49 33 72 81 -314 -211 -147 -57 126 210 -226 -139
6379 -139 -164 31 -160 94 -152 -124 14 185 -95 -261 61 55 -72 206 -60 130 -72 -1 -82 -176 -120 98 -23
$$ packed form
6216H5k10K04k83j93N56l8J7l6j62k4n1K10j25Q1j8p4q0K91j63k84K87k9j26K23
6240E8j52J73K4k70K32k45K56L7j19j83L40j07k46K64l58o6M82j75j03m6J41K48
6262A85k25NJj29M59j64j50j24j50L02k42L72k26k34P7J8J68RK16j38J2J33J8
6285A93l24L09K92o65L75r6K31J43l85j03K02P3l02k9K13n2o5o0j65N3L09m2j2
6308I3m48L19j49J34N0j9J08K15l44QMk80K72R4M7k74J02ON5K41m85K80N1l15
6332b35J48k37K55J60j05k20J79K77j53k09J51j8L5j65Q5K50j57j2l66K20OJ4
6354i7L40l79J52M4m2J12o0L31l30k42j10K71N1Qj6L9Rl95J03O4R0J83Q4m36Q7
6379a39k5J95j91K54k46K8J38J71k80j66L22oj27K78k66J90k02P1q1r4N6K18j21
$$ plain form
6402 -23 211 -34 -59 -124 187 -132 174 -31 212 277 -143 12 -347 130 -176 -173 35 180 47 219 216 27 179
6425 179 -394 226 -293 80 80 -83 154 -48 110 31 -13 -94 -123 -37 111 219 -80 21 -83 157 121 57 17
6448 17 391 -180 130 -87 14 -81 -144 -210 263 121 -38 98 9 -172 -43 -217 -1 -53 -289 163 -45 -154
6470 -154 265 178 -147 185 252 197 43 15 26 -25 57 -119 155 -89 -44 -181 54 -87 275 -19 -136 128 -328
6493 -328 54 53 2 -105 -186 -143 35 92 56 24 141 -140 111 73 -2 -218 -91 -154 -145 45 50 151 8 222 -218
6518 -218 -56 -80 14 14 276 81 106 47 168 58 28 -92 60 -56 122 202 50 55 -135 -81 -300 12 160 -3
6542 -3 -52 -94 -54 127 22 -201 252 146 123 97 100 -91 -216 -310 -55 170 -311 7 -347 118 374 -37 57 -2
6566 -2 0 43 59 141 40 146 94 21 14 60 -89 -16 119 147 126 -38 -217 201 -216 55 74 75 -202 -189 61 -46
$$ packed form
6402b3K34k45k5o5L11l19L06k05K43O5m20J55l59M77l06LK08J45j33J72lj89J52
6425A79n73O20n19L73%j63K37k02J58p9m4q1k9Q6J48J08k99J01j04K40l6o4m0
6448A7L74n71L10k17J01r5o3o6M73j42j59J36q9j81J29j74K16n2k36M52k08j09
6470a54M19q7l25L32O7n5j54k8J1n1Q2j76K74k44M5j37K35j41L62k94j17K64m56
6493c28L82jn1j07q1M3J78N7l6l2J17k81K51l8p5k16J27o3RJ90NJ01j43K14m40
6518b18J62k4R4%K62j95K5n9J21j10l0j20J52j16J78Q0j52Nj90N4k19L12J48j63
6542cm9m2M0J81j05k23M53j06k3k6Lj91j25r4K55K25m81L18l54M65K56m11R4n9
6566bKM3J6Q2j01J06n2p3pM6j49P3J35K8k1j64j79M18m17K71J9Jk77J3K50j07
$$ plain form
6592 -46 15 -57 79 -193 252 -229 93 67 -278 -20 -54 245 -104 182 -87 68 24 -71 154 -137 -83 -147 -74
6615 -74 -102 -24 -19 -68 -427 -89 128 52 -149 5 -65 10 229 -152 -52 118 -146 -61 -16 137 186 15 -154 -59
6639 -59 47 158 -125 -79 2 98 145 -64 49 126 -36 320 6 -33 163 -97 -92 81 171 120 -135 117 -36 121
6663 121 -35 -159 -38 121 316 -164 209 -233 39 41 -148 -6 105 -369 16 227 73 -100 277 -87 10
6684 10 -33 -185 12 -215 -146 216 -29 11 189 26 233 226 311 17 154 227 -167 220 16 283 101 56 -171
6707 -171 -83 -135 44 -130 36 -257 84 40 -210 -201 -374 301 -31 306 -190 -138 94 -140 -245 -88 -19 -36 142
6730 142 -230 -86 -15 10 184 9 215 275 186 240 210 45 200 -51 219 86 68 -5 -146 221 -239 157 166
6753 166 -52 -179 107 -76 14 -354 -7 -144 65 60 -57 101 -10 199 -46 46 -82 92 -67 71 305
$$ packed form
6592d6O1p2J36k72M45m81L22k6l45K58l4K99l49K86k69J55m4r5K25k91N4o4P3
6615g4k8P8Nm9l59L38K17p6k01J54p0P5K19l81J00J70k64Q5M5J53M9j71j69R5
6639e9J06J11k83M6Q1R6M7k09J13P7j62L56l14l9J96k60NJ73R0n1k55K52j53J57
6663A21j56j24J21J59J95m80L73m42K72Kj89J42J11m74L85K11j54j73L77l64R7
6684A0m3j52J97k27O9L62k45M0J78j63K07pQ5k94J37P3l94L87k04K67j82m5k27
6707a71Q8n2J79j74J66k93L41m4k50Rj73O75l32L37m96N2K32k34j05J57O9j7J78
6730A42l72J44P1K5J74j75K06O0q9N4l0j65J55k51K70j33j8p3j41L67m60L96R
6753A66k18j27K86j83R0l68L47j37K09nj17J58j11K09k45R2j28J74j59J38K34
$$ plain form
6774 305 -287 -20 35 14 -94 -287 -36 -77 16 71 -379 -47 -94 283 304 -367 -240 44 -2 -111 325 -16 15
6797 15 118 -71 114 -86 -251 -63 -38 231 -88 125 -123 24 12 45 -117 61 121 -100 49 -83 3 -89
6819 -89 -15 -104 -55 -69 290 -61 321 -101 -57 158 -212 70 75 101 182 -199 -333 78 -198 -440 -49 148 -60
6842 -60 -186 -172 154 -140 23 124 61 -206 62 122 -211 175 -20 -89 92 -115 -5 -461 -53 217 -191 63
6864 63 77 64 -56 330 -156 29 117 -7 -66 27 -64 269 419 -55 31 262 359 -158 275 278 45 225 -193 -1
6888 -1 -13 -112 -422 50 90 -34 -40 4 -270 -172 140 49 4 281 89 -39 39 8 309 123 101 8 156 -387 121
6913 121 46 -145 114 -74 69 -45 -25 -70 -135 -164 14 -280 46 237 102 52 -199 -48 -222 29 117 15
6935 15 -57 -15 135 -23 -42 -229 27 60 -72 -157 -26 50 92 -136 61 12 -48 86 34 77 -54 -67 -243 117
$$ packed form
6774C05n92K67N5k1j08j93K51m1R3N5m50L32m7L77K1o71J27K84m6j09M36l41L1
6797A5J03j89J85k00j65J88K5K69l19K13k48J47j2L3j62J78O0k21J49j32Q6r2
6819h9P4q9M9j4L59l51L82m22M4K15l70K82NK6Q1l81j34M11k76k42L91J97k08
6842f0j26J4L26k94J63J01o3k67K68O0l33L86j95o9J81k07J10m56M08K70m08K54
6864F3J4j3j20L86m86J85Q8j24n9R3r1L33J50m74Q6K31R7n17M33Lk33J80m18J92
6888aj2r9l10M72M0j24oM4k74R8L12r1m5K77j92j28P8l1L01j86k2r3J48n43N08
6913A21p5j91K59j88J43j14K0m5o5k9J78k94L26J91j35n0k51J51j74K51Q8j02
6935A5p2M2J50j58j9j87K56L3j32q5J31P6M2k28J97m9o0J34n2M3j31j3j76L60
$$ plain form
6959 117 221 -84 24 -150 45 120 -95 -90 26 88 -21 -46 317 -21 30 5 11 -255 -293 63 -83 -169 183 89
6983 89 155 -157 186 -319 61 -228 -237 -175 -68 -16 43 -97 -152 65 -161 396 -75 -296 -125 -113 -53 -17 -92 -185
7007 -185 45 228 45 -276 -56 -77 186 -41 -61 293 144 169 -114 -233 -28 345 83 -344 -103 -90 127
7028 127 255 -181 -267 174 79 -222 -276 -29 -188 -52 -68 -81 -114 -14 86 -63 -18 21 222 -131 207 22 135
7051 135 -248 -223 10 86 -139 -285 121 109 23 233 243 217 -228 -42 -177 -140 82 121 194 -146 169 -68 76
7074 76 -270 124 51 -125 -28 -29 89 -69 -309 -27 -56 -147 17 163 -136 33 -38 -28 -358 -249 194 -209 168
7097 168 77 99 -122 168 237 -100 -130 -226 -4 193 175 15 -16 16 295 -19 -71 12 46 -33 8 31 -185 -39 109
7122 109 190 -168 -155 242 185 25 -290 -56 -13 -34 -7 -71 87 133 151 72 -273 50 -231 32 -17 -2 -208 -72
$$ packed form
6959A17J04l05J08j74J95P5k15NJ16O2j09k5L63l38N1k5Ok66l8L56j46q6L52r4
6983H9O6l12L43n05L80k89rO2J07N2N9j40n5K17k26N57m71k21J71J2O0L6p5r3
7007a85K30J83j83l21K20k1K63k27k0L54j49K5k83j19K05L73k62m27K41J3K17
7028A27J28m36q6M41r5l01n4K47j59J36j6j3l3J00J00j49M5L9K01l53L38j85J13
7051A35l83K5K33P6k25j46M06j2q6K10J0k6m45J86j35L7K22L9P3l40L15k37J44
7074G6l46L94p3j76R7jJ18j58k40K82k9r1J64J46k99J69p1J0l30J09M43m03L77
7097A68r1K2k21K90O9l37l0r6K22J97j8j60l1L2K79l14n2Q3L4p9M1K3k16J46J48
7122A09Q1l58J3L97n7j60l15K34M3k1K7o4J58M6J8p9l45L23k81K63m9J5k06J36
$$ plain form
7146 -72 415 181 99 -157 -60 -8 58 174 167 -106 172 47 -193 157 -33 -53 90 197 75 -53 -127 318 -70
7169 -70 -170 -90 -104 -100 -288 -29 -161 -123 -226 68 48 104 -114 -288 81 130 126 177 168 -69 -354 -68 199 56 16
7194 16 156 63 -57 100 -121 -30 -212 -21 45 -29 153 -157 -61 90 139 -268 -184 -52 118 -20 169 201 147
7217 147 80 -265 -52 -101 -81 -55 -45 -95 -50 -37 -83 -218 -69 54 -135 343 72 -20 -73 -27 -384 158 8 136
7241 136 286 39 -67 377 -202 -293 215 183 -77 -148 261 89 165 73 167 -49 66 39 -107 -53 -13 -136 170
7264 170 -30 -61 86 95 32 -68 96 -110 9 193 141 -120 -14 178 -10 -302 -188 133 -7 -20 -149 -26
7286 -26 -160 82 -254 -12 85 -326 -24 -106 148 133 -218 -113 -180 -111 -131 255 -237 -38 33 -178 137 142 -340
7309 -340 -30 -209 -53 -55 -176 -61 3 109 42 -53 13 362 -168 -82 -102 61 3 -414 238 67 234 105 -164
$$ packed form
7146g2M87k34q2k56R7N2O6J16pk73K78j25k40L50j90k0J43J07j22j28p4M45l88
7169g0j00Q0j4Mj88K59j32L8j03K94k0N6k18j74L69M9mN1rk37k85K86K67j43m0
7194A6J40r3j20J57k21R1j82J91O6p4J82l10R6J51M9m07Q4J32J70j38J89L2n4
7217A47o7l45K13m9K0K6J0n0M5J3m6j35J49J23j89M78k71r2n3M6l57N42j50J28
7241A36J50k47j06M44n79r1N08l2k60p1M09j72P6r2R4k16J15k7j46N4M0j23L06
7264A70k00l1J47Ro3j00J64k06J19J84n2k61J06J92j88k92J14L21j40j3j29J23
7286b6j34K42l36K42R7m11L02q2K54j5l51J05o7O9k0L86m92J99P1k11L15Nm82
7309c40L10j79J56kj21J15O4J06o7r5O6L49n30Q6k0J63n8m17O52j71J67j29k69
$$ plain form
7332 -164 -56 88 -154 -207 -19 -136 -71 -149 128 -192 -149 40 -113 58 -10 -88 -227 33 -105 117 -184 4
7354 4 78 -132 -23 278 47 122 83 -11 -123 177 35 234 -39 -263 147 134 -43 -148 4 -29 232 -99 -155
7377 -155 88 -193 40 55 134 151 -60 -31 -45 5 -157 133 -39 134 -26 41 154 445 5 -45 57 -192 203
7400 203 30 -54 221 59 -23 -186 82 -89 -162 103 -127 139 52 -15 -246 -19 -52 11 -232 169 -73 -1 190
7423 190 414 145 112 248 -265 -256 8 232 -192 -19 61 -222 0 -186 7 161 89 127 39 -209 11 -126
7445 -126 175 211 80 -135 -347 19 -17 -18 38 180 -106 -384 178 175 -42 135 5 -113 187 60 28 104 -93
7468 -93 27 50 -62 -49 -113 54 -59 70 -4 -418 145 62 88 25 137 224 -378 -126 146 -36 -147 -78 45
7491 45 -380 200 121 -209 -90 -251 -94 129 226 142 245 225 -89 -103 -154 162 -89 -64 308 272 -3 4 155 28
$$ packed form
7332a64J08J44k42n3J88j17O5p8K77l20M3J89j53J71o8p8j39K60j38K22l01J88
7354DP4k10J09L01k31P5l9r4j12L00j42J99k73k24M10j3j77j05J52l3K61l31n6
7377a55K43k81K33J5P9J7k11K9j4N0j62K90j72J73j60O7J13K91m40n0J02k49L95
7400B03j73q4K75j62q2j63K68j71p3K65k30K66q7o7k31K27l3O3k43M01k42P2J91
7423A90K24k69l3J36n13RK64K24m24J73Q0k83K22j86J93J54p2L8q8k48K20j37
7445a26L01L6j31k15k12L66l6jN6J42k86k78N62lk17J77j30j18L00j27l2P6j97
7468i3J20K3j12J3o4J67j13J29p4m14N63q3K6o3J12Q7o02K52K72j82j11O9J23
7491D5m25N80p9l30J19j61J57K23R7q4J03k0l14j4n1L16k51K5L72l6k75PJ51j27
$$ plain form
7515 28 -48 -58 118 -3 -116 94 -129 13 -82 57 193 187 126 -305 261 -206 -23 -141 41 327 110 -240
7537 -240 95 41 57 153 81 -49 -16 -55 125 -89 -121 -18 -146 4 -199 34 50 16 120 231 -316 -28 -68
7560 -68 -63 -12 161 48 17 47 -144 83 128 -233 150 -16 0 -128 -129 106 192 145 48 -103 -61 188 45 125 -207
7585 -207 -142 72 -34 159 177 127 -162 -78 -167 29 69 -234 96 -131 61 147 59 -74 -9 -35 136 -108 9
7608 9 -291 -53 -48 34 -35 3 71 -104 215 -36 91 86 315 -142 -31 60 3 -41 166 -267 -82 -84 74 72 -145 -110
7634 -110 44 106 -161 115 243 225 137 84 -96 55 70 -62 276 -158 136 -63 -150 410 -254 186 -1 -26
7656 -26 -64 242 -5 238 33 7 72 -245 104 98 -161 174 82 25 98 32 276 15 -62 -277 -205 68 101 59 -187
7681 -187 127 370 343 178 22 -299 40 224 55 -101 -79 -50 -387 131 179 -303 150 -249 70 124 225 -21
$$ packed form
7515B8p6j0J76j21j13K10k23J42r5J39J36oo1m31N66m67J83j18J82K86k17l50
7537b40L35n4J6R6p2j30L3l9J80k14l2J03j28J50k03K33J6l4J04J11n47K88m0
7560f8NN1J73j13l1L0j91K27M5l61L83j66J6j28jK35Q6m7r7j51M2K49j43Q0l32
7585b07O5K14j06J93J8n0k89Q4q9J96M0l03L30k27J92Q6q8j33O5k6J71k44J17
7608Il00K38NQ2o9L8O8j75L19k51J27nK29m57J11R1n7m4K07m33J85kJ58kk17L5
7634a10J54O2k67K76J28j8q8n3j80J51J5j32L38m34K94j99q7N60o64M40j87k5
7656b6l8L06k47K43k05k6O5l17L49ok59L35r2n7P3o6K44k61p7k15P2K73L3m2k46
7681a87L14K43k7j65j56l21L39J84j69j56K2K9l37N18M8m82M53l99L19N4J01k46
$$ plain form
7703 -21 -1 102 2 -35 189 1 24 -217 14 -275 -93 46 5 -126 57 262 -436 -20 17 268 -141 58
7725 58 21 -10 -6 176 -3 -30 -154 324 10 65 236 140 312 134 314 61 -323 -8 179 29 234 -31 144
7748 144 -182 -82 25 147 126 45 80 58 -172 89 -186 -134 3 300 129 -76 -51 -217 -12 -63 25 307 -203
7771 -203 -153 -138 -122 181 -124 256 72 -34 15 -78 63 -258 -160 186 -56 2 3 73 -152 -86 180 38 -45 269
7795 269 -101 80 98 -1 -60 -49 -115 184 104 -93 319 226 163 -214 -37 179 96 238 -251 118 -93 -100 -81 197
7819 197 -133 206 -34 -190 238 -210 -34 -52 -56 -89 -23 -99 -377 246 -156 51 -308 -147 -254 76 181 -92
7841 -92 -104 -44 164 5 46 65 211 306 67 58 139 183 83 193 127 42 280 62 -234 47 98 94 -62 10 -101
7866 -101 92 -40 172 234 -238 116 -87 -133 91 52 40 355 -61 -82 109 -137 -49 118 150 56 33 65 21 161
$$ packed form
7703b1K0J03j00l7K24j88K3k41K31k89J82J39m1j31J83K05o98M16L7K51m09J99
7725E8l7l1MJ82j79k7j24M78l14N5J71r6J72j78J80k53l84L15J87j50K05k65J75
7748A44l26J00J07J22k1q1L5k2k30K61k75N2J37K97j71k05K5j66K05n1Q8K82n10
7771b03N0J5J6L03l05L80j84j06M9r3J41l21R8L46k42N8JP0k25O6K66j42q3L14
7795B69l70J81J8r9n9J1o6K99q0j97M12r3o3l77J77K16q3J42m89L69k11pJ9K78
7819A97l30L39k40j56M28m48J76j8ml3O6p6k78O23m02K07l59J61j07L30J05k73
7841i2j2O0K08j59M1J9J46R5k39rQ1M4j00J10o6q5K38k18k96K81N1mj56P2j11
7866a01J93j32K12O2m72L54k03m6K24l9j2L15m16k1J91k46Q8J67L2r4k3L2m4J40
$$ plain form
7890 161 -83 -135 264 -360 97 -164 -76 109 169 -130 -167 77 -290 305 -250 142 -206 -84 -68 -143 250 -25
7912 -25 -170 272 -127 -252 74 -209 -190 21 28 70 -186 -352 220 -361 -10 2 -145 -211 271 126 -106 -272
7934 -272 -110 -48 3 98 -197 68 -28 -96 -152 150 134 -207 46 231 -247 -72 -54 144 -68 -22 -168 88 -77
7957 -77 66 44 45 28 -59 -32 -22 -228 -46 -283 -25 -106 -217 134 126 181 -69 -15 -164 -121 -103 254 240 -88 -123 -177
7983 -177 145 -170 158 -107 -192 122 23 -179 -1 65 119 -208 -89 -116 3 -127 -221 -112 -71 -30 -144 -101 42
8006 42 62 58 161 -117 37 -118 243 297 159 -178 336 232 -51 -53 -98 59 158 55 43 -104 -273 136 102 -16
8030 -16 51 121 -79 -47 -21 -172 135 -253 76 55 -464 -138 -173 -109 -58 25 -140 -146 11 -30 -102 179 95 171 -11
8055 -11 -92 -6 -7 -66 -109 -60 60 20 -85 137 -143 -7 -27 154 6 -177 -115 151 7 19 1 171 94 -78 68
$$ packed form
7890A61k44n2L99o24M57k61Q8J85O0k99l7K44l67N95n55L92l48J22J6p5L93k75
7912b5j45M42l99j25L26k83J9K11PM2k56j66N72n81L51J2j47o6M82j45k32j66
7934b72J62O2N1R5k95K65r6o8n6L02j6l41K53J85m78J75J8J98k12M6j46K56j65
7957g7J43k2Jj7q7K7J0k06J82k37K58q1j11L51qN5k50N4j49M3J8L57j4l28l5n4
7983a77L22l15L28k65q5L14r9k02J78O6N4l27J19k7J19j30r4J09M1M1j14M3J43
8006D2K0mJ03k78J54j55L61N4j38l37N14j04k83km5J57R9j03j2j47j69M09l4j18
8030a6O7P0k00L2K6j51L07l88L29k1n19L26l5O4N1Q3j65oJ57m1p2K81q4P6j82
8055a1q1Q6jn9m3M9J20m0j05K22k80J36k0J81j48j83O2K66j44J2j8J70p7j72J46
$$ plain form
8080 68 -227 192 -14 -12 -185 -156 123 40 -134 120 41 -127 9 -82 105 168 -161 58 158 211 205 -148 -148 -189 -254
8105 -254 21 307 -203 -290 151 199 234 -171 -339 147 -83 78 -283 -16 -37 296 -93 -270 27 -4 79 -6
8127 -6 438 106 -344 -88 -97 207 79 -9 31 -97 127 -319 -96 185 65 138 -17 104 -141 49 72 158 -44
8150 -44 118 99 -35 -113 -14 -54 -31 99 34 64 40 -2 -128 -55 -127 -74 185 -245 200 328 98 176 -212 -60 -9
8175 -9 -29 -94 -61 -124 114 176 119 -106 46 64 62 -160 -11 -426 -308 -15
$$ packed form
8080F8k95M19k06Kj73K9K79q3j74K54p9j68J36r1J87O3l29K19J00N3ol53%m1o5
8105b54K75K86n10q7M41M8L5m05j68M86k30J61l61K67k1L33l89j77K97l1Q3q5
8127fM44l32m50K56rL04j28q8M0j28K24m46K23K81j20P3j55J21k45J90K3Q6k02
8150d4J62j9j34p8R9m0K3J30o5L0k4m2j26P3p2N3K59m30M45J28k30P8l88J52N1
8175ik0o5L3o3K38O2n7k25J52J8kk22J49m15J18K93
8191a5
$$ Imaginary data points
##PAGE= N=2
##DATA TABLE= (X++(I..I)), XYDATA
$$ plain form
0 0 0 0 0 0 0 0 8 -8 8 -8 16 -16 21 -24 32 -35 41 -49 61 -72 82 -96 112 -129 149 -170 194 -220 250 -282
30 -282 318 -357 399 -448 497 -556 618 -684 761 -844 934 -1033 1145 -1268 1404 -1559 1732
47 1732 -1929 2158 -2423 2738 -3114 3580 -4169 4942 -6012 7585 -10149 15048 -27844 132396
61 132396 292922 35190 -99869 -73377 34888 33082 23718 49908 79060 24016 -21119 -5364
73 -5364 29866 -3068 -30348 14894 84025 58357 -24031 -51569 2527 37828 20394 2306
85 2306 21723 31880 11303 -6629 3930 8674 -3051 552 30367 31763 -15307 -49739 -19668
98 -19668 28186 24993 -14935 -25839 -4931 194 -18477 -18768 7830 15348 -13612 -33046 -8113
111 -8113 26180 21441 -8379 -14531 7340 18358 3786 -4760 12333 25983 4392 -27416 -19100
$$ packed form
0@%%%%%%Qj6J6j6K4l2L7m5N6o7P6r0J10j33J54j78K08k41K78l19L64m14M70n32
30b82O00o75P56q47R45j053J174j302J445j605J778j967K178k413K672k963L291
47A732l661M087m581N161n852O694p749R111j0954J3597j7734K5197m2892J60240
61A32396J60526k57732j35059K6492J08265j806r364K6190K9152n5044m5135J5755
73e364L5230l2934k7280M5242O9131k5668q2388k7538N4096L5301j7434j8088
85B306J9417J0157k0577j7932J0559M744j1725L603K9815J396m7070l4432L0071
98a9668M7854l193l9928j0904K0908N125j8671k91K6598P518k8960j9434K4933
111h113L4293m739k9820o152K1871J1018j4572q546J7093J3650k1591l1808Q316
$$ plain form
124 -19100 26539 47298 8740 -40142 -36610 11071 36073 9353 -25521 -27923 -9541 -221 1211
137 1211 5670 3865 -13248 -23495 -4394 21468 16387 -10804 -18473 705 14020 4438 -3321
150 -3321 4706 10485 852 -6400 3242 11457 2475 -8311 -2720 5516 -1555 -11752 -4529 8266
164 8266 4868 -7232 -4620 5787 649 -10087 263 21549 13704 -19042 -25188 13685 43980
177 43980 20143 -21813 -22170 13789 31446 14224 -5296 -5814 -2309 -3852 2306 14888 11249 -11848
191 -11848 -22915 -4641 16295 9946 -10942 -17578 -7249 494 -1364 -3391 -2052 -3387 -6265 -2862
205 -2862 3074 2193 -3826 -4100 1153 1404 -6427 -9053 -1836 4742 1110 -6752 -8740 -4272 -393 -27
221 -27 -1097 -5322 -10979 -10849 -2181 5453 1654 -9298 -10023 1963 10007 3735 -6511 -4754 6147
$$ packed form
124a9100M5639K0759l8558m8882L532M7681K5002k6720l4874k402J8382R320J432
137A211M459j805j7113j0247J9101K5862n081k7191p669J9178J3315r582p759
150c321Q027N779r633p252R642Q215q982j0786N591Q236p071j0197P223J2795
164H266l398j2100K612J0407n138j0736J0350K1286p845l2746o146L8873L0295
177D3980k3837m1956l57L5959J7657j7222j9520n18L505j543O158J2582l639k3097
191a1848j1067J8274K0936o349k0888o636J0329P743j858k027J339j335k878L403
205b862N936q81o019k74N253K51p831k626P217O578l632p862j988M468L879L66
221b7j070m225n657J30Q668P634l799j0952p25J1986Q044o272j0246J757J0901
$$ plain form
236 6147 9968 813 -7604 -3046 9606 13586 4374 -6793 -6534 5467 13878 8624 -5376 -12729
250 -12729 -5976 6619 10515 2229 -8517 -9934 -242 9155 9082 -247 -7421 -5053 2781 6865 4247
265 4247 -822 -1594 1504 4802 5509 4140 2684 2180 1573 1581 2119 1411 204 -304 142 1613 2080 1098
283 1098 -400 -246 1753 2845 -128 -3639 -3569 829 4244 2497 -2539 -3479 1129 5893 4902 -289
299 -289 -3310 -1347 1981 1625 -957 -2369 -1268 545 440 -1496 -1672 -53 905 -1117 -4667 -5592 -2037
316 -2037 822 -295 -4322 -5735 -2175 2067 2407 -1147 -4386 -3520 -472 1037 -1369 -4228 -3707 -594
332 -594 1329 -498 -2320 -1218 1126 1058 -1966 -3722 -2287 33 -192 -2820 -3759 -2132 480 2175
348 2175 -244 -2358 -2008 544 973 -1527 -4078 -2832 13 1229 -1329 -2639 -517 1760 2097 -578
$$ packed form
236F147L821r155q417M558J2652L980r212j1167K59J2001Q411n254j4000p353
250a2729O753J2595L896q286j0746j417R692R397p3r329p174K368P834M084k618
265D247n069p72L098L298P07j369j456n04o07QN38p08j207n08M46J471M67r82
283A098j498J54J999J092k973l511P0M398L415j747n036r40M608M764r91n191
299b89l021J963L328l56k582j412J101J813j05j936j76J619R58k022l550r25L555
316b037K859j117m027j413L560M242L40l554l239Q66L048J509k406k859N21L113
332e94J923j827j822J102K344o8l024j756J435K320k25k628r39J627K612J695
348B175k419k114L50K552M29k500k551J246K845J216k558j310K122K277L37k675
$$ plain form
364 -578 -2603 -1958 33 874 -647 -2757 -1882 308 1843 1129 -1108 -886 1040 1750 -430 -2325 -1843
381 -1843 147 634 -1368 -2076 -862 1741 2036 128 -1887 -1621 443 985 -459 -2189 -1782 574 2300
398 2300 1452 258 489 2304 3185 1886 -264 -216 1657 1839 1237 -370 196 2589 3129 1798 183
415 183 224 1272 1602 450 -1636 -1699 166 1583 1167 -74 -39 1757 3302 1969 601 135 1344 2612
433 2612 1633 352 494 2295 3126 2299 1175 1076 1464 1730 447 -910 -1580 -651 -196 -1059 -1855 -1040 91
452 91 577 -905 -2159 -1607 -337 -113 -1709 -2641 -1829 -30 1223 182 -1077 -804 1237 2099 329
469 329 -2382 -3047 -1229 -165 -1764 -3504 -3987 -2056 -419 -1565 -3367 -4041 -3122 -1966 -2543 -3769 -4801
486 -4801 -3732 -1696 -873 -1601 -2077 -1025 212 341 -514 -831 -341 -314 -844 -1521 -1090 30 158 -220 -1193
$$ packed form
364e78k025O45J991Q41j521k110Q75K190J535p14k237K22J926P10k180j895M82
381a843J990M87k002p08J214K603K95j908k015K66K064N42j444j730M07K356J726
398B300q48j194K31J815Q81j299k150M8J873J82o02j607N66K393N40j331j615
415A83M1J048L30j152k086o3J865J417m16j241L5J796J545j333j368m66J209J268
433B612r79j281J42J801Q31q27j124r9L88K66j283j357o70R29M55q63p96Q15J131
452I1M86j482j254N52J270K24j596r32Q12J799J253j041j259K73K041Q62j770
469C29k711o65J818J064j599j740m83J931J637j146j802o74R19J156n77j226j032
486d801J069K036Q23p28m76J052J237J29q55l17M90K7n30o77M31J120J28l78r73
$$ plain form
505 -1193 -1052 -744 -272 -973 -2393 -3029 -1664 -188 -599 -1570 -1256 1126 2536 1920 781 605 2255 3173
523 3173 2264 969 1136 2668 4566 4095 2491 2194 3576 4424 3786 1436 -96 768 2235 2228 926 -158
541 -158 521 2294 3562 2739 1001 487 1227 2528 2932 1976 854 1061 2864 4916 4917 2860 1361 1939
559 1939 3997 4714 2026 -825 -1802 170 2161 2012 77 -2494 -2752 -200 2221 1609 -2976 -5604
575 -5604 -4067 1012 3209 -351 -5068 -4454 1385 5552 3167 -2784 -4840 -913 3668 2600 -2584
590 -2584 -5246 -3061 818 1875 -634 -3775 -4499 -2451 62 -578 -3642 -5924 -5133 -2068 -564 -2039
606 -2039 -3913 -3767 -584 1386 466 -1594 -2230 -741 634 792 -392 -1466 -446 1372 1893 267
622 267 -1097 -217 1860 1127 -1739 -3267 -1681 357 -371 -1596 -1581 -241 291 -197 979 1994 470
$$ packed form
505a193J41L08M72p01j420o36J365J476m11r71L14K382J410o16j139j76J650R18
523C173r09j295J67J532J898m71j604k97J382Q48o38k350j532Q64J467pj302j084
541a58O79J773J268q23j738n14P40J301M04r56j122K07J803K052Jk057j499N78
559A939K058P17k688k851r77J972J991j49j935k571k58K552K421o12m585k628
575e604J537N079K197l560m717O14N839M167k385n951k056L927M581j068n184
590b584k662K185L879J057k509l141p24K048K513o40l064k282P91L065J504j475
606b039j874J46L183J970r20k060o36J489J375J58j184j074J020J818N21j626
622B67j364Q80K077p33k866j528J586K038p28j225J5J340N32m88J176J015j524
$$ plain form
639 470 -2149 -726 3772 5460 1189 -2988 32 6406 7423 2548 -1885 -256 4218 4381 1760 -1244
655 -1244 -1524 -278 1206 2438 1720 -666 -2066 -124 2758 2536 -659 -2462 -1649 1168 2437 2330
671 2330 915 -384 102 3073 5026 3405 -276 -1455 1314 3319 2031 -188 -417 288 234 110 1449
688 1449 2058 -1010 -4244 -3512 1645 3312 -1672 -6362 -3808 2572 5598 1381 -3381 -2035 2999 4558
704 4558 2176 -433 -320 982 1754 2637 3101 2000 -204 -51 2624 4302 1817 -1984 -2430 513 2943
721 2943 1712 -1533 -1606 1171 3399 2807 819 457 1611 2736 3011 1885 1133 2275 4160 4783 3064
738 3064 2500 4040 5259 4508 2035 1394 2746 3311 2720 1745 1931 1563 1352 2094 4485 4214 157 -2397
756 -2397 878 6089 5299 -756 -3897 1187 7796 7004 808 -2174 1730 5683 5547 2708 -404 -748
$$ packed form
639D70k619J423M498J688m271m177L020O374J017m875m433J629M474J63k621l004
655a244k80J246J484J232p18k386j400J942K882k22l195j803Q13K817J269j07
671B330j415j299M86K971J953j621l681j179K769K005j288k219k29P05n4j24J339
688A449O09l068l234P32N157J667m984m690K554O380L026m217m762J346N034J559
704D558k382k609J13J302P72Q83M64j101k204J53K675J678k485l801m46K943K430
721B943j231l245p3K777K228n92j988l62J154J125K75j126p52J142J885O23j719
738C064n64J540J219p51k473o41J352N65n91r75J86l68k11P42K391k71m057k554
756b397L275N211p90o055l141N084O609p92o196k982L904L953j36k839l112l44
$$ plain form
772 -748 685 3278 4597 2242 -1438 -2200 1291 4896 3381 -1949 -4607 -2132 2108 2437 -532 -3908
788 -3908 -3185 527 3563 2432 -1338 -3238 -894 2342 2336 -1037 -2842 -1518 677 728 39 -37 -463 -662
806 -662 -1163 -237 189 -1135 -3303 -3308 -856 120 -767 -2578 -1909 -206 -71 -1171 -1753 -978 -372 -985 -1574
825 -1574 -1088 594 1002 -5 -747 -43 1664 1283 -30 -1112 -997 349 663 220 -289 -244 56 520
843 520 1068 1057 716 -247 -470 198 1303 1143 174 -339 1071 2156 2644 1594 365 771 2025 1906 812
862 812 586 678 1099 1130 1131 1777 1948 1393 675 672 1524 2124 990 -799 -639 821 2006 1369 464 341 1014
883 1014 1891 2109 981 120 -423 389 1369 1315 524 -455 -179 1250 2213 1363 97 -632 -285 835 712
902 712 -88 -1563 -1050 607 1008 691 -139 -814 -135 739 386 -609 -1006 -1106 -76 -38 -50 139 103 -235
$$ packed form
772g48J433K593J319k355l680p62L491L605j515n330k658K475M240L29k969l376
788c908P23L712L036j131l770j900K344L236ol373j805J324K195N1o89p6m26j99
806f62n01R26M26j324k168nK452R76q87j811O69J703J35j100n82P75O06o13n89
825a574M86J682M08j007p42P04J707l81j313j082J15J346L14m43n09M5L00M64
843E20N48j1l41r63k23O68J105j60r69n13J410J085M88j050j229M06J254j19j094
862H12k26R2M21L1JO46J71n55p18lQ52O00j134j789J60J460J185o37r05j23O73
883A014Q77K18j128q61n43Q12R80n4p91r79K76J429R63q50j266p29L47J120j23
902G12q00j475N13J657M01l17q30o75O79Q74l53r95l97j00J030L8j2J89l6l38
$$ plain form
922 -235 244 661 330 -750 -1127 -644 -307 -291 -499 -671 -308 414 -420 -210 -23 4 -431 -758 -527 -641 -759
943 -759 -710 -61 54 -92 102 338 134 117 -451 -711 -307 -598 -404 -853 -385 59 173 601 12 -56 -178
964 -178 -11 -159 -21 -720 -767 -278 304 317 -19 -184 316 517 36 -448 -687 -794 -478 -303 -133 -5 -346
985 -346 -277 509 456 754 422 248 -188 -380 -173 -165 163 24 336 269 639 705 349 159 -118 32 -171 -495
1007 -495 -849 -533 -77 467 614 98 93 233 447 380 -208 -467 -398 114 464 461 192 561 682 823 741 275
1029 275 -108 -154 141 -154 -467 -730 -276 -99 24 308 101 -261 -308 -200 -225 -597 -955 -657 -415 78 38
1050 38 -264 555 577 171 126 8 -279 -610 -444 -523 -328 -508 -477 45 177 -394 -354 -596 -373 -868 -1131 -1391
1072 -1391 -761 -485 -697 -186 -392 301 -192 101 255 -198 -575 -657 -391 -33 -209 -216 -16 252 513 134 27
$$ packed form
922b35M79M17l31j080l77M83L37J6k08j72L63P22q34K10J87K7m35l27K31j14j18
943g59M9O49J15j46J94K36k04j7n68k60M04k91J94m49M68M44J14M28n89o8j22
964a78J67j48J38o99m7M89N82J3l36j65N00K01m81m84k39j07L16J75J70J28l41
985c46O9P86n3K98l32j74m36j92K07QL28j39L12o7L70O6l56j90k77J50k03l24
1007d95l54L16M56N44J47n16nJ40K14o7n88k59O9N12L50lk69L69J21J41q2m66
1029B75l83m6K95k95l13k63M54J77J23K84k07l62m7J08k5l72l58K98K42M93m0
1050C8l02Q19K2m06m5j18k87l31J66p9J95j80L1N22J32n71M0k42K23m95k63k60
1072a391O30K76k12N11k06O93m93K93J54m53l77q2K66L58j76pK00K68K61l79j07
$$ plain form
1093 27 224 -390 -452 -821 -384 -374 -542 -635 150 214 118 199 299 88 -114 -196 -139 189 16 190 697 1137 904
1116 904 970 940 1182 873 442 672 258 -24 -143 184 639 282 374 458 637 828 634 164 250 23 83 382
1138 382 202 228 244 1147 1438 1532 900 564 710 912 1007 584 71 232 206 887 420 323 4 289 534 320
1160 320 -439 -786 -865 -372 259 -174 -748 -295 315 440 391 -162 -185 -231 208 -16 -236 -624 -216 451 299
1181 299 403 -333 -72 -69 111 -257 -675 -1230 -1019 -473 -302 -416 -1011 -1030 -659 114 -37 -602 -1084 -730 -528
1202 -528 193 96 -118 -429 -209 681 991 438 -305 -481 -234 492 -35 -658 -884 -243 12 456 -60 -225
1222 -225 -299 99 536 159 -492 -757 -265 391 467 77 58 681 840 1454 658 327 86 -29 345 446 163
1243 163 -142 -54 556 1044 749 -91 45 -61 552 78 -324 -640 -441 547 474 334 169 52 431 1037 268
$$ packed form
1093B7J97o14o2l69M37J0j68r3P85O4r6Q1J00k11k02q2N7L28j73J74N07M40k33
1116I04O6l0K42l09m31K30m14k82j19L27M55l57R2Q4J79J91j94m70Q6k27O0K99
1138C82j80K6J6R03K91R4o32l36J46K02R5m23n13J61k6O81m67r7l19K85K45k14
1160C20p59l47p9M93O31m33n74M53O10J25m9n53k3m6M39k24k20l88M08O67j52
1181B99J04p36K61LJ80l68m18n55K11N46J71j14n95j9L71P73j51n65m82L54K02
1202e28P21r7k14l11K20Q90L10n53p43j76K47P26n27o23k26O41K55M44n16j65
1222b25p4L98M37l77o51k65M92O56P6l90j9O23J59O14p96l31k41j15L74J01k83
1243A63l05Q8O10M88k95q40J36j06O13m74m02l16J99R88p3j40j65j17L79O06p69
$$ plain form
1264 268 -329 -528 -50 -119 -68 -145 -370 -482 -46 571 716 -558 -1122 -1123 -131 -133 -953 -1481 -1512 -151 587 110
1286 110 -660 -1126 -512 369 125 -699 -1594 -1130 -374 529 119 -290 -820 -408 353 870 179 -1017 -1636 -928
1306 -928 240 100 -1045 -1415 -912 159 872 -189 -888 -903 -175 54 -182 -173 -844 -329 434 492 412 18
1326 18 154 389 973 587 -33 -524 -378 -7 268 264 248 -246 268 866 914 159 -394 321 445 144 -381 -278
1348 -278 434 629 798 726 784 637 721 660 398 87 -81 567 505 560 529 305 640 944 772 530 -89 -315
1370 -315 -477 548 403 -240 -334 -238 967 1272 539 -60 -50 478 687 61 -237 -121 -243 -63 576 707
1390 707 614 -91 -300 391 927 150 -711 -1216 -951 346 842 312 -816 -430 383 1027 632 -648 -1118
1409 -1118 -556 256 110 -241 -378 -291 182 786 1224 359 -540 -685 84 616 -115 -846 -865 57 598 746
$$ packed form
1264B68n97j99M78o9N1p7k25j12M36O17J45j274n64jR92kq20n28l1J361P38m77
1286A10p70m66O14Q81k44q24q95M64P56R03m10m09n30M12P61N17o91j196o19P08
1306i28J168j40j145l70N03J071P13j061o99j5P28K29k36Ro71N15P63N8q0l94
1326A8J36K35N84l86o20m91J46L71K75mj6m94N14N98M8p55n53P15J24l01n25J03
1348b78P12J95J69p2N8j47Q4o1k62l11j68O48o2N5l1k24L35L04j72k42o19k26
1370c15j62J025j45o43r4R6J205L05p33n99J0N28K09o26k98J16j22J80O39J31
1390G07r3p05k09O91N36p77q61n05K65J297M96n30j128L86Q13O44l95j280m70
1409a118N62Q12j46l51j37Q7M73O04M38q65q99j45P69N32p31p31j9R22N41J48
$$ plain form
1429 746 270 -156 138 311 55 73 -844 -537 -174 332 117 386 120 127 461 273 455 73 -166 39 -141
1450 -141 123 -15 7 104 694 865 350 -69 112 723 380 5 -677 -118 566 192 -341 219 74 546 933
1471 933 367 -108 25 -132 212 266 341 -245 -135 503 1010 917 200 -347 50 601 521 -321 -902 -602 266
1492 266 1018 622 157 -523 267 590 328 65 -179 -304 -170 152 -35 61 -11 -34 220 467 661 -135 -760
1513 -760 -429 -199 297 -168 -294 134 364 418 276 374 -91 -49 -99 -24 25 -372 -156 -314 146 294 256 505
1535 505 89 -208 120 132 -68 -577 -588 -152 -201 -63 -113 245 504 298 123 82 54 -410 -605 -355 -479 211
1557 211 97 82 -7 -7 395 436 -46 -352 -35 -170 -181 -171 63 -66 -186 221 483 442 118 73 -88 -58 -138 -159
1581 -159 -266 -282 -52 423 279 429 38 -217 -69 -74 12 30 -262 -363 -119 229 489 84 -51 27 246 382
$$ packed form
1429G46m76m26K94J73k56J8r17L07L63N06k15K69k66PL34j88J82l82k39K05j80
1450a41K64j38K2R7N90J71n15m19J81O11l43l75o82N59O84l74n33N60j45M72L87
1471I33n66m75J33j57L44N4P5n86J10O38N07r3p17n47L97N51q0q42n81L00Q68
1492B66P52l96m65o80P90L23k62k63k44j25J34L22j87R6p2k3K54K47J94p96o25
1513g60L31K30M96m65j26M28K30N4j42R8m65M2n0P5M9l97K16j58M60J48l8K49
1535E05m16k97L28J2k00n09j1M36m9J38n0L58K59k06j75m1k8m64j95K50j24O90
1557B11j14j5q9%M02M1m82l06L17j35j1J0K34j29j20M07K62m1l24m5j61L0q0k1
1581a59j07j6K30M75j44J50l91k55J48nQ6J8k92j01K44L48K60m05j35P8K19J36
$$ plain form
1603 382 -3 -405 -395 -509 15 272 36 -284 305 314 340 316 -121 -258 -204 26 -195 -184 -348 -376 -38 101 274
1626 274 -194 -11 -157 -408 -596 -172 -232 -132 -109 143 8 309 83 115 -73 -299 111 -71 216 -393 -511
1647 -511 -341 225 29 60 -156 -89 -53 -169 -171 -181 -403 -499 -53 -210 -71 -20 28 113 -3 -258 129 -366 -584
1670 -584 -242 -239 -397 16 -329 -36 63 120 294 157 -189 -366 -233 -368 -443 -164 -238 -12 -118 40 99 -82
1692 -82 72 14 -199 -368 -402 -193 -457 -249 -47 -294 164 -105 -96 -288 -33 -52 15 -80 -302 -445 135 154 37
1715 37 43 -217 198 33 -15 -304 -288 -285 -459 -166 -164 -274 16 140 505 -205 127 92 18 -299 -178 -446 -383 -69
1739 -69 49 87 -106 -372 295 403 -42 -297 -477 -70 -149 -260 -186 9 -121 -304 403 425 -204 -10 -335 78
1761 78 -140 -304 -492 -75 -65 219 220 286 352 232 80 70 -448 -320 -190 -144 45 -55 471 5 143 150 178 -53
$$ packed form
1603C82l85m02J0j14N24K57k36l20N89RK6k4m37j37N4K30k21J1j64k8L38J39J73
1626B74m68J83j46k51j88M24o0J00K3K52j35L01k26L2j88k26M10j82K87o09j18
1647e11J70N66j96L1k16O7L6j16kj0k22r6M46j57J39N1M8Q5j16k55L87m95k18
1670e84L42Lj58M13l45K93R9N7J74j37l46j77J33j35p5K79p4K26j06J58N9j81
1692h2J54n8k13j69l4K09k64K08K02k47M58k69Rj92K55j9O7r5k22j43N80J9j17
1715C7Ok60M15j65m8k89J6Lj74K93Kj10K90J24L65p10L32l5p4l17J21k68O3L14
1739f9J18L8j93k66O67J08m45k55j80M07p9j11P4J95j30j83P07K2o29J94l25M13
1761G8k18j64j88M17J0K84JO6O6j20j52j0n18J28J30M6J89j00N26m66J38PK8k31
$$ plain form
1785 -53 9 -207 -277 -172 -112 -55 153 257 136 377 287 8 -219 -102 -219 -167 -136 -276 -144 -29 126 198 319
1808 319 58 72 80 -194 -189 -50 -417 -183 -241 -195 75 -214 129 187 294 90 -20 -88 46 -357 -335 72 343
1831 343 -305 139 575 271 231 55 52 10 -267 -384 -203 -215 -186 256 247 219 49 -115 433 240 -298 -515 -358
1854 -358 -254 -30 -60 -49 324 117 425 208 -196 -114 -236 -179 113 -154 78 -200 315 508 359 68 -158
1875 -158 -17 178 155 -216 -457 -356 -136 -96 -98 3 123 192 523 139 268 -99 -522 -29 336 39 277 -51
1897 -51 49 454 561 305 -27 -163 -78 -78 69 -1 133 69 338 456 58 70 85 -98 81 -118 -209 -77 -330
1920 -330 -17 78 213 -1 -70 276 94 25 -24 -197 -334 -199 209 56 -299 67 -6 446 27 138 150 -31
1942 -31 224 -106 -166 -650 58 98 -52 76 82 111 250 219 -207 27 -299 -361 -165 -36 -15 -119 340 261 217 235
$$ packed form
1785e3O2k16p0J05O0N7K08J04j21K41r0k79k27J17j17N2L1j40J32J15J55P2J21
1808C19k61J4Qk74NJ39l67K34n8M6K70k89L43N8J07k04j10o8J34m03K2M07K71
1831C43o48M44M36l04m0j76lm2k77j17J81j2K9M42rk8j70j64N48j93n38k17J57
1854c58J04K24l0J1L73k07L08k17m04Q2j22N7K92k67K32k78N15J93j49k91k26
1875a58J41J95k3l71k41J01K20M0kJ01J20O9L31l84J29l67m23M93L65k97K38l28
1897e1J00M05J07k56l32j36Q5%J47p0J34o4K69J18l98J2J5j83J79j99r1J32k53
1920c30L13R5J35k14o9L46j82o9m9j73j37J35M08j53l55L66p3M52m19J11J2j81
1942c1K55l30o0m84P08M0j50J28OK9J39l1m26K34l26o2J96J29K1j04M59p9m4J8
$$ plain form
1966 235 -149 -69 -169 -12 -163 -165 -467 280 266 533 169 253 157 -13 -3 -51 60 -324 -468 -460 210 312 50
1989 50 -256 -79 173 149 -126 -6 -474 -425 -22 217 -235 -409 -87 568 282 123 113 -233 15 -9 -89 -571
2011 -571 -169 -46 177 696 84 -37 -201 -89 30 -247 -289 -473 -128 -328 -85 -117 171 -59 60 -1 204
2032 204 194 -401 -197 -140 -189 -147 -87 -203 110 303 334 -13 27 -86 -229 -148 -255 -235 -261 149 155 -227 18 160
2056 160 283 -15 -210 218 -306 -223 -140 91 -18 -197 -91 461 287 186 50 -252 -71 -50 -217 -83 -202
2077 -202 -122 300 314 203 177 384 85 200 28 -188 -312 14 -157 108 175 66 213 34 422 -37 -14 -194
2099 -194 -254 -378 -380 120 -68 -13 310 78 -4 417 11 -97 -126 -114 -80 -244 -308 -335 -150 148 418 48 172
2122 172 -31 -163 90 -135 -300 -124 -121 133 135 88 -77 467 376 -20 7 -251 -25 5 -200 97 54 -106 -48
$$ packed form
1966B35l84Q0j00J57j51kl02P47j4K67l64Q4r6j70J0m8J11l84j44QO70J02k62
1989E0l06J77K52k4k75J20m68M9M03K39m52j74L22O55k86j59j0l46K48k4q0m82
2011e71M02J23K23N19o12j21j64J12J19k77m2j84L45k00K43l2K88k30J19o1K05
2032B04j0n95K04N7m9M2O0j16L13J93L1l47M0j13j43Q1j07K0k6M10Ol82K45J42
2056A60J23k98j95M28n24Q3Q3K31j09j79J06N52j74j01j36l02J81K1j67J34j19
2077b02Q0M22J4j11k6K07k99J15j72k16j24L26j71K65O7j09J47j79L88m59K3j80
2099a94o0j24kN00j88N5L23k32q2M21m06j08k9J2L4j64o4k7J85K98K70l70J24
2122A72k03j32K53k25j65J76LK54Km7j65N44r1l96K7k58K26L0k05K97m3j60N8
$$ plain form
2145 -48 419 133 84 -293 63 39 -239 15 -347 -606 -131 44 -79 285 211 28 302 94 -107 -15 -227 -297
2167 -297 -5 -147 -67 421 155 118 138 154 88 51 -42 -308 -108 -469 -268 -136 332 370 131 -45 232 300 99
2190 99 -123 -273 -303 -134 -53 -159 239 245 225 131 289 161 -82 -278 -412 -233 -443 -111 -248 138 -32 1 144
2213 144 62 -18 -329 -268 -274 -61 -288 33 -8 -50 38 166 177 -246 44 75 -218 -233 146 167 -14 19 -175 172
2237 172 219 193 172 93 -158 -437 59 -191 -208 -63 57 355 183 198 125 19 187 -29 100 -63 -339 -302 -303
2260 -303 -51 -186 149 196 323 122 127 -105 -103 -185 72 -221 -238 248 362 -93 258 -230 140 336 1 89 -193
2283 -193 155 -15 -7 84 145 56 326 440 -131 -290 137 -87 76 52 -218 -59 23 -63 140 169 207 147 402 -33
2307 -33 61 -82 -195 -58 -267 -326 -191 280 209 253 22 67 379 -20 18 -228 -468 -202 216 10 -204 52
$$ packed form
2145d8M67k86m9l77L56k4k78K54l62k59M75J75j23L64p4j83K74k08k01R2k12p0
2167b97K92j42Q0M88k66l7K0J6o6l7r3k66K00l61K01J32M68L8k39j76K77O8k01
2190I9k22j50l0J69Q1j06L98Ok0r4J58j28k43j96j34J79k10L32j37L86j70L3J43
2213A44q2q0l11O1oK13k27L21m1m2Q8J28J1m23K90L1k93j5L79K1j81L3j94L47
2237A72M7k6k1p9k51k79M96k50j7J45J20K98j72J5p3j06J68k16J29j63k76L7j
2260c03K52j35L35M7J27k01Nk32Kq2K57k93j7M86J14m55L51m88L70J96l35Q8k82
2283a93L48j70QR1O1q9K70J14n71j59M27k24J63k4k70J59Q2q6K03K9L8o0K55m35
2307c3R4j43j13J37k09n9J35M71p1M4k31M5L12l99L8k46k40K66M18k06k14K56
$$ plain form
2329 52 183 360 86 -197 -323 94 -274 -161 132 -78 245 406 95 282 457 277 322 -258 -175 119 2
2350 2 186 107 -63 91 307 199 138 -9 -150 62 -3 -280 23 -134 188 18 130 332 425 651 293 -4
2372 -4 56 -122 -55 -6 -309 83 275 396 97 261 73 150 92 251 -230 -147 -415 192 -93 27 -212 137 364
2395 364 330 -34 90 179 248 21 -194 -128 -37 59 184 52 16 261 -172 47 -185 -332 -90 144 -146 10
2417 10 -141 69 33 17 -302 -60 -154 53 235 -332 -560 -523 -92 -157 108 -160 106 37 35 -143 -184 -307 -102
2440 -102 -6 -149 -79 -158 117 -101 -37 -162 3 188 -314 -177 -281 -430 -99 149 -142 -204 -85 381 138 -58
2462 -58 -118 16 -76 -40 -41 -308 190 249 240 132 341 329 277 342 84 -257 -121 97 -118 11 55 27 189 235 129
2487 129 368 -15 209 214 94 -149 270 140 -26 -55 177 207 286 -4 -57 -53 271 -36 252 -289 -55 197 341
$$ packed form
2329E2J31J77k74k83j26M17l68J13K93k10L23J61l11J87J75j80M5n80Q3K94j17
2350BJ84p9j70J54K16j08o1j47j41K12o5k77L03j57L22j70J12K02R3K26l58k97
2372dO0j78O7M9l03L92J92J21k99J64j88P7n8J59m81Q3k68O07k85J20k39L49K27
2395C64l4l64J24Q9O9k27k15O6R1R6J25j32l6K45m33K19k32j47K42K34k90J56
2417A0j51K10l6j6l19K42r4K07J82n67k28L7M31o5K65k68K66o9kj78m1j23K05
2440a02R6j43P0p9K75k18O4j25J65J85n02J37j04j49L31K48k91o2J19M66k43j96
2462e8o0J34r2L6jk67M98N9rj08K09j2n2O5k58l41J36K18k15J29M4k8J62M6j06
2487A29K39l83K24Nj20k43M19j30j66k9K32L0P9k90n3ML24l07K88n41K34K52J44
$$ plain form
2510 341 181 123 -8 92 363 -313 -77 -115 -186 82 234 16 -209 161 25 114 226 -13 -27 205 -31 -207
2532 -207 -228 -191 -13 42 -166 -267 0 -140 17 -108 -172 -356 63 278 -141 -88 37 112 465 99 -137 62
2554 62 14 -156 -155 -340 -99 124 109 -107 -226 -43 385 143 -8 -176 31 -89 11 -355 -371 -22 236 240 253
2577 253 -161 -59 582 388 -176 79 -256 -89 378 280 -142 149 288 469 -86 -360 -106 -74 350 -130 -121
2598 -121 -210 235 93 169 -239 47 284 249 -30 -211 26 173 115 386 200 108 419 405 34 -125 -190 126
2620 126 77 -63 -136 -117 126 495 140 -99 -101 399 538 142 -180 -83 -15 -20 -83 -66 -156 418 371 138 86 161 -107
2645 -107 280 140 -519 -412 103 16 98 30 -68 203 404 255 24 -267 -196 43 194 -249 -160 103 268 269 23
2668 23 -20 259 266 -30 -76 -407 -152 136 -118 -145 159 -177 386 173 123 -104 -34 -38 -11 -228 -569 104 334 195
$$ packed form
2510C41j60n8j31J00K71o76K36l8p1K68J52k18k25L70j36Q9J12k39j4K32k36j76
2532b07k1L7J78N5k08j01K67j40J57j25o4j84M19K15m19N3J25P5L53l66k36J99
2554F2m8j70Jj85K41K23j5k16j19J83M28k42j51j68K07j20J00l66j6L49K58MJ3
2577B53m14J02O41j94n64K55l35J67M67r8m22K91J39J81n55k74K54L2M24m80R
2598a21q9M45j42P6m08K86K37l5k79j81K37J47n8K71j86r2L11j4l71j59o5L16
2620A26m9j40p3J9K43L69l55k39kN00J39l96l22R7O8no3J7r0N74m7k33n2P5k68
2645a07L87j40o59J07N15q7Q2o8r8K71K01j49k31k91P1K39J51m43Q9K63J65Jk46
2668B3m3K79Pk96m6l31K55K88k54k7L04l36N63k13n0k27P0mK7k17l41O73K30j39
$$ plain form
2692 195 -401 -3 110 92 12 -346 -356 -240 -29 -25 40 -80 234 334 312 29 -147 84 125 294 -291 -356 -97
2715 -97 413 255 -106 -317 -58 349 39 14 -255 -208 102 86 87 -628 -132 317 391 87 132 83 218 -237 -153
2738 -153 -284 -466 152 143 106 -12 430 160 117 80 40 -43 -51 40 194 -5 -405 309 125 -88 95 301 559
2761 559 -18 60 -248 -15 -27 155 -227 -337 -333 182 338 24 -264 59 315 -41 -108 -78 -79 121 -137 75 -261
2784 -261 31 117 46 322 -145 -136 50 -19 -149 -298 -255 -57 275 199 14 -211 16 184 103 -389 -580 230 41
2807 41 -250 -100 -19 209 153 -32 -22 -220 158 -117 86 -570 -121 28 281 290 71 -159 99 92 -210 -286 -104
2830 -104 -15 -55 -94 -209 -316 281 347 10 332 69 -5 178 -51 -54 -88 -172 149 77 -326 -121 286 172 168 -372
2854 -372 -332 -289 66 -178 -286 61 144 132 103 141 -82 -85 193 -100 -76 -74 -19 98 104 -119 -47 399 160 201 77
$$ packed form
2692A95n96L98J13j8q0l58j0J16K11MO5j20L14J00k2k83j76K31M1J69n85o5K59
2715i7N10j58l61k11K59M07l10k5k69M7L10j6Jp15M96M49P4l04M5m9J35m55Q4
2738a53j31j82O18rl7j18M42k70m3l7m0q3qR1J54j99m00P14j84k13J83K06K58
2761E59n77P8l08K33j2J82l82j10MN15J56l14k88L23K56l56o7L0jK00k58K12l36
2784b61K92Q6p1K76m67RJ86o9j30j49M3J98L32p6j85k25K27J68q1m92j91Q10j89
2807D1k91J50Q1K28n6j85J0j98L78k75K03o56M49J49K53Rk19k30K58pl02p6J82
2830a04Q9m0l9j15j07N97O6l37L22k63p4J83k29ll4q4L21p2m03K05M07j14mn40
2854c72M0M3L55k44j08L47Q3j2k9L8k23lK78k93K4KN5J17Ok23P2M46k39M1j24
$$ plain form
2879 77 -283 -263 26 -122 -161 -59 -554 127 -137 -443 -290 220 156 -81 28 -215 -12 -57 -166 -116 -101 -15 276
2902 276 45 19 -429 -294 35 -216 -191 -360 -101 101 281 -6 105 -57 -113 112 -171 2 -400 -88 48
2923 48 -307 -102 -38 69 -90 59 -6 -67 82 -119 -366 -267 5 -169 171 -217 -272 -173 50 86 -311 -12 -150
2946 -150 -92 16 -311 -341 34 304 -75 100 89 -69 107 212 127 -108 -85 220 10 83 150 83 468 -79 321
2969 321 14 116 250 302 -140 -206 -2 286 21 423 290 115 308 270 302 -77 -40 -181 22 89 -306 80
2991 80 578 296 210 319 241 197 251 -45 -248 10 8 163 66 -84 -57 148 -60 -24 -112 -162 147 222 20 -168
3015 -168 -19 106 294 -111 177 -37 117 248 159 -12 -350 -97 -44 -294 -163 -64 -375 -153 207 66 255
3036 255 -153 -170 -331 -662 37 163 -207 -63 -458 94 105 -64 -92 -339 -218 -46 -295 -109 -133 -64 86 127
$$ packed form
2879G7l60K0K89j48l9J02m95O81k64l06J53N10o4k37J09k43K03m5j09N0J5Q6K91
2902B76k31k6m48J35L29k51K5j69K59K02J80k87J11j62n6K25k83J73m02L12J36
2923D8l55K05O4J07j59J49o5o1J49k01k47R9K72j74L40l88n5R9K23L6l97K99j38
2946a50N8J08l27l0L75K70l79J75j1j58J76J05q5k35K3L05k10P3O7o7L85n47M00
2969C21l07J02J34N2m42o6K04K88k65M02j33j75J93l8L2l79L7j41K03O7l95L86
2991H0M98k82q6J09p8m4N4k96k03K58kJ55r7j50K7K05k08L6q8n0L09P5k02j88
3015a68J49J25J88m05K88k14J54J31q9j71l38K53N3k50J31R9l11K22L60j41J89
3036B55m08j7j61l31O99J26l70J44l95N52J1j69k8k47J21J72k49J86k4O9J50M1
$$ plain form
3058 127 12 74 -199 25 2 -387 -38 -176 -137 154 -1 287 -279 117 69 -39 29 -47 200 -34 -69 -200
3080 -200 40 369 193 82 26 184 55 114 45 -220 -398 331 35 261 181 -13 215 226 354 200 160 138
3102 138 69 252 -74 175 214 329 16 76 63 502 210 -43 25 -23 50 124 236 41 -138 46 739 -44 7
3125 7 259 -119 118 -302 -92 -639 -331 -132 -13 -9 247 -29 337 216 165 107 100 -138 -291 60 -207 126 197
3148 197 294 212 289 267 -14 -375 -88 -245 48 -23 30 17 -36 -45 346 82 101 -77 -182 205 -117 -167 -117 -86 -64
3173 -64 19 72 -60 -29 148 -58 -84 -298 -46 -17 139 -189 136 37 116 166 -281 -140 47 -33 -80 -295 -24 143
3197 143 59 89 -102 73 413 103 203 177 -98 49 -119 -58 207 -177 -171 141 21 320 211 -72 127 -90
3219 -90 -125 298 79 163 -114 110 141 293 14 348 46 101 188 2 5 -49 251 -80 30 -96 58 72 92 -90
$$ packed form
3058A27j15O2k73K24k3l89L49j38L9K91j55K88n66L96m8j08O8p6K47k34l5j31
3080b00K40L29j76j11n6J58j29N9o9k65j78P29k96K26q0j94K28J1J28j54m0k2
3102A38o9J83l26K49L9J15l13O0j3M39k92k53O8m8P3P4J12j95j79J84O93p83N1
3125GK52l78K37m20K10n47L08J99J19MK56k76L66j21n1n8pk38j53L51k67L33P1
3148A97R7q2P7k2k81l61K87j57K93p1N3j3n3rL91k64J9j78j05L87l22n0N0L1K2
3173f4Q3N3j32L1J77k06k6k14K52K9J56l28L25r9P9N0m47J41J87q0m7k15K71J67
3197A43q4L0j91J75L40l10J00k6k75J47j68O1K65l84OL12j20K99j09k83J99k17
3219i0l5M23k19Q4k77K24L1J52k79L34l02N5Q7j86Ln4L00l31J10j26J54J4K0j82
$$ plain form
3243 -90 2 149 -44 -309 -157 -286 125 15 -175 -109 107 -131 -27 67 -70 -98 -210 103 12 -162 65 211
3265 211 189 515 324 318 -216 -170 -85 -138 -158 -199 -439 176 277 341 84 -55 123 168 -25 -93 -72 -335 -67 37
3289 37 118 155 -94 357 34 37 -366 -263 155 -13 -62 -224 -221 -89 122 163 80 243 398 -91 227 -180 156
3312 156 -130 -282 19 101 139 109 97 220 -73 -213 -266 135 64 -99 -431 125 -230 -3 196 -4 95 100 16
3335 16 37 151 27 -92 -30 -222 118 -175 279 441 247 41 71 -43 -133 -60 -146 -357 156 80 -151 178 43
3358 43 119 147 -27 -80 -322 -81 27 -227 -184 100 -135 -120 201 -70 -70 268 83 -112 -53 -2 -69 -79 200 -28
3382 -28 75 156 9 17 10 14 141 -97 77 -21 -95 104 200 -15 90 77 195 -55 96 -61 23 118 -273 148 105
3407 105 294 141 46 180 -74 -1 -6 -20 -181 -315 -356 187 -134 -93 80 164 -105 44 17 -237 -64 -140 45
$$ packed form
3243i0R2J47j93k65J52j29M11j10j90O6K16k38J04R4j37k8j12L13r1j74K27J46
3265B11k2L26j91on34M6Q5n3k0m1k40O15J01O4k57j39J78M5j93o8K1k63K68J04
3289C7Q1L7k49M51l23Lm03J03M18j68m9j62LJ32K11M1q3J63J55m89L18m07L36
3312A56k86j52L01Q2L8l0j2J23k93j40n3M01p1j63l32N56l55K27J99k00R9Nq4
3335A6K1J14j24j19O2j92L40k93M54J62j94k06L0j14r0P3q6k11N13p6k31L29j35
3358D3P6K8j74n3k42K41J08k54M3K84k35J5L21k71%L38j85j95N9N1o7j0K79k28
3382b8J03Q1j47QpMJ27k38J74r8p4J99R6k15J05j3J18k50J51j57Q4R5l91M21m3
3407A05J89j53r5J34k54P3nj4j61j34m1N43l21M1J73Q4k69J49k7k54J73p6J85
$$ plain form
3430 45 59 -319 -39 61 97 226 -129 23 -16 69 -210 -145 -3 -50 -89 -197 -127 353 1 23 2 46 -33 69
3454 69 -128 -287 -102 -127 26 -234 -25 -125 296 -96 80 52 9 82 -188 -199 98 52 101 53 -74 -43 26 21
3478 21 40 176 -8 -1 98 -261 -125 20 -219 282 180 75 -133 133 -121 116 -110 -206 75 187 184 1 199
3501 199 174 78 53 151 -22 -268 -313 -328 -86 -27 -175 70 188 -60 -336 203 -11 43 61 -459 79 -157 -146
3524 -146 127 -234 -133 -25 -25 48 267 -232 93 -330 -47 -165 -266 76 206 149 -33 78 -238 -157 -119 -3
3546 -3 -64 -432 -278 -13 -117 231 -127 245 275 -5 20 -29 80 8 5 -104 -98 116 -136 275 105 -30 131 -120
3570 -120 -227 -86 -13 -379 83 314 -65 328 -175 259 80 -165 -99 82 -25 -175 -319 97 149 -552 -166
3591 -166 -26 6 -92 11 254 -130 -258 -314 -421 111 -38 -455 198 93 170 -78 19 79 38 -418 66 125 -13
$$ packed form
3430D5J4l78K80J00L6J29l55J52l9Q5k79O5J42m7l9j08P0M80l52K2k1M4p9J02
3454F9j97j59J85k5J53k60K09j00M21l92J76k8m3P3k70j1K97m6M9m8j27L1O9n
3478B1J9J36j84PR9l59J36J45k39N01j02j05k08K66k54K37k26r6K81J12lj83J98
3501A99k5r6k5R8j73k46m5j5K42N9j48K45J18k48k76N39k14N4J8n20N38k36J1
3524a46K73l61J01J08%P3K19m99L25m23K83j18j01L42J30n7j82J11l16Q1L8J16
3546co1l68J54K65j04L48l58L72L0k80K5m9J09p2lj09OK14k52M11j70j35J61k51
3570a20j07J41P3l66M62K31l79L93n03M34j79k45O6J81j07j50j44M16N2p01L86
3591a66J40L2r8J03K43l84j28n6j07N32j49m17O53j05P7k48R7O0m1m56M84N9j38
$$ plain form
3614 -13 27 -37 151 -52 3 14 -15 64 1 -11 -255 10 284 40 -217 67 83 141 107 -60 156 -309 -272 -257 -212
3639 -212 -191 -254 -98 -20 41 424 4 -134 -207 38 -195 -279 -13 105 -97 -377 -215 -169 158 27 -143 -79 -115
3662 -115 -343 72 289 -38 -222 163 27 177 -64 -48 35 -189 132 -230 -340 -124 -28 70 334 46 125 94
3684 94 -21 -208 -14 -284 -119 -70 -114 -315 -75 109 -158 -6 -136 100 -24 -11 -101 -86 10 -125 0 20 -188
3707 -188 200 334 174 21 19 -89 63 99 6 47 -202 -228 -213 168 -74 207 49 95 -318 52 -140 -42 -132
3730 -132 -98 -2 295 73 -57 69 -39 -3 -62 14 -81 -146 -271 48 71 -87 0 107 -46 176 -12 146 164
3753 164 -25 -63 38 -167 -2 45 -362 -54 130 33 39 -70 52 -108 -40 -237 -293 193 -67 156 139 71 -43
3776 -43 84 -63 22 -141 31 155 -241 125 113 116 149 126 -34 -83 128 -277 -50 -146 -127 -31 -405 70 85 -110
$$ packed form
3614a3M0o4J88k03N5J1k9P9o3j2k44K65K74k44k57K84J6N8l4j67K16m65L7J5M5
3639b12K1o3J56P8O1L83m20j38p3K45k33q4K66J18k02k80J62M6L27j31j70O4l6
3662a15k28M15K17l27j84L85j36J50k41J6Q3k24L21l62j10K16R6R8K64k88P9l1
3684I4j15j87J94k70J65M9m4k01K40J84k67J52j30K36j24J3r0J5R6j35J25K0k08
3707a88L88J34j60j53kj08J52L6r3M1k49k6J5L81k42K81j58M6m13L70j92R8r0
3730a32L4R6K97k22j30J26j08L6n9P6r5o5j25L19K3j58Q7J07j53K22j88J58J8
3753A64j89l8J01k05J65M7m07L08J84r7Oj09J22j60O8j97n6M86k60K23j7o8j14
3776d3J27j47Q5j63J72J24l96L66j2LL3k3j60m9K11m05K27r6J9R6l74M75J5j95
$$ plain form
3800 -110 45 232 207 85 -30 79 -226 -116 73 79 191 -19 -143 87 306 -26 -102 -202 -105 -44 -99 -285
3822 -285 163 -122 -182 218 -57 471 98 -18 -52 10 -183 -79 -163 294 -38 171 54 36 114 51 3 160 -93
$$ packed form
3800a10J55J87k5j22j15J09l05J10J89OJ12k10j24K30K19l32p6j00R7O1n5j86
3822b85M48k85o0M00k75N28l73j16l4O2j93J04q4M57l32K09j17j8P8o3m8J57k53
$$ [...]
8191C5
##END NTUPLES=NMR FID
##END=
