##TITLE=1H_Pr 5-5-5
 CDCl3, 8 sc, 
 1.6.2020
##JCAMPDX= 6.0         $$ Bruker NMR JCAMP-DX V2.0
##DATA TYPE= NMR FID
##DATA CLASS= NTUPLES
##ORIGIN= UXNMR, Bruker Analytische Messtechnik GmbH
##OWNER= root
$$ XWIN-NMR		Version 3.5
$$ Mon Jun  1 13:11:10 2020 Russian Standard Time (UT+4h)  she@DPX200
##.OBSERVE FREQUENCY= 200.1315
##.OBSERVE NUCLEUS= ^1H
##.DELAY= (6, 6)
##.ACQUISITION MODE= SIMULTANEOUS
##.ACQUISITION SCHEME= undefined
##.AVERAGES= 8
##.DIGITISER RES= 18
##SPECTROMETER/DATA SYSTEM= spect
##.PULSE SEQUENCE= zg30
##.SOLVENT NAME= CDCl3
##.SHIFT REFERENCE= (INTERNAL, CDCl3, 0, 15.7039)
##AUDIT TRAIL= $$ (NUMBER, WHEN, WHO, WHERE, WHAT)
$$ ##TITLE= Audit trail, XWIN-NMR		Version 3.5
$$ ##JCAMPDX= 5.01
$$ ##ORIGIN= Bruker BioSpin GmbH
$$ ##OWNER= she
$$ F:/spectra/data/she/nmr/H-F/1/audita.txt
$$ ##AUDIT TRAIL=  $$ (NUMBER, WHEN, WHO, WHERE, WHAT)
(   1,<2020-06-01 13:10:08.82 +0400>,<she>,<DPX200>,
      <created by zg, POWCHK disabled, PULCHK disabled
       configuration hash MD5:
       00 E9 B6 7A A2 85 ED C7 34 08 36 98 17 FE 4E 26
       data hash MD5: 16K
       1B 3A 8B 94 42 C0 C5 20 88 D7 A2 F1 03 5E FE 9E>)
$$ ##END=
$$ 
$$ hash MD5
$$ 35 6A 62 B5 F0 FE 54 E9 6F 8A 39 67 5A D9 23 09
##$RELAX= 
##$RELAX= 
##$RELAX= 
##$RELAX= 
##$RELAX= 
##$RELAX= 
$$ Bruker specific parameters
$$ --------------------------
##$DU= <F:/spectra>
##$EXPNO= 1
##$NAME= <H-F>
##$PROCNO= 1
##$TYPE= <nmr>
##$USER= <she>
##$AMP= (0..31)
100 100 100 100 100 100 100 100 100 100 100 100 100 100 100 100 100 100 
100 100 100 100 100 100 100 100 100 100 100 100 100 100 
##$AQSEQ= 0
##$AQ_mod= 1
##$AUNM= <au_zg>
##$AUTOPOS= <>
##$BF1= 200.13
##$BF2= 200.13
##$BF3= 200.13
##$BF4= 200.13
##$BF5= 200.13
##$BF6= 200.13
##$BF7= 200.13
##$BF8= 200.13
##$BYTORDA= 1
##$CFDGTYP= 0
##$CFRGTYP= 5
##$CHEMSTR= <none>
##$CNST= (0..31)
1 1 145 1 1 1 1 1 1 1 1 1 1 1 1 1 1 1 1 1 1 1 1 1 1 1 1 1 1 1 1 1 
##$CPDPRG= <>
##$CPDPRG1= <>
##$CPDPRG2= <>
##$CPDPRG3= <>
##$CPDPRG4= <mlev>
##$CPDPRG5= <mlev>
##$CPDPRG6= <mlev>
##$CPDPRG7= <mlev>
##$CPDPRG8= <mlev>
##$CPDPRGB= <>
##$CPDPRGT= <>
##$D= (0..31)
0 1.2 0 0 0 0 0 0 0 0.06 0 0.03 0 0 0 0 0.0002 0 0 0 0 0 0 0 0 0 0 0 0 
0 0 0 
##$DATE= 1591002608
##$DBL= (0..7)
120 120 120 120 120 120 120 120 
##$DBP= (0..7)
150 150 150 150 150 150 150 150 
##$DBP07= 0
##$DBPNAM0= <>
##$DBPNAM1= <>
##$DBPNAM2= <>
##$DBPNAM3= <>
##$DBPNAM4= <>
##$DBPNAM5= <>
##$DBPNAM6= <>
##$DBPNAM7= <>
##$DBPOAL= (0..7)
0.5 0.5 0.5 0.5 0.5 0.5 0.5 0.5 
##$DBPOFFS= (0..7)
0 0 0 0 0 0 0 0 
##$DE= 6
##$DECBNUC= <off>
##$DECIM= 24
##$DECNUC= <off>
##$DECSTAT= 4
##$DIGMOD= 1
##$DIGTYP= 9
##$DL= (0..7)
0 120 120 120 120 120 120 120 
##$DP= (0..7)
150 150 150 150 150 150 150 150 
##$DP07= 0
##$DPNAME0= <>
##$DPNAME1= <>
##$DPNAME2= <>
##$DPNAME3= <>
##$DPNAME4= <>
##$DPNAME5= <>
##$DPNAME6= <>
##$DPNAME7= <>
##$DPOAL= (0..7)
0.5 0.5 0.5 0.5 0.5 0.5 0.5 0.5 
##$DPOFFS= (0..7)
0 0 0 0 0 0 0 0 
##$DQDMODE= 0
##$DR= 18
##$DS= 0
##$DSLIST= <SSSSSSSSSSSSSSS>
$$ [...]
##$SUBNAM2= <"">
##$SUBNAM3= <"">
##$SUBNAM4= <"">
##$SUBNAM5= <"">
##$SUBNAM6= <"">
##$SUBNAM7= <"">
##$SUBNAM8= <"">
##$SUBNAM9= <"">
##$SW= 24.9337058887773
##$SWIBOX= (0..15)
0 0 2 0 0 0 0 0 0 0 0 0 0 0 0 0 
##$SW_h= 4990.01996007984
##$TD= 16384
##$TD0= 1
##$TE= 0
##$TE2= 300
##$TE3= 300
##$TEG= 300
##$TL= (0..7)
0 120 120 120 120 120 120 120 
##$TP= (0..7)
150 150 150 150 150 150 150 150 
##$TP07= 0
##$TPNAME0= <>
##$TPNAME1= <>
##$TPNAME2= <>
##$TPNAME3= <>
##$TPNAME4= <>
##$TPNAME5= <>
##$TPNAME6= <>
##$TPNAME7= <>
##$TPOAL= (0..7)
0.5 0.5 0.5 0.5 0.5 0.5 0.5 0.5 
##$TPOFFS= (0..7)
0 0 0 0 0 0 0 0 
##$TUNHIN= 0
##$TUNHOUT= 0
##$TUNXOUT= 0
##$USERA1= <user>
##$USERA2= <user>
##$USERA3= <user>
##$USERA4= <user>
##$USERA5= <user>
##$V9= 5
##$VALIST= <valist>
##$VCLIST= <CCCCCCCCCCCCCCC>
##$VD= 0
##$VDLIST= <DDDDDDDDDDDDDDD>
##$VPLIST= <PPPPPPPPPPPPPPP>
##$VTLIST= <TTTTTTTTTTTTTTT>
##$WBST= 1024
##$WBSW= 4
##$XGAIN= (0..3)
0 0 0 0 
##$XL= 0
##$YL= 0
##$YMAX_a= 230266
##$YMIN_a= -152400
##$ZGOPTNS= <>
##$ZL1= 120
##$ZL2= 120
##$ZL3= 120
##$ZL4= 120
##$ABSF1= 10
##$ABSF2= 0
##$ABSG= 5
##$ABSL= 3
##$ALPHA= 0
##$AQORDER= 0
##$ASSFAC= 0
##$ASSFACI= 0
##$ASSFACX= 0
##$ASSWID= 0
##$AUNMP= <proc_1d>
##$AZFE= 0.1
##$AZFW= 0.1
##$BCFW= 1
##$BC_mod= 2
##$BYTORDP= 1
##$COROFFS= 0
##$CY= 11.3945322036743
##$DATMOD= 1
##$DC= 2
##$DFILT= <>
##$DTYPP= 0
##$F1P= 16.9975609425685
##$F2P= -3.02152046262296
##$FCOR= 0.5
##$FTSIZE= 0
##$FT_mod= 4
##$GAMMA= 1
##$GB= 0.15
##$INTBC= 1
##$INTSCL= 1
##$ISEN= 128
##$LB= 0.24
##$LEV0= 0
##$LPBIN= 0
##$MAXI= 10000
##$MC2= 0
##$MEAN= 0
##$ME_mod= 0
##$MI= 1.114404
##$NCOEF= 0
##$NC_proc= 0
##$NLEV= 6
##$NOISF1= 3.799351
##$NOISF2= 2.8
##$NSP= 1
##$NTH_PI= 0
##$NZP= 0
##$OFFSET= 15.70392
##$PC= 1
##$PHC0= -9795.796
##$PHC1= 23.60082
##$PH_mod= 1
##$PKNL= yes
##$PPARMOD= 0
##$PSCAL= 0
##$PSIGN= 0
##$REVERSE= no
##$SF= 200.130013532006
##$SI= 16384
##$SIGF1= 3
##$SIGF2= 2
##$SINO= 400
##$SIOLD= 16384
##$SREGLST= <1H.CDCl3>
##$SSB= 0
##$STSI= 0
##$STSR= 0
##$SW_p= 3612.71676300578
##$SYMM= 0
##$S_DEV= 0
##$TDeff= 0
##$TDoff= 0
##$TI= <>
##$TILT= no
##$TM1= 0
##$TM2= 0
##$TOPLEV= 0
##$USERP1= <user>
##$USERP2= <user>
##$USERP3= <user>
##$USERP4= <user>
##$USERP5= <user>
##$WDW= 1
##$XDIM= 8192
##$YMAX_p= 0
##$YMIN_p= 0
$$ End of Bruker specific parameters
$$ ---------------------------------
##NTUPLES= NMR FID
##VAR_NAME=  TIME,          FID/REAL,        FID/IMAG
##SYMBOL=    X,             R,               I
##VAR_TYPE=  INDEPENDENT,   DEPENDENT,       DEPENDENT
##VAR_FORM=  AFFN,          ASDF,            ASDF
##VAR_DIM=   8192,          8192,            8192
##UNITS=     SECONDS,       ARBITRARY UNITS, ARBITRARY UNITS
##FACTOR=    0.0002004,     1,               1
##FIRST=     0,             0,               0
##LAST=      1.6414764,     0,               0
##MIN=       0,             -152400,         0
##MAX=       1.6414764,     230266,          0
$$ Real data points
##PAGE= N=1
##DATA TABLE= (X++(R..R)), XYDATA
$$ [...]
$$ plain form
1972 556 559 -913 -1808 -697 992 926 -527 -1437 -1364 165 914 230 -789 -920 -719 259 599 200 -371
1991 -371 -204 -828 -282 580 1023 174 -1378 -1454 -197 1388 524 -914 -1894 -835 783 1096 22 -1162
2009 -1162 -884 278 785 519 -76 -552 -608 84 446 630 576 -219 -919 -227 829 1578 634 -1084 -1230
2028 -1230 556 2014 1355 -364 -1152 -314 1505 1513 436 -279 -363 222 787 652 478 114 -462 -54 518
2047 518 1237 1169 -93 -792 -321 1191 1846 685 -778 -765 499 1646 1163 -303 -940 -154 828 626
2065 626 473 -80 -433 -85 -131 282 346 -150 -781 -1073 -206 1165 1140 -491 -1385 -1026 507 883 32 -1183
2085 -1183 -839 -10 670 101 -603 -930 -529 -96 -47 -135 -28 -342 -909 -680 181 541 -37 -800 -1638 -382
2105 -382 465 61 -492 -1429 -715 57 356 -84 -908 -459 -267 292 411 -339 -505 -462 -411 -126 249 163 -30
$$ packed form
1972E56Lj472q95J111J689o6j453r10P3J529P49o84j019j31K01R78L40l99n71
1991c71J67o24N46Q62M43q49j552p6J257J585q64j438r80J059J618L13j074j184
2009a162K78J162N07k66n95m76n6O92L62J84n4p95p00O92J056P49r44j718j46
2028a230J786J458o59j719p88Q38J819Qj077p15q4N85N65j35j74l64n76M08N72
2047E18P19o8j262o99M71J512O55j161j463J3J264J147m83j466o37P86R82k02
2065F26j53n53l53L48m6M13O4m96o31k92Q67J371k5j631q94L59J533L76q51j215
2085a183L44Q29O80n69p04l27M01M33M9q8J07l14n67K29Q61L60n78p63q38J256
2105c82Q47m04n53r37P14P72K99m40q24M49J92N59J19p50j66M3N1K85L75q6j93
$$ plain form
2126 -30 -776 -387 291 808 304 -635 -684 52 782 331 -439 -715 -148 742 656 194 -320 15 88 -99 391
2147 391 7 27 35 -15 291 538 661 -92 -171 -3 600 679 104 -471 46 449 796 443 -254 -56 334 720
2169 720 449 279 217 455 231 382 454 250 65 -235 23 162 660 370 121 -154 -336 270 738 -221 -165
2190 -165 -218 400 72 -9 33 -27 361 416 45 64 -135 -228 421 -370 278 -60 -94 -257 -196 123 -16 -46 -275
2213 -275 -459 96 -9 311 -328 -398 -124 -331 -165 55 -292 -323 -225 -170 -60 -372 -236 -501 26 -58 53 -41
2235 -41 -411 -454 -226 76 -41 -17 -323 -291 274 -42 49 -210 -257 -161 66 14 -210 -74 195 -143 -130 -139 -201 -299
2259 -299 -192 57 -31 90 -297 -384 -239 -181 -16 -347 -315 -296 -187 -299 -22 -174 -76 -241 -93 -29 10 234 -76
2282 -76 112 -124 53 340 303 54 77 221 56 15 239 72 -103 95 425 283 115 24 499 299 161 230
$$ packed form
2126c0p46L89O78N17n04r39m9P36P30m51p70k76N67Q90q6m62n14L35P3j87M90
2147C91l84K0Qn0L06K47J23p53p9J68O03P9n75n75N17M03L47l53o97J98L90L86
2169G20k71j70o2K38k24J51P2k04j85l00K58J39M98k90k49k75j82O06M68r59N6
2190a65n3O18l28q1M2o0L88N5l71J9j99r3O49p91O48l38l4j63O1L19j39l0k29
2213b75j84N55j05L20o39p0K74k07J66K20l47l1R8N5J10l12J36k65N27q4J11r4
2235d1l70m3K28L02j17K4l06L2N65l16R1k59m7R6K27n2k24J36K69l38J3ro2r8
2259b99J07K49q8J21l87q7J45N8J65l31L2J9J09j12K77j52R8j65J48O4L9K24l10
2282g6J88k36J77K87l7k49K3J44j65m1K24j67j75J98L30j42j68r1M75k00j38O9
$$ plain form
2304 230 -47 -35 -90 -108 247 43 187 111 -136 34 129 326 206 312 240 200 211 128 308 -17 286 259 139
2327 139 379 -199 150 157 -31 -12 288 273 250 39 253 -84 -135 253 -27 -157 -194 162 187 103 -260 -90 -149
2350 -149 -41 143 -67 -80 75 69 -9 66 -74 -27 -40 -95 -156 16 97 -247 -155 237 38 -18 -106 -164 -96 -84 -529
2375 -529 -157 -44 -3 -392 -54 120 -92 -121 -431 -100 -58 17 29 -405 -219 -35 -42 177 -182 57 -31 239 137
2398 137 -190 -237 -123 -58 2 302 -18 89 -122 -123 48 -235 -49 -23 73 101 104 8 63 -107 -220 -59 142 163
2422 163 285 205 149 159 327 329 327 67 264 212 462 397 -72 412 228 17 124 51 59 155 16 147 -68 -333
2446 -333 260 118 126 182 -230 72 -259 -75 191 -171 39 -133 77 125 364 397 24 194 118 147 192 55 -76
2469 -76 127 294 -104 449 89 161 -61 103 81 -120 -103 -221 -339 -226 181 -50 -433 -415 -398 -415 -348 -272 -699
$$ packed form
2304B30k77J2n5j8L55k04J44p6k47J70R5J97j20J06p2m0J1q3J80l25L03k7j20
2327A39K40n78L49Pj88J9L00j5k3k11K14l37n1L88k80j30l7L56K5q4l63J70n9
2350a49J08J84k10j3J55op8P5j40M7j3n5o1J72Q1l44R2L92j99n6q8n8O8J2m45
2375e29L72J13M1l89L38J74k12k9l10L31M2P5J2m34J86J84pK19l59K39q8K70j02
2398A37l27m7J14O5O0L00l20J07k11jJ71k83J86K6R6K8Lr6N5j70j13J61K01K1
2422A63J22q0n6J0J68Kkk60J97n2K50o5m69M84j84k11J07p3QR6j39J31k15k65
2446c33N93j42QN6m12L02l31J84K66l62K10j72K10M8K39L3l73J70p6K9M5j37j31
2469g6K03J67l98N53l60P2k22J64k2k01J7j18j18J13M07k31l83J8J7j7O7P6m27
$$ plain form
2492 -699 -527 -368 -524 -134 -144 -306 -473 30 46 -143 15 -245 -133 15 257 105 21 -210 -109 -48 63
2513 63 117 -197 94 -84 -48 243 -43 -156 -267 -310 142 251 106 -204 -427 -180 -204 56 485 -65 -71 86
2535 86 340 27 -11 -29 -131 274 351 341 285 30 52 21 432 200 285 -40 251 162 337 287 98 -11 -126 44
2559 44 220 313 -130 -177 257 183 549 226 153 115 297 215 578 56 185 63 146 -123 198 452 -28 -34 -202
2582 -202 601 272 298 -282 -384 168 230 174 -347 -204 -345 329 60 -125 -156 -143 -3 -474 -139 79 8 45
2604 45 -121 -488 161 315 9 -626 47 141 232 -68 -128 -295 -209 193 -43 -282 -279 -294 70 -245 -160 -200 -123 -425
2628 -425 -699 -356 75 32 -333 -396 -163 56 -54 -189 -417 -114 237 -150 -143 -34 -43 -248 -95 87 177 -51
2650 -51 62 177 -335 -28 239 326 -276 -44 208 -42 517 420 -65 85 264 27 40 52 -41 312 -34 -258
$$ packed form
2492f99J72J59j56L90j0j62j67N03J6j89J58k60J12J48K42j52q4k31J01O1J11
2513F3N4l14K91j78L6K91k86j13j11m3M52J09j45l10k23K47k4K60M29n50oJ57
2535H6K54l13l8j8j02M05P7j0n6k55K2l1M11k32Q5l25K91q9J75n0j89j09j15J70
2559D4J76R3m43m7M34p4L66l23p3l8J82q2L63n22J29j22Q3k69L21K54m80oj68
2582b02Q03l29K6n80j02N52O2n6n21J43j41O74k69j85l1J3J40m71L35K18p1L7
2604D5j66l67O49J54l06o35O73R4R1l00o0j67Q6M02k36k39Lj5L64l15Q5m0P7l02
2628d25k74L43M31m3l65o3K33K19j10j35k28L03L51l87PJ09rk05J53J82R0k28
2650e1J13J15n12L07K67Q7o02K32K52k50N59r7m85J50J79k37J3J2r3L53l46k24
$$ plain form
2672 -258 -69 237 245 26 -19 196 514 127 -16 -168 83 685 443 141 -76 269 321 376 28 83 288 170
2694 170 -181 -4 210 700 25 -497 -38 205 464 230 -394 -101 168 540 158 -66 -164 110 234 59
2714 59 -169 -353 -37 133 149 67 169 124 -109 -96 -224 188 304 -56 -526 -163 226 345 205 -428 -436 -60
2736 -60 83 80 -289 -329 -143 -76 7 -73 -8 -208 -191 -250 3 -129 -8 -320 -293 111 192 271 -202 -421 -485 -129 219
2761 219 -66 -169 -313 -77 38 -266 96 -73 54 -42 -318 -170 29 -19 -276 124 221 396 -4 -29 -358
2782 -358 -316 201 341 -3 -394 77 506 155 332 -2 -370 -102 168 315 24 10 -282 -226 -7 430 345
2803 345 325 111 -24 291 415 137 -126 -234 447 437 317 438 22 -177 28 426 119 359 -236 -44 -92
2824 -92 245 -13 -113 233 -96 -181 314 205 82 139 -18 346 589 68 -286 88 71 444 63 232 -310
$$ packed form
2672b58J89L06Qk19m5K15L18l87j43j52K51O02k42l02k17L45N2N5l48N5K05j18
2694A70l51J77K14M90o75n22M59K43K59k34o24K93K69L72l82k24r8K74J24j75
2714E9k28j84L16J70J6q2J02m5k33J3j28M12J16l60m70L63L89J19j40o33qL76
2736f0J43ll69m0J86O7Q3q0O5k00J7n9K53j32J21l12K7M04Q1P9m73k19o4L56L48
2761B19k85j03j44K36J15l04L62j69J27r6k76J48J99m8k57M00R7J75m00k5l29
2782c58M2N17J40l44l91M71M29l51J77l34l68K68K70J47k91j4k92N6K19M37q5
2803C45k0k14j35L15J24k78k63j08O81j0j20J21m16j99K05L98l07K40n95J92m8
2824i2L37k58j00L46l29q5M95j09j23N7j57L64K43n21l54L74j7L73l81J69n42
$$ plain form
2845 -310 213 -64 13 53 3 50 -257 -398 -34 55 -47 -216 40 -141 121 -254 -293 -325 -242 -107 -36 195 -98
2868 -98 -226 -208 -79 -50 -173 -271 -99 -253 -175 -292 -53 -367 -263 -297 201 227 -63 -415 -125 52 56 26 -80
2891 -80 -166 70 -15 84 -143 62 -130 -128 -500 -176 -67 226 163 -118 209 58 85 -15 7 19 257 261 260 160 -104
2916 -104 116 168 119 88 114 277 -40 438 228 299 178 224 284 221 52 206 124 217 514 329 240 132 241 71
2940 71 449 388 343 368 44 492 250 252 20 140 227 67 -315 -32 163 86 -39 143 -129 -141 10 -50 -79 -118
2964 -118 3 -382 -342 -381 -56 -27 -236 -524 -225 -51 58 -317 -106 -62 -414 151 -450 -48 46 -273 -168 -262
2986 -262 -231 -329 -219 -266 -205 -170 -416 -201 -325 -298 -306 -412 -57 -256 -478 -164 -249 -287 -323 -502 -488 -404 -128 -346
3010 -346 -273 -90 -263 -204 -153 -275 -408 -253 -449 -107 -199 175 -196 -187 27 -261 -38 -69 62 137 263 124 -250
$$ packed form
2845c10N23k77P7M0n0M7l07j41L64Q9j02j69K56j81K62l75l9l2Q3J35P1K31k93
2868i8j28J8J29K9j23r8J72j54P8j17K39l14J04l4M98K6k90l52K90J77Ml0j06
2891h0q6K36q5R9k27K05j92Kl72L24J09K93o3k81L27j51K7j00K2J2K38Mjj00k64
2916a04K20N2m9l1K6J63l17M78k10P1j21M6O0o3j69J54q2R3K97j85q9j08J09j70
2940G1L78o1m5K5l24M48k42Kk32J20Q7j60l82K83J95p7j25J82k72j2J51o0k9l9
2964a18J21l85M0l9L25K9k09k88K99J74J09l75K11M4l52N65o01M02R4l19J05r4
2986b62L1r8J10m7O1L5k46K15j24K7qj06L55j99k22L14q5l8l6j79J4Q4K76k18
3010c46P3J83j73N9N1j22j33J55j96L42r2L74l71RK14k88K23l1J31P5J26j39l74
$$ plain form
3033 -250 -126 -193 -175 26 120 -95 -49 -61 100 109 -69 197 129 6 27 26 36 -40 -80 106 122 301 143 186 332
3058 332 15 486 122 93 65 275 -86 531 172 421 82 77 301 241 210 217 306 -290 112 312 46 146 -175
3081 -175 244 560 258 317 92 30 98 30 51 6 -51 196 -58 -4 146 -329 67 -67 -49 35 -26 246 -158 -91
3105 -91 -27 210 179 -90 -115 -57 318 21 -139 -96 -161 -25 -121 6 -225 -47 -387 -17 -325 384 35 -61 -106
3128 -106 159 -27 -43 -47 -35 -119 -4 -101 -19 58 114 -118 155 -19 -14 266 -343 -130 -280 27 141 3 4 -2 -261
3153 -261 358 225 -69 80 -181 -139 223 -90 216 -11 5 198 -196 204 265 426 34 397 -47 88 145
3174 145 235 -17 290 190 -2 164 149 -16 284 122 -22 73 -26 230 8 134 -30 -23 86 260 21 170
3196 170 -68 141 208 -22 -40 28 330 526 31 355 327 248 -12 53 -177 -181 236 335 236 123 -106 -87 -121 -106
$$ packed form
3033b50J24o7J8K01R4k15M6j2J61Rj78K66o8j23K1jJ0p6m0J86J6J79j58M3J46
3058C32l17M71l64k9k8K10l61O17l59K49l39nK24o0l1PQ9n96M02K00k66J00l21
3081a75M19L16l02N9k25o2O8o8K1m5n7K47k54N4J50m75L96j34J8Q4o1K72m04O7
3105i1O4K37l1k69k5N8L75k97j60M3o5J36r6J27k31J78l40L70l08P09l49r6m5
3128a06K65j86j6mJ2q4J15r7Q2P7N6k32K73j74NK80o09K13j50L07J14j38Jok59
3153b61O19j33k94J49k61M2L62l13L06k27J6J93l94M00O1J61l92L63m44J35N7
3174A45R0k52L07j00j92J66j5j65L00j62j44R5r9K56k22J26j64PJ09J74k39J49
3196A70k38K09O7k30j8O8L02J96m95L24k8p9k60O5k30mM17R9r9j13k29J9l4J5
$$ plain form
3220 -106 196 59 0 -119 -138 96 84 -256 -216 -285 -248 209 -45 1 -420 -300 244 -88 -74 56 -232 -15 409
3243 409 138 62 -124 -18 149 234 -40 191 -309 -105 -113 -9 -140 -20 -157 -550 -89 -4 14 -181 -291 -153
3265 -153 153 -223 -38 -319 -428 -176 52 -4 50 -92 39 -7 -274 -318 423 -193 218 -33 -90 -70 64 4
3287 4 -109 236 41 394 141 -12 -123 108 287 135 -173 -42 -93 -300 97 -34 291 -61 -125 -87 274 258
3309 258 3 28 -31 402 362 145 42 4 -62 62 374 59 -19 141 330 197 203 209 31 13 -47 132 236 -64
3333 -64 -19 -84 -81 238 159 315 52 -26 140 513 -39 -282 -72 44 64 230 72 83 329 50 392 185 136
3356 136 160 122 10 -116 112 84 -1 -312 -145 -93 -5 -98 -200 -240 -10 347 -171 33 -316 129 -135 -116 -235
3379 -235 38 39 62 -63 -29 89 28 -75 -170 183 -124 289 -266 -77 -157 -12 -80 15 -174 -132 -58 -223 -89 -233
$$ packed form
3220a06L02j37n9j19j9K34j2l40M0o9L7M57k54M6m21J20N44l32J4J30k88K17M24
3243D09k71p6j86J06J67Q5k74K31n00K04qJ04j31J20j37l93M61Q5J8j95j10J38
3265a53L06l76J85k81j09K52K28n6N4j42J31m6k67m4P41o16M11k51n7K0J34o0
3287Dj13L45j95L53k53j53j11K31J79j52l08J31n1k07L97j31L25l52o4L8L61j6
3309B58k55K5n9M33m0k17j03l8o6J24L12l15p8J60J89j33OOj78j8o0J79J04l00
3333f4M5o5LL19p9J56k63p8J66L73n52k43K10J16K0J66j58J1K46k79L42k07m9
3356A36K4l8j12j26K28k8q5l11J67N2Q8r3j02m0K30L57n18K04l49M45k64J9j19
3379b35K73JK3j25L4J18o1j03r5L53l07M13n55J89q0J45o8R5j89M2P4j65J34j44
$$ plain form
3403 -233 -330 -324 92 62 -270 -151 229 179 -78 -445 -78 -40 35 -175 89 -30 -57 -112 -118 82 -186 -171 174 191
3427 191 -3 -10 100 -75 -393 156 144 1 -407 -45 -123 291 102 57 89 33 95 128 66 388 68 203 106 -137
3451 -137 157 -222 314 -171 104 -75 134 -31 -199 -3 272 41 212 129 331 212 23 -97 95 138 263
3472 263 6 -42 69 19 6 -251 255 61 -12 -81 74 -13 141 69 201 117 -199 67 142 124 -101 -5 235 -261
3496 -261 13 -16 -223 289 85 -98 -205 -74 -175 -296 -106 -464 -193 -42 155 -257 18 -207 -71 2 -251
3517 -251 -224 -35 80 63 -43 200 -333 -195 87 -266 161 55 -208 104 -18 297 48 -250 -225 -71 69
3538 69 -194 -56 -381 -94 189 59 -68 -8 37 -102 28 -4 -220 -255 -123 11 -334 -241 -1 -220 31 13
3560 13 -88 30 -48 155 -128 -137 197 -99 -47 49 44 62 -134 -104 -310 273 67 -107 -86 -112 -140 -136 -61 -8 -15 200
$$ packed form
3403b33r7OM16l0l32J19L80n0k57l67L67L8P5k10K64j19k7n5oK00k68J5L45J7
3427A91j94pJ10j75l18N49j2j43m08L62p8M14j89m5L2n6O2L3o2L22l20J35r7k43
3451a37K94l79N36m85K75j79K09j65j68J96K75k31J71q3K02j19j89j20J92M3J25
3472B63k57m8J11n0j3k57N06j94p3o9J55q7J54p2J32q4l16K66P5j8k25R6K40m96
3496b61K74k9k07N12k04j83j07J31j01j21J90l58K71J51J97m12K75k25J36P3k53
3517b51K7J89J15j7j06K43n33J38K82l53M27j06k63L12j22L15k49k98K5J54J40
3538F9k63J38l25K87K83j30j27O0M5j39J30l2k16l5J32J34l45R3K40k19K51j8
3560A3j01J18p8K03k83rL34k96N2R6nJ8j96L0k06N83k06j74K1k6k8MP5N3pK15
$$ plain form
3586 200 35 239 113 96 -124 -11 -6 -286 -236 62 -129 -97 36 73 444 44 62 -113 133 303 -150 18
3608 18 181 285 155 30 -33 27 -323 -22 124 104 78 20 162 196 165 76 8 269 52 -9 145 25 10 -118
3632 -118 -103 -13 108 -2 192 -231 115 101 118 61 -55 -35 -158 -29 185 -56 -2 72 -58 16 -164 -180 -174 23
3656 23 -92 23 -8 -81 -236 63 156 208 85 11 -37 -82 -180 -8 127 132 -107 37 -26 68 -190 -30 32 405 258
3681 258 -384 -24 -51 -73 -35 206 116 -211 121 -144 165 268 181 -152 60 -74 115 29 -127 106 182 102 222
3704 222 88 -83 -260 -19 87 361 382 256 254 398 235 112 21 339 201 -102 -76 88 -49 244 145 101
3726 101 237 236 332 71 110 -58 128 136 70 93 34 278 179 182 94 -47 -43 -54 4 -87 -227 -190 -204 -33 117 -122 72
3753 72 -209 -21 -369 1 -70 -140 67 43 -159 14 -36 -81 -197 111 -120 -274 95 -192 -156 124 329 -41
$$ packed form
3586B00j65K04j26j7k20J13Nk80N0K98j91L2J33L7L71m00J8j75K46J70m53J68
3608A8J63J04j30j25o3O0l50L01J46k0k6n8J42L4l1q9o8K61k17o1J54j20j5j28
3632a18J5R0J21j10J94m23L46j4J7n7j16K0j23J29K14k41N4P4j30P4j80j6OJ97
3656B3j15J15l1p3j55K99R3N2j23p4m8m5r8J72J35Nk39J44o3R4k58J60O2L73j47
3681B58o42L60k7k2L8K41r0l27L32k65L09J03q7l33K12j34J89q6j56K33P6q0J20
3704B22j34j71j77K41J06K74K1j26kJ44j63j23r1L18j38l03K6J64j37K93r9m4
3726A01J36jR6k61L9j68J86Qo6K3n9K44r9Lq8j41Mj1N8r1j40L7j4J71J50k39J94
3753G2k81J88l48L70p1p0K07k4k02J73n0m5j16L08k31j54L69k87L6K80K05l70
$$ plain form
3775 -41 -128 -360 -174 -45 125 -279 -418 -275 -481 196 -66 -80 63 52 -61 -176 -228 -66 104 -94 79 -55
3797 -55 -50 -130 -121 -303 -113 19 -287 102 172 139 -176 -49 -48 -48 -167 -219 26 114 49 102 111 39 -54 -81 113 -159 19
3824 19 79 -431 75 127 -50 -185 54 -31 -154 30 60 -185 330 183 334 62 17 -105 72 163 102 18 -144
3847 -144 -45 -63 -177 -42 103 323 104 -322 -176 -198 76 116 71 45 102 7 2 123 -439 133 247 -136 -90 -296
3871 -296 -135 21 -86 26 106 138 -62 -194 25 -242 -238 101 -32 -201 24 169 158 -417 -8 -281 -46 -25
3893 -25 54 23 15 -73 -24 252 -174 -159 81 44 -83 -91 44 54 -111 -5 -186 -72 -82 17 -173 38 75 -165 69
3918 69 133 -122 -233 -164 -102 233 -84 65 -213 93 295 -5 9 6 75 134 -71 -193 335 -174 362 -34 91
3941 91 171 -147 -16 327 -52 14 42 -197 99 -66 58 -124 66 -110 77 274 263 329 -362 41 213 333
$$ packed form
3775d1q7k32J86J29J70m04j39J43k06O77k62j4J43j1j13j15n2J62J70j98J73j34
3797e5Nq0Rj82J90J32l06L89P0l3l15J27J%j19n2K45Q8o5N3Rp2r3k7J94k72J78
3824A9O0n10N06N2j77j35K39q5j23J84L0k45N15j47J51k72m5j22J77R1o1q4j62
3847a44R9j8j14J35J45K20k19m26J46k2K74M0m5k6N7r5nJ21n62N72J14l83M6k06
3871b96J61J56j07J12Q0L2k00j32K19k67ML39j33j69K25J45j1n75M09k73K35K1
3893b5P9l1qq8M9K76m26J5K40l7j27qJ35J0j65J06j81J14j0R9j90K11L7k40K34
3918F9O4k55j11O9O2L35l17J49k78L06K02l00J4lO9N9k05j22N28n09N36l96J25
3941I1Q0l18J31L43l79O6K8k39K96j65J24j82J90j76J87J97j1O6o91M03J72J20
$$ plain form
3963 333 189 -116 123 348 570 -97 40 140 213 90 203 67 344 24 93 130 141 -6 -44 -41 41 50 92 150
3987 150 -16 42 -132 -152 -147 -126 -55 79 -98 188 310 -138 -98 135 101 -116 -155 -28 196 29 172 86 -8 64
4011 64 103 -243 280 -38 151 -215 -24 -58 49 110 -91 107 -152 115 235 85 -41 48 -79 -136 -320 19
4033 19 64 -153 -159 64 77 -68 291 -92 74 -244 76 -78 -362 -283 77 -31 63 108 38 88 -292 96 -201
4056 -201 -192 -232 -12 -8 -79 -38 -89 -2 -202 -271 151 -97 6 102 5 -15 116 217 275 -95 -38 136 66 -134 -187 -114
4082 -114 86 157 157 274 -24 214 15 3 10 15 126 155 -285 -1 116 119 -121 -378 -1 9 -52 -14 -131 57 163
4107 163 277 319 -73 -175 61 -187 73 -248 -82 60 -61 -67 -138 59 -101 -304 -316 131 -184 -45 -37 -250
4129 -250 163 -287 -160 -41 17 -144 19 -1 102 120 32 160 -31 17 -118 -42 -137 47 -117 97 -125 -291
$$ packed form
3963C33j44l05K39K25K22o67J37J00P3j23J13j36K77l20O9L7J1j47l8LQ2RM2N8
3987A50j66N8j74k0NK1P1J34j77K86J22m48M0K33l4k17l9J27K24j67J43q6r4P2
4011F4L9l46N23l18J89l66J91l4J07O1k01J98k59K67J20j50j26Q9j27n7j84L39
4033A9M5k17oK23J3j45L59l83J66l18L20j54k84P9L60j08R4M5p0N0l80L88k97
4056b01Rm0K20Mp1M1n1Q7k00o9M22k48J03R6r7k0J31J01N8l70N7J74p0k00n3P3
4082a14K00P1%J17k98K38j99j2PNJ11K9m40K84J17Lk40k57L77J0o1L8j17J88J06
4107A63J14M2l92j02K36k48K60l21J66J42j21op1J97j60k03j2M47l15J39Qk13
4129b50M13m50J27J19N8j61J63k0J03J8q8J28j91M8j35P6r5J84j64K14k22j66
$$ plain form
4151 -291 -174 -22 -183 -162 -131 -22 221 -10 76 -410 -51 -277 -365 -52 -264 -1 160 -51 14 -141 -8 -201
4173 -201 -13 -99 63 -46 -10 64 -187 106 198 58 -180 21 -25 218 278 94 6 -157 57 -26 36 -94 229
4196 229 -191 75 -195 -48 37 135 188 130 162 -140 21 205 225 126 87 -8 350 168 154 150 112 10 217 330
4220 330 105 -63 34 -208 -35 124 67 -91 -50 81 -148 4 41 -129 244 17 37 269 256 152 269 65
4242 65 -20 -341 -150 169 74 79 -133 79 -93 62 -133 301 -133 -82 -37 171 -97 -219 -75 39 -44 -219 -337
4265 -337 -19 5 -149 -65 -186 -32 -94 -49 -24 107 -584 27 136 -40 77 1 -105 -51 -243 -163 -186 -43 202
4288 202 139 138 -145 30 91 72 -135 -123 41 -21 -40 305 327 243 168 -297 -90 23 -150 -335 -65 94 -207 41
4312 41 17 80 74 -24 128 118 36 77 -126 384 -318 67 -145 314 -66 16 75 -342 -85 -8 -75 106 -65 -119 -27
$$ packed form
4151b91J17J52j61K1L1J09K43k31Q6m86L59k26q8L13k12K63J61k11O5j55J33j93
4173b01J88q6J62j09L6P4k51K93R2j40k38K01m6K43O0j84q8j63K14q3O2j30L23
4196B29m20K66k70J47Q5R8N3n8L2l02J61J84K0r9l9r5L58j82j4ml8j02K07J13
4220C30k25j68R7k42J73J59n7j58M1J31k29J52L7j70L73k27K0K32j3j04J17k04
4242F5q5l21J91L19r5Nk12K12j72J55j95M34m34N1M5K08k68j22J44J14q3j75j18
4265c37L18K4j54Q4j21J54o2M5K5J31o91O11J09j76J17p6j06N4j92Q0k3J43K45
4288B02o3jk83J75O1j9k07J2J64o2j9L45K2q4p5m65K07J13j73j85K70J59l01K48
4312D1k4O3or8J52j0q2M1k03N10p02L85k12M59l80Q2N9m17K57P7o7J81j71n4R2
$$ plain form
4337 -27 18 188 210 219 85 136 32 143 -101 19 -98 3 349 -105 -54 -35 164 -87 1 221 115 175 -77
4360 -77 -137 41 45 -54 108 -66 82 149 -18 -28 76 -11 -62 -27 -70 165 101 -197 122 -120 92 41 219 57
4384 57 64 42 -115 3 -126 105 -112 -169 -116 48 143 209 -28 -1 -70 100 41 -325 -161 -63 173 -236 -176 170
4408 170 -111 -95 163 -63 -316 -216 -54 -55 -117 -4 -141 125 -202 21 -242 141 -178 -99 -193 -9 -113 -14
4430 -14 42 -47 -188 127 -77 110 -136 -254 37 -278 241 -243 138 271 -79 10 100 26 -102 -47 338 151
4452 151 58 25 -69 138 22 146 134 228 235 147 -2 59 217 -116 -41 159 -110 -176 164 -214 141 343 74 5
4476 5 -30 56 -27 70 59 87 84 -271 45 285 -59 112 337 200 176 169 135 38 -21 -8 85 -53 182 131 -251 264
4502 264 97 58 57 -199 71 -309 63 187 312 72 -40 -75 -103 -174 119 -11 -48 293 162 -149 -291 -172
$$ packed form
4337b7M5J70K2Rj34N1j04J11k44J20j17J01L46m54N1J9J99k51Q8K20j06O0k52
4360g7o0J78Mr9J62j74J48O7j67j0J04q7n1L5m3K35o4k98L19k42K12n1J78j62
4384E7Pk2j57J18j29K31k17n7N3J64R5O6k37K7o9J70n9l66J64R8K36m09O0L46
4408A70k81J6K58k26k53J00J62jo2J13j37K66l27K23k63L83l19P9r4J84j04R9
4430a4N6q9j41L15k04J87k46j18K91l15N19m84L81J33l50Q9R0p4j28N5L85j87
4452A51r3l3r4K07j16J24j2R4Pq8j49O1J58l33P5K00k69o6L40l78L55K02k69o9
4476El5Q6q3R7j1K8ll55L16K40l44J71K25j37k4pl4r7n9J3R3j38K35n1l82N15
4502B64j67l9jk56K70l80L72J24J25k40j12l5k8p1K93j30l7L41j31l11j42J19
$$ plain form
4524 -172 151 124 113 -128 -85 -157 58 -36 -50 -38 -57 -124 -224 -368 214 -66 -82 -98 104 26 30 -122 -335 42 -21
4549 -21 29 -33 336 -134 -56 -82 8 -34 -140 90 120 -178 209 -10 -112 123 -77 114 94 178 -143 -384 -167
4572 -167 -334 -101 193 -54 96 182 78 78 25 -80 -9 -152 269 -65 -84 -22 -198 -94 -11 178 -116 176 235
4595 235 -206 339 292 141 76 -39 337 15 -35 -135 30 71 -53 160 -131 159 -98 227 -28 139 122 430
4617 430 -18 84 212 -103 119 438 82 -45 58 -64 -148 -5 -120 -164 18 -42 -131 -4 120 -4 -287
4638 -287 -60 99 19 -281 -46 -118 167 -38 -92 20 -42 166 21 -95 -104 120 -113 -56 175 -223 -122 46
4660 46 31 -225 12 167 80 7 -136 -235 363 17 -357 45 -268 -107 -121 -19 -349 145 -169 -129 263 -88
4682 -88 84 -21 -123 185 241 65 165 -75 128 31 -177 17 172 -200 1 72 68 -158 -116 -118 -254 112 -160
$$ packed form
4524a72L23k7j1k41M3p2K15r4j4J2j9o7j00j44N82k80j6j6K02p8Mj52k13L77o3
4549b1N0o2L69m70P8k6R0m2j06K30L0k98L87k19j02K35k00J91k0Q4l21k41K17
4572a67j67K33K94k47J50Q6j04%n3j05P1j43M21l34j9O2j76J04Q3J89k94K92N9
4595B35m41N45m7j51o5j15L76l22n0j00J65M1j24K13k91K90k57L25k55J67j7L08
4617D30m48J02J28l15K22L19l56j27J03j22q4J43j15m4J82o0q9J27J24j24k83
4638b87K27J59q0l00K35p2K85k05n4J12o2K08j45j16rK24k33N7K31l98J01J68
4660D6j5k56K37J55q7p3j43r9N98l46l74M02l13J61j4J02l30M94l14M0L92l51
4682h8J72j05j02L08N6j76J00k40K03r7k08J94J55l72K01P1mk26M2kj36L66k72
$$ plain form
4705 -160 -260 8 -327 -49 92 -104 -1 11 316 190 -160 121 159 -209 23 -231 165 135 110 19 149 -10
4727 -10 78 -20 -113 -176 96 164 -58 130 108 251 -42 -89 -64 338 -272 3 -120 126 -42 153 -118 -291 -68
4750 -68 -333 -120 -228 58 79 211 178 19 120 -96 -103 132 150 233 59 -86 246 120 -99 -180 -30 -136 -173
4773 -173 -48 17 -548 -118 -116 -108 -14 72 -54 96 -108 -88 1 -94 -37 -162 -211 -47 -138 5 205 -6 212 -49
4797 -49 -31 76 -234 230 -32 -97 16 -64 145 -219 -216 -296 -43 256 -32 339 152 -314 85 73 -87 -73 -89
4820 -89 -127 -244 -29 -9 30 -41 -314 177 64 -201 118 11 -357 -174 1 -120 -30 -32 -45 56 133 14 -154
4843 -154 200 -63 -197 103 -16 -21 -30 229 -114 170 -171 304 408 -193 -48 57 312 97 99 50 -104 166
4865 166 83 -105 -101 -31 154 257 292 -178 -214 75 181 -284 -107 32 18 -47 237 -83 -233 175 357 137 -63
$$ packed form
4705a60j00K68l35K78J41j96J03J2L05j26l50K81L8l68K32k54L96l0k5r1J30j59
4727a0Q8r8r3o3K72O8k22J88k2J43k93m7K5M02o10K75j23K46j68J95k71j73K23
4750f8k65K13j08K86K1J32l3j59J01k16pK35J8Q3j74j45L32j26k19q1J50j06l7
4773a73J25O5n65M30KQR4Q6j26J50k04K0Q9r5N7j25m9J64r1J43K00k11K18k61
4797d9J8J07l10M64k62o5J13q0K09l64Lq0K53K99k88L71j87m66L99j2j60J4j6
4820h9l8j17K15K0L9p1k73M91j13k65L19j07l68J83J75j21R0kj3J01P7j19j68
4843a54L54k63j34L00j19nrK59l43K84l41M75J04o01J45J05K55k15Km9j54K70
4865A66q3j88MP0J85J03L5m70l6K89J06m65J77J39j4o5K84l20j50M08J82k20k00
$$ plain form
4888 -63 -26 -72 309 -57 120 255 -114 279 142 -20 -116 -58 -68 -244 23 83 -38 188 -104 -86 261 -162 -108
4911 -108 -53 24 182 -326 -162 -82 30 50 102 233 -225 22 -27 -173 91 58 160 96 280 -140 114 -213 -251
4934 -251 -147 -38 -249 -223 -34 438 -26 -116 -78 -172 171 -95 425 -143 68 -80 -203 -310 27 -105 229
4955 229 119 -92 12 128 -121 -204 42 110 -187 181 -106 7 163 -247 -244 160 -174 76 -61 4 265 306
4977 306 85 -219 432 -266 -83 69 18 322 72 -188 21 75 229 -229 -147 181 -15 -78 340 31 166
4998 166 -151 -197 14 122 298 82 -135 -275 -93 5 137 119 36 -20 41 33 -169 -94 -74 12 201 141 -54 -15
5022 -15 -188 113 54 -63 -84 -287 -83 125 -164 -17 166 14 245 51 248 -168 -102 -10 33 -12 -209 -35
5044 -35 -222 165 136 -243 115 -203 -79 -82 -237 160 -175 64 -186 -144 -70 -181 -35 -32 202 7 -195 19 53
$$ packed form
4888f3L7m6L81l66J77J35l69L93j37j62r6N8j0j76K67O0j21K26k92J8L47m23N4
4911a08N5P7J58n08J64Q0J12K0N2J31m58K47m9j46K64l3J02o4J84m20K54l27l8
4934b51J04J09k11K6J89M72m64r0L8r4L43k66N20n68K11j48j23j07L37j32L34
4955B29j10k11J04J16k49q3K46O8k97L68k87J13J56m10LM04l34K50j37O5K61M1
4977C06k21l04O51o98J83J52n1L04k50k60K09N4J54m58Q2L28j96o3M18l09J35
4998A66l17m6K11J08J76k16k17j40J82R8J32j8q3n6O1qk02P5K0Q6J89o0j95L9
5022a5j73L01n9j17k1k03K04K08k89J47J83j52K31j94J97m16O6R2M3m5j97J74
5044c5j87L87k9l79L58l18J24lj55L97l35K39k50M2P4j11J46LK34j95k02K14L4
$$ plain form
5067 53 -5 -164 305 207 19 -213 -104 -328 107 212 8 -53 52 -77 -124 207 -235 136 24 43 315 51
5089 51 -126 -16 -111 -69 97 163 -15 150 58 141 111 -201 116 -84 203 149 18 2 -41 -311 97 97 -40 -246
5113 -246 -7 -15 259 209 4 -21 275 118 -140 -188 -180 145 14 -44 -22 -132 35 22 -232 142 -4 -9 -25 6 80
5138 80 110 336 24 10 6 277 -131 -9 377 101 -183 -296 -102 -67 326 96 -193 23 -26 23 -192 -144 -25
5161 -25 -14 -122 250 -75 -153 -38 -218 -133 -46 -145 -1 -74 -138 158 142 -50 -212 201 -10 -164 -200 -319 -43
5184 -43 -16 -1 -130 157 -9 126 136 -318 -194 44 -133 132 112 -200 -195 -110 119 -89 35 -106 119 -73 -228
5207 -228 -28 45 212 -7 162 -102 -156 72 5 -105 -9 -82 2 -84 145 -143 135 91 200 103 1 20 -133
5230 -133 184 61 -47 -311 -43 -25 223 -149 -139 169 -160 258 -165 105 350 35 63 186 43 429 -165
$$ packed form
5067E3n8j59M69r8j88k32J09k24M35J05k04o1J05j29m7L31m42L71j12J9K72k64
5089E1j77J10r5M2J66O6j78J65r2Q3l0l12L17k00K87n4j31j6m3k70M08%j37k06
5113b46K39qK74n0k05k5K96j57k58m8QL25j31n8K2j10J67j3k54L74j46nj6L1P4
5138H0L0K26l12j4mK71m08J22L86k76k84j13J94L5L93k30k89K16m9M9k15M8J19
5161b5J1j08L72l25p8J15j80Q5Q7r9J44p3o4K96j6j92j62M13k11j54l6j19K76
5184d3K7J5j29K87j66J35J0m54J24K38j77K65k0l12NQ5K29k08J24j41K25j92j55
5207b28K00P3J67k19J69k64n4K28o7j10R6p3Q4q6K29k88K78m4J09r7j02J9j53
5230a33L17j23j08k64K68J8K48l72J0L08l29M18m23K70K45l15K8J23j43L86n94
$$ plain form
5251 -165 -11 136 -38 132 40 -271 -95 -21 -63 -88 136 113 77 261 36 -214 24 -71 -69 349 140 -84 90
5274 90 -226 141 213 77 19 117 4 -33 34 -4 -48 145 -65 -140 -140 -116 96 300 64 62 -92 -188 -85 -250 -86
5299 -86 -194 -247 -259 172 -188 -37 -142 69 179 -231 80 183 -169 21 -81 7 -36 -66 80 118 -86 158
5321 158 -197 -124 179 78 -51 -91 -124 183 -90 -131 123 -21 151 -254 -30 -8 -171 -28 39 107 36 -19 83
5344 83 111 -162 -208 -109 -17 197 92 -65 -172 -141 -17 43 -312 113 -45 228 -53 -125 92 -204 -128 -30 264
5367 264 174 -121 -70 320 79 140 73 0 -142 95 109 26 45 44 27 431 120 148 92 -473 270 39 -299 152
5391 152 -26 293 -202 195 -141 236 42 -15 134 -116 73 -63 51 -199 338 -78 26 -135 44 163
5411 163 -145 -195 162 226 202 -168 117 178 -443 52 179 38 -109 -81 -142 -121 108 -159 -77 103 138 -208 -94
$$ packed form
5251a65J54J47j74J70r2l11J76P4m2k5K24k3l6J84k25k50K38r5KM18k09k24J74
5274I0l16L67P2j36n8R8j13l7O7l8m4J93k10p5%K4K12K04k36kj54r6J03j65J64
5299h6j08n3j2M31l60J51j05K11J10m10L11J03l52J90j02Q8m3l0J46L8k04K44
5321A58l55P3L03j01j29m0l3L07k73m1K54j44J72m05K24K2j63J43O7O8p1n5J02
5344H3K8k73m6R9R2K14j05j57j07L1J24O0l55M25j58K73k81p2K17k96P6R8K94
5367B64r0k95N1L90k41O1o7p3j42K37J4q3J9jj7M04l11K8n6n65P43k31l38M51
5391A52j78L19m95L97l36L77j94n7J49k50J89j36J14k50N37m16J04j61J79J19
5411A63l08n0L57O4k4l70K85O1o21M95J27j41j47K8o1K1K29k67Q2J80L5l46J14
$$ plain form
5434 -94 140 288 -40 -24 -114 -48 78 60 173 20 139 -47 147 156 232 179 -320 -266 1 -39 -111 34 -190 31
5458 31 -15 169 360 -475 -226 -143 -174 -273 -87 86 -219 -172 -5 51 152 -16 -258 -19 111 221 153 -257 108
5481 108 100 -573 -44 29 -151 52 -197 42 -79 -212 96 50 -114 13 -345 76 -70 -157 -329 107 161 -50
5503 -50 159 -9 255 -57 36 92 163 304 68 60 208 54 188 -93 50 54 140 9 96 -167 215 109 -151
5526 -151 145 302 -127 274 52 72 166 -207 -180 -119 90 139 106 141 164 -144 -41 191 28 52 -66 165 92
5549 92 -11 7 104 -36 144 116 141 160 171 -201 185 -101 -61 -240 -25 138 -19 -147 -257 16 -200 -3 -187
5572 -187 -164 228 -13 36 -188 72 151 150 -208 -268 27 -56 129 -113 10 216 135 62 -131 -174 -6 -328 161
5595 161 -266 -126 -422 230 -181 -67 193 -100 93 -242 343 -104 163 189 367 41 -74 207 -107 6
$$ packed form
5434i4K34J48l28J6r0O6J26j8J13j53J19j86J94RP6n3m99N4K67m0p2J45k24K21
5458C1m6J84J91q35K49Q3l1r9J86J73l05M7J67N6J01j68k42K39J30J10o8m10L65
5481A08qo73N29P3j80K03k49K39j21j33L08m6j64J27l58M21j46q7j72M36N4k11
5503e0K09j68K64l12R3N6P1J41k36qJ48j54J34k81J43MQ6j31Q7k63L82j06k60
5526a51K96J57m29M01k22K0R4l73K7O1K09M9l3L5K3l08J03K32j63K4j18K31p3
5549I2j03J8R7j40J80k8K5J9J1l72L86k86M0j79K15J63j57j28j10K73k16J97j84
5572a87K3L92k41M9k24K60P9jl58o0K95q3J85k42J23K06q1p3j93m3J68l22M89
5595A61m27J40k96O52m11J14K60k93J93l35N85m47K67K6J78l26j15K81l14J13
$$ plain form
5615 6 -77 33 34 229 180 158 -23 -307 223 93 175 61 17 54 100 279 191 -171 -57 38 3 529 -151 215 -10
5640 -10 110 -137 130 43 45 -149 305 -32 123 -65 376 228 147 -133 -68 -12 -415 21 -101 -154 131 22 -270
5663 -270 35 -18 343 -143 4 -73 -202 -43 -80 -182 137 -83 298 8 -338 -51 133 -115 100 -248 38
5684 38 -51 -17 92 -20 -20 37 296 -261 -35 74 234 -87 53 111 354 -55 168 -27 -18 -169 -137 -218 142 58
5708 58 191 96 -392 -220 20 283 80 -38 11 -296 80 95 -194 112 93 -150 -203 56 20 -287 -108 -107 63
5731 63 -46 55 -140 104 48 -19 -42 -59 14 153 -29 -167 16 30 338 249 -50 -242 214 85 135 -47 27
5754 27 -29 113 112 25 -131 31 228 -1 -4 -141 -80 124 159 -27 -219 79 -193 -237 -139 72 238 347 81 -35
5778 -35 -7 26 81 -58 316 259 82 -198 70 -294 1 175 195 121 -27 43 -32 184 -270 -59 23 97 208 -26
$$ packed form
5615Fq3J10JJ95m9k2j81k84N30j30Q2j14m4L7M6J79q8l62J14R5l5N26o80L66k25
5640a0J20k47K67q7Kj94M54l37J55j88M41j48q1k80O5N6m03M36j22n3K85j09k92
5663b70L05n3L61m86J47p7j29J59l7j02L19k20L81k90l46K87J84k48K15l48K86
5684C8q9L4J09j12%N7K59n57K26J09J60l21J40N8K43m09K23j95Rj51L2q1L60q4
5708E8J33r5m88J72K40K63k03j18M9l07L76J5k89L06j9k43n3K59l6l07J79JJ70
5731F3j09J01j95K44n6o7k3j7P3J39j82j38J83J4L08q9k99j92M56j29N0j82P4
5754B7n6J42jq7j56J62J97k29lj37O1K04L5j86j92K98k72m4R8K11J66J09k66j16
5778c5K8L3N5j39L74n7j77k80K68l64K95J74K0p4j48P0p5K16m54K11Q2P4J11k34
$$ plain form
5802 -26 18 -13 -225 -301 106 231 -274 -11 -75 -253 248 43 -201 -6 90 143 25 194 -88 132 -92 203
5824 203 -294 -163 75 -120 65 7 212 -100 6 84 104 -66 285 66 -111 -16 -82 140 122 125 65 -105 -206
5847 -206 16 -256 141 26 57 -36 46 -27 -318 -248 -101 41 -231 102 -23 47 -136 53 -4 166 -56 270
5869 270 -179 -473 69 230 -85 136 -8 30 -134 -113 85 -167 -100 51 -135 157 96 60 -261 201 54 -56
5891 -56 205 -181 -93 187 -24 127 -89 -202 180 82 133 -111 148 165 -110 250 -21 -129 252 -111 40 237
5913 237 107 59 -252 -39 108 39 94 103 65 -17 -49 -174 -97 -109 -32 91 113 -87 188 95 -14 180 -84 10 -21
5938 -21 183 -363 -109 48 -194 -44 -37 16 -8 157 -28 -221 -92 5 108 -83 260 181 -162 -61 -26 -217 -166
5961 -166 -16 -176 43 -18 -113 -224 2 -161 -47 170 40 152 42 -152 29 -19 12 96 -316 -119 163 -256
$$ packed form
5802b6M4l1k12p6M07J25n05K63o4j78N01k05k44J95R6N3j18J69k82K20k24K95
5824B03m97J31K38j95J85n8K05l12J06P8K0j70L51k19j77R5o6K22j8Lo0j70j01
5847b06K22k72L97j15L1r3Q2p3k91P0J47J42k72L33j25P0j83J89n7J70k22L26
5869B70m49k94N42J61l15K21j44L8j64K1J98k52O7J51j86K92o1l6l21M62j47j10
5891e6K61l86Q8K80k11J51k16j13L82r8N1k44K59J7k75L60k71j08L81l63J51J97
5913B37j30m8l11K13J47o9N5Rl8q2l2j25P7j2P7J23K2k00K75r3j09J94k64R4l1
5938b1K04n46K54J57k42J50PN3k4J65j85j93J29R7J03j91L43p9l43J01L5j91N1
5961a66J50j60K19o1r5j11K26j63J14K17j30J12j10j94J81m8L1Q4m12J97K82m19
$$ plain form
5983 -256 316 -75 136 38 183 -200 38 -38 130 5 62 -235 -14 92 -171 -4 -28 -37 41 124 34 159 -32
6006 -32 58 -175 -73 -294 -45 -44 -93 352 300 219 -156 188 53 54 237 250 111 -33 100 -98 -116 -146 -62 -44 -127
6031 -127 110 134 -112 89 -254 -165 79 164 -66 69 363 184 -43 -125 55 -36 24 371 186 -198 0 93
6053 93 54 23 4 -133 157 -67 287 373 -188 108 -218 83 -140 249 7 -135 -114 -75 70 -52 -63 210 73
6076 73 -207 254 -254 -252 106 188 -43 -219 -125 88 94 -124 -171 -61 -134 -38 -9 -21 -57 -39 163 -69 130 -177 45
6101 45 -181 10 92 -143 -100 259 -88 -139 -168 -9 -232 149 -270 -58 161 -46 175 70 -45 -41 54 57 -61
6124 -61 139 -65 -99 -325 -1 138 -41 169 50 -166 -199 -276 -118 -79 76 -44 54 237 73 -158 -108 91
6146 91 -170 -19 255 -94 62 -205 -13 -97 171 42 -193 -144 99 -306 403 210 -110 -11 -78 -80 -192 95
$$ packed form
5983b56N72l91K11r8J45l83K38p6J68j25N7k97K21J06k63J67k4rP8Q3r0J25j91
6006c2R0k33J02k21K49Jm9M45n2q1l75L44j35JJ83J3j39j44J33j98j8l0Q4J8q3
6031a27K37K4k46K01l43Q9K44Q5k30J35K94j79k27q2J80r1O0L47j85l84J98R3
6053I3l9l1j9j37K90k24L54Q6n61K96l26L01k23L89k42j42K1L9J45j22j1K73j37
6076G3k80M61n08KL58Q2k31j76R4K13Ok18m7J10p3R6K9j2l6J8K02k32J99l07K22
6101D5k26J91Q2k35M3L59l47n1k9J59k23L81m19K12K19k07K21j05j15MR5Lj18
6124f1K00k04l4k26L24J39j79K10j19k16l3p7J58L9J55j20R8J83j64k31N0J99
6146I1k61J51K74l49J56k67J92q4K68j29k35M9K43m05P09j93l20R9o7kj12K87
$$ plain form
6168 95 106 193 136 267 81 -173 408 541 257 -24 224 202 204 209 -51 85 -381 -118 355 44 -97 113 -96
6191 -96 -70 17 106 -250 72 -58 77 29 -227 46 84 -16 176 96 -269 182 -51 -211 339 -134 163 -212
6213 -212 -64 -155 13 -35 132 -34 283 -92 -124 96 -95 30 -270 -176 176 162 -102 138 -20 238 318 53
6235 53 -96 14 -14 127 -46 -97 -89 -18 -131 216 76 -148 -34 22 -239 -89 27 -195 -127 -191 356 309 -31
6258 -31 114 -71 -187 126 93 63 -112 274 46 204 79 40 -111 67 178 -50 84 80 65 38 -97 -116 -25
6281 -25 60 37 3 378 58 25 108 124 -208 -251 162 -52 -148 -307 -99 -46 41 70 -92 -7 -172 -40 103 57 19
6306 19 180 -57 190 -98 208 -104 -288 -180 15 336 83 -62 -147 56 124 144 -36 -176 250 42 -93
6327 -93 18 312 -3 -94 -4 401 104 -58 129 -94 -129 -37 114 -17 -45 -183 165 -254 -34 -272 260 -147
$$ packed form
6168I5J1Q7n7J31j86k54N81J33k84k81K48k2KNk60J36m66K63M73l11j41K10k09
6191i6K6Q7Q9l56L22j30J35m8k56K73L8j00J92q0l65M51k33j60N50m73K97l75
6213b12J48r1J68m8J67j66L17l75l2K20j91J25l00R4L52j4k64K40j58K58Q0k65
6235E3j49J10k8J41j73n1QP1j13L47j40k24J14N6k61J50J16k22O8o4N47m7l40
6258c1J45j85j16L13l3l0j75L86k28J58j25l9j51J78J11k28J34mj5k7j35j9R1
6281b5Q5k3l4L75l20l3Q3J6l32m3M13k14r6j59K08N3Q7K9j62Q5j65J32J43m6l8
6306A9J61k37K47k88L06l12j84J08J95L21k53j45q5K03O8K0j80j40M26k08j35
6327i3J11K94l15r1R0M05k97j62J87k23l5R2J51j31k8j38L48m19K20k38N32m07
$$ plain form
6349 -147 -173 -136 172 31 58 137 54 37 -25 8 68 223 -285 98 146 31 -222 -41 -193 25 -104 185 -64
6372 -64 72 -87 73 -173 -103 -46 72 141 -3 -163 -60 207 -22 -25 46 -327 40 154 193 -121 445 38 -31
6395 -31 208 -167 -238 226 48 141 174 -32 7 202 38 -5 3 245 300 30 132 102 -127 93 -112 -65 179 -23
6419 -23 -65 260 238 -57 -216 -89 136 -42 -133 -110 -239 216 181 -303 -103 -48 29 -68 -84 -79 88 -79 202 -70
6443 -70 -162 52 127 -44 54 -87 152 -10 106 -83 -377 97 175 -41 101 63 152 105 69 -145 223 -184 -113
6466 -113 206 24 -245 -34 -137 148 107 -84 -62 -279 163 -102 -192 -7 -391 -24 -222 -130 -217 -56 -36 -263
6488 -263 152 239 -96 139 -208 -106 201 -2 -150 53 -188 132 24 -142 223 118 -169 -31 -110 -17 69
6509 69 163 296 -162 -88 156 158 320 197 -252 -202 232 -78 301 120 -74 -184 161 -167 -34 -165 350 79
$$ packed form
6349a47k6L7L08j41K7P9q3j7o2L3O0J55n08L83M8j15k53J81j52K18j29K89k49
6372f4J36j59J60k46P0N7J18O9j44j60J03K67k29lP1l73L67J14L9l14N66m07o9
6395c1K39l75p1M64j78R3L3k06L9J95j64m3QK42N5k70J02l0k29K20k05M7K44k02
6419b3m2L25k2k95j59J27K25j78r1K3j29M55l5m84K00N5P7r7j6NJ67j67K81k72
6443g0r2K14P5j71R8j41K39j62J16j89k94M74P8k16J42l8Q9m7l6k14L68m07P1
6466a13L19j82k69K11j03K85m1j91K2k17M42k65r0J85l84L67j98R2q7J61K0k27
6488b63M15Q7l35K35l47J02L07k03j48K03k41L20j08j66L65j05k87J38p9R3Q6
6509F9R4J33m58P4K44KJ62j23m49N0M34l10L79j81j94j10L45l28J33j31N15k71
$$ plain form
6531 79 -8 52 -96 41 128 -148 31 91 -84 14 152 220 -93 -225 20 71 -88 295 -98 244 -88 147 99
6554 99 141 15 -160 40 -292 79 152 -13 63 187 49 -32 116 -67 14 265 38 19 -46 36 -159 -81 305
6577 305 93 168 -180 -106 -81 -198 -184 -120 57 106 -74 161 158 -20 117 11 -58 204 28 -353 -168 -132 -76 55
6601 55 126 86 -189 -140 -5 -6 124 -206 210 -58 -105 -17 14 -91 -135 -207 -75 -11 195 -27 70 -50 -224 -213 35
6626 35 70 241 193 -97 -14 202 -58 117 75 -6 -217 169 67 -6 74 -33 135 -168 242 -46 -121 106 -16
6649 -16 68 19 175 -70 23 -55 -269 127 45 -53 8 -245 167 50 106 44 75 -49 119 281 89 82 -92 59
6673 59 170 85 197 57 -124 -15 -206 173 147 -175 325 103 -210 42 -282 -149 47 -120 295 -91 -24
6694 -24 -195 -16 107 13 -218 -33 227 -52 -33 55 90 -71 -121 -185 -399 49 -297 -96 -22 -255 -112 -257 105
$$ packed form
6531G9q7O0j48J37Q7k76J79O0j75R8J38O8l13j32K45N1j59L83l93L42l32K35m8
6554I9M2j26j75K00l32L71P3j65P6J24j38q1J48j83Q1K51k27j9o5Q2j95P8L86
6577C05k12P5l48P4K5j17J4O4J77M9j80K35lj78J37j06o9K62j76l81J85L6N6J31
6601E5P1m0k75M9J35jJ30l30M16k68m7Q8L1j05m4p2J32O4K06k22R7j20j74J1K48
6626C5L5J71m8k90Q3K16k60J75m2q1k11L86j02p3Q0j07J68l03M10k88p5K27j22
6649a6Q4m9J56k45R3p8k14L96q2r8O1k53M12j17N6o2L1j24J68J62j92pj74J51
6673E9J11q5J12j40j81J09j91L79k6l22N00k22l13K52l24J33J96j67M15l86O7
6694b4j71J79J23r4k31J85K60k79J9Q8L5j61n0o4k14M48l46K01P4k33J43j45L62
$$ plain form
6717 105 -60 -225 -308 -179 37 74 -11 15 -154 -92 -102 -20 137 337 -343 -52 -202 -81 58 76 -82 -270 81
6740 81 -65 -166 -130 34 -26 96 108 -1 -348 145 -165 -213 149 83 -91 72 48 -67 -208 -238 -69 21 58
6763 58 -158 318 77 110 104 20 -24 -15 52 -176 -16 205 -178 -49 -18 -88 48 188 71 -98 -83 48 -222 138
6787 138 -180 111 104 16 2 -125 -23 -164 -153 62 -33 -177 152 71 6 52 -81 -91 125 80 72 51 -15 -115 -153
6812 -153 225 106 -46 -89 -15 140 213 328 330 -66 -107 137 -25 -73 25 -92 -126 50 37 0 259 -279 -148 -62
6836 -62 -280 32 -64 -76 19 188 -294 -44 -159 -126 133 -91 195 116 -88 -47 149 177 -236 10 -46 492 102
6859 102 -138 54 175 -82 183 64 192 -22 -81 90 -34 -174 81 -35 -116 100 -58 21 154 -295 -10
6880 -10 -289 1 -318 96 203 -84 281 -179 8 88 155 -40 -5 -6 163 206 190 94 -76 -100 -25 173 -33 257
$$ packed form
6717A05j65j65q3J29K16L7q5K6j69O2j0Q2J57K00o80K91j50J21J39J8j58j88L51
6740H1j46j01L6J64o0J22J2j09l47M93l10m8L62o6j74J63k4j15j41l0J69R0L7
6763E8k16M76k41L3oq4m4RO7k28J60K21l83J29L1p0J36J40j17j69J5J31k70L60
6787A38l18K91pq8j4j27J02j41J1K15r5j44L29q1o5M6j33j0K16m5qk1o6j00l8
6812a53L78j19j52m3P4J55P3J15Kl96m1K44j62m8R8j17l4J76j3l7K59n38J31Q6
6836f2k18L12r6j2R5J69m82K50j15L3K59k24K86p9k04M1J96K8m13K46n6N38l90
6859A02k40J92J21k57K65j19J28k14n9J71j24j40K55j16q1K16j58P9J33m49K85
6880a0k79K90l19M14J07k87L65m60J87Q0O7j95L5jJ69M3j6r6j70k4P5J98k06K90
$$ plain form
6904 257 87 -154 -167 -53 -11 46 62 16 122 -165 81 -77 -189 310 138 34 20 -102 22 93 69 -135 -452
6927 -452 18 -91 -133 203 126 331 -189 292 -9 -125 15 233 234 149 -287 -239 -169 -179 -251 8 45 56 293 -210
6951 -210 312 152 94 141 -111 -82 48 -443 24 -78 -106 -110 46 -179 286 -52 6 8 30 47 -87 -100 130 -127
6975 -127 202 64 -87 285 63 -172 302 -87 65 83 169 122 -78 -27 3 40 -216 -62 3 25 -7 336 -105
6998 -105 -5 -231 279 132 -3 86 -389 37 24 43 284 91 117 29 -46 -107 45 194 -60 -14 366 -264 -75
7021 -75 96 -114 46 -64 -107 -13 119 -151 304 94 101 205 -185 148 185 134 197 219 -264 -30 -123 198 -40
7044 -40 -40 -172 29 59 86 -82 -116 247 227 -158 -96 350 -30 120 176 248 90 211 -63 -19 -64 -310 118 -282
7068 -282 -126 173 58 139 -168 -12 273 -62 204 -23 -49 157 -118 -7 91 -148 -269 -122 34 -23 10 112
$$ packed form
6904B57j70k41j3J14M2N7J6m6J06k87K46j58j12M99j72j04j4j22J24P1k4k04l17
6927d52M70j09m2L36p7K05n20M81l01j16J40K18Jq5m36M8P0j0p2K59L7J1K37n03
6951b10N22j60n8M7k52K9J30m91M67j02k8mJ56k25M65l38N8KK2J7j34j3K30k57
6975a27L29j38j51L72k22k35M74l89J52J8Q6m7k00N1L0L7k56J54O5K2l2L43m41
6998a05J00k26N10j47j35Q9m75M26j3J9K41j93K6q8p5o1J52J49k54M6L80o30J89
7021g5J71k10J60j10m3R4J32k70M55k10PJ04l90L33L7n1O3K2m83K34r3L21k38
7044d0%j32K01L0K7j68l4L63k0l85O2M46l80J50N6P2j58J21k74M4m5k46M28m00
7068b82J56K99j15Q1l07J56K85l35K66k27k6K06k75J11R8k39j21J47J56n7L3J02
$$ plain form
7090 112 69 -200 -131 82 190 197 -3 16 -14 -73 -412 36 -153 -411 -85 -104 71 -19 -78 42 -15 -26 -74 70
7114 70 -60 122 -170 -143 -1 -183 111 -123 -22 15 -352 -290 -370 123 251 -119 174 13 131 101 85 187
7136 187 -22 76 33 24 -48 139 18 -226 -5 15 6 -227 277 -189 -138 28 77 98 -154 -76 -124 -224 -8 -61 -369
7161 -369 -125 107 -199 -20 -273 105 -36 -181 148 -157 128 74 202 77 186 -41 -299 64 90 -266 85
7182 85 -60 22 69 -39 170 -6 -186 -71 159 66 -183 -28 41 162 -11 -339 73 -84 -107 208 -123 -167
7204 -167 -38 31 -171 -77 85 140 154 12 24 182 -138 -191 214 -29 -4 271 -23 125 -24 128 71 15 -32
7227 -32 -46 299 27 -153 162 -52 196 -138 175 111 -13 -93 -253 -216 -38 69 -60 -302 20 -227 -48 -109
7249 -109 193 -112 21 -125 -131 0 46 56 58 105 87 193 136 -164 -49 -193 27 -29 102 203 32 39 68 258
$$ packed form
7090A12m3k69O9K13J08Pk00J9l0n9l39M48j89k58L26j9J75r0n9J20n7j1m8J44
7114G0j30J82k92K7J42j82K94k34J01L7l67O2q0M93J28l70K93j61J18l0j6J02
7136A87k09R8m3rp2J87j21k44K21K0rk33N04m66N1J66M9K1k52P8m8j00K16n3l08
7161c69K44K32l06J79k53L78j41j45L29l05K85n4J28j25J09k27k58L63K6l56L51
7182H5j45Q2M7j08K09j76j80J15K30r3k49J55O9J21j73l28M12j57k3L15l31m4
7204a67J29O9k02R4J62N5J4j42J2J58l20n3M05k43K5K75k94J48j49J52n7n6m7
7227c2j4L45k72j80L15k14K48l34L13o4j24q0j60L7J78J07j29k42L22k47J79o1
7249a09L02l05J33j46oJ31M6J0KM7j8J06n7l00J15j44K20n6J31J01j71PK9J90
$$ plain form
7273 258 -80 110 -39 118 136 -114 -83 23 233 -187 114 -234 -11 224 -62 -127 -258 266 -138 -43 57
7294 57 11 -278 13 -242 7 -96 28 -183 67 93 -307 60 112 301 -8 28 121 -41 80 -159 47 180
7316 180 -103 143 14 195 -78 37 -110 -111 -132 50 -91 108 109 153 273 9 91 -98 214 11 35 -108 217
7339 217 -28 -4 178 -45 56 -115 -142 335 -309 -286 -234 -134 -54 -72 -100 515 240 99 -39 122 165 20 18
7362 18 -363 161 207 86 26 -144 92 -289 152 -324 -130 104 410 151 -21 99 -25 -83 38 -276 -171
7383 -171 47 226 -99 43 84 -29 280 278 143 -30 49 -12 84 35 200 40 45 -9 86 25 120 -128 -169 66 168
7408 168 51 112 207 -165 -339 165 313 -4 -3 31 30 -37 146 198 86 -22 89 -204 -12 -66 -287 293 -150
7431 -150 22 -107 59 284 -2 -43 165 -220 -59 -188 -142 -81 81 217 -85 -46 -169 185 -27 -202 16
$$ packed form
7273B58l38J90j49J57J8k50L1J06K10m20L01l48K23K35k86o5j31N24m04R5J00
7294E7m6k89K91k55K49j03J24k11K50K6m00L67N2J89l09L6R3j62J21k39K06J33
7316A80k83K46j29J81k73J15j47jk1J82j41J99JM4J20k64Q2j89L12k03K4j43L25
7339B17k45K4J82k23J01j71k7M77o44K3N2J00Q0j8k8O15k75j41j38J61M3j45k
7362A8l81N24M6j21o0j70K36l81M41m76J94K34L06k59j72J20j24n8J21l14J05
7383a71K18J79l25J42M1j13L09kj35j73P9o1R6m9J65j60Nn4R5o1R5k48m1K35J02
7408A68j17O1R5l72j74N04J48l17JL4jo7J83N2j12j08J11k93J92n4k21N80m43
7431a50J72j29J66K25k86m1K08l85J61j29M6O1J62J36l02L9j23L54k12j75K18
$$ plain form
7452 16 91 77 -85 88 -94 20 158 -207 180 216 210 202 217 371 117 -160 -338 -22 -48 -186 236 30 267
7475 267 -78 12 -128 71 -86 -193 88 -66 143 -159 -156 -82 -1 304 -6 -43 233 191 3 113 11 -65 -133
7498 -133 178 124 -86 193 177 -87 -290 -280 -139 -46 134 178 -139 84 -98 -82 157 236 -286 -22 -138 -65 46
7521 46 243 139 102 292 -31 50 262 163 2 -29 55 -90 -135 86 86 32 56 -47 178 -298 -559 -6 136 69
7545 69 -76 84 -56 -111 146 165 -123 120 -50 201 195 -32 50 -40 -160 -290 -104 14 -74 -42 139 148 -301 -62
7569 -62 -186 219 -92 -13 18 4 -79 124 -74 -182 4 102 -44 68 -19 175 -56 148 -129 94 -257 -53
7591 -53 -8 68 16 133 262 75 323 166 -214 66 345 -103 -80 -206 62 -158 238 280 -322 161 -38 122
7613 122 109 -14 87 135 190 -165 -262 -13 -100 -121 141 285 -104 -174 -51 115 -93 -20 -21 -162 56 -73 -59 -191
$$ packed form
7452A6P5j4j62J73j82J14J38l65L87L6oqJ5J54k54k77j78L16k6j38M22k06K37
7475B67l45R0j40J99j57j07K81j54K09l02LP4Q1L05l10l7K76m2j88J10j02p6o8
7498a33L11n4k10K79j6k64k03J0J41R3J80M4l17K23j82J6K39P9n22K64j16P3J11
7521D6J97j04l7J90l23Q1K12r9j61l1Q4j45m5K21%n4K4j03K25m76k61N53J42o7
7545F9j45J60j40n5K57J9k88K43j70K51ok27Q2r0j20j30J86J18q8L2J81Rm49K39
7569f2j24M05l11P9L1j4q3K03j98j08J86R8j46J12q7J94k31K04k77K23l51K04
7591e3M5P6n2J17J29j87K48j57l80K80K79m48K3j26K68k20L96M2o02M83j99J60
7613A22j3j23J01M8N5l55r7K49q7k1K62J44l89p0J23J66k08P3jj41K18j29J4j32
$$ plain form
7637 -191 126 -219 -51 20 -106 43 176 254 21 91 -78 128 405 -271 -118 13 167 -117 -257 174 -179
7658 -179 93 -29 -64 -330 -105 167 -6 230 199 142 -117 42 0 -88 157 -177 65 -91 -210 104 -26 -72
7680 -72 89 -92 -135 -331 14 -404 125 -103 -29 164 -400 -6 -85 32 113 305 -158 -103 174 -81 235 -51
7702 -51 39 79 -166 -95 -103 18 -44 -120 195 -81 128 235 -14 -74 -33 140 0 -17 -76 -67 170 -282 -82 43 31
7727 31 141 92 67 -60 315 -105 353 -105 16 -36 130 -215 290 -94 -35 -101 -249 -151 155 59 133 327 99
7750 99 47 -125 209 131 -83 -78 222 43 117 -219 -55 -28 18 -213 113 -74 -128 -288 327 225 -205 -144 -61 127
7774 127 24 -178 12 -131 251 -108 317 -187 -38 -155 -142 -171 101 -112 124 164 -378 -305 9 151 -231
7795 -231 6 -75 -171 -109 -140 -29 27 108 118 -63 -11 142 32 -104 -81 115 -106 300 20 132 -101 69 132
$$ packed form
7637a91L17l45J68P1j26J49J33P8k33P0j69K06K77o76J53J31J54k84j40M31l53
7658a79K72j22l5k66K25K72j73K36l1n7k59J59m2q8K45l34K42j56j19L14j30m6
7680g2J61j81m3j96L45m18N29k28P4J93n64L94p9J17Q1J92m63N5K77k55L16k86
7702e1R0M0k45P1qJ21o2p6L15k76K09J07k49o0M1J73j40j7n9RK37m52K00J25j2
7727C1J10m9k5j27L75m20M58m58J21n2J66l45N05l84N9o6j48R8L06r6P4J94k28
7750I9n2j72L34p8k14NL00j79P4l36J64K7M6k31L26j87n4j60O15j02m30O1Q3J88
7774A27j03k02J90j43L82l59M25n04J49j17J3k9K72k13K36M0n42P3L14J42l82
7795b31K37q1r6O2l1J11N6Q1J0j81N2J53j10j36K3J96k21M06k80J12k33J70O3
$$ plain form
7818 132 84 -37 9 149 -14 -54 52 95 -213 99 27 242 13 -30 40 29 236 -157 69 223 -102 46 59
7841 59 109 11 42 -125 -310 85 227 31 116 -80 -183 155 26 129 -90 50 -19 128 -178 -35 -368 -181
7863 -181 11 -30 -49 94 -123 119 117 22 0 -73 56 0 440 109 -207 -38 56 -162 -368 -69 -170 -157 84
7886 84 -47 102 152 237 228 -5 242 -417 -40 42 -154 278 46 -137 -44 -109 57 -123 273 83 101 -9 -9 -46
7910 -46 116 -196 124 -59 -181 187 -125 241 183 -45 93 148 162 -273 154 -219 -65 -62 -245 182 2 -236
7932 -236 163 -61 88 -166 64 -112 -121 -327 -169 -98 -96 -107 -34 83 -212 33 81 -14 51 3 -294 0 -29 74
7956 74 532 118 313 249 -89 260 82 244 -325 -8 -246 -216 152 -131 -107 248 73 -318 -120 -108 -120 56
7978 56 127 29 -160 -25 56 214 93 301 -331 -20 -23 45 294 -65 93 238 108 -113 162 -115 -296 19
$$ packed form
7818A32m8j21M6J40j63m0J06M3l08L12p2K15k29m3P0j1K07l93K26J54l25J48J3
7841E9N0r8L1j67j85L95J42j96Q5j96j03L38j29J03k19J40o9J47l06J43l33J87
7863a81J92m1j9J43k17K42kr5k2p3J29n6M40l31l16J69R4k18k06K99j01J3K41
7886H4j31J49N0Q5rk33K47o59L77Q2j96M32k32j83R3o5J66j80L96j90J8j10%l7
7910d6J62l12L20j83j22L68l12L66n8k28J38N5J4m35M27l73J54Lj83M27j80k38
7932b36L99k24J49k54K30j76rk06J58P1Kj1P3J17k95K45M8r5O5m8k97K94k9J03
7956G4M58m14J95o4l38L49j78J62n69L17k38L0L68k83K4L55j75l91J98J2j2J76
7978E6P1r8j89J35Q1J58j21K08o32L11lO8K49l59J58J45j30k21K75k77j81L15
$$ plain form
8000 19 -151 -234 -187 -75 11 -43 -23 26 206 -156 -108 82 12 -124 47 75 45 62 -160 -251 -141 -164 -71 12 -185
8025 -185 -75 -115 41 118 -79 -27 167 -67 200 78 35 -14 -166 280 13 -10 87 50 -46 103 31 -115 -254
8048 -254 227 63 204 -16 -39 -65 245 -112 -33 259 44 -167 -35 95 19 -27 149 24 17 117 53 -112 121
8071 121 -151 247 -155 -117 72 42 -14 21 155 148 132 74 -42 -391 45 -115 140 -282 294 -269 -47 -64 -82
8094 -82 -375 -115 -51 52 -37 179 187 -140 -35 173 316 15 -106 192 68 -86 393 -16 -29 240 -177 51
8116 51 -132 -82 16 -95 -37 116 171 237 182 -113 31 -33 -16 233 15 86 -93 258 -272 -62 -231 -213 153 -66
8140 -66 -31 310 -80 41 -18 154 66 137 -109 -429 -102 -230 120 -111 81 115 -92 134 -253 -62 -153 153
8162 153 -57 183 124 -50 189 -89 -103 -151 -145 46 -40 172 -99 108 24 200 -5 -280 319 76 -47 -139 -57
$$ packed form
8000A9j70q3M7J12Q6n4K0M9J80l62M8J90p0j36J71K8l0J7k22r1J10k3R3Q3j97
8025a85J10m0J56P7j97N2J94k34K67j22m3m9j52M46k67k3R7l7r6J49p2j46j39
8048b54M81j64J41k20k3k6L10l57P9K92k15k11J32J30p6m6J76j25pJ00o4j65K33
8071A21k72L98m02L8J89l0n6L5J34pj6n8j16l49M36j60K55m22N76n63K22j7j8
8094h2k93K60O4J03q9K16Ql27J05K08J43l01j21K98j24j54M79m09j3K69m17K28
8116E1j83N0R8j11N8J53N5O6n5k95J44o4J7K49k18P1j79L51n30K10j69J8L66k19
8140f6L5L41l90J21n9J72q8P1k46l20L27j28L50k31J92L4k07K26l87J91r1L06
8162A53k10K40n9j74K39k78j4m8OJ91q6K12k71K07q4J76k05k75N99k43j23r2Q2
$$ plain form
8185 -57 297 11 -193 165 -225 280
$$ packed form
8185e7L54k86k04L58l90N05
8191B80
$$ Imaginary data points
##PAGE= N=2
##DATA TABLE= (X++(I..I)), XYDATA
$$ plain form
0 0 0 0 0 0 0 0 0 -8 8 -8 8 -16 16 -24 24 -32 39 -43 53 -62 72 -83 96 -111 128 -146 166 -190 215 -242 272
31 272 -306 343 -383 430 -478 530 -590 655 -724 801 -887 985 -1090 1207 -1338 1491 -1659
48 -1659 1855 -2083 2352 -2678 3076 -3581 4245 -5161 6508 -8699 12873 -23723 112209 230266
62 230266 952 -83331 -2695 125991 101171 21868 -20153 6748 17748 19518 21539 35104
74 35104 13643 -26742 -49506 -14113 40045 53456 -4732 -65346 -50245 30363 67340 16577
86 16577 -52050 -46830 17412 61620 38001 -14408 -31842 602 36599 36453 11688 -2234 1121
99 1121 5210 4777 10986 20690 10856 -22680 -39130 -6007 38848 28667 -31921 -67287 -33388 22841
113 22841 29084 -17928 -54948 -40913 -5224 6128 -6979 -20072 -25711 -28377 -21185 -3998 7428
$$ packed form
0@%%%%%%%qJ6j6J6k4L2m0M8n6P1q2R6j15J34j55J79k07K39k74L12l56M05m57N14
31B72n78O49p26Q13r08J008j120J245j379J525j688J872k075K297k545K829l150
48a659L514l938M435n030N754o657P826r406J1669j5207K1572l6596J35932J18057
62B30266k29314q4283Q0636J28686k4820p9303m2021K6901J1000J770K021J3565
74C5104k1461m0385k2764L5393N4158J3411n8188o0614J5101Q0608L6977n0763
86A6577o8627N220O4242M4208k3619n2409j7434L2444L5997j46k4765j3922L355
99A121M089m33O209R704r834l3536j6450L3123M4855j0181o0588l5366L3899N6229
113B2841O243m7012l7020J4035L5689J1352j3107j3093n639k666P192J7187J1426
$$ plain form
126 7428 -455 -20788 -31824 -19912 3467 14154 657 -22468 -30206 -12507 12161 13508 -10299
139 -10299 -30095 -21859 104 9085 -983 -15386 -20176 -12104 -1360 1001 -4012 -9987 -12549 -10944
153 -10944 -3682 4147 3076 -6435 -14572 -11443 4034 14675 7099 -11563 -16805 -2537 12922 13593
167 13593 -956 -13915 -12912 598 11476 7678 -5824 -15981 -12798 155 7794 1834 -7763
180 -7763 -11080 -8885 -4760 2825 7704 339 -11950 -12922 1556 15353 11874 -4228 -11809 -1476
194 -1476 12310 14817 5560 -3091 -4019 2775 9850 8483 -486 -5698 -3514 152 1008 -1331 -4313
209 -4313 -7865 -10221 -8713 -4282 -2152 -6806 -14846 -15430 -6228 521 -2968 -11586 -14578 -7760 2703
224 2703 4727 -3131 -8646 -3236 5485 6973 3651 1770 3311 5044 4993 5312 7902 8119 2849 -581
$$ packed form
126G428p883k0333j1036J1912K3379J0687j3497k3125p738J7699K4668J347k3807
139a0299j9796Q236K1963Q981j0068j4403m790Q072J0744K361n013n975k562J605
153a0944P262P829j071r511q137L129J5477J0641p576j8662n242J4268J5459O71
167A3593j4549j2959J003J3510J0878l798j3502j0157L183J2953P639n960r597
180g763l317K195M125P585M879p365j2289r72J4478J3797l479j6102p581J0333
194a476J3786K507r257q651r28O794P075j367q969n212K184L666Q56k339k982
209d313l552k356J508M431K130m654q040n84R202O749l489q618k992O818J0463
224B703K024p858n515N410Q721J488l322j881J541J733n1L19K590K17n270l430
$$ plain form
240 -581 3145 7252 4497 -995 -2739 -1129 -99 -1042 -4046 -5317 -5788 -5754 -5276 -5329 -6985 -8660 -6842
257 -6842 -3511 -4422 -8216 -7362 -3341 -1120 -2187 -3172 -2405 -175 1193 1105 1278 2553 2854 1771 2284
274 2284 4900 6051 4608 2068 1305 3276 6274 5468 717 -878 1996 3664 1797 480 -795 -486
290 -486 -611 -70 258 462 -1183 -2523 -1206 1956 1358 -1719 -1705 623 1302 1068 1468 1941 770 75
308 75 1384 3898 3809 1338 -462 1566 4312 3238 1412 1136 1525 1427 2465 3120 2314 989 558 1496
326 1496 2544 3419 2264 1021 846 2551 3632 3186 2078 615 1412 3095 3014 1702 1803 2511 1611
343 1611 1354 2773 2660 915 708 1496 1525 1293 316 -193 565 887 -4 -851 255 557 -748 -381 558
362 558 43 -1323 -1044 175 -186 -730 -1351 -957 -278 -227 -927 -1284 -438 -1070 -1369 -165 -284 -1535 -1969
$$ packed form
240e81L726M107k755n492j744J610J030r43l004j271m71L4M78n3j656j675J818
257f842L331r11l794Q54M021K221j067r85P67K230J368q8J73J275L01j083N13
274B284K616J151j443k540p63J971K998q06m751j595K874J668j867j317j275L09
290d86j25N41L28K04j645j340J317L162n98l077J4K328O79k34M00M73j171o95
308G5J309K514q9k471j800K028K746j074j826k76L89r8J038O55q06j325m31R38
326A496J048Q75j155j243j75J705J081m46j108j463P97J683q1j312J01P08r00
343A611k57J419j13j745k07P88K9k32r77n09P58L22q91q47J106L02j305L67R39
362E58n15j366K79J219l61n44o21L94O79N1p00l57Q46o32k99J204j19j251m34
$$ plain form
381 -1969 -610 -185 -952 -1176 -1088 -1381 -1203 -772 -1034 -775 -1472 -1813 -1293 -244 -1301 -2284 -1867 -1057 -2032
400 -2032 -2174 -1608 -1620 -2448 -2487 -1921 -2356 -2729 -2600 -2826 -2509 -2559 -2541 -2480 -2274 -2896 -2794 -1740 -932 -1554 -1687
421 -1687 -443 190 -385 -129 699 1159 1348 1505 1971 2676 2677 2351 2179 3348 2925 1609 2154 2682 2218 1011
441 1011 939 1151 467 517 414 -508 -1098 -1021 -1028 -567 -1016 -2230 -2741 -1450 -654 -463 -953 -1034 -1370 -415 1835
462 1835 2198 890 277 1601 2654 3723 3835 2654 2105 2749 3884 4912 4734 2838 1277 2214 4167
479 4167 4020 2552 892 -161 -252 1401 2480 547 -2135 -3429 -1316 877 714 -2258 -4514 -3642
495 -3642 -1351 -25 -91 -1691 -4029 -3721 -489 1397 648 -1528 -3190 -2262 586 2498 1401 -2053
511 -2053 -3488 -2020 1223 3259 732 -3522 -4180 -970 1725 2031 -653 -3215 -3779 -1029 1718 1828
$$ packed form
381a969J359M25p67k24Q8k93J78M31k62K59o97l41N20J049j057r83M17Q10r75
400b032j42N66j2q28l9N66m35l73J29k26L17n0J8O1K06o22J02J054Q08o22j33
421a687J244O33n75K56Q28M60J89J57M66P05Jl26j72J169m23j316N45N28m64j207
441A011p2K12o84N0j03r22n90P7pM61m49j214n11J291P96J91m90q1l36R55K250
462A835L63j308o13J324J053J069J12j181n49O44J135J028j78j896j561R37J953
479D167j47j468j660j053r1J653J079j933k682j294K113K193j63k972k256Q72
495c642K291J326o6j600k338L08L232J886p49k176j662R28K848J912j097l454
511b053j435J468L243K036k527m254o58L210K695L06k684k562n64K750K747J10
$$ plain form
527 1828 -717 -3150 -3363 -718 2359 2488 -261 -3124 -3180 -859 3012 3649 -817 -4721 -3457 1529
543 1529 3884 1183 -3675 -5289 -2543 1244 1602 -1319 -4122 -5123 -3262 71 1014 -891 -3784 -4444
559 -4444 -2852 823 3887 1980 -2973 -3998 740 6685 6755 1994 -2087 100 6015 8545 5604 1563
575 1563 624 2625 5916 6218 3967 1444 428 739 2114 3590 3637 64 -3768 -3204 855 4318 1926
592 1926 -3950 -6231 -1111 4038 3619 -1078 -3844 -1397 3516 5731 3405 1156 2335 5018 6086
607 6086 5980 6364 7466 6475 5157 5391 8204 10285 8023 2766 2146 6280 9109 5763 75 -1567
623 -1567 1817 4810 2609 -2656 -3996 -827 1035 -1498 -4372 -4118 -1479 -538 -2982 -5302 -2954 1397
639 1397 978 -3528 -4338 2 3741 2188 -1664 -1505 2922 5549 2073 -1269 232 4302 4507 213
$$ packed form
527A828k545k433k13K645L077J29k749k863n6K321L871O37m466l904J264M986
543A529K355k701m858j614K746L787L58k921k803j001J861L333R43j905k893o60
559d444J592L675L064j907m953j025M738N945P0m761m081K187N915K530k941m041
575A563r39K001L291L02k251k523j016L11J375J476M7l573l832N64M059L463k392
592A926n876k281N120N149m19m697k766K447M913K215k326k249J179K683J068
607F086j06L84J102r91j318K34K813K081k262n257o20M134K829l346n688j642
623a567L384K993k201n265j340L169J862k533k874K54K639R41k444k320K348M351
639A397m19m506q10M340L739j553l852J59M427K627l476l342J501M070K05m294
$$ plain form
655 213 -2720 16 3747 2981 -3100 -6468 -1931 2384 161 -6543 -8733 -4699 -1230 -3105 -8129 -8704
671 -8704 -4968 -3045 -6109 -8158 -5662 -3205 -4274 -7916 -8056 -3311 484 -2105 -8686 -8624 -1182 3546
687 3546 -428 -7260 -8210 -1585 3650 897 -5341 -6485 -1423 630 -1237 -2994 -2092 -725 -1891 -3799
703 -3799 -2768 1362 2929 -1975 -7091 -3955 3349 6308 420 -6629 -5770 2403 7550 2693 -4411
718 -4411 -4307 580 3884 2108 -639 -1268 -654 -540 -1030 1060 3190 1674 -3715 -5657 -751 5927
734 5927 5409 -1916 -7876 -3916 5744 8913 1622 -5654 -4544 3044 8004 5793 93 -1940 696
749 696 3640 5249 5287 3838 773 -1470 875 5559 7607 3771 -3905 -6328 369 8401 6516 -3765
765 -3765 -10201 -6134 3106 6304 -434 -8527 -8416 -2757 1847 1221 -2451 -5755 -6063 -3329 457 2232
$$ packed form
655B13k933K736L731p66o081l368M537M315k223o704k190M034L469j875n024n75
671h704L736J923l064k049K496K457j069l642j40M745L795k589o581O2P442M728
687C546l974o832r50O625N235k753o238j144N062K053j867j757R02J367j166j908
703c799J031M130J567m904n116L136P304K959n888p049Q59Q173N147m857p104
718d411J04M887L304j776k747o29O14J14m90K090K130j516n389j942M906O678
734E927n18p325n960L960R660L169p291p276J110P588M960k211n700k033K636
749F96K944J609L8j449l065k243K345M684K048l836p676k423O697Q032j885j0281
765c765o436M067R240L198o738q093J11N659M604o26l672l304l08K734L786J775
$$ plain form
781 2232 1538 -3276 -6799 -3516 3989 8175 3238 -5443 -7211 1110 9561 7908 -1195 -7295 -2989
796 -2989 5261 7445 2309 -3638 -5013 -1760 2110 2862 241 -3165 -5307 -4896 -1199 3345 1783 -4163
812 -4163 -8555 -5406 2384 6265 1435 -7129 -7366 452 7015 5671 -963 -4566 -1691 4433 7095
827 7095 4804 1147 -611 63 3564 6267 6480 3016 -574 -860 3020 7375 6859 759 -3974 -1296
843 -1296 5557 7519 3255 -2927 -3781 1159 5394 4643 671 -2075 -1495 1286 3735 3532 1277 -704
859 -704 -1299 523 3555 4761 2209 -1291 -2022 1734 5229 4850 317 -2957 -760 3519 4616 2225
875 2225 -1659 -2070 -125 2015 2955 777 -1536 -2098 -857 785 1825 823 -1672 -2803 -1670 784
891 784 1745 266 -2964 -3772 -1239 1576 621 -1475 -3465 -2709 -603 505 151 -2324 -3235 -2272 -1083
$$ packed form
781B232o94m814l523L283P505M186m937q681j768Q321Q451j653r103o100M306
796b989Q250K184n136n947j375L253L870P52k621l406k142M11L697M544j562n946
812d163m392L149P790L881m830q564k37P818O563j344o634l603K875O124K662
827G095k291l657j758O74L501K703K13l464l590k86L880M355n16o100m733K678
843a296O853J962m264o182q54M940M235p51l972k746N80K781K449k03k255j981
859g04n95J822L032J206k552l500p31L756L495l79m533l274K197M279J097k391
875B225l884m11J945K140R40k178k313n62J241J642J040j002k495j131J133K454
891G84R61j479l230q08K533K815r55k096j990P56K106J108l54k475r11R63J189
$$ plain form
908 -1083 175 -818 -2498 -3041 -2495 -1365 -417 -538 -2068 -3035 -2580 -459 244 -698 -2320 -2497 -1293 119
926 119 681 -689 -1758 -1892 -532 508 763 -400 -1223 -816 162 536 652 -432 -832 -727 248 819
944 819 972 -507 -894 -406 704 1089 354 -271 -419 47 541 1097 383 -335 -244 582 746 859 386 -20
964 -20 466 733 1107 1170 644 366 532 992 1732 1052 466 210 833 1053 903 1438 892 562 1001 1124 994
985 994 1232 705 809 909 1146 951 464 600 603 689 716 737 149 -66 218 178 -12 -132 -207 -515 -41 -118 -396
1008 -396 -738 -572 -530 -626 38 -550 -719 -514 -387 -354 -501 -404 -418 -654 -343 59 -281 -584 -358 -374 -90 130
1030 130 -543 -790 -51 -290 -228 -625 -548 -814 -972 -235 -539 -873 -552 -589 -973 -783 -921 -1165 -999 -1009 -987 -1017
1052 -1017 -858 -796 -1179 -851 -680 -760 -972 -489 -263 -388 -277 -497 -580 -486 -341 -249 -144 14 1 -355 -143 96
$$ packed form
908a083J258r93j680n43N46J130R48j21j530r67M55K121P03r42j622j77J204J412
926A19N62j370j069j34J360J040K55j163q23M07R78L74J16j084m00J05R75N71
944H19J53j479l87M88J110L85p35o25j48M66M94N56p14p18R1Q26J64J13m73m06
964b0M86K67L74O3n26k78J66M60P40o80n86k56O23K20j50N35n46l30M39J23j30
985I94K38n27J04J00K37j95m87J36LQ6K7K1n88k15K84m0j90j20p5l08M74p7k78
1008c96l42J66M2r6O64n88j69K05J27L3j47R7j4k36L11M02l40l03K26j6K84K20
1030A30o73k47P39k39O2l97P7k66j58P37l04l34L21l7l84J90j38k44J66j0K2l0
1052a017J59O2l83L28J71q0k12M83K26j25J11k20q3R4J45R2J05J58j3l56K12K39
$$ plain form
1074 96 325 -71 10 264 304 296 448 92 89 116 256 664 539 621 361 248 640 368 803 535 209 46 570
1097 570 492 521 575 474 -49 190 701 176 284 -190 -218 45 595 584 -297 -386 -6 321 540 811 469 -55
1119 -55 179 946 1312 1241 907 687 708 1245 1661 1081 841 755 760 879 1122 769 129 -242 95 172 394 -4
1141 -4 -714 -1269 -895 -723 -508 -926 -1544 -1871 -1149 -776 -684 -1052 -1510 -1563 -918 -302 231 -228 -946 -471 -331
1162 -331 783 960 350 -377 -294 158 1247 1467 399 -700 -322 719 1051 516 -205 -993 -1067 -261 166
1181 166 -335 -1447 -2003 -1954 -1057 67 -358 -1708 -2656 -2186 -317 810 -381 -1875 -2195 -747 1215
1198 1215 1531 56 -1249 -1118 510 1903 2092 811 -522 -488 406 2326 2563 1043 -388 -923 673
1215 673 2472 2206 281 -1826 -1205 957 3013 1213 -991 -2376 -1062 1411 1792 168 -1573 -1446
$$ packed form
1074I6K29l96Q1K54M0qJ52l56lK7J40M08j25Q2k60j13L92k72M35k68l26j63N24
1097E70p8K9N4j01n23K39N11n25J08m74k8K63N50j1q81q9L80L27K19K71l42n24
1119e5K34P67L66p1l34k20K1N37M16n80k40q6NJ19K43l53o40l71L37P7K22l98
1141dp10n55L74J72K15m18o18l27P22L73R2l68m58n3O45O16N33m59p18M75J40
1162c31J114J77o10p27Q3M52J089K20j068j099L78J041L32n35p21p88p4Q06M27
1181A66n01j112n56M9Q97J124m25j350r48M70J869J127j191j494l20J448J962
1198A215L16j475j305J31J628J393J89j281j333L4Q94J920K37j520j431n35J596
1215F73J799k66j925k107O21K162K056j800k204j385J314K473L81j624j741J27
$$ plain form
1231 -1446 -275 1004 1694 889 -625 -1717 -1225 1207 2253 1346 -1834 -2452 -545 2368 2799 31
1247 31 -2471 -2236 889 2936 1603 -695 -2279 -1058 928 2025 1265 -745 -1607 -1567 153 1923 1881
1264 1881 -526 -2647 -2242 677 3082 1947 -1949 -4006 -1810 2001 3009 -380 -3429 -3053 -211
1279 -211 1970 1272 -1384 -2776 -2547 -665 307 849 -684 -2556 -3003 -1461 993 1812 -465 -3727 -3729
1296 -3729 -122 3521 2073 -2154 -3758 -1555 2088 3074 366 -2210 -1942 451 1678 1522 244 -716
1312 -716 -977 -493 646 1717 1428 -902 -2719 -1678 2012 3073 693 -2774 -3201 130 3108 1921
1328 1921 -1593 -3309 -990 1745 2311 717 -817 -1356 205 1224 1538 1503 1001 65 -771 967 3308
1345 3308 3206 720 -1690 -693 2923 4333 1750 -1526 -1175 1544 3464 2364 -128 -1417 269 1939
$$ packed form
1231a446J171J279O90q05j514j092M92K432J046r07l180o18J907K913M31k768
1247C1k502K35L125K047j333k298j584J221J986J097p60k010q62M0J720J770m2
1264A881k407k121M05K919K405j135l896k057K196L811J008l389l049L76K842
1279b11K181o98k656j392K29J882R72N42j533j872m47J542K454Q19k277l262k
1296c729L607L643j448m227j604K203L643R86k708k576K68K393J227j56j278r60
1312g16k61M84J139J071k89k330j817J041L690J061k380l467m27L331K978j187
1328A921l514j716K319K735N66j594j534n39J561J019L14l5n02r36q36J738K341
1345C308j02k486k410R97L616J410k583l276L51K719J920j100k492j289J686J670
$$ plain form
1361 1939 1538 407 85 194 -91 -537 954 1579 1138 -716 -2144 -436 2471 2703 -279 -2183 -1005
1378 -1005 1991 2723 1031 -1560 -1417 1205 2252 1247 -195 -151 371 858 700 102 639 859 -467
1395 -467 -1085 45 1886 1282 -1001 -1847 -526 1718 1492 -725 -2389 -948 706 1014 -691 -1520 -790
1412 -790 15 71 -1086 -986 -215 115 -537 -1404 -453 720 272 -1238 -1534 -467 933 578 -1403 -1613
1430 -1613 21 857 435 -1265 -1500 -84 732 321 -964 -1009 46 409 -372 -1086 -604 475 520 -416
1448 -416 -1156 -400 504 188 -596 -1073 114 330 -436 -911 -211 543 525 -592 -1497 46 862 688 -727
1467 -727 -1164 -707 1036 928 128 -1047 -54 848 573 -80 -85 322 143 105 108 446 532 578 -315 156 649 1163
1489 1163 448 -325 -522 572 1309 1097 -422 -763 537 1042 852 57 -286 -88 419 485 465 399 94 -248
$$ packed form
1361A939m01j131l22J09k85m46J491O25m41j854j428J708K907K32k982j904J178
1378a005K996P32j692k591J43K622J047j005j442M4N22M87j58n98N37K20j326
1395d67o18J130J841o04k283q46J321K244k26k217j664J441J654L08j705q29P30
1412g90Q05N6j157J00P71L30o52q67R51J173m48j510k96J067J400l55j981k10
1430a613J634Q36m22j700k35J416Q16m11j285m5J055L63p81p14M82J079M5r36
1448d16p40P56R04l16p84m77J187K16p66m75P00P54j8j117r05J543Q16j74j415
1467g27m37M57J743j08q00j175R93R02k75o53nM07j79l8LL38Q6M6q93M71M93N14
1489A163p15p73j97J094P37k12j519l41J300N05j90p95l43J98N07O6k0o6l05l42
$$ plain form
1509 -248 -145 690 771 143 -183 -664 34 761 853 226 -893 -539 379 890 532 -296 -751 -394 545 432
1529 432 -129 -159 -447 -104 57 506 456 -551 -656 -721 -144 719 -157 -699 -1229 -862 145 514 -592 -1066
1549 -1066 -1416 -305 562 -363 -870 -911 -694 -144 158 -309 -449 -857 -719 -379 72 -219 -567 -800 -574 -21
1569 -21 360 -81 -605 -975 -508 37 48 -184 -431 -537 -80 142 -9 16 -472 -48 -146 65 229 -48 -245
1590 -245 -271 -5 471 488 -56 -174 -211 262 258 17 270 -100 -158 219 535 237 120 417 94 508 645 305
1612 305 285 474 304 449 348 240 227 95 543 643 249 499 375 327 155 603 331 421 426 191 681 206
1634 206 154 499 555 576 134 282 -29 334 327 306 282 245 161 -166 219 179 -7 165 -303 -42 121 -194 -243 -260
1658 -260 -113 -255 -118 -307 -183 -373 -40 -586 -414 -464 -557 -536 -93 123 -2 -527 -606 -457 -118 34 -8 -332
$$ packed form
1509b48J03Q35Q1o28l26m81O98P27R2o27j119L54R18N11l58q28m55L57R39j13
1529D32n61l0k88L43J61M49n0j007j05o5N77Q63q76n42n30L67J007L69j106m74
1549a066l50J111Q67r25n07m1K17N50L02m67j40m08J38L40M51k91l48k33K26N53
1569b1L81m41n24l70M67N45J1k32k47j06M57K22j51K5m88M24r8K11J64k77j97
1590b45k6K66M76J7n44j18l7M73mk41K53l70n8L77L16k98j17K97l23M14J37l40
1612C05k0J89j70J45j01j08j3j32M48J00l94K50j24m8j72M48k72R0Nk35M90m75
1634B06n2L45N6K1m42J48l11L63pk1k4l7q4l27L85m0j86J72m68K61J63l15m9j7
1658b60J47j42J37j89J24j90L33n46J72n0r3K1M43K16j25n25p9J49L39J52m2l24
$$ plain form
1680 -332 -383 -325 7 -155 11 -630 -254 -124 59 -5 -401 -157 -552 -181 -173 -139 -571 -478 -318 -368 -134 -122 -324
1703 -324 -207 -271 -103 -15 248 -387 -294 -228 358 51 -78 11 -63 -46 352 300 151 95 326 42 69 332 167
1726 167 134 163 470 213 331 442 -113 60 601 400 256 213 324 426 608 610 433 225 410 427 709 405
1748 405 -11 77 323 375 535 255 577 41 270 244 502 321 -90 151 429 -16 31 17 167 574 476 64
1770 64 355 378 293 -61 68 391 120 -141 -156 -31 184 482 -30 -132 -219 18 243 314 -358 -329 -207 4
1792 4 -364 -14 -221 -670 -605 -428 -299 -114 -619 -392 -450 -318 -39 -248 -593 -603 -581 -249 -120 93 -261 -474
1814 -474 -319 -51 237 -95 -30 -560 -177 -67 73 11 -274 -812 -386 182 -41 -466 -684 -492 -206 36 150
1835 150 -231 -560 -692 -34 -66 -72 -168 -425 -275 -306 542 138 -186 -446 -119 497 449 296 5 -384 -47 459
$$ packed form
1680c32n1N8L32j62J66o41L76J30J83o4l96K44l95L71QL4m32R3J60n0K34J2k02
1703c24J17o4J68Q8K63o35R3O6N86l07j29Q9p4J7L98n2j49n6K31k84K7K63j65
1726A67l3K9L07k57J18J11n55J73N41k01j44m3J11J02J82Kj77k08J85J7K82l04
1748D05m16Q8K46N2J60k80L22n36K29k6K58j81m11K41K78m45M7j4J50M07r8m12
1770F4K91K3q5l54J29L23k71k61j5J25K15K98n12j02q7K37K25P1o72K9J22K11
1792Dl68L50k07m49O5J77J29J85n05K27n8J32K79k09l45j0K2L32J29K13l54k13
1814d74J55K68K88l32O5n30L83J10J40o2k85n38M26N68k23m25k18J92K86K42J14
1835A50l81l29j32O58l2or6k57J50l1Q48m04l24k60L27O16m8j53k91l89L37N06
$$ plain form
1857 459 338 417 125 32 -145 318 541 154 206 -158 249 132 432 187 296 -280 -56 323 567 273 105
1878 105 -282 -189 662 1009 249 -9 139 517 6 378 618 17 -88 348 353 469 635 -63 -457 -252 262
1899 262 393 131 -227 -639 -257 377 429 -383 -547 -357 62 52 -60 93 -315 -353 -299 223 408 459 -344 -783
1921 -783 -195 565 510 -353 -736 -1073 213 629 208 -664 -703 -422 -51 170 -160 -752 -455 -610 -532 140 165
1942 165 -297 -1269 -1377 -351 651 430 -725 -1514 -665 948 1049 -226 -1177 -923 141 654 420 -600
1960 -600 -571 -304 287 209 637 208 -434 -764 -418 768 948 344 -1000 -962 -208 1341 1138 -674 -1710
1979 -1710 -812 808 1270 253 -721 -611 202 747 933 343 -248 -427 -119 875 1089 896 -35 -936 -379
1998 -379 1079 1625 839 -794 -980 240 1714 1716 -356 -1031 -422 747 1315 715 -278 -491 -71 624 400
$$ packed form
1857D59j21P9k92r3j77M63K23l87N2l64M07j17L00k45J09n76K24L79K44k94j68
1878A05l87R3Q51L47p60k58J48L78n11L72K40o01j05M36NJ16J66o98l94K05N14
1899B62J31k62l58m12L82O34N2q12j64J90M19j0j12J53m08l8N4N22J85N1q03m39
1921g83N88P60n5q63l83l37J286M16m21q72l9K81L71K21l30n92K97j55P8O72K5
1942A65m62r72j08J026J002k21j155p89Q49J613J01j275r51K54J064N13k34j020
1960f00K9K67N91p8M28m29o42l30L46J186J80o04j344L8P54J549k03j812j036
1979a710Q98J620M62j017r74J10Q13N45J86n90n91j79L08R94K14j93r31r01N57
1998c79J458N46p86j633j86J220J474Kk072o75O09J169N68o00r93k13M20O95k24
$$ plain form
2017 400 583 56 -553 -577 115 1173 1360 -211 -1305 -948 993 1744 672 -1157 -930 499 1450 1095
2035 1095 -278 -1321 -514 238 747 283 -421 -445 -472 -375 0 728 235 -861 -1010 -275 1169 934 -451
2054 -451 -1359 -789 721 1316 97 -1029 -1130 -389 648 487 119 -624 -637 -399 115 210 -104 -279 -974
2073 -974 -803 330 891 145 -777 -1503 -410 815 622 -434 -1241 -977 98 706 168 -790 -683 -216
2091 -216 467 710 6 -4 -197 -435 -416 788 866 -33 -811 -556 271 1165 545 -380 -996 -222 1003 871
2111 871 -78 -654 -417 297 436 434 -87 -568 184 16 384 421 151 -285 -451 64 719 679 50 -726 -322
2132 -322 411 925 326 -484 -364 -146 705 667 9 -93 127 621 564 290 23 42 -153 283 491 313 352
2153 352 -80 -196 26 568 534 200 -359 -229 481 551 131 -310 -90 197 278 274 -271 -327 -125 92 93 64 35
$$ packed form
2017D00J83n27o09k4O92J058J87j571j094L57J941P51j072j829K27J429R51l55
2035A095j373j043Q07P52N09m64p04k4k7R7L75P28m93j096j49P35J444k35j385
2054d51r08N70J510N95j219j126j01P41J037j61l68p43j3K38N14R5l14j75o95
2073i74J71J133N61p46r22p26J093J225j93j056q07K64J075O08n38r58J07M67
2091b16O83K43p04j0j93k38J9J204P8q99p78K55Q27Q94o20r25o16P74J225j32
2111H71r49n76K37P14J39kn21m81P52j68L68L7k70m36j66N15O55m0o29p76M04
2132c22P33N14n99q10J20K18Q51l8o58j02K20M94n7k74k67J9j95M36K08j78L9
2153C52m32j16K22N42l4l34n59J30P10P0m20m41K20K87Q1mn45n6K02K17Jk9k9
$$ plain form
2176 35 -7 -50 -103 -300 224 -27 -390 -544 -98 259 25 -381 -413 -211 6 123 -241 -654 -397 -190 -217 -141
2198 -141 -63 -624 -169 -197 -282 -444 -72 -214 -474 -108 158 154 -117 -127 -372 -10 97 -144 -495 -400 -194 -173 -218
2221 -218 -286 -204 43 96 122 -156 -163 -140 -136 83 183 117 -24 -68 -208 -66 70 173 -215 -522 130 170 114 171 -272
2246 -272 227 135 417 425 29 188 334 441 185 226 326 30 258 301 343 543 425 271 472 393 466 213 -56
2269 -56 267 28 285 496 201 104 -274 183 -202 128 78 -268 80 -36 175 -55 168 32 -47 16 89 193
2291 193 -144 132 -111 -63 108 177 -242 -387 -188 4 -15 -205 -196 -210 -130 -214 -376 -144 -399 -464 -388 -211 -222 -488
2315 -488 -508 -678 -245 -681 -585 -324 -461 -467 -580 -416 -759 -576 -499 -521 -49 -539 -314 53 -341 -312 -147 -127 77
2338 77 -237 1 -71 -405 -170 -286 -10 -127 -257 -116 144 212 -165 -151 -49 -216 -175 -141 253 46 -285 106
$$ packed form
2176C5m2m3n3j97N24k51l63j54M46L57k34m06l2K02K17J17l64m13K57K07k7P6
2198a41P8n61M55k8q5j62L72j42k60L66K66mk71j0k45L62J07k41l51R5K06K1m5
2221b18o8Q2K47N3K6k78pK3MK19J00o6j41m4j40J42J36J03l88l07O52M0n6N7m43
2246b72M99r2K82Ql96J59J46J07k56M1J00k96K28M3M2K00j18j54K01p9P3k53k69
2269e6L23k39K57K11k95r7l78M57l85L30n0l46L48j16K11k30K23j36p9O3P3J04
2291A93l37K76k43M8J71O9m19j45J99J92j9j90Rj4Q0q4j62K32k55o5P6J77j1k66
2315d88k0j70M33m36R6K61j37oj13J64l43J83P7k2M72m90K25L67l94K9J65K0K04
2338G7l14K38p2l34K35j16K76j17j30J41K60O8l77J4J02j67M1L4L94k07l31L91
$$ plain form
2360 106 143 -110 168 273 410 -88 212 23 45 182 469 -36 454 271 342 368 410 363 390 442 313 285 303
2383 303 287 336 393 387 73 221 273 667 264 416 510 593 408 678 558 111 215 463 316 588 -42 211 237
2406 237 583 180 315 223 144 -18 442 261 182 34 140 -159 -110 -431 -17 -74 -324 -135 -241 -415 -158 -30
2428 -30 19 -170 -168 161 -23 -225 -25 -161 19 311 -68 -99 -131 90 118 -99 -112 -14 -48 -239 -166 -460 -287 -449
2452 -449 -262 -377 -445 -257 -371 -601 -424 -458 -354 -500 -605 -554 -323 -315 -166 -331 -338 115 82 -114 -362 -136 -126
2475 -126 58 273 219 -347 -195 -82 602 156 37 58 62 -19 151 155 84 -101 -257 -98 172 58 78 -371 -104
2498 -104 22 159 -146 -195 -130 127 139 154 32 -20 -177 292 271 496 303 262 355 295 431 146 329 224 116
2521 116 401 314 177 227 63 -92 -33 225 301 184 -208 69 -52 512 -82 -428 -234 -144 188 -69 132 227
$$ packed form
2360A06L7k53K78J05J37m98L00j89K2J37K87n05M90j83P1K6M2m7K7N2j29k8J8
2383C03j6M9N7ol14J48N2L94m03J52R4Q3j85K70j20m47J04K48j47K72o30K53K6
2406B37L46m03J35r2p9j62M60j81p9j48J06k99M9l21M14n7k50J89j06j74K57J28
2428c0M9j89KL29j84k02K00j36J80K92l79l1l2K21K8k17j3R8l4j91P3k94J73j62
2452d49J87j15o8J88j14k30J77l4J04j46j05N1K31QJ49j65pM53l3j96k48K26J0
2475a26J84K15n4n66J52J13O84m46j19K1Mq1J70Mp1j85j56J59K70j14K0m49K67
2498a04J26J37l05m9O5K57J2J5j22n2j57M69k1K25j93m1R3o0J36k85J83j05j08
2521A16K85q7j37N0j64j55N9K58P6j17l92K77j21N64n94l46J94R0L32k57K01R5
$$ plain form
2543 227 -233 155 502 467 246 -351 -136 162 95 363 410 -70 -75 -211 162 127 237 -2 -107 -332 161 172
2565 172 -435 -288 -306 -92 -185 -186 -138 -294 -466 -56 -240 -12 -84 -297 -366 -149 298 226 -404 -625 -177 129 57
2588 57 -72 -91 -367 -134 240 68 -411 -405 -419 -57 -26 90 55 -56 -154 -310 43 255 133 -402 -314 67 237
2611 237 289 -49 -429 -374 319 223 188 -70 -8 306 278 97 139 361 148 146 -245 247 577 -101 20 -50 269
2634 269 470 464 -210 -142 -130 233 307 -68 44 228 276 148 7 54 186 -18 17 -106 357 386 411 448 171 100
2658 100 444 487 -66 -67 312 589 306 -153 270 320 264 -178 -152 230 359 247 -116 -322 143 157 157 -285 -168
2681 -168 140 278 182 -298 -603 -212 -112 68 -109 31 -265 -136 -134 -21 91 77 -121 -405 -206 -27 85
2702 85 21 -684 65 57 225 -145 -673 -804 -251 91 -279 -428 -437 -7 -181 -293 -322 -42 -117 -348 -378 -386 -273 -185
$$ packed form
2543B27m60L88L47l5k21n97K15K98o7K68M7m80nj36L73l5J10k39j05k25M93J1
2565A72o07J47j8K14r3jM8j56j72M10j84K28p2k13o9K17M47p2o30k21M48L06p2
2588E7j29j9k76K33L74j72m79Oj4L62L1J16l5j11r8j56L53K12j22n35Q8L81J70
2611B37N2l38l80N5O93r6l5k58O2L14k8j81M2K22k13kl91M92L30o78J21p0L19
2634B69K01oo74O8J2L63P4l75J12J84M8j28j41M7J32k04L5j23M63K9K5L7k77p1
2658A00L44M3n53jL79K77k83m59M23N0n6m42K6L82J29j12l63k06M65J4%m42J17
2681a68L08J38r6m80l05L91J00J80j77J40k96J29KJ13J12j4j98k84J99J79J12
2702H5o4p05P49qJ68l70n28j31N53L42l70j49rM30j74j12k9K80p5k31l0qJ13Q8
$$ plain form
2726 -185 -106 -683 -264 576 475 -109 -152 -152 -41 198 74 -460 -338 74 93 215 -252 158 -74 -76 -155 103 87
2749 87 57 -248 -326 256 161 367 -109 -445 89 449 330 -54 -280 296 648 509 386 98 -180 199 270 229
2771 229 230 203 10 -88 95 285 191 -89 -323 17 285 509 536 74 171 32 229 175 170 -324 -48 23 132 9
2795 9 -74 42 -106 -178 129 437 291 22 -247 158 226 366 79 -177 -205 201 435 77 64 -131 14 355
2817 355 340 -17 27 -147 129 84 -225 -17 117 107 -201 -91 80 148 67 -222 -346 -128 62 -76 -214 -397
2839 -397 55 103 -301 -157 -478 -124 39 9 47 -22 -211 -463 -126 -254 -66 -39 -400 -173 -72 -48 -121 -135 -306
2862 -306 100 -120 -296 -434 -124 -330 -147 113 -140 59 -115 -158 17 -30 -43 -32 -66 -391 -97 29 251 -104
2884 -104 -34 -94 -19 275 -109 -24 247 -137 193 140 96 175 257 235 156 215 224 263 -157 97 241 271 209 -176 195
$$ packed form
2726a85P9n77M19Q40j01n84m3%J11K39j24n34J22M12J9J22m67M10k32kp9K58j6
2749H7l0l05p8N82r5K06m76l36N34L60j19l84k26N76L52j39j23k88k78L79P1m1
2771B29Jk7j93r8J83J90r4k80k34L40K68K24K7m62R7j39J97n4nm94K76P1J09j23
2795Iq3J16j48p2L07L08j46k69k69M05O8J40k87k56k8M06K34l58j3j95J45L41
2817C55j5l57M4j74K76m5l09K08J34j0l08J10J71O8q1k89j24K18J90j38j38j83
2839c97M52M8m04J44l21L54J63l0L8o9j89k52L37j28J88K7l61K27J01K4p3j4j71
2862c06M06k20j76j38L10k06J83K60k53J99j74m3J75m7j3J1l4l25K94J26K22l55
2884a04P0o0P5K94l84Q5K71l84L30n3m4P9Q2k2p9N9RL9m20K54J44L0o2l85L71
$$ plain form
2909 195 210 19 -36 6 38 75 275 120 33 41 54 369 192 101 66 433 273 -179 245 73 343 311 97 180
2933 180 290 286 35 -50 -32 322 -41 -65 -192 113 314 233 135 25 76 148 375 96 380 115 171 649 445
2956 445 336 -26 163 496 569 306 164 -290 -59 25 -171 90 2 116 -100 -148 -9 111 -214 -35 -138
2977 -138 -197 87 -284 -140 41 -49 -268 52 -141 26 -90 -227 -233 292 72 -149 -26 -263 136 307 -192
2998 -192 -227 -157 250 25 116 -5 -194 124 -52 -225 -475 -18 -164 -147 -96 -233 47 -255 91 -114 -111 -120 -305
3021 -305 -2 -43 112 -185 338 -94 -115 -120 176 -20 -78 -87 225 -7 161 178 54 88 62 39 215 186 19 -186
3045 -186 -27 9 -256 368 -10 -109 76 -186 -56 269 23 133 170 115 -72 -329 4 7 91 171 -85 -192 57
3068 57 102 120 160 78 -57 199 -193 15 251 371 203 -127 185 133 265 -73 -138 -398 57 -89 -359 -396 -279
$$ packed form
2909A95J5j91n5M2L2L7K00j55q7QJ3L15j77r1l5L67j60m52M24j72K70l2k14Q3
2933A80J10mk51q5J8L54l63k4j27L05K01q1r8j10N1P2K27k79K84k65N6M78k04
2956D45j09l62J89L33P3k63j42m54K31Q4j96K61q8J14k16m8J39J20l25J79j03
2977a38n9K84l71J44J81r0k19L20j93J67j16j37oN25k20k21J23k37L99J71m99
2998a92l5P0M07k25R1j21j89L18j76j73k50M57j46J7N1j37K80l02L46k05Lrj85
3021c05L03m1J55k97N23m32k1nK96j96n8rL12k32J68J7j24L4k6k3J76k9j67k05
3045a86J59L6k65O24l78r9J85k62J30L25k46J10L7n5j87k57L33LQ4Q0k56j07K49
3068E7M5J8M0q2j35K56l92K08K36J20j68l30L12n2J32l38o5k60M55j46k70l7J17
$$ plain form
3091 -279 73 -146 -272 -135 168 -360 49 -193 -250 73 -141 -141 -320 -287 -44 64 -30 -208 79 -56 -120 70
3113 70 -228 -115 317 -258 -29 -139 -116 -205 -238 15 247 -44 -232 -250 410 101 -78 -123 -49 -269 -64 -64 158
3136 158 -93 -60 -308 -227 100 105 -26 1 232 40 -14 77 67 -30 223 92 191 400 178 -56 -4 94 46 23 266
3161 266 64 -57 109 265 158 211 369 91 151 314 156 218 128 -52 353 86 361 219 278 123 -38 286
3183 286 108 677 130 66 211 184 -208 379 228 325 99 330 79 -166 -11 140 19 -20 111 -129 -20
3204 -20 -10 -106 25 121 -359 -44 -218 60 -52 -123 47 -313 -133 240 138 -235 -214 -306 204 15 48 -186 -259
3227 -259 -184 -38 120 -87 65 -82 -33 -205 -398 74 -278 -187 -153 -202 -92 146 -256 -286 -400 67 150 44
3249 44 247 -64 -58 269 -159 139 -58 -86 -270 -148 228 -112 -242 -286 -155 53 274 -3 20 -121 180 37
$$ packed form
3091b79L52k19j26J37L03n28M09k42n7L23k14%j79L3K43J08r4j78K87j35o4J90
3113G0k98J13M32n75K29j10K3q9l3K53K32k91j88j8O60l09j79m5P4k20K05%K22
3136A58k51L3k48Q1L27Nj31K7K31j92n4R1j0r7K53j31R9K09k22k34N2R8m8k3K43
3161B66k02j21J66J56j07N3J58k78O0J63j58O2r0j80M05k67K75j42N9j55j61L24
3183B86j78N69n47o4J45k7l92N87j51R7k26K31k51k45J55J51j21l9J31k40J09
3204b0J0r6J31R6m80L15j74K78j12p1J70l60J80L73j02l73K1r2N10j89L3k34p3
3227b59P5J46J58k07J52j47M9j72j93M72l52R1L4m9J10K38m02l0j14M67Q3j06
3249D4K03l11OL27m28K98j97k8j84J22L76l40j30m4J31K08K21k77K3j41L01j43
$$ plain form
3271 37 311 18 -59 223 267 103 80 143 40 187 87 -24 -83 26 -100 112 -141 68 -124 206 105 374
3293 374 -169 -57 -85 28 44 322 -12 209 373 -88 3 171 14 196 138 -3 -2 -61 285 277 175 -121 -89
3316 -89 172 443 170 -128 -326 -195 256 315 42 -60 179 334 99 -92 98 34 -189 -57 45 182 197
3337 197 202 -350 -104 2 -88 -142 93 -25 -42 123 -394 -169 -62 -101 -62 -25 -216 31 -405 -9 -93 125 -280
3360 -280 -179 -15 -136 58 162 -7 10 -161 -181 4 -85 -4 -368 -54 -156 92 -188 -199 -231 -48 -37 21 -203
3383 -203 -93 -88 -215 -225 153 114 -63 -236 -79 57 133 80 -107 193 96 -16 54 17 -282 -14 82 -122 20
3406 20 163 318 82 139 -105 -21 118 239 85 -140 120 43 88 39 -175 233 50 79 420 201 38 222
3428 222 138 -30 81 383 422 -189 -164 -36 4 68 -2 -257 3 90 120 -49 -62 131 64 182 147 161 -220 152
$$ packed form
3271C7K74k93p7K82M4j64k3O3j03J47j00j11n9J09j26K12k53K09j92L30j01K69
3293C74n43J12k8J13J6K78l34K21J64m61R1J68j57J82n8j41Jn9L46qj02k96L2
3316h9K61K71k73k98j98J31M51N9k73j02K39J55k35j91J90o4k23J32J02J37J5
3337A97Nn52K46J06r0n4K35j18j7J65n17K25J07l9L9L7j91K47m36L96q4K18m05
3360b80J01J64j21J94J04j69J7j71k0J85q9Q1l64L14j02K48k80j1l2J83J1N8k24
3383b03J10Nj27j0L78l9j77j73J57J36P6n3j87L00r7j12P0l7k99K68R6k04J42
3406B0J43J55k36N7k44Q4J39J21j54k25K60p7M5m9k14M08j83K9L41k19j63J84
3428B22q4j68J11L02L9o11K5J28M0O4p0k55K60Q7L0j69j3J93o7J18l5J4l81L72
$$ plain form
3452 152 -51 -154 209 323 69 -280 -560 -60 24 1 -159 -210 -19 21 420 -204 -100 269 -58 68 -179
3473 -179 229 -140 -12 28 58 265 103 -137 -617 -327 -99 -89 -17 -175 -180 -138 103 7 -76 -78 193 18 -281 59
3497 59 -28 -192 -162 -331 -239 -88 0 -210 -11 26 -105 36 146 -328 -8 22 -256 98 11 102 261 209 248 205
3521 205 139 -13 75 -292 303 206 10 246 -89 -183 121 96 -8 5 70 118 211 -12 62 -86 -53 323 -170 211
3545 211 412 265 176 191 208 192 7 -3 67 -30 19 61 124 -18 269 2 163 277 48 156 -79 -131 102 157
3569 157 188 98 69 -5 5 -21 66 -175 -5 59 -180 257 -224 285 -162 -90 -65 -41 -65 -80 -63 -22 37 -335 -326 23
3595 23 -131 -180 -20 -169 -264 -294 -248 -211 -273 -323 -159 -130 -262 -96 -115 -377 -408 -205 -145 -255 -70 -459 -144 -81
3619 -81 72 -250 -59 -187 -227 -77 -492 -44 -122 -469 -301 73 -98 164 45 -282 -181 80 4 83 52 345
$$ packed form
3452A52k03j03L63J14k54l49k80N00Q4k3j60n1J91M0L99o24J04L69l27J26k47
3473a79M08l69J28M0L0K07j62k40m80K90K28J0P2j58nM2K41r6q3kK71j75k99L40
3497E9q7j64L0j69R2J51Q8k10J99L7j31J41J10m74L20L0k78L54q7R1J59n2L9m3
3521B05o6j52Q8l67N95r7j96K36l35r4L04k5j04J3O5M8R3k23P4j48L3L76m93L81
3545B11K01j47q9J5J7j6j85j0P0r7M9M2O3j42K87k67J61J14k29J08k35n2K33N5
3569A57L1r0k9p4J0k6Q7k41J70O4k39M37m81N09m47P2K5K4k4j5J7M1N9l72RL49
3595B3j54m9J60j49r5l0M6L7o2n0J64K9j32J66j9k62l1K03O0j10J85l89L15O3
3619h1J53l22J91j28m0J50m15M48p8l47J68L74j71K62j19l27J01K61p6P9l1K93
$$ plain form
3641 345 52 -4 240 22 230 368 12 -85 -8 -46 21 122 173 100 172 162 12 119 -3 53 -47 163 65 -291
3665 -291 47 228 139 153 112 274 34 187 -14 199 360 58 101 109 374 13 252 -60 213 -212 32 19
3687 19 -67 -136 226 115 -71 9 -19 191 297 47 257 -80 72 -249 9 79 -78 102 -49 86 85 85 27 -67
3711 -67 73 -34 -69 -126 -222 35 49 -123 -104 333 -35 -112 -83 -33 -103 43 -158 102 35 103 21 -174 -194 -111 295
3736 295 -204 -48 93 125 -28 -91 167 -136 -216 34 -76 -38 -354 450 -253 221 -10 -74 -214 -58 -222 83
3758 83 -159 247 -27 19 -79 180 252 267 312 -67 -22 58 -81 -218 -27 -31 -72 167 -33 111 52 -3 -43 -105 22
3783 22 131 289 27 -65 -66 116 -21 102 2 174 223 230 -19 36 -371 15 107 171 390 39 323 -183 -190 -104
3807 -104 -218 125 -122 390 131 164 99 63 173 -362 -92 -63 86 -54 -83 166 335 351 258 66 -58 389
$$ packed form
3641C45k93n6K44k18K08J38l56r7P7l8O7J01N1p3P2j0j50J07j22N6j00K10r8l56
3665b91L38J81q9J4m1J62k40J53k01K13J61l02M3QK65l61K39l12K73m25K44j3
3687A9q6o9L62j11j86Q0k8K10J06k50K10l37J52l21K58P0j57J80j51J35j%n8r4
3711f7J40j07l5n7r6K57J4j72J9M37l68p7K9N0p0J46k01K60o7O8q2j95k0Q3M06
3736B95m99J56J41L2j53o3K58l03q0K50j10L8l16Q04p03M74k31o4j40J56j64L05
3758H3k42M06k74M6r8K59P2J5M5l79M5Q0j39j37J91mm1K39k00J44n9n5m0o2J27
3783B2J09J58k62r2jJ82j37J23j00J72M9Pk49N5m07L86R2O4K19l51K84n06pQ6
3807a04j14L43k47N12k59L3o5l6J10n35K70K9J49j40k9K49J69J6r3j92j24M47
$$ plain form
3829 389 -399 116 -98 -248 99 -31 221 5 117 -317 20 -227 32 -214 -29 -335 15 132 -92 -142
3849 -142 -130 -13 -34 -83 -164 -148 -37 10 -277 -314 -405 -25 45 -252 -202 -383 -300 112 -40 22 211 -356 157 -215
3873 -215 -83 -211 -195 -69 -163 -260 -29 -29 72 -178 131 -121 124 34 -117 57 -160 -28 -83 50 -72 190
3895 190 -63 -22 -117 -229 149 -100 57 194 -4 131 -99 -55 52 -266 -24 -126 307 40 -55 6 -42 -5
3917 -5 76 -88 -3 -19 -122 127 -101 32 317 77 -11 217 33 70 10 12 -114 -94 -78 30 128 300 -52 -145 199
3942 199 247 393 -400 33 51 -12 -13 125 -277 -117 208 -191 372 208 -13 39 162 6 179 119 83 0 -209
3965 -209 5 99 150 -114 -174 49 -92 -72 -352 -237 -38 -547 -92 -75 -139 -55 -201 96 -143 -86 -42 -8 77 -102
3989 -102 87 12 23 -164 43 -305 -13 161 -124 -281 207 -250 -190 -48 2 221 -230 71 113 -103 24 -159
$$ packed form
3829C89p88N15k14j50L47j30K52k16J12m34L37k47K59k46J85l06L50J17k24n0
3849a42J2J17k1m9q1J6J11M7k87l7r1L80P0k97N0j81Q3M12j52O2J89n67N13l72
3873b15J32j28J6J26r4r7K31%J01k50L09k52K45r0j51J74k17J32n5J33j22K62
3895A90k53M1r5j12L78k49J57J37j98J35k30M4J07l18K42j02M33k67r5O1m8L7
3917eQ1j64Q5j6j03K49k28J33K85k40q8K28j84L7o0Kj26K0J6J08R8J72l52r3L44
3942A99M8J46p93M33J8o3jJ38m02J60L25l99N63j64k21N2J23j56J73o0l6q3k09
3965b09K14R4N1k64o0K23j41K0k80J15J99n09M55J7o4Q4j46K97k39N7M4L4Q5j79
3989a02J89p5J1j87K07l48K92J74k85j57M88m57O0J42N0K19m51L01M2k16J27j83
$$ plain form
4011 -159 -171 200 26 -163 -317 -183 -54 28 -45 -184 76 265 -21 -111 -137 -4 -57 -127 118 -107 94 -18
4033 -18 -169 17 145 116 90 69 119 318 23 102 125 -50 -230 474 71 -129 78 163 -344 268 296 62 -269
4056 -269 -106 44 91 -316 126 188 31 94 182 250 23 342 104 -55 188 -58 -95 250 -193 239 93 80
4078 80 24 -33 -35 58 14 220 40 -198 196 -66 144 81 -30 -62 -35 -50 159 -94 -181 -10 -18 172 -266 -389 -215
4103 -215 182 41 55 -10 -81 -312 -43 -71 22 -149 247 63 -232 -60 -4 -68 306 -199 -248 -24 -4 -27 107
4126 107 -217 -194 235 -165 4 -31 4 106 17 -271 -112 -236 -162 -44 211 38 -9 -275 -186 -39 -36 -134 -123 140
4150 140 22 -180 12 -3 -326 -235 -29 161 113 -59 -30 -104 84 38 237 239 -87 -78 -75 19 -52 277 -66 -34 337
4175 337 42 -146 323 91 42 53 5 139 44 -232 50 184 92 97 30 123 59 -97 348 74 -14 60 -105 73
$$ packed form
4011a59j2L71j74j89j54J34J29Q2p3j39K60J89k86r0k6J33n3p0K45k25K01j12
4033a8j51J86J28k9k6k1N0J99k95P9K3j75j80P04m03k00K07Q5n07O12K8k34l31
4056b69J63J50M7m07M42O2j57O3Q8O8k27L19k38j59K43k46l7L45m43M32j46j3
4078H0n6n7kR3m4K06j80k38L94k62K10o3j11l2K7j5K09k53q7J71qJ90m38j23J74
4103b15L97j41J4o5p1k31K69k8R3j71L96j84k95J72N6o4L74n05m9K24K0k3J34
4126A07l24K3M29m00J69l5L5J02q9k88J59j24P4J18K55j73m7k66Q9J47Lr8J1K63
4150A40j18k02J92j5l23R1K06J90m8j72K9p4J88m6J99Kl26RLR4p1L29l43L2L71
4175C37k95j88M69k32m9J1m8J34r5k76K82J34r2No7R3o4j56M45k74q8P4j65J78
$$ plain form
4199 73 176 8 -96 36 -135 70 242 74 57 56 -27 51 219 -131 -38 -25 260 87 -81 -460 184 252 -124
4222 -124 98 272 -14 117 14 -54 -71 18 -1 86 -347 -58 -141 13 -9 -38 -46 -39 174 158 -40 161 292 229 175
4247 175 231 -60 -255 -177 -17 121 -134 -87 -307 -77 102 126 184 1 -88 -36 30 -246 70 -264 -146 -276 -214
4270 -214 6 -107 -425 346 197 -110 -144 -148 45 198 68 -225 -63 -76 74 50 -84 64 -131 -89 -34 105
4292 105 3 107 192 37 -83 44 -60 250 -7 297 40 -10 219 360 -8 81 175 -129 89 -28 371
4313 371 100 -13 191 173 20 287 117 111 -47 272 23 113 108 278 223 41 162 64 58 29 111 -43 25 -178
4337 -178 153 -7 130 69 -122 -135 16 242 -37 -43 52 138 -119 39 -12 -232 -237 -9 -135 21 123 389 236
4360 236 254 -200 -17 8 159 -86 -168 -77 -296 117 -163 35 -124 -13 -84 234 -52 -188 -173 103 268 -159
$$ packed form
4199G3J03j68j04J32j71K05J72j68j7jq3P8J68l50R3J3K85j73j68l79O44O8l76
4222a24K22J74k86J31j03o8j7Q9j9Q7m33K89q3J54k2k9qPK13j6j98K01J31o3n4
4247A75N6k91j95P8J60J38k55M7k20K30J79K4N8j83q9N2O6k76L16l34J18j30O2
4270b14K20j13l18P71j49l07l4mJ93J53j30k93J62j3J50k4j34J48j95M2N5J39
4292A05j02J04Q5j55j20J27j04L10k57L04k57n0K29J41l68Q9R4l04K18j17L99
4313C71k71j13K04j8j53K67j70oj58L19k49R0nJ70n5j82J21r8ok9Q2j54O8k03
4337a78L31j60J37o1j91j3J51K26k79oR5Q6k57J58n1k20nK28j26J56J02K66j53
4360B36J8m54J83K5J51k45q2R1k19M13k80J98j59J11p1L18k86j36J5K76J65m27
$$ plain form
4382 -159 -74 -33 -47 -61 -88 30 -168 -391 28 -141 -56 -43 142 82 -133 -369 -169 -97 -129 -386 -374 -94 172 -226
4406 -226 132 33 -346 90 -163 189 -250 -5 -11 146 -238 -103 -64 -144 -217 67 19 -249 -32 -101 16 361 125
4429 125 -391 -62 74 -196 -15 164 118 31 -137 23 -63 -153 8 135 222 180 90 -95 273 -206 14 256
4451 256 164 225 -159 259 -100 446 216 -224 236 326 14 289 26 -156 54 7 16 50 89 213 301 -110 -185
4474 -185 167 114 132 58 0 -130 102 177 -376 39 -78 -22 12 -86 -180 -136 300 166 36 -12 6 48 133 107 -44
4499 -44 -10 -19 1 -26 -215 139 -248 62 -182 -79 94 121 97 30 -161 37 -246 -72 -49 -21 -55 -21 42 13 -144
4524 -144 177 96 -12 -39 -218 43 179 265 -69 95 -29 -91 -102 -150 -232 95 46 52 -174 -152 139 -110 -160 471
4548 471 -202 -330 6 -108 -147 214 -26 122 250 -122 -79 -109 130 -50 39 -96 130 4 33 140 -6 -15
$$ packed form
4382a59Q5M1j4j4k7J18j98k23M19j69Q5J3J85o0k15k36K00P2l2k57J2K80K66l98
4406b26L58r9l79M36k53L52m39K45oJ57l84J35L9q0p3K84m8k68K17o9J17L45k36
4429A25n16L29J36k70J81J79m6q7j68J60q6r0J61J27Q7m2r0j85L68m79K20K42
4451B56r2O1l84M18l59N46k30m40M60R0l12K75k63j82K10m7RL4L9J24Q8m11p5
4474a85L52n3J8p4n8j30K32P5n53M15j17N6L4r8r4M4M36j34j30m8J8M2Q5k6j51
4499d4L4rK0k7j89L54l87L10k44J03J73K7k4o7j91J98k83J74K3K8l4L4O3k9j57
4524a44L21q1j08k7j79K61J36Q6l34J64j24o2j1m8q2L27m9Ok26K2K91k49n0O31
4548D71o73j28L36j14l9L61k40J48J28l72M3l0K39j80Q9j35K26j26K9J07j46r
$$ plain form
4570 -15 -43 -105 171 -83 51 241 33 215 19 77 211 314 107 32 304 -5 350 -120 -68 281 -136 91
4592 91 182 332 -104 -77 273 16 105 212 138 32 -48 63 102 -100 49 -89 184 -93 -150 319 -401 -112 84
4615 84 -139 300 -23 218 145 160 42 -400 -193 -98 44 124 -294 -64 -60 -77 187 -111 -143 -180 112 -26 -33 177
4639 177 -132 -100 -117 163 -89 -89 11 -171 450 148 -177 -85 229 -38 265 -129 -70 76 -47 -103 -80 -291 234
4662 234 -174 103 111 37 -140 -23 142 -139 166 -244 139 222 13 228 -73 83 -161 65 -273 -5 75 -88
4684 -88 -211 -23 -2 227 -48 172 -81 10 -114 -175 132 -46 101 45 210 2 48 -206 130 58 134 391 129
4707 129 -13 -225 130 355 247 101 -244 -203 -47 138 83 137 21 148 47 -88 -89 142 146 -210 -144 -94 107
4730 107 144 138 70 123 286 130 -60 -51 128 -150 145 64 -24 -25 -62 -18 23 -155 140 50 23 185 -16 99 -145
$$ packed form
4570a5k8o2K76k54J34J90k08J82j96N8J34J03k07p5K72l09L55m70N2L49m17K27
4592I1R1J50m36K7L50k57Q9J07p4j06q0J11L9k02J49j38K73k77n7M69p20K89J96
4615H4k23M39l23K41p3J5j18m42K07R5J42Q0m18K30Mj7K64k98l2l7K92j38pK10
4639A77l09L2j7K80k52%J00j82O21l02l25R2L14k67L03l94N9J46j23n6K3k11N25
4662B34m08K77Qp4j77J17J65k81L05m10L83Q3k09K15l01J56k44K26l38K68Q0j63
4684h8j23J88K1K29k75K20k53R1j24o1L07j78J47n6J65k08M6k54L36p2P6K57k62
4707A29j42k12L55K25j08j46l45M1J56J85n5N4j16J27j01j35jK31Ml56O6N0K01
4730A07L7oo8N3J63j56j90RJ79k78K95q1q8jl7M4M1j78K95r0k7J62k01J15k44
$$ plain form
4755 -145 -318 71 -366 135 -184 186 -355 34 -186 -118 -124 -253 102 126 -315 -27 0 -99 -61 -319 184 -369
4777 -369 242 -294 -67 26 93 82 -270 -67 103 -73 -205 97 -192 -260 104 197 40 -46 -85 -192 -56 84
4799 84 -202 -105 218 -56 -172 75 139 62 181 -201 -225 -10 -52 104 9 265 299 124 65 -62 -216 288 36
4822 36 158 -85 261 44 88 129 -15 -38 252 -65 -86 -129 353 199 -72 58 -322 118 31 -92 197 186 161
4845 161 305 48 73 226 88 119 325 -185 328 223 65 359 51 85 77 72 -47 -126 67 -77 288 -257 -16
4868 -16 -16 -136 -309 57 158 -142 -35 25 123 -298 -120 -171 151 22 73 -84 104 -433 -131 111 25 51 -144
4891 -144 208 -166 -120 -199 35 103 -41 116 16 -95 -148 113 180 13 124 -184 173 -197 -94 -62 16 -92
4913 -92 -143 -41 -372 -123 -155 -203 31 -185 -70 -20 -67 -94 131 -43 15 82 223 25 30 -200 25 92 -52 257
$$ packed form
4755a45j73L89m37N01l19L70n41L89k20O8oj29L55K4m41K88K7r9L8k58N03n53
4777c69O11n36K27R3O7j1l52K03J70j76j32L02k89o8L64R3j57q6l9j07J36J40
4799H4k86R7L23k74j16K47O4p7J19l82k4K15m2J56r5K56L4j75n9j27j54N04k52
4822C6J22k43L46k17M4M1j44k3K90l17k1m3M82j54k71J30l80M40q7j23K89j1k5
4845A61J44k57K5J53j38L1K06n10N13j05j58K94l08L4qnj19p9J93j44L65n45K41
4868a6%j20j73L66J01l00J07O0R8m21J78n1L22j29N1j57J88n37L02K42q6K6j95
4891a44L52l74M6p9K34O8j44J57j00j11n3K61O7j67J11l08L57l70J03L2P8j08
4913i2n1J02l31K49l2m8K34k16J15N0m7k7K25j74N8O7J41j98Nk30K25O7j44L09
$$ plain form
4937 257 148 -52 107 -80 -93 -128 -360 181 -200 20 145 88 69 -109 -89 110 188 3 -82 5 303 -224 -4
4960 -4 130 -171 -71 24 256 -436 -154 81 230 15 90 -16 62 47 12 363 -21 13 1 292 300 41 -249 20
4984 20 96 42 -82 -12 -115 165 109 247 -129 -306 5 168 12 86 -80 -90 125 31 275 -69 52 48 -39 -317
5008 -317 -8 308 143 128 -208 -65 103 54 -72 -85 103 114 118 22 66 194 -145 -95 -128 157 36 -235 -51
5031 -51 11 132 -43 133 251 49 -77 50 117 -215 -196 -117 -161 7 -164 1 128 -115 100 -222 162 -391
5053 -391 -270 129 -137 142 -84 159 -200 97 -21 236 185 -47 -100 -62 -314 9 -85 -21 -27 92 -128 -138 142
5076 142 -32 1 -246 102 75 -8 269 321 -176 -65 126 -93 -123 -158 -112 181 -123 -100 76 68 -14 -216 -26 -189
5100 -189 68 -52 10 136 -60 90 49 80 -104 37 -196 -62 -248 55 66 77 235 -58 241 -162 -110 -31
$$ packed form
4937B57j09k00J59j87j3l5k32N41l81K20J25n7j9j78K0J99P8j85q5Q7K98n27K20
4960dJ34l01J00R5K32o92K82K35J49k15P5j06P8j5l5L51l84L4j2K91Qk59k90K69
4984B0P6n4j24P0j03K80n6J38l76j77L11J63j56P4j66j0K15r4K44l44J21mq7k78
5008c17L09L16j65j5l36J43J68m9j26j3J88J1Mr6M4J28l39N0l3K85j21k71J84
5031e1O2J21j75J76J18k02j26J27O7l32J9P9m4J68j71J65J27k43K15l22L84n53
5053c91J21L99k66K79k26K43l59K97j18K57n1k32n3L8k52L23r4O4oJ19k20j0K80
5076A42j74L3k47L48k7q3K77N2m97J11J91k19l0l5M6K93l04K3J76qq2k02J90j63
5100a89K57j20O2J26j96J50m1L1j84J41k33J34j86L03J1J1J58k93K99m03N2P9
$$ plain form
5122 -31 -72 97 18 189 -113 94 -92 -118 53 -26 83 66 55 -243 -103 -80 61 46 133 -226 -94 3 201 -144
5146 -144 -7 186 -177 64 171 257 -16 -47 -166 -5 -163 25 111 -195 225 -218 -14 52 -138 -62 151 -125
5168 -125 -42 -236 -61 -138 31 6 -64 -21 -69 114 -159 -20 57 148 -80 -207 151 50 66 -68 -64 58 -59 38
5192 38 60 -45 -35 87 171 14 -256 72 -146 -183 51 146 -169 202 152 -61 -128 211 157 -81 -16 -285 143
5215 143 86 -7 -89 -171 -110 118 121 18 -120 150 94 202 -97 -103 400 0 -17 177 -78 -67 153 -230 188 119
5239 119 -249 305 23 183 75 -194 279 196 153 -56 155 284 141 -44 59 22 123 -46 -91 69 -192
5260 -192 -78 -238 189 235 -33 -90 221 -140 142 -193 -206 62 -148 -149 -162 47 -117 -198 -138 116 -57 -1 -273
5283 -273 229 -607 -148 -119 -365 -255 -150 333 -36 -95 26 -37 -234 -118 -45 110 2 -179 -234 -56 -93 113
$$ packed form
5122c1m1J69p9J71l02K07j86k6J71p9J09j7j1k98J40K3J41j5Q7l59J32R7J98l45
5146a44J37J93l63K41J07Q6k73l1j19J61j58J88Q6l06M20m43K04O6j90P6K13k76
5168a25Q3j94J75p7J69k5p0M3m8J83k73J39P7R1k28j27L58j01J6j34MJ22j17R7
5192C8K2j05J0J22Q4j57k70L28k18l7K34R5l15L71n0k13o7L39n4k38O5k69M28
5215A43n7r3q2q2O1K28Lj03j38K70n6J08k99oN03m00j7J94k55J1K20l83M18o9
5239A19l68N54k82J60j08k69M73q3m3k09K11J29j43j85J03l7J01j69m5J60k61
5260a92J14j60M27M6k68n7L11l61K82l35j3K68k10jj3K09j64q1O0K54j73N6k72
5283b73N02q36M59K9k46J10J05M83l69n9J21o3j97J16P3J55j08j81n5J78l7K06
$$ plain form
5305 113 -184 -62 -66 220 -14 -23 -38 117 57 127 5 206 242 -227 165 -142 -108 -187 31 -68 69 -277 12 -4
5329 -4 89 136 -133 -106 -257 -98 -46 -123 197 118 -122 91 57 38 -203 -90 23 20 211 48 181 146 111 178 42
5354 42 -2 -99 63 -191 -168 73 255 121 -191 -80 376 -85 -100 126 -134 153 169 89 -181 -11 99 -39
5376 -39 -80 17 130 177 -2 -175 151 132 169 34 235 87 12 -132 133 -264 170 -72 -227 120 -144 -139 79
5399 79 258 145 -171 -130 -98 -87 56 -65 312 -77 239 409 83 54 -126 68 -82 -45 -391 -141 -250 -205
5421 -205 19 234 -153 -224 5 -46 -149 -45 -145 31 -53 171 175 -5 -195 -36 16 -152 33 -8 -158 -324
5443 -324 -204 -193 90 -57 -204 -87 63 -219 -112 -114 9 126 -321 94 53 167 132 137 -10 -154 -126 47 -111
5466 -111 117 238 -74 -170 -4 170 99 20 -111 -81 -47 122 -163 140 159 7 393 -22 -60 -166 -399 258
$$ packed form
5305A13k97J22mK86k34rj5J55o0P0j22K01L6m69L92l07L4p9K18r9J37l46K89j6
5329dR3M7k69K7j51J59N2p7L20p9k40K13l4j9k41J13J13lJ91j63J33l5l5O7j36
5354D2m4r7J62k54K3K41J82j34l12J11M56m61j5K26k60K87J6q0k70J70J10j38
5376c9m1R7J13M7j79j73L26j9L7j35K01j48p5j44K65l97M34k42j55L47k64NK18
5399G9J79j13l16M1L2J1J43j21L77l89L16J70l26k9j80J94j50L7l46K50j09M5
5421b05K24K15l87p1K29n1j03J04j00J76q4K24Mj80j90J59N2j68J85m1j50j66
5443c24J20J1K83j47j47J17J50k82J07kJ23J17m47M15m1J14l5Nj47j44K8J73j58
5466a11K28J21l12r6J66J74p1p9j31L0L4J69k85L03J9j52L86m15l8j06k33O57
$$ plain form
5488 258 -100 -96 91 -31 -108 -34 -150 8 133 24 -137 124 -49 291 -155 92 181 -87 -127 -121 -84 -200 27
5511 27 -36 7 145 72 -75 189 -173 -16 367 -164 -80 -295 -117 -58 -159 50 -171 -148 -49 -15 -302 -264 -55
5534 -55 241 119 -145 10 -229 -118 167 -250 -74 -74 68 37 -23 180 -71 141 -173 37 -107 -224 3 -190
5556 -190 -32 -231 -149 -106 -91 -209 48 -53 -319 -82 -75 124 157 -19 -37 5 -38 63 -222 117 91 -24 137
5579 137 -41 -29 -70 13 -92 -104 -2 22 168 -128 -99 222 -20 53 17 -69 -245 64 84 -20 63 123 14 -178
5603 -178 -302 -35 -102 32 -125 -91 103 235 -13 320 -6 259 116 152 105 99 141 151 34 20 48 -126 64
5626 64 233 -155 -127 176 315 -111 -322 -66 -15 18 -126 322 -59 33 -35 -197 -183 292 0 90 472 8 -99
5649 -99 51 -11 -51 151 -49 80 -95 194 97 526 -279 -159 198 35 54 102 61 204 177 26 121 34 12 -41
$$ packed form
5488B58l58MJ87j22p7P4j16J58J25j09j61K61j73L40m46K47Q9k68m0OL7j16K27
5511B7o3M3J38p3j47K64l62J57L83n31Q4k15J78N9j01K09k21K3R9L4k87L8K09
5534e5K96j22k64J55k39J11K85m17J76%J42l1o0K03k51K12l14K10j44j17K27j93
5556a90J58j99Q2M3J5j18K57j01k66K37PJ99L3j76j8M2m3J01k85L39k6j15J61
5579A37j78J2m1Q3j05j2J02K4J46k96K9L21k42P3l6q6j76L09K0j04Q3O0j09j92
5603a78j24K67o7J34j57L4J94J32k48L33l26K65j43L6m7oM2J0j17j4K8j74J90
5626F4J69l88K8L03J39m26k11K56N1L3j44M48l81R2o8j62J4M75k92R0L82m64j07
5649i9J50o2m0K02k00J29j75K89r7M29q05J20L57j63J9M8m1J43k7j51R5q7k2n3
$$ plain form
5673 -41 24 -56 174 -91 -379 -38 -67 -106 -109 118 -184 -4 176 -152 368 249 -50 -30 8 43 -153 -150 -171 -41
5697 -41 84 -249 -52 73 -308 29 -166 70 56 -9 -34 -181 -88 -36 -378 42 197 -5 311 113 320 -5
5719 -5 44 -91 -105 -116 56 -262 -249 167 204 -25 50 -56 -170 85 29 -257 116 86 83 -209 -41 -10 -12 -51 -19 183
5745 183 -11 -170 -109 -21 -164 320 97 20 293 -174 213 166 -6 -60 -111 67 -417 400 327 236 -166 -66 -94
5768 -94 -61 -183 -220 77 -37 -89 144 -37 -39 271 38 34 -9 -77 -109 141 16 43 -27 -6 258 -154 -134 183 188 -199
5794 -199 -136 253 -176 -36 -199 -191 -142 -148 -312 -23 -236 143 -1 -59 28 -71 -217 -181 150 -170 84 -74 -107 -232
5818 -232 -75 -169 91 252 -30 47 -97 -56 -105 -157 157 46 -57 205 109 -49 -94 -231 174 76 -95 106 -23
5841 -23 -1 -51 -183 -116 82 -64 -7 -97 68 -46 -238 174 107 36 -113 -6 159 203 -175 290 121 274 23
$$ packed form
5673d1O5q0K30k65k88L41k9l9lK27l02J80J80l28N20j19k99K0L8L5j96Lk1J30
5697d1J25l33J97J25l81L37j95K36j4o5k5j47R3N2l42M20J55k02L16j98K07l25
5719eM9j35j4j1J72l18J3M16L7k29P5j06j14K55n6k86L73l0lk92J68L1kl9L2K02
5745A83j94j59O1Q8j43M84k23p7K73m67L87m7j72n4n1J78m84Q17p3r1m02J00k8
5768i4L3j22l7K97j14n2K33j81kL10k33mm3o8l2K50j25K7p0K1K64m12K0L17Nl87
5794a99O3L89m29J40j63QM9oj64K89k13L79j44n8Q7r9j46L6L31l20K54j58l3j25
5818b32J57r4K60J61k82P7j44M1m9n2L14j11j03K62r6j58m5j37M05r8j71K01j29
5841b3K2n0j32O7J98j46N7r0J65j14j92M12o7p1j49J07J65M4l78M65j69J53k51
$$ plain form
5864 23 -80 190 -147 128 68 15 -140 108 -74 182 -74 -7 39 7 301 98 215 33 -143 2 90 -9 -128
5887 -128 -48 151 17 4 -61 286 -157 230 267 380 80 62 32 91 52 34 358 23 -135 143 -5 89 -148
5910 -148 -27 -214 8 -159 -161 -188 -188 246 8 -95 -115 18 -1 -30 20 -48 137 90 255 -162 164 -84 -27 -185
5934 -185 65 24 20 -337 51 87 0 297 58 13 34 1 167 23 -5 -295 54 316 -232 31 -120 -113 -70 -17
5958 -17 -234 15 290 45 99 16 -363 31 20 -86 -58 -33 13 -84 126 -63 -118 268 288 -32 158 -124 51
$$ packed form
5864B3j03K70l37K75o0n3j55K48j82K56k56O7M6l2K94k03J17j82j76J45Q8r9j19
5887a28Q0J99j34j3o5L47m43L87L7J13l00j8l0N9l9j8L24l35j58K78j48R4k37
5910a48J21j87K22j67kk7%M34k38j03k0J33j9k9N0o8J85m7J65m17L26k48N7j58
5934a85K50m1ml57L88L6q7K97k39m5K1l3J66j44k8k90L49K62n48K63j51PM3N3
5958a7k17K49K75k45N4q3l79L94j1j06K8K5M6r7K10j89n5L86K0l20J90k82J75
$$ [...]
8191C9
##END NTUPLES=NMR FID
##END=
