##TITLE=1H_Pr 5-5-2
 CDCl3, 8 sc, 
 27.6.2019
##JCAMPDX= 6.0         $$ Bruker NMR JCAMP-DX V2.0
##DATA TYPE= NMR FID
##DATA CLASS= NTUPLES
##ORIGIN= UXNMR, Bruker Analytische Messtechnik GmbH
##OWNER= root
$$ XWIN-NMR		Version 3.5
$$ Thu Jun 27 16:26:59 2019 Russian Standard Time (UT+4h)  she@DPX200
##.OBSERVE FREQUENCY= 200.13155
##.OBSERVE NUCLEUS= ^1H
##.DELAY= (6, 6)
##.ACQUISITION MODE= SIMULTANEOUS
##.ACQUISITION SCHEME= undefined
##.AVERAGES= 8
##.DIGITISER RES= 18
##SPECTROMETER/DATA SYSTEM= spect
##.PULSE SEQUENCE= zg30
##.SOLVENT NAME= CDCl3
##.SHIFT REFERENCE= (INTERNAL, CDCl3, 0, 15.7039)
##AUDIT TRAIL= $$ (NUMBER, WHEN, WHO, WHERE, WHAT)
$$ ##TITLE= Audit trail, XWIN-NMR		Version 3.5
$$ ##JCAMPDX= 5.01
$$ ##ORIGIN= Bruker BioSpin GmbH
$$ ##OWNER= she
$$ F:/spectra/data/she/nmr/H-F/1/audita.txt
$$ ##AUDIT TRAIL=  $$ (NUMBER, WHEN, WHO, WHERE, WHAT)
(   1,<2019-06-27 16:26:08.32 +0400>,<she>,<DPX200>,
      <created by zg, POWCHK disabled, PULCHK disabled
       configuration hash MD5:
       00 E9 B6 7A A2 85 ED C7 34 08 36 98 17 FE 4E 26
       data hash MD5: 16K
       47 96 C8 28 28 A2 4E 35 F9 6F 22 55 9E 6D 59 97>)
$$ ##END=
$$ 
$$ hash MD5
$$ 0B 98 C0 89 8C 44 0D 53 53 07 70 CA AA A0 A3 30
##$RELAX= 
##$RELAX= 
##$RELAX= 
##$RELAX= 
##$RELAX= 
##$RELAX= 
$$ Bruker specific parameters
$$ --------------------------
##$DU= <F:/spectra>
##$EXPNO= 1
##$NAME= <H-F>
##$PROCNO= 1
##$TYPE= <nmr>
##$USER= <she>
##$AMP= (0..31)
100 100 100 100 100 100 100 100 100 100 100 100 100 100 100 100 100 100 
100 100 100 100 100 100 100 100 100 100 100 100 100 100 
##$AQSEQ= 0
##$AQ_mod= 1
##$AUNM= <au_zg>
##$AUTOPOS= <>
##$BF1= 200.13
##$BF2= 200.13
##$BF3= 200.13
##$BF4= 200.13
##$BF5= 200.13
##$BF6= 200.13
##$BF7= 200.13
##$BF8= 200.13
##$BYTORDA= 1
##$CFDGTYP= 0
##$CFRGTYP= 5
##$CHEMSTR= <none>
##$CNST= (0..31)
1 1 145 1 1 1 1 1 1 1 1 1 1 1 1 1 1 1 1 1 1 1 1 1 1 1 1 1 1 1 1 1 
##$CPDPRG= <>
##$CPDPRG1= <>
##$CPDPRG2= <>
##$CPDPRG3= <>
##$CPDPRG4= <mlev>
##$CPDPRG5= <mlev>
##$CPDPRG6= <mlev>
##$CPDPRG7= <mlev>
##$CPDPRG8= <mlev>
##$CPDPRGB= <>
##$CPDPRGT= <>
##$D= (0..31)
0 1.2 0 0 0 0 0 0 0 0 0 0.03 0 0 0 0 0 0 0 0 0 0 0 0 0 0 0 0 0 0 0 0 
##$DATE= 1561638367
##$DBL= (0..7)
120 120 120 120 120 120 120 120 
##$DBP= (0..7)
150 150 150 150 150 150 150 150 
##$DBP07= 0
##$DBPNAM0= <>
##$DBPNAM1= <>
##$DBPNAM2= <>
##$DBPNAM3= <>
##$DBPNAM4= <>
##$DBPNAM5= <>
##$DBPNAM6= <>
##$DBPNAM7= <>
##$DBPOAL= (0..7)
0.5 0.5 0.5 0.5 0.5 0.5 0.5 0.5 
##$DBPOFFS= (0..7)
0 0 0 0 0 0 0 0 
##$DE= 6
##$DECBNUC= <off>
##$DECIM= 24
##$DECNUC= <off>
##$DECSTAT= 4
##$DIGMOD= 1
##$DIGTYP= 9
##$DL= (0..7)
0 120 120 120 120 120 120 120 
##$DP= (0..7)
150 150 150 150 150 150 150 150 
##$DP07= 0
##$DPNAME0= <>
##$DPNAME1= <>
##$DPNAME2= <>
##$DPNAME3= <>
##$DPNAME4= <>
##$DPNAME5= <>
##$DPNAME6= <>
##$DPNAME7= <>
##$DPOAL= (0..7)
0.5 0.5 0.5 0.5 0.5 0.5 0.5 0.5 
##$DPOFFS= (0..7)
0 0 0 0 0 0 0 0 
##$DQDMODE= 0
##$DR= 18
##$DS= 0
##$DSLIST= <SSSSSSSSSSSSSSS>
##$DSPFIRM= 0
$$ [...]
##$SUBNAM2= <"">
##$SUBNAM3= <"">
##$SUBNAM4= <"">
##$SUBNAM5= <"">
##$SUBNAM6= <"">
##$SUBNAM7= <"">
##$SUBNAM8= <"">
##$SUBNAM9= <"">
##$SW= 24.9336996594482
##$SWIBOX= (0..15)
0 0 2 0 0 0 0 0 0 0 0 0 0 0 0 0 
##$SW_h= 4990.01996007984
##$TD= 16384
##$TD0= 1
##$TE= 0
##$TE2= 300
##$TE3= 300
##$TEG= 300
##$TL= (0..7)
0 120 120 120 120 120 120 120 
##$TP= (0..7)
150 150 150 150 150 150 150 150 
##$TP07= 0
##$TPNAME0= <>
##$TPNAME1= <>
##$TPNAME2= <>
##$TPNAME3= <>
##$TPNAME4= <>
##$TPNAME5= <>
##$TPNAME6= <>
##$TPNAME7= <>
##$TPOAL= (0..7)
0.5 0.5 0.5 0.5 0.5 0.5 0.5 0.5 
##$TPOFFS= (0..7)
0 0 0 0 0 0 0 0 
##$TUNHIN= 0
##$TUNHOUT= 0
##$TUNXOUT= 0
##$USERA1= <user>
##$USERA2= <user>
##$USERA3= <user>
##$USERA4= <user>
##$USERA5= <user>
##$V9= 5
##$VALIST= <valist>
##$VCLIST= <CCCCCCCCCCCCCCC>
##$VD= 0
##$VDLIST= <DDDDDDDDDDDDDDD>
##$VPLIST= <PPPPPPPPPPPPPPP>
##$VTLIST= <TTTTTTTTTTTTTTT>
##$WBST= 1024
##$WBSW= 4
##$XGAIN= (0..3)
0 0 0 0 
##$XL= 0
##$YL= 0
##$YMAX_a= 189536
##$YMIN_a= -321879
##$ZGOPTNS= <>
##$ZL1= 120
##$ZL2= 120
##$ZL3= 120
##$ZL4= 120
##$ABSF1= 10
##$ABSF2= 0
##$ABSG= 5
##$ABSL= 3
##$ALPHA= 0
##$AQORDER= 0
##$ASSFAC= 0
##$ASSFACI= 0
##$ASSFACX= 0
##$ASSWID= 0
##$AUNMP= <proc_1d>
##$AZFE= 0.1
##$AZFW= 0.1
##$BCFW= 1
##$BC_mod= 2
##$BYTORDP= 1
##$COROFFS= 0
##$CY= 11.3945322036743
##$DATMOD= 1
##$DC= 2
##$DFILT= <>
##$DTYPP= 0
##$F1P= 18.9103706918063
##$F2P= -1.10871071338519
##$FCOR= 0.5
##$FTSIZE= 0
##$FT_mod= 4
##$GAMMA= 1
##$GB= 0.15
##$INTBC= 1
##$INTSCL= 1
##$ISEN= 128
##$LB= 0.24
##$LEV0= 0
##$LPBIN= 0
##$MAXI= 10000
##$MC2= 0
##$MEAN= 0
##$ME_mod= 0
##$MI= 1.114404
##$NCOEF= 0
##$NC_proc= 0
##$NLEV= 6
##$NOISF1= 3.799351
##$NOISF2= 2.8
##$NSP= 1
##$NTH_PI= 0
##$NZP= 0
##$OFFSET= 15.70392
##$PC= 1
##$PHC0= -8501.026
##$PHC1= 15.40098
##$PH_mod= 1
##$PKNL= yes
##$PPARMOD= 0
##$PSCAL= 0
##$PSIGN= 0
##$REVERSE= no
##$SF= 200.130013532006
##$SI= 16384
##$SIGF1= 3
##$SIGF2= 2
##$SINO= 400
##$SIOLD= 16384
##$SREGLST= <1H.CDCl3>
##$SSB= 0
##$STSI= 0
##$STSR= 0
##$SW_p= 3612.71676300578
##$SYMM= 0
##$S_DEV= 0
##$TDeff= 0
##$TDoff= 0
##$TI= <>
##$TILT= no
##$TM1= 0
##$TM2= 0
##$TOPLEV= 0
##$USERP1= <user>
##$USERP2= <user>
##$USERP3= <user>
##$USERP4= <user>
##$USERP5= <user>
##$WDW= 1
##$XDIM= 8192
##$YMAX_p= 0
##$YMIN_p= 0
$$ End of Bruker specific parameters
$$ ---------------------------------
##NTUPLES= NMR FID
##VAR_NAME=  TIME,          FID/REAL,        FID/IMAG
##SYMBOL=    X,             R,               I
##VAR_TYPE=  INDEPENDENT,   DEPENDENT,       DEPENDENT
##VAR_FORM=  AFFN,          ASDF,            ASDF
##VAR_DIM=   8192,          8192,            8192
##UNITS=     SECONDS,       ARBITRARY UNITS, ARBITRARY UNITS
##FACTOR=    0.0002004,     1,               1
##FIRST=     0,             0,               0
##LAST=      1.6414764,     0,               0
##MIN=       0,             -321879,         0
##MAX=       1.6414764,     189536,          0
$$ Real data points
##PAGE= N=1
##DATA TABLE= (X++(R..R)), XYDATA
0 0 0 0 0 0 0 -4 7 -8 8 -9 16 -16 24 -32 38 -42 56 -64 73 -88 104 -120 140 -161 185 -214 243 -278 313
29 313 -354 399 -449 504 -563 630 -701 781 -866 961 -1066 1184 -1307 1448 -1604 1777 -1970
46 -1970 2188 -2435 2721 -3051 3440 -3905 4474 -5187 6114 -7374 9194 -12063 17303 -29967
60 -29967 126746 33878 -222212 13938 189536 117078 -33087 10173 66300 39638 -2374
71 -2374 68162 90275 -18483 -91568 36220 134759 43575 -59618 -9818 39813 11335 -7272
83 -7272 21472 21756 -1816 -7527 14906 12989 -28892 -35832 37340 63915 -18348 -61302 8471
96 8471 40373 -14315 -34087 8537 22199 -4237 -8506 27745 41837 -24567 -90247 -20767 102772
109 102772 85923 -36312 -74990 -7784 51840 50057 2059 -40090 -23614 23906 43179 30050
121 30050 -2859 -40508 -30025 23290 38677 10878 -5868 -20867 -33283 -1794 31388 3031
133 3031 -29553 -6754 15828 -10571 -40763 -23708 19031 15566 -42744 -49723 24381 46520 -29512
146 -29512 -69397 -24410 6052 -1108 3812 3941 -21330 -30232 -7566 8471 -6376 -25281 -7114
159 -7114 25246 6561 -30832 -2344 41565 5759 -38243 1395 45329 17690 -10126 12689
171 12689 28169 1884 -13030 28115 69005 31923 -34137 -15625 51665 49362 6073 13905
183 13905 38547 20059 4631 28811 46045 21087 -11316 -2783 41843 61046 29694 450
195 450 377 1483 13055 46644 44755 -8039 -27891 18719 57601 33003 -18540 -26883 18157 45500
209 45500 14284 -11361 6047 14605 345 9495 27771 9642 -14393 79 27181 19396 -15709
222 -15709 -21297 24964 50952 7431 -33500 -7889 25229 16369 1771 701 -3902 740 20717
235 20717 24850 3235 -18829 -16296 9630 24947 8922 -4760 2521 -1195 -9673 10317 24548
248 24548 -4476 -26753 -4660 18498 12933 -2144 -10407 -7071 2766 4727 3802 2789 -12290 -21095
262 -21095 3110 21469 -370 -16550 -918 5979 -3896 -5349 -5584 -8462 -554 7678 3842 -2932
276 -2932 -8880 -6908 7910 7182 -19394 -19527 13711 19710 -5250 -12310 -3586 194 2271 398 -6225
291 -6225 -2562 -315 -6249 1757 12457 -4164 -16819 1802 9404 -7008 -10727 323 3099 342
305 342 -3515 -5518 6113 9359 -11907 -16802 4868 7179 -5976 1146 6665 -4553 -2968 7153
319 7153 43 -7124 -2244 438 4870 8863 -255 -2725 9426 3710 -9087 2615 10604 -3670
333 -3670 -1738 12970 4125 -5397 6806 10371 -690 -3800 -1342 4139 10880 1451 -9408 7101
347 7101 17444 -3832 -10549 6633 3969 -8086 35 5553 -703 1849 3279 -2755 -655 -539
361 -539 -9999 -3348 7755 -3571 -9055 5343 4981 -7116 -2771 -354 -7791 -2425 3887 -4030 -2189
376 -2189 5406 -1405 -2941 5634 -2256 -9502 3812 6861 -6428 -1933 8991 3875 861 2770
390 2770 -3088 140 8012 -1648 -5863 9333 9063 -2919 3812 8877 -3667 -3787 5884 771 -2121
405 -2121 4607 2693 921 7260 1623 -6545 1625 3252 -5351 -413 4846 -3880 -366 9603 -1890
420 -1890 -10389 1655 3902 -6430 -3798 1709 90 2620 2008 -4382 586 4258 -7059 -6672 6960
435 6960 1905 -7487 3021 8558 -1284 -2331 784 -2011 639 2697 -4168 -904 9315 2811 -4522
450 -4522 3399 3049 -5557 -1688 2319 -2451 -184 3030 -2203 375 4974 -5413 -9786 117 369
465 369 -7704 -3850 -104 -3704 -2069 -1515 -8432 -7318 -2623 -8676 -9376 -1369 -3954 -8701 -3154 -2939
481 -2939 -8906 -6489 -6428 -12202 -6907 -51 -6356 -9583 -2502 -2182 -5718 -4961 -8707 -10540 -2512 -1012
497 -1012 -7041 -4003 -311 -5176 -3772 695 -6487 -10694 -3629 -704 -1726 -404 -4016 -6981 515
512 515 2833 -6396 -9577 -5562 -3867 662 2679 -6917 -10856 -768 3028 -5069 -10188 -11335 -7695
527 -7695 1328 1295 -8844 -8819 -2754 -4741 -5593 -2329 -7708 -14396 -7197 3052 2966 -3106 -11851 -11089 3717
544 3717 7003 -8266 -13655 -2495 3791 4117 4025 -1923 -6080 272 4508 2561 2872 -777 -5078 4862
560 4862 15460 8688 -2279 -3021 2190 10684 13914 279 -8562 5719 18446 12826 3937 -1545
574 -1545 -3015 7323 15734 5435 -6252 -2361 6868 13109 12157 -2402 -12732 -2064 9314 5982
588 5982 316 -4306 -8954 406 13614 4821 -11840 -12068 -4438 2812 6820 -2035 -14121 -6874 5791
603 5791 2545 -4615 -7826 -10395 -5033 1915 -4263 -8297 -1030 -2724 -10305 -2702 2371 -10932 -16525
618 -16525 -4589 1711 -1946 -8168 -11835 -4005 4898 -5536 -18713 -11239 -2260 -4818 -2787 -3207
632 -3207 -13659 -11436 1016 -3012 -13624 -11208 -9110 -10731 -4928 -2698 -8853 -11208 -11632 -11987 -3652
647 -3652 -3126 -18805 -19238 -986 -1601 -15425 -12720 -4261 -5718 -8786 -15216 -19927 -6444 5836 -7999
662 -7999 -20829 -11962 -1613 -185 -4709 -16880 -21010 -5776 2349 -3796 -3506 -4612 -16635 -11950
676 -11950 7759 5287 -12324 -15034 -7516 1940 11328 2767 -15270 -12157 4528 8037 1335 -7261
690 -7261 -11774 775 14215 2335 -9661 3025 8011 -4584 -1795 9070 825 -8617 1516
703 1516 14809 14920 -135 -15546 -3332 22968 16903 -10860 -13662 5047 17520 19907 6902
716 6902 -15566 -12836 13095 20112 7571 -1521 -7726 -6460 12579 24324 7966 -13083 -15896
729 -15896 1052 24018 19647 -12983 -22744 4366 20083 9270 -2612 -10907 -13070 2449 13254
742 13254 -302 -12894 -6521 2420 4147 -217 -10870 -13340 -3628 -1793 -4987 -818 -4410 -15316
756 -15316 -6651 7826 -3368 -21067 -16970 -2764 5942 3397 -13583 -22992 -7189 8137 1246
769 1246 -10458 -15021 -14386 -5321 5029 2231 -6796 -13129 -16334 -4583 14738 5134 -24838 -24608
783 -24608 2654 12194 700 -9484 -11802 -6958 -1891 -2525 -4969 -6040 -10039 -7556 4490 2470
797 2470 -12214 -10425 -52 -6637 -13520 -4476 1949 -3818 -7884 -7653 -6003 -3793 -4912 -5914 -4360
812 -4360 -7522 -12624 -3746 5852 -2722 -11485 -5894 -2202 -3417 -2231 -3298 -7007 -3300 893 -2182
827 -2182 -1628 4234 2838 -4137 -7561 -5036 4988 11438 2957 -5072 777 6098 3234 4598 4737
842 4737 -2866 -3123 6893 10655 7078 4406 614 -1794 2135 8172 8584 4021 -3718 -4653 8315
857 8315 14109 3727 -3488 -1041 -1663 537 9136 6426 -7144 -9185 2943 11007 6983 -4988
871 -4988 -11583 -4309 4469 2029 -2257 -2887 -3431 415 5407 -2761 -11901 -3889 5748 -504 -6150 -3204
887 -3204 112 2304 3494 -1512 -7118 -5819 -1098 5284 6461 -3826 -10273 841 8732 2007 -2379
902 -2379 -241 -4645 -4952 5597 7759 -612 -4153 -1607 2388 5286 1070 -4858 -3394 -2042 -2408
917 -2408 5062 8905 -3695 -11357 -1038 5479 -158 -4130 -4809 -4860 1663 5114 -1539 -4886 -2390
932 -2390 -3530 -3014 -75 -2834 -4166 1308 1469 -3356 -1938 -1460 -3726 1393 3368 -7579 -8387 5236
948 5236 7306 -2284 -3555 -543 -253 951 -271 -2203 913 1430 -2135 2576 7528 -1294 -5301 2598
964 2598 1458 -4626 1528 5802 -1071 -2096 2749 1066 -550 313 -3407 -3676 933 804 173 2852
980 2852 -2596 -6833 2466 4769 -6058 -6903 1890 -175 -3900 1352 1211 -2994 -783 -654 -3519 -1048
996 -1048 -364 -2506 1052 2691 -3424 -918 6266 -182 -6058 921 2097 -2214 2574 5261 -389
1011 -389 297 4550 721 -864 2559 195 12 5070 3325 -22 4232 3935 -1317 1451 2910 -2303
1027 -2303 854 6390 -59 -2621 6066 5352 -3067 -1149 1951 -555 510 1162 -1185 1716 3888
1042 3888 -919 -393 3304 -1896 -4156 3416 2720 -3854 1304 6150 -166 -1180 2462 -662 -1763
1057 -1763 3012 2157 263 3362 3101 1713 4477 1981 -2297 2743 5819 -1296 520 7690 3986
1072 3986 -566 4916 4964 -878 742 3632 1949 2062 2217 710 4458 5113 -1999 -2031 3977 687 -3992
1089 -3992 1567 3147 -1208 786 2131 -2847 -2523 573 -2823 -4397 -500 -936 -2080 620 -856
1104 -856 -4157 -2064 -2347 -5030 -905 232 -5358 -3190 3294 -245 -4538 -1251 -1188 -3986 -1429 163
1120 163 -1832 -847 745 -639 674 1553 -2572 -2289 1175 -326 -1064 3268 1791 -2229 2038 4304
1136 4304 -1309 -2907 715 682 506 1979 511 292 2497 1317 -313 392 -1674 -3046 2988 4332
1152 4332 -2011 -1585 3473 1261 -1714 762 -194 -3282 -637 2439 2478 1442 -1671 -1548 3791 3886 -3393
1169 -3393 -3412 2519 2352 1519 3791 2030 -734 2246 3631 952 482 358 90 3982 6482 2285 -141
1186 -141 2207 2942 2949 3078 -655 -1311 4859 6454 1788 978 2355 145 1522 4130 301 -2726 821
1203 821 3602 3573 2634 -1713 -3174 1925 3052 -1748 -2014 4 -985 1912 5273 -817 -5352 -1185
1219 -1185 1947 289 10 -2188 -3443 1979 5679 1318 -2560 -2487 -2216 1847 5103 -1725 -5103 2203
1235 2203 5237 1289 950 610 -3337 -1437 3881 3060 -152 -1206 -1399 3240 7570 -7 -7729 -1526
1251 -1526 4541 1672 391 -361 -3031 442 5734 708 -4377 -3065 -2140 -737 3709 776 -5896
1266 -5896 -2226 3151 694 -1117 -1580 -6429 -3866 4722 3354 -3172 -2880 -805 1007 4461 306
1281 306 -7647 -2877 5465 2773 -445 1813 73 -690 3998 3141 -1265 333 1338 67 5542 7064
1297 7064 -1004 -1952 5223 4382 813 1680 -443 -199 7063 6550 -1637 -377 4594 2238 519 683
1313 683 -1691 549 5194 1033 -2101 3403 2684 -4426 -1248 3272 -1561 -3685 81 1208 2079 1030
1329 1030 -4953 -4029 4977 1621 -7935 -3243 3987 1276 -283 403 -2854 -1359 3068 -36 -3441
1344 -3441 -158 -74 164 4883 2904 -3400 -334 3836 -195 243 4150 -796 -3192 5474 8252 1226
1360 1226 -2701 -2021 2161 7161 2812 -5901 -1111 7617 4283 18 2019 -1563 -4386 3007 5498
1375 5498 -1068 -3330 -751 628 4722 4232 -4861 -7424 -848 2638 2577 1015 -6607 -7379 5719 9727
1391 9727 -3453 -9913 -3742 1714 3767 2261 -3745 -4282 1995 2933 1025 2135 -1967 -7193 117
1406 117 8596 4025 -2662 -2706 255 6053 7126 -2354 -7377 1569 6863 2876 1390 762 -1624 1839
1422 1839 6451 2123 -2933 -1953 -16 3373 6414 1838 -3992 -1054 2374 2173 3260 -666 -8520
1437 -8520 -3033 9331 6942 -3995 -6049 -1651 2682 3457 -1135 -5507 -2495 684 1384 3649 1522
1452 1522 -5993 -4657 3688 2870 -2553 -1454 42 -820 2356 4114 -180 -3196 -1339 1527 2975
1467 2975 135 -3175 1563 6673 831 -4335 2067 4275 -2097 -2611 2621 2887 -79 -66 1315 3288
1483 3288 2071 -3084 -3087 2020 1747 -649 601 425 -1993 648 2955 -1158 -3025 -1635 -1919 -640
1499 -640 2832 1106 -2705 -1451 -161 -195 1091 -628 -3883 -1842 1675 1485 1324 981 -2527 -2390 1842
1516 1842 742 -1618 1284 1589 -2251 648 5322 2838 -2154 -2795 -598 2659 3283 -599 -1044 2278
1532 2278 1668 176 3262 1051 -4718 -1271 5027 1224 -2758 434 2408 587 127 -1190 -2204
1547 -2204 -675 -213 -77 1431 -1670 -4604 2130 5484 -3422 -7405 -130 2064 -1601 -44 996
1562 996 -1986 -1476 843 998 267 -2349 -5095 10 4631 958 -1438 1680 -728 -2894 3059 3908
1578 3908 -2979 -2851 1910 1928 2060 3542 444 -2273 109 1423 1510 2263 -1189 -2474 3494 4911 -1642
1595 -1642 -1133 2566 -883 -2196 1375 180 -2285 2192 2747 -1739 -1386 59 -2009 -563 535 -2687
1611 -2687 -1971 1731 352 -567 1244 -2526 -4529 1348 1727 -4428 -1687 3087 -817 -2027 2304 598
1627 598 -3154 -1300 -240 -398 1750 923 -764 1647 831 -2606 2411 4446 -3860 -5383 3993 4960
1643 4960 -1096 444 1920 -921 -208 1327 -247 -41 405 -1216 1546 3747 -1353 -2627 2839 185
1659 185 -5023 -101 2285 -2334 -961 2883 -965 -3076 370 -442 -2866 -1357 -1483 -1317 1588 -616
1675 -616 -3163 869 1800 -3609 -2667 1835 -1406 -2782 2326 1202 -1990 982 1903 -2120 -1546 782
1691 782 -103 1026 1478 -942 522 3519 828 -1282 1178 -416 -2203 2661 3568 -1730 127 3982
1707 3982 40 -2239 1112 594 -1675 135 1026 -101 1050 424 -629 1092 -773 -4590 -689 3546
1723 3546 -1857 -3769 2412 2125 -2691 -1511 101 -1634 -1496 531 -787 -278 399 -52 1203 1323
1739 1323 -2617 -2464 2088 430 -2693 1518 3250 -830 -393 2801 -8 -1872 768 958 91 843
1755 843 930 1171 2286 305 -1332 1344 1316 -2285 -187 2806 -200 -1011 2425 929 -2711 -785 837
1772 837 -1460 -1227 -518 -422 319 392 -829 -429 -6 -3220 -2499 536 -434 -2082 959 987 -2741 -1135
1790 -1135 1833 -1176 -3098 -1011 612 182 322 -45 196 1267 -728 -1599 1150 189 -2257 1604
1806 1604 3979 -630 -1553 2536 2033 -677 -303 201 126 1484 1727 797 902 125 -741 1417 1138 -3045
1824 -3045 -1613 2457 1081 -706 1354 190 -2433 -531 1392 -1571 -2492 -808 -123 879 736 -1218
1840 -1218 -1006 -178 -2222 -1817 1402 -239 -3211 680 3076 -975 -1948 563 -229 -702 407 -382 -697
1857 -697 1711 1673 729 947 -112 -1458 1642 2004 -1372 -255 2467 871 680 3357 399 -3268 71
1874 71 2914 645 -893 235 633 1919 1812 -1095 -874 23 -1942 -649 2822 -314 -3926 747
1890 747 3296 -1512 -2632 -460 -1342 -1418 563 -427 -1519 -38 20 -152 1016 -2166 -4122 636 2566
1907 2566 -1718 -1341 2041 -289 -913 2522 53 -3232 -636 1352 1086 1643 857 -1163 1169 2949
1923 2949 -266 -1121 634 -1233 105 4607 1631 -2630 350 2897 -207 -415 512 -2054 -724 2749
1939 2749 939 -822 282 -691 -1179 1252 -134 -3852 -1348 1369 -398 304 710 -3129 -2213 2390
1955 2390 -366 -4350 -1293 1073 -736 546 1003 -1301 -1068 189 -1065 -67 810 -2101 -1175 4221
1971 4221 2357 -2657 -213 1877 -634 182 1785 -583 -657 2975 2053 328 587 -523 -577 2136 808
1988 808 -2163 1112 2844 -892 47 2599 -528 -3284 475 921 -1216 41 306 -625 1085 934
2004 934 -2626 -1695 697 -1377 -1363 503 -918 -1226 2230 738 -3279 -1276 909 -954 -548 811
2020 811 -967 -174 2009 507 -755 711 -1027 -1967 2034 2653 -1411 -581 2119 1744 1602 967 -2522
2037 -2522 -1336 3319 1897 -1139 718 1844 337 1132 1536 -1597 -1558 424 185 1015 1790 -1248 -1954
2054 -1954 2331 2012 -1657 -2109 -1312 -1236 1557 1941 -2016 -2685 874 1172 -924 -1341 -2828 -2088 1298
2071 1298 1071 -1118 -227 104 -1835 -165 2074 -997 -3340 -464 1570 1745 1644 -1088 -2226 977
2087 977 2437 -471 -787 -191 -182 1500 3623 629 -1938 476 1111 167 700 208 -1271 467 2492
2104 2492 1104 326 -334 -2362 -403 2788 212 -3382 -690 2292 1285 48 -1489 -2209 -872 404
2120 404 -1100 -662 220 -1365 -623 1820 507 -2729 -1734 -471 -383 649 619 -1581 -365 1604 794
2137 794 -339 -373 -1076 -467 1613 1030 -62 1176 1128 -522 750 1842 -333 -969 641 774 1406 2212
2155 2212 268 -1223 1123 1472 -782 -686 -318 -537 963 2085 -659 -814 687 -697 -1576 386 -551
2172 -551 -1973 -184 1227 -179 -209 -92 -1960 -1481 216 -954 -1088 -264 -685 -358 1251 62 -1893
2189 -1893 151 314 -2287 -84 2519 176 -1615 927 1964 521 -190 -1122 -744 1844 1546 -525
2205 -525 1132 2189 -171 832 2543 -630 -1977 1468 2186 95 764 964 -209 868 1201 -816
2221 -816 -1049 -106 -231 650 2030 -955 -2040 1196 959 -2385 -1064 214 -1951 -1094 1395 -170 -1091
2238 -1091 164 -1411 -2130 273 -199 -1864 -226 91 -656 1443 1416 -2128 -1518 1232 -226 -1419 966
2255 966 441 -848 1674 2001 -1024 -685 893 -252 15 1362 206 440 2275 752 -884 1182
2271 1182 72 -1721 1410 1779 -1956 -552 3174 910 -1516 -190 -84 -1248 -134 -285 -802 953
2287 953 107 -1591 84 810 -2568 -1687 887 -1489 -2413 1659 1367 -1994 -1115 251 -1054 -995 -66
2304 -66 -1311 -759 804 -39 356 1343 -995 -2087 1258 984 -2420 114 2429 167 -112 1976 384
2321 384 -1252 655 328 -409 375 790 278 1961 894 -1276 853 1835 -1199 -1458 1487 516 -502
2338 -502 1492 814 -1129 184 1035 -1336 -974 588 -219 -194 886 -343 1 1031 -550 -1895 432
2355 432 -5 -1822 1045 2045 -1166 -962 1860 207 -1747 -190 304 -9 595 723 254 1053 724
2372 724 -659 478 716 -1359 -50 2361 107 -1419 1740 1915 -1399 -921 457 -251 -402 636
2388 636 -164 0 422 -177 377 305 -1668 -1947 1232 487 -1666 -48 1593 -854 -1200 585 -618 -1966
2406 -1966 -411 304 -37 302 -83 -277 1087 -613 -2072 100 674 -966 -130 1596 168 -794 1335
2423 1335 717 -1223 -114 777 -211 19 585 880 1017 459 -819 41 675 -925 -852 1497 588 -943
2441 -943 1206 1433 -1466 -891 949 -336 -1398 -467 411 569 271 -716 -676 100 -1309 -2014 290 232
2459 232 -1883 -415 1505 -473 -1785 238 -83 -1161 -479 -8 -618 400 567 457 478 -535 -917
2476 -917 738 975 -1810 -356 2780 1005 -1184 724 1519 -281 -255 814 -94 -2 988 1487 1432 816
2494 816 -730 -119 1395 -191 -972 962 586 -948 861 2171 -1029 -1764 416 171 -1092 -427 -42
2511 -42 -286 276 -574 -949 -4 -1060 -2281 76 768 -1773 -1166 1433 65 -1459 741 22 -2393
2528 -2393 -730 1225 55 -575 134 557 1293 592 -1284 -836 1187 117 -212 2018 1021 -1526 1297
2545 1297 3044 -114 -1217 750 325 242 1827 1402 83 593 695 387 1079 -373 -1756 1320 2032
2562 2032 -994 -943 2014 202 -1797 347 70 -2104 -694 1193 -147 -137 -260 -1012 31 509 -1741
2579 -1741 -1260 901 -723 -1140 1811 554 -2441 -378 1595 -945 -1328 438 -308 -426 2013 1184
2595 1184 -644 23 -105 -189 1069 454 -1366 659 2242 -293 -76 2195 -406 -1864 1403 1314 -1543
2612 -1543 -440 1831 752 384 222 -1272 -509 829 -1062 -933 755 -722 -794 1767 274 -2800
2628 -2800 -818 1323 -1358 -1575 597 -274 -1445 609 469 -733 -739 -1486 -1379 912 533 -1915 333
2645 333 1975 -307 -649 1397 -490 -1735 900 1558 -498 143 1625 356 447 607 -364 -60 916
2662 916 -372 168 2151 621 -763 1644 1336 -1382 -686 1105 -147 -57 1304 -80 -562 873 291
2679 291 -1125 -288 -658 -928 476 294 -1010 267 894 -1374 -1102 840 -855 -1898 528 1108 -765
2696 -765 0 802 -326 -170 11 -791 -270 432 -352 312 1512 -148 -635 1566 785 -1456 -177 1678
2714 1678 281 38 1638 978 -161 715 703 -130 -85 -384 -48 1577 1002 -589 520 1015 -902 -630
2732 -630 847 -531 -1632 759 1351 -468 -314 -538 -715 -23 -515 -1331 -691 272 -800 6 868 -881
2750 -881 -1762 -150 -94 -904 -276 56 -914 201 1562 -36 -1028 -136 -32 -27 755 -369 -493 1352 998
2769 998 -298 333 575 -758 69 1236 41 -362 1236 699 346 809 -130 -1322 -501 330 -42 326
2787 326 -86 -649 651 1292 -895 -1541 228 -201 -1100 376 473 -957 -772 -192 -601 -667 -356 -1554 -936
2806 -936 363 -37 -484 424 -711 -1566 651 296 -1930 -833 925 128 -270 1152 183 -577 62 -211
2824 -211 -275 733 -157 -672 1419 1676 -750 -628 789 -196 -724 290 -389 -473 928 653 -574 360
2842 360 163 -1377 -486 373 -699 -625 627 -363 -719 1054 -342 -1688 -608 -123 -1086 229 778 -910
2860 -910 -320 1146 -487 -930 339 -569 -1221 1214 1122 -108 470 816 -452 601 931 -895 -588 1839
2878 1839 994 -37 1631 1304 -317 1049 1353 -451 193 1276 394 724 1746 273 -155 1150 351
2895 351 -982 890 748 -1101 476 1801 -361 -542 399 -666 -954 403 -618 -1159 478 424 -706
2912 -706 -60 135 -1872 -1116 420 -800 -1027 544 -390 -912 544 54 -1383 -304 63 -1258 349
2929 349 1128 -835 -349 1604 215 -1126 254 248 -905 900 530 -463 663 1143 -534 -393 1178
2946 1178 -594 -1022 727 179 -920 766 653 -1176 -566 -33 -1424 -938 21 -1024 -674 383 -675
2963 -675 -1491 -38 -1234 -2463 -529 136 -2163 -1512 488 -445 -1299 -545 -1255 -1786 -470 -732 -1716 -59
2981 -59 293 -956 -271 540 -760 -857 467 -369 -624 1167 785 -122 1355 1338 -203 438 1336 -126 362
3000 362 1740 658 822 2102 769 236 1405 1013 -283 833 1149 183 1316 1994 -146 -113 1462
3017 1462 252 -1049 412 406 -286 694 245 -365 465 96 -1075 -337 224 -1007 -551 1067 86 -1153
3035 -1153 272 367 -1198 -574 222 -105 -39 473 -32 141 483 -332 -207 479 -477 -544 1464 977 -528
3054 -528 31 1520 47 -488 323 81 -86 724 646 406 789 215 -431 658 91 -1379 -152 861
3072 861 -337 -182 681 -213 -903 57 -376 -1520 -472 -376 -1039 -674 -22 -659 -598 -449 -1799 -1038 -96
3091 -96 -1012 -1545 167 -68 -1455 -561 -197 -1509 -1079 81 -980 -900 236 11 -264 123 -206 -961 -122
3110 -122 -275 -697 632 425 -877 634 1856 -422 -1528 573 523 -317 -85 306 331 810 264 -499
3128 -499 346 127 -1044 80 1143 -563 -210 1153 699 -1094 411 788 -889 -441 604 -24 104
3145 104 483 201 127 451 -904 -576 1117 122 -774 738 1322 -341 369 1317 -483 -743 772 401
3163 401 -291 798 685 442 685 597 -463 429 440 -826 325 1300 -292 -536 1605 705 -965 198
3181 198 390 -994 -116 884 -73 -193 517 -300 -190 121 -1144 -1086 656 -46 -1107 644 563 -1216
3199 -1216 -154 1128 -1263 -1648 465 35 -553 672 67 -887 152 153 -369 44 13 -1185 477 1655
3217 1655 -402 -1008 1425 589 -1358 200 654 -626 5 1166 124 283 611 -753 -330 992 -481
3234 -481 -793 789 188 -934 1008 462 -1803 -687 946 -944 -1515 309 368 -810 -172 62 -747
3251 -747 -65 -820 -1127 209 381 -1478 -390 1214 -376 -1199 325 -530 -1599 603 890 -1003 -182
3268 -182 1162 259 -249 -199 -268 21 436 -331 -100 1578 559 -729 1208 1395 -961 -545 1161 104
3286 104 -197 1236 573 -262 799 604 -595 -313 92 -210 462 275 -1053 130 1516 -715 -1453 440
3304 440 -76 -1737 -167 770 -614 -564 -65 -165 -98 -120 -1103 -785 384 -522 -259 883 103 -991 370
3323 370 447 -1431 -594 957 50 -522 777 652 -10 482 394 -45 0 -13 144 1090 883 -280 610 1072
3343 1072 -485 -561 905 384 -759 686 1204 -101 -435 500 114 -273 -87 -721 -218 527 -244 -277 834
3362 834 -539 -1131 110 316 -1192 -141 982 -300 -793 539 415 -582 -554 -616 -182 -39 -542 -132
3380 -132 1056 700 -745 53 1077 -526 -464 832 432 114 850 1212 -44 -16 640 90 -66 306 173
3399 173 838 937 81 660 1370 -268 -1332 650 952 -467 -401 720 39 -77 67 -481 -491 -28 -316
3418 -316 -395 197 -234 -285 482 -135 -1132 -307 101 -1248 -513 1020 -94 -916 214 543 -205 -362 -594
3437 -594 -193 305 29 -518 374 1075 -67 135 905 -366 -580 793 539 -195 835 1195 -170 -53
3455 -53 924 410 -198 -208 -230 384 1190 -258 -244 941 242 -1158 67 601 -1070 -716 747 -72 -615
3474 -615 99 -463 -916 -580 -485 -793 -202 -267 -690 320 62 -1562 -585 396 -941 -1303 504 286 -600
3493 -600 116 594 -527 -186 30 -506 -39 420 -226 293 1363 235 -294 1120 300 -748 847 1045
3511 1045 -369 398 1494 367 213 803 229 -436 447 403 6 887 347 -202 431 506 -743 -309 561
3530 561 -650 -587 1114 671 -925 165 313 -613 -149 181 -610 -9 761 -158 70 751 -272 -939 794
3549 794 -127 -1187 566 773 -489 194 1398 140 -600 637 397 -117 424 549 252 1057 748 -252
3567 -252 636 692 -457 82 1221 152 -74 1328 623 -147 601 357 -820 -193 553 -154 -61 491 -301
3586 -301 21 664 -588 -950 361 -47 -1125 193 812 -644 -588 364 -713 -887 -172 -629 -988 346
3604 346 215 -673 127 -71 -974 -358 -84 -1050 -386 757 -386 -827 807 290 -1140 -284 -90 -917 -142
3623 -142 299 -162 33 557 -505 -469 319 -408 -872 208 -10 -666 316 669 -735 -208 371 -621 -909
3642 -909 256 -205 -430 356 302 -108 363 11 -739 -109 366 -197 -264 924 35 -294 849 302 -642 107
3662 107 312 -121 351 869 97 368 1023 -101 0 775 185 -167 814 645 329 889 779 -48 175 663
3682 663 -33 43 692 225 317 885 362 -44 574 163 -625 -134 515 24 286 581 -222 -176 351 -225 -628
3703 -628 395 269 -350 267 664 -208 149 107 -410 110 37 -291 -215 678 372 -270 226 547 -165 -76 80
3724 80 -108 257 847 -31 -182 870 164 -342 173 -125 -262 284 435 -288 336 752 -244 -560 98 -592
3744 -592 -650 52 -402 -186 238 -327 -961 -177 -310 -1075 -610 -67 -689 -586 -85 -330 -756 -250 -903 -1133
3764 -1133 -472 -213 -815 -298 29 -190 -38 321 -645 -1022 344 52 -431 256 187 67 455 239 -331 5
3784 5 481 -433 404 1061 70 -16 884 687 58 315 225 -269 229 1145 -21 308 748 384 4 498 -534
3805 -534 -583 633 357 -338 574 549 -549 -312 223 -594 -518 -45 -113 -447 616 253 -592 -60 -1 -560 30
3826 30 138 -660 -163 825 -14 -324 497 135 -697 251 292 -337 550 1118 29 24 696 -181 -286 495 262
3847 262 -135 808 569 -20 872 762 -666 -160 970 -221 -795 525 609 -85 198 -86 -507 150 88
3866 88 -859 -449 390 -615 -427 664 -655 -717 -47 -98 -1291 -82 290 -711 -296 431 -141 -768 -153
3885 -153 -536 -196 87 -319 -660 863 508 -747 5 577 -681 -332 500 148 -404 523 525 -325 597 410
3905 410 -199 132 257 -102 571 586 -188 161 1318 -160 -932 316 434 -809 224 695 -208 -98 726
3924 726 -383 -481 -8 -757 -612 50 -50 -517 386 -333 -587 198 179 -1131 -878 651 -113 -599 322 472
3944 472 -360 -112 -46 -552 69 -237 -409 438 631 -500 -98 949 -8 -787 654 293 -590 253 812
3963 812 -157 -189 513 205 -33 86 -294 -42 573 251 -250 807 167 -857 80 593 -582 -526 648
3982 648 -90 -331 314 201 -445 -285 -341 -630 -167 -206 -426 181 332 -693 -674 112 -439 -681 432 127
4002 127 -323 380 443 -426 -464 193 -139 -48 155 -245 433 561 98 45 737 81 -686 460 748 -82 285
4023 285 836 329 -164 447 153 -421 -128 175 -39 313 -126 -188 703 -74 -791 -260 478 -552 -769 442
4043 442 354 -825 -77 166 -477 -554 -361 -499 -301 28 -436 251 484 -378 -449 376 -427 -1066 449 420 -773
4064 -773 39 547 233 77 161 -74 -113 -211 -50 266 978 128 -73 516 327 -550 46 676 -527 -312 786
4085 786 106 -419 380 197 -453 -397 -194 -215 285 -106 -245 211 253 -854 -452 449 -437 -776 240 329 -485
4106 -485 -118 474 -131 -430 -63 -404 -264 133 -196 245 572 -270 -382 710 63 -653 229 745 -409
4125 -409 110 1009 489 -194 177 297 -148 64 347 350 549 134 -316 605 650 -841 -318 716 -77 -902
4145 -902 463 497 -518 -116 184 -418 -557 -50 -342 -14 125 -333 83 238 -652 -919 172 82 -1120
4164 -1120 169 943 -347 -342 562 126 -720 -64 -13 -435 168 123 71 476 365 -699 100 618 -419 -310
4184 -310 902 -89 -139 1140 724 -345 -106 809 -237 -342 108 -25 146 307 -179 153 382 -502 -812
4203 -812 122 237 -972 -118 429 -509 -411 541 -432 -997 -219 -37 -774 204 288 -336 -5 -160 -631 46
4223 46 128 -827 -283 733 82 -301 704 560 -441 -73 390 -286 349 553 113 278 810 -14 356 527
4243 527 -201 -580 666 895 -284 632 914 -169 -69 776 77 -836 81 405 151 499 -171 -360 267
4262 267 -97 -577 61 126 -753 -465 548 -199 -842 25 102 -1053 -560 121 -473 -275 159 -165 -58 65
4282 65 -463 -525 180 -619 -555 347 172 -731 365 770 -331 -380 352 201 -153 270 563 153 375 283 -141
4303 -141 368 211 -183 256 682 -202 116 740 182 10 524 75 -766 -192 545 6 -8 86 -376 28 -219
4324 -219 -404 -482 94 -613 -706 392 242 -447 -46 -2 -674 -288 -88 -489 -468 273 188 -219 262 -134 -266
4345 -266 115 -208 -376 437 815 -314 204 900 118 -500 448 348 -206 108 497 361 613 673 132 256
4365 256 279 -157 53 508 -40 -151 900 492 -310 394 331 -773 -99 219 -98 -325 117 -28 -78 179
4385 179 -331 -419 -66 -349 -554 71 482 -403 -211 448 -680 -500 63 -96 -604 411 270 -238 228 131
4405 131 -305 167 -66 -476 34 682 53 0 684 112 -285 69 289 -341 120 509 -187 237 619 -156
4425 -156 197 42 -477 -374 542 66 -490 324 96 -485 -94 279 -564 -699 82 2 -416 273 57 -368
4445 -368 34 -83 -633 -153 -84 -517 -24 588 -133 -301 242 42 -423 220 -106 -168 325 554 -246 321 513
4466 513 -162 -164 523 114 -343 580 359 104 678 454 -409 -62 398 -673 -252 594 258 -282 672 50
4486 50 -331 -25 -41 -558 82 639 -577 -285 397 -376 -362 135 -623 -653 380 -11 -690 133 498 -229 -133
4507 -133 39 -387 -103 352 -262 -350 503 303 -341 356 426 -792 143 477 -150 162 505 69 79 542 302
4528 302 -306 193 127 -489 418 466 -167 389 656 -137 -411 555 -323 -482 226 227 -159 74 526 -507 -360
4549 -360 323 -357 -640 102 -5 -495 224 -38 -603 56 94 -695 -264 364 -464 -268 490 25 -391 437
4569 437 -104 -663 160 164 -323 81 531 -149 -83 681 -2 -146 397 -124 -48 647 500 -129 516 192 -254
4590 -254 -34 366 -251 -335 568 301 -211 297 402 -621 51 232 -334 -125 279 -235 52 225 -425 -392
4610 -392 368 -383 -760 -127 -12 -441 -151 415 -349 -277 -152 -319 -299 -188 -112 -34 313 79 -385 160 117 -383
4632 -383 -73 434 15 -118 675 148 31 439 81 -130 152 397 -45 380 459 107 282 377 -196 -120 423
4653 423 -153 -128 394 121 -324 367 233 -227 -420 5 -227 -231 268 -124 -49 590 -198 -232 81 -195 -687 -14
4675 -14 411 -259 -204 436 -80 -204 1 -173 -319 204 -115 11 466 235 -155 95 510 -438 -149 393 -53
4696 -53 -161 627 400 -102 1 267 -241 17 -20 -196 355 462 -107 158 663 -496 -436 250 -206 -416 7
4717 7 311 -603 -156 196 -536 -470 148 -644 -370 54 -273 -350 197 111 -449 -79 -361 -715 -124 389 -44 15
4739 15 370 -23 -122 204 185 -207 -75 90 294 523 478 -43 139 570 -372 -412 318 112 -316 516 595 -382
4761 -382 168 245 -164 -431 219 81 -169 454 81 -252 280 -232 -713 108 148 -889 151 356 -155 -531
4781 -531 231 45 -747 -349 -36 -224 207 220 -502 103 114 -231 -37 299 -513 -211 633 -34 -418 528 828
4802 828 -369 33 641 12 -217 405 143 235 452 268 106 615 188 -271 385 129 -368 199 732 18
4822 18 -187 512 -86 -560 -42 -148 -311 -119 352 -135 238 16 -855 -153 412 -714 -469 632 94 -347
4842 -347 181 47 -729 -484 229 -497 -358 274 -191 -155 226 4 -146 138 -188 -461 523 298 -501 93
4862 93 1044 169 -281 489 285 -408 159 330 9 353 244 88 396 206 -632 -267 391 -285 -211 469 203
4883 203 -545 177 373 -509 -185 -24 -64 -30 300 -265 -232 -105 -411 -744 92 -186 -420 179 283 -532 -75
4904 -75 520 -157 -633 496 66 -306 300 -76 123 171 164 149 331 147 -320 36 741 -202 81 831 241
4925 241 -387 356 320 -399 97 483 142 32 312 215 86 278 -489 -363 -37 -164 -566 496 294 -442
4945 -442 -130 309 -631 -576 104 17 -510 -111 307 -214 -79 -118 -443 48 5 -470 -91 219 -271 -57 511
4966 511 -75 -575 51 268 -190 31 195 -98 324 303 55 161 -6 -18 -88 541 -299 6 651 562 -237
4987 -237 7 585 -127 -141 125 7 -334 -72 239 35 12 -153 -492 -107 -241 -443 440 345 -568 -312 373
5008 373 -424 -679 -16 -47 -439 -146 291 70 -50 -61 -353 21 38 -296 45 260 0 58 629 276 -427
5029 -427 12 344 -194 90 782 226 -81 451 205 62 250 -139 -62 426 364 -456 335 391 -187 44 464
5050 464 104 -359 155 288 -342 -17 227 -220 30 -280 -408 14 87 -668 84 609 -286 -453 359 -168
5070 -168 -575 -126 308 -369 -226 244 -39 5 378 176 -210 74 -277 -167 384 419 -144 605 481 -349 -254
5091 -254 551 -97 -561 510 517 -80 15 190 -109 306 9 -444 181 404 -360 210 680 -505 -232 399
5111 399 -209 -880 -40 418 -425 -99 293 79 -319 -99 -274 -329 -97 -354 -484 433 -130 -458 368 212
5131 212 -585 -85 384 -306 -309 332 359 -38 365 32 -205 275 193 -114 219 388 -28 239 600 -272 -251 340
5153 340 147 -355 106 262 -28 -44 439 -42 -52 -29 -166 55 460 -225 -384 449 7 -533 105 -96 -722
5174 -722 -236 366 -193 -309 148 -15 -288 -174 -162 -559 -108 -117 -158 320 262 -197 203 524 -205 -519 226 203
5196 203 -268 360 325 -82 226 424 99 23 377 -89 102 461 41 -135 409 4 -367 338 98 -405 -184
5217 -184 525 71 -271 133 -12 -269 -63 -143 -376 35 -50 -33 18 32 -255 -207 133 -346 -463 272 110 -395
5239 -395 135 102 -327 -151 -47 -255 -101 -144 -217 -114 371 -66 -158 484 328 -408 46 420 -116 442 541 295
5261 295 74 366 141 -103 283 141 57 544 209 -44 215 208 -119 -29 512 -292 -250 261 78 -180 189 -151
5283 -151 -451 -254 -212 -323 -495 102 -271 -111 59 -344 -245 150 -300 -561 8 134 -147 76 224 37 -62
5304 -62 139 -230 -234 375 45 -10 341 402 176 342 111 -117 128 259 -111 75 406 192 -54 135 -7 -268
5326 -268 -16 -61 -482 246 226 -64 -24 532 -126 -392 169 -23 -528 67 -13 -145 91 114 -266 -120 73 -402
5348 -402 -379 -4 -28 -98 228 135 -351 -7 337 -107 -100 -164 -46 410 556 -82 133 186 125 -360 140 114 66 370
5372 370 379 93 290 316 -343 -44 484 -173 -149 298 486 148 301 -58 -139 295 185 -649 -164 397 -29 -326
5394 -326 266 -27 -306 -142 -137 -458 114 505 -106 164 -53 -15 -145 4 -533 -427 379 -44 -549 225 324
5415 324 -201 14 136 -255 -488 432 12 -44 520 216 -18 245 -22 -192 152 135 -244 125 597 2 53
5436 53 461 247 -182 105 -118 -175 74 420 -173 34 281 -173 -252 220 -180 -452 318 280 -334 95 3 -517
5458 -517 -307 191 -310 -412 126 -161 -112 164 -51 -312 359 -74 -518 -56 118 -109 102 456 -178 -283
5478 -283 350 45 -365 195 189 -216 154 555 -192 154 298 -176 -106 550 -137 -172 659 176 -322 331 161
5499 161 -50 -57 172 -117 -335 404 28 -149 322 -84 -291 -104 -118 -424 6 267 -258 -398 359 -140 -422
5520 -422 10 -192 -444 54 -38 -99 129 252 -528 2 252 -378 -145 481 144 -244 412 341 -184 92 204
5541 204 -285 -112 557 85 108 294 395 102 252 74 -387 319 -67 -400 295 480 -407 -61 271 -292
5561 -292 -329 -23 66 -303 -272 87 -188 25 -101 -184 31 50 -336 -79 217 -156 -56 178 100 -321 36 147
5583 147 -238 -322 319 13 142 147 -383 133 223 -150 -145 185 275 190 378 553 -326 -76 328 243 38 116 318
5606 318 270 374 335 11 134 -128 -364 133 106 -225 234 245 -399 -285 297 99 -505 -162 1 -349 -171
5627 -171 34 27 -184 -96 -296 -96 171 -310 -139 477 71 -361 344 173 -558 -365 162 -346 -82 8 242
5648 242 184 227 168 101 258 -144 -190 656 321 -204 130 557 -57 -282 312 109 -60 154 426 -43 86 167
5670 167 52 25 -228 -213 -49 46 -444 -119 261 -21 -453 165 39 -419 -332 -8 -156 -178 1 -115 -134 228
5692 228 -376 -439 14 -340 -240 140 14 -231 -63 386 -216 -280 359 -92 -496 64 375 116 196 192 39 111
5714 111 148 64 266 252 150 182 720 92 -380 280 90 -450 -2 541 -84 -221 507 168 -335 89 -181
5735 -181 -422 102 -315 -285 429 -28 -392 90 95 -379 -132 391 -129 -269 165 85 -410 -19 -23 -142 46 -43
5757 -43 -190 295 229 -157 -107 299 -213 -383 610 25 -288 228 501 191 208 538 -3 135 98 -298 137 236
5779 236 -67 -140 403 319 -234 170 316 -519 -71 235 -274 -114 214 151 -428 152 199 -251 -243 -92 -114 -68 -100
5802 -100 -150 -93 66 -259 -481 254 64 -505 -24 175 -61 -191 65 -122 -60 -83 -393 -170 194 0 -148
5823 -148 366 352 -622 -21 338 -104 64 362 49 -207 274 225 -23 75 205 -62 26 181 -8 376 424 -415
5845 -415 -60 367 -395 -413 -27 206 -247 8 30 -211 -253 142 -133 -428 144 -124 -320 145 -270 -200 -3
5866 -3 -51 -252 119 434 -283 -149 550 1 -127 324 184 -396 18 -102 20 375 128 -1 340 267 -187
5887 -187 25 372 11 -247 122 480 -362 166 515 -174 -66 198 -230 -15 133 -266 -179 309 -23 -318
5907 -318 453 -110 -614 -184 295 -200 -17 128 -378 -355 -54 -298 -181 160 54 -263 158 174 -164 5 111
5928 111 -610 -126 459 -92 103 446 144 -115 108 66 167 -205 242 80 4 306 21 185 346 197 -79
5949 -79 200 -52 -232 230 629 -312 -42 393 -164 -478 116 -130 -345 4 79 26 205 123 -279 244 -128
5970 -128 -473 -254 253 -393 -223 150 30 -302 -201 -128 -205 -183 240 -92 308 -59 -288 28 229 -240 -55
5991 -55 269 328 -226 88 542 -151 156 410 -109 -125 86 -74 -224 271 405 122 481 -129 -4 68 -208
6012 -208 -232 80 73 -216 -117 162 90 -245 -100 -82 -174 -158 83 -253 54 -91 -614 20 7 -373 -311 100 -156
6035 -156 -391 121 206 -418 361 206 -38 -376 81 8 280 493 51 17 647 6 -10 -24 258 -251 135 429
6057 429 -235 -49 322 -145 -313 -27 55 -91 293 179 -153 33 405 -384 -192 225 -183 -203 216 47 -309
6078 -309 399 62 -383 -189 219 -400 -188 -94 62 -52 165 -298 -92 110 -81 -146 246 46 -422 133 210
6099 210 -17 -160 210 147 -56 421 110 46 180 284 -56 83 323 -3 154 143 -20 -82 318 -97 -3 353
6121 353 323 -213 303 -89 -265 51 87 -87 -258 92 -25 -183 -36 -67 -546 200 196 -318 -66 32 -309 -369
6143 -369 105 -216 -311 53 -112 -263 129 136 -178 -227 164 -282 -112 399 -273 220 319 180 -307 363 -113 -344
6165 -344 -20 356 101 73 362 70 137 392 14 -302 645 160 -7 237 277 17 156 562 -425 -7 54
6186 54 -58 -417 43 4 -166 15 -172 -422 7 -5 -314 -332 248 -100 -238 137 -167 -303 230 -119 -571
6207 -571 -11 -12 -190 151 326 -224 -14 5 -143 40 151 -83 54 152 355 -6 -28 245 -48 -183 354 19
6229 19 22 480 -168 -218 308 -195 -220 -90 198 -305 50 40 -85 168 -8 -149 -255 56 -230 -208 -43 -25 -289
6252 -289 65 116 -485 -210 270 -357 -247 295 119 -41 184 178 -271 119 282 -16 62 -102 92 39 316 -88
6274 -88 94 266 381 -222 297 321 26 42 357 -78 74 235 -269 -332 291 -116 -180 340 35 -459 116 133
6296 133 -220 -13 -12 -128 -92 187 -51 11 71 -73 -170 -175 -163 -311 -84 187 -192 91 287 -212 -177 81 -168
6319 -168 -236 283 139 10 162 242 33 -87 128 -99 13 261 228 -171 302 151 -510 346 211 -274 -161
6340 -161 540 100 -170 349 -181 -229 8 -283 -113 25 15 -323 68 216 -397 73 160 -159 -343 323 -1
6361 -1 -405 -99 -2 -60 116 -137 -170 -184 -179 -440 -264 164 20 -187 353 -170 -189 105 -135 -44 -43 502 340 85
6385 85 191 253 21 222 109 -93 327 61 -210 508 358 -263 260 337 -132 -122 442 44 -170 301 128
6406 128 -56 -103 -153 -155 62 101 62 -10 246 -184 -359 -195 -219 -438 -72 -149 -236 162 204 -53 -86 26 -106 -171
6430 -171 -216 -154 -125 180 170 9 219 292 -367 47 324 -1 73 266 153 -86 134 39 -95 -75 214 -51 344
6453 344 241 230 204 429 -145 -176 282 -55 -482 -134 223 28 -231 257 -47 -344 22 -209 -156 109 -125
6474 -125 -229 -7 55 -136 -13 -10 -404 -22 120 -328 -143 268 66 -216 129 182 -227 -225 -139 -113 -55 227 -321
6497 -321 154 327 -50 -141 284 361 -134 106 241 97 253 297 -8 -246 47 -95 -135 -51 244 89 -50 -3
6519 -3 -221 411 17 33 166 150 -300 -11 202 84 -289 118 13 -272 162 21 -139 -8 154 -69 27 163
6541 163 -215 -240 -64 -56 -188 172 -37 -266 -64 119 49 48 231 -204 -18 15 19 201 257 -135 -293 115 286
6564 286 -276 10 33 72 82 337 211 -42 -77 -96 -95 -93 298 -161 137 -20 -125 98 119 -217 -367 194 -286
6587 -286 -470 248 -42 -246 70 -6 -76 -87 -214 -96 17 -5 2 31 59 -300 -158 82 -278 -259 138 255 -53
6610 -53 42 308 282 -221 2 -29 83 87 76 105 239 50 -235 97 53 -301 144 185 27 2 258 2 -88 108
6634 108 -70 -426 -83 201 -123 22 -134 -202 -35 163 -221 -260 279 -88 -452 189 86 -111 -161 -21 -175
6655 -175 10 204 -14 -7 -165 65 -145 289 -114 -214 -16 278 -120 128 441 59 159 153 301 -85 46
6676 46 -46 -72 68 59 -172 250 200 -308 4 149 -39 -155 15 -263 -253 260 107 -298 -118 -6 -78 -249 48
6699 48 49 -90 207 -69 -215 7 56 -606 163 -15 -228 -198 368 -241 -84 114 -228 -184 0 60 -147 430
6721 430 332 -233 154 68 -289 12 186 -112 -111 389 289 138 88 170 -60 23 117 -6 -184 -66 62 61 9 -305
6745 -305 -27 213 -120 -402 -74 10 -188 -252 198 -70 -540 126 -123 -277 89 29 -147 -156 82 -312 55 -71
6767 -71 -175 -177 205 -386 -45 343 72 -344 101 170 -156 21 155 294 60 302 90 -35 153 114 -164 369
6789 369 142 -150 279 161 257 2 270 -98 -211 184 -40 -330 -106 -62 -64 -46 12 -77 -11 -190 -357 30 194
6812 194 -233 -111 287 123 -308 -50 -74 -280 -157 -46 -321 -253 164 -77 -226 162 -134 -180 296 84 128
6833 128 57 379 -138 146 188 -69 -23 47 92 16 221 203 122 211 66 -132 91 289 206 157 291 -19 -277 -51
6857 -51 -5 -210 118 137 -196 -31 313 111 -163 135 -224 -294 -13 -130 -101 196 111 -205 91 -55 -290 -71
6879 -71 -240 -13 -68 120 -6 -201 170 -88 -184 10 165 63 -152 90 -86 101 295 132 65 69 -6 -380
6901 -380 -9 311 38 152 551 53 -21 76 -30 40 251 -79 -311 393 42 -130 -2 -41 -23 -220 -59 -217
6923 -217 -70 188 -148 -68 38 -2 -169 -82 -270 -297 -12 23 -288 114 -25 -320 -43 252 -82 -132 135 122
6945 122 60 210 161 -26 -149 4 27 -74 -47 16 104 284 234 -17 -69 153 -99 113 1 -151 45 113 -78
6968 -78 -165 154 -137 -15 79 3 7 233 158 -144 -11 -24 -387 -24 43 -138 -190 104 -180 -165 176 116 -330 -202
6992 -202 334 -304 -104 331 -11 -60 194 -32 -11 48 -143 75 171 -42 74 33 205 -258 -10 282 -173 99
7014 99 92 155 -281 396 126 -5 -23 184 -80 -104 16 -17 11 84 -102 76 19 149 -359 -17 -57 -120 12 87
7038 87 -88 -158 159 -195 -354 -138 -203 -149 -96 88 -277 138 44 -238 -16 -26 24 -26 238 -21 -27 135 47 -214
7062 -214 105 -54 -170 27 4 -33 -144 424 -51 31 350 153 128 49 253 59 127 205 -143 120 61 242 -185
7085 -185 151 8 -141 148 230 -47 -7 93 -393 -111 120 -263 -324 -66 23 -118 -80 -71 -568 12 -50 -375 -28
7108 -28 -64 -86 -2 219 -94 -158 101 69 -144 -87 383 -377 140 201 1 -54 111 -38 12 -172 154 0 300
7131 300 74 -404 265 121 -129 67 243 -32 -51 167 138 -81 -66 -67 -117 112 84 -121 29 189 -140 -205 106
7154 106 32 -492 14 140 -416 -77 175 -155 -175 162 -256 -69 43 6 74 58 136 7 238 78 -369 238
7176 238 57 -147 119 75 44 -93 110 295 -184 179 70 236 360 182 -5 75 75 36 94 -92 -158 -192 309
7199 309 23 -85 146 72 -270 -110 306 -161 -191 -41 -116 -170 -125 -330 -114 20 62 -175 -225 207 -154 -103 -19
7222 -19 63 -173 -36 23 -191 11 72 -69 78 69 -145 409 31 -217 212 161 -144 147 263 139 -5 250
7244 250 174 -207 86 86 -85 -117 194 -55 113 231 -145 -38 -162 -151 -327 174 184 -232 -1 58 -187 -197 23
7267 23 -43 -112 89 -85 -156 -15 -265 -291 117 27 -443 44 -97 -209 49 40 40 -334 -30 -45 -91 -149 163 -61
7291 -61 -98 294 -184 80 178 120 21 192 90 -28 255 148 41 270 291 119 -62 160 145 -366 153 106 -109
7314 -109 141 -8 -25 74 -49 -326 -217 -249 -273 -187 102 109 -361 179 -216 -344 124 230 -170 -5 127 -141
7336 -141 129 -114 70 -104 -262 12 -171 76 381 -31 55 47 9 -130 120 68 -107 239 109 8 33 61
7358 61 -203 75 134 -142 150 206 41 75 150 111 -340 -26 60 -83 40 216 -163 68 -23 66 -60 -30 -370
7381 -370 83 72 84 -45 273 77 -326 -101 -33 -186 -107 136 -25 72 76 -151 -395 113 41 -47 7 -126 -57 283
7405 283 340 5 14 110 105 -211 63 462 -19 181 285 58 -25 -96 -119 -24 -3 -135 -163 16 -120 -447 223 156
7429 156 -169 6 -60 -106 -185 243 -237 -146 -103 -37 -228 -34 -213 -315 77 96 -8 82 311 -88 16 219 -173
7452 -173 -105 246 -4 5 127 130 -54 138 110 -258 41 250 -76 -288 382 242 -107 305 138 -211 24 375
7474 375 -94 76 55 -166 -8 70 -28 -121 -149 -99 -307 -76 122 -192 236 -270 32 -166 164 -49 -401 372
7496 372 74 -142 -104 45 -216 85 25 -193 -7 29 102 104 195 -168 -59 19 69 -274 91 66 -27 136 232 -8
7520 -8 -38 -34 -32 321 112 -93 -85 81 -301 -139 269 -128 164 -200 341 -41 -78 191 -129 -102 -13 -143 48 213
7544 213 -146 -270 -125 -15 -222 -125 -28 -162 -223 103 -114 -239 -56 102 -120 -37 148 142 -288 23 -85 250
7566 250 38 -178 -385 194 124 242 3 38 -211 -162 281 -64 52 365 216 -250 228 -149 122 29 -21 -134
7588 -134 107 -1 -253 35 -170 -319 -46 200 -139 -7 59 27 -193 51 84 -8 -301 -27 -152 193 -113
7609 -113 -231 -120 116 104 -164 -46 -84 -107 201 62 -206 -168 174 -98 -5 84 -41 -33 135 24 -11 269 291
7632 291 -19 161 216 21 -53 142 81 -64 233 92 4 286 186 257 4 240 -75 -78 250 -120 34 176
7654 176 -13 -162 74 116 -112 34 47 -253 -113 -40 -154 95 91 -329 -242 142 -44 -337 161 -408 -339 229
7676 229 37 -98 -59 288 82 41 198 93 -123 288 125 47 194 50 -85 190 257 -142 157 -29 136
7697 136 -148 243 -25 -228 -93 203 145 -50 181 94 32 205 -221 -230 176 -28 -253 292 -83 -326 14 -26
7719 -26 -172 -299 182 -166 -323 -96 -221 -180 -29 -56 -47 1 224 -73 -249 84 208 -155 245 -23 -39 253
7741 253 91 -188 -10 320 -112 -31 157 51 128 92 45 54 115 -39 -72 105 114 -33 -135 167 -30 -114 304 -169
7765 -169 -260 -113 -249 -61 172 -80 -116 39 38 -287 -44 -131 31 -133 -57 -209 -257 310 -182 -141 -141 -4 -193
7788 -193 -239 284 -96 82 -105 -123 -15 269 175 86 -39 78 -199 77 159 53 96 91 -40 -62 31 75 -79 162
7812 162 -34 -72 113 262 -162 68 164 -143 -115 15 118 -148 1 -50 -4 -211 -195 -343 76 46 95 -51 -75
7835 -75 -114 -101 -68 -333 -31 -62 -12 -85 -215 236 -300 165 -169 85 -78 -24 -296 -272 216 -49 -192 -156 234
7858 234 131 -179 111 203 197 108 294 137 215 -41 -107 2 55 62 -166 -11 65 -39 127 3 63 43 100 -129
7882 -129 129 121 -158 277 -119 -289 58 122 -129 30 87 -175 -144 76 87 -61 -9 -236 -66 -113 -58 -369 197
7905 197 221 2 -155 116 -211 -189 137 -198 -112 7 90 -275 57 -5 -48 36 29 -252 -174 69 111 -85 263 -131
7929 -131 -203 -310 353 -74 -16 43 250 61 262 102 17 55 -62 -254 -58 -27 -53 -167 120 -39 99 9 -288
7952 -288 -151 110 -141 -89 -7 160 34 41 84 86 124 -131 23 45 42 3 77 88 -139 224 8 168 5 45 182
7977 182 -363 -130 79 101 -25 362 68 -171 79 122 -12 -64 -5 -271 -202 234 -108 -238 237 217 -202 38
7999 38 -120 -110 -99 33 -281 14 275 40 -147 -78 -60 14 -38 6 -114 -128 55 -54 65 151 -94 -142 223 91
8023 91 -111 127 153 -7 321 239 40 75 122 -115 -48 172 29 -24 164 -14 -311 44 311 13 -106 262
8045 262 -105 -84 200 58 -125 -84 -168 -127 66 -215 118 99 -19 -122 -57 226 13 -147 12 -3 -274 54
8067 54 -3 -119 29 -42 10 98 -30 117 55 -43 -109 -300 45 -27 -67 172 281 -54 -148 249 170 306 218 240 -110
8092 -110 -74 15 -154 122 111 -181 29 73 -183 -78 175 -185 -53 189 -110 43 -12 -35 38 -197 12 -218
8114 -218 -157 47 -13 144 163 -323 -259 -27 -174 -34 80 274 179 -205 118 -95 54 139 73 111 97 -84 69
8137 69 55 114 -96 153 -57 -35 286 -67 -229 250 151 -65 -123 -119 148 -227 187 178 -84 180 -65 137 -22
8160 -22 -32 -74 -33 -2 -78 -299 187 -51 -245 254 26 -90 -13 328 172 -35 72 -69 -109 -27 -341 -8 -198
8183 -198 189 -51 62 140 -141 -30 164 207
8191B07
$$ Imaginary data points
##PAGE= N=2
##DATA TABLE= (X++(I..I)), XYDATA
0 0 0 0 0 0 0 0 0 8 -8 8 -8 8 -16 16 -20 24 -32 32 -40 48 -56 64 -75 87 -99 113 -128 147 -164 186 -210
31 -210 235 -264 294 -326 365 -405 451 -500 552 -612 678 -749 831 -922 1022 -1138 1268 -1421
49 -1421 1597 -1810 2066 -2385 2791 -3336 4095 -5237 7148 -10921 21203 -106208 -321879 -32159
63 -32159 167712 35222 -143140 -85041 7531 -16331 -66226 -16338 7389 -78721 -124805 3250
75 3250 91255 -19442 -127213 -55546 23045 -9269 -40023 -9142 -2002 -26311 -28733 -4846
87 -4846 -1821 -28645 -27737 32700 49752 -29998 -66141 12847 53787 -6275 -29788 20996 38494
100 38494 5711 -2351 25452 30317 -20553 -55379 19448 118477 70613 -61811 -75929 22430
112 22430 75716 41998 -15630 -40699 -7192 42302 43534 7896 -23339 -37949 -14067 36676
124 36676 40316 -5069 -26539 -21808 -18427 7887 32993 1743 -34399 -10410 15775 -9277 -33830
137 -33830 -10287 26295 16268 -33776 -35544 30786 44475 -33610 -66095 -1509 38630 14960
149 14960 2026 2189 -16221 -20224 6101 20225 2913 -13645 2723 28142 10427 -25577 -2889
162 -2889 37940 4995 -39118 -156 44388 9821 -27794 -4378 16170 -7600 -20344 12455
174 12455 37519 -5384 -61706 -33138 36641 27980 -29661 -26894 4811 -9785 -29452 -8280
186 -8280 5620 -20298 -44342 -25350 14996 19985 -22315 -51458 -36053 -17802 -8328 9162 198
199 198 -45543 -53828 -1323 29082 -8138 -54524 -46349 4895 25794 -12069 -40426 -16440 2889
212 2889 -11258 -9535 6671 -7724 -28803 -11003 15069 4641 -25377 -22365 19394 35032 -11539
225 -11539 -46982 -11245 28497 12705 -10711 -7242 -2314 1729 15223 13368 -10031 -23433 -9323
238 -9323 17098 25830 3800 -13187 -2497 3230 -3362 8901 19822 -5897 -24387 3380 27183
251 27183 13380 -6821 -9930 -1236 9590 9916 3548 656 -6374 -9373 11556 26042 2102 -16603
265 -16603 1884 13296 -24 -3768 1627 1338 6237 12072 4638 -4137 -5245 -1430 8854 7710
279 7710 -12840 -12046 19208 22048 -9351 -17169 -672 5030 2519 21 -5807 -3306 2123 -2114
293 -2114 129 8119 -5153 -17803 359 11044 -6838 -12378 2299 5209 -1490 -4444 -4445 2469
307 2469 4976 -12155 -16096 7378 12036 -5706 -3175 5975 -4545 -6419 4738 -536 -8736 -1368
321 -1368 3929 3742 4772 -2868 -7155 3429 1702 -11270 -2125 9241 -4242 -6898 8049 1779
335 1779 -10787 -339 5411 -6856 -9694 -2527 1560 4151 -3157 -12822 18 10751 -9039 -18599
349 -18599 1579 3726 -10909 -4222 4639 -3077 -4743 -703 -6295 -5989 -1870 -7236 -3549 7676
363 7676 -1353 -9960 3480 5761 -8597 -5696 2095 -3870 -1390 6512 -418 -2982 5494 525 -4847
378 -4847 3210 -18 -8659 3197 9048 -4849 -3546 8880 2759 -4798 -1325 -3167 -2482 5015 -1699
393 -1699 -7491 5211 7158 -7786 -4458 3861 -6944 -9382 2698 217 -5918 752 874 -4320
407 -4320 -337 -2469 -10599 -3149 2626 -5620 -3357 4600 -2597 -3962 5563 -2291 -11876 648 6523
422 6523 -4367 -2973 5839 3269 2244 2839 -2452 229 5864 -2133 -3543 10216 8113 -3928 4213
437 4213 11785 644 -2878 3735 3003 3067 6259 1570 2091 11228 5107 -4032 2729 5786 -2476 -129
453 -129 7126 2345 1340 5533 1230 207 4995 -2336 -7177 3825 6759 -2711 -567 5569 1147
468 1147 -206 2004 -3449 -2921 3541 -209 -2375 5294 4269 -2670 1790 3931 -2590 -1819 1955 -2430
484 -2430 621 7794 1434 -4155 2704 4033 -2191 -2054 -2380 -3575 2774 4779 -2873 -2589 1903 -2843
500 -2843 -4253 34 -4865 -9625 -2018 2060 -2493 -3841 -5644 -8907 -3631 -1354 -10668 -13692 -6302
515 -6302 -3473 -3509 -3333 -11338 -14772 -4753 -1347 -10686 -15139 -11418 -5993 -327 -1726 -12073 -12270 -3536
531 -3536 -4301 -7974 -4624 -6939 -11113 -2946 6491 2417 -6250 -10575 -6336 5802 7967 -7370 -11494
546 -11494 3474 9913 4700 1557 -2394 -4686 2002 7493 3062 1134 748 -738 6498 14141 5014
561 5014 -6748 -3236 5003 9788 9107 -1922 -8407 6114 17381 6369 -5583 -6190 -2489 6306
575 6306 12010 923 -9806 -2102 9014 9861 3647 -7761 -12828 656 13312 5941 -3040 -3764
589 -3764 -2867 4464 13736 3355 -12616 -7447 5864 10418 9015 187 -8574 -10 12920 7476
603 7476 -3807 -4228 -1492 3230 8849 3307 -3226 3226 4283 -3446 985 7005 -3869 -9308 4215
618 4215 10587 2010 -4360 -5187 1033 7276 -2435 -14320 -4897 6923 1691 -2348 -2084 -9476 -8546
633 -8546 3320 -285 -12847 -9508 -2830 -4444 -2558 -862 -8282 -10962 -7583 -7017 -2371 -1711 -14070
648 -14070 -14615 3086 3570 -12974 -11416 -535 -3185 -9192 -11460 -11411 -529 8529 -6035 -19012
662 -19012 -7004 5308 1145 -6458 -13440 -12952 2755 10178 -542 -5689 -3333 -9843 -5665 11251
676 11251 7065 -12303 -11759 2319 9357 10048 399 -14536 -8301 10590 11166 -1227 -7092 -5735
690 -5735 5588 15682 3218 -10283 1617 10645 -2164 -2694 9417 4116 -5570 4685 15964
703 15964 9677 -5121 -13015 1505 23182 13888 -14555 -12418 12480 20483 11105 -3132 -16722
716 -16722 -8563 18175 21275 548 -9193 -5802 284 14286 19066 -1298 -19210 -11303 9589
729 9589 22962 11388 -18215 -21460 9837 23781 3532 -12149 -11433 -6128 6944 14582 -794
742 -794 -13676 -3662 7566 5003 -2189 -8987 -8157 3283 6270 -207 625 137 -7518 -1301 11352
757 11352 593 -15724 -6739 10415 12918 3523 -10617 -13912 3266 16608 4512 -10067 -9387
770 -9387 -2797 5401 11275 4224 -7432 -9311 -5777 3821 15038 3289 -22607 -17330 12900 18404
784 18404 -2168 -13732 -10125 -2792 2216 -142 -4498 -4752 -5584 -3588 4952 1971 -12224 -11061 1854
799 1854 -1623 -9913 -1366 5429 -2730 -7935 -4664 -1942 -682 -1151 -3142 -1885 -2281 -5068 1804 9475
815 9475 594 -8832 -1995 5104 2242 1316 1606 -1154 2121 7257 3731 1778 6023 4296 -2371 -3019
831 -3019 2903 10552 12555 3005 -5793 1186 8475 3976 1546 3005 -2064 -1612 7935 9827 2072
846 2072 -1693 -2937 -3096 1725 6262 3898 -2041 -6549 -4320 6479 9751 -2789 -10509 -4058 70
861 70 483 5286 2292 -9631 -8442 5116 10158 1287 -9606 -11384 -708 8433 3851 -2719 -1972
876 -1972 -51 1815 4613 -1015 -8155 237 10311 3649 -4426 780 5271 4699 3309 -1163 -4557
891 -4557 -669 5577 8111 6096 -2871 -7464 3953 11599 1807 -5038 -585 -1093 -1454 6506 7384 -2882
907 -2882 -6065 -670 2968 2801 -1380 -6530 -3506 1041 354 3400 5030 -5909 -12600 -300 7274
922 7274 -993 -6108 -3238 -1403 3064 4949 -2316 -6459 -1791 -288 -935 1616 491 -1936 2584
937 2584 3347 -2437 -1755 1155 -931 1254 4289 -4152 -4957 8028 9559 -2868 -5112 1104 1935 1255
953 1255 878 -1041 1178 2767 -519 1320 5119 -2504 -7281 1477 2967 -3893 182 5645 -1646
968 -1646 -4483 1543 644 -3174 -1680 -2952 -3005 1899 2067 -929 440 -2365 -6236 1476 5602 -5363
984 -5363 -6874 4106 3682 -2440 1473 2646 -2431 -1079 1454 -1332 80 2593 461 1743 4083
999 4083 -1268 -1136 5617 919 -5792 1173 5319 -350 1514 5096 -916 -2037 2658 -37 -2913
1014 -2913 970 645 -1148 2818 1935 -2855 109 1357 -3865 -2481 1170 -2905 -1853 3938 -1164
1029 -1164 -5519 1977 2554 -6180 -4534 1300 -829 -1162 847 -1142 -411 2375 -1417 -2714 1549 -927
1045 -927 -3704 3467 4650 -2618 588 6217 320 -2875 2219 1506 -831 3729 3832 640 3190 3760
1061 3760 898 2279 1614 -2604 1551 5875 -343 -1146 6334 3316 -3444 1402 3322 -2763 -1727
1076 -1727 2972 1279 -151 1052 -266 1235 2118 -3859 -4613 2243 865 -4424 357 3546 -1643
1091 -1643 -1478 1232 -2629 -3298 1184 -702 -2863 1237 2302 -75 1425 1109 -2327 -432 1259 -1047
1107 -1047 1904 4069 -449 -131 6236 3191 -2739 413 2809 379 1308 3982 1404 1161 3130 1520
1123 1520 1062 1880 -1181 -1618 2728 2060 -339 2900 2354 -2292 310 2983 -2480 -4381 272 1675
1139 1675 -416 450 -598 -1872 -240 -561 -3028 -1986 -2110 -2934 1342 2951 -3461 -4360 1649 76
1155 76 -4298 -1784 -892 -3179 -832 2690 1371 -1096 -2651 -2375 2143 2273 -4172 -4121 2992 3513 -174
1172 -174 1025 423 -2305 68 2120 -885 -1362 530 647 2731 4100 -341 -3400 -186 1398 223
1188 223 400 -1392 -1765 3378 4963 -1454 -3067 397 -567 -582 2097 -630 -3155 1408 4499 1862
1204 1862 -141 -2356 -2924 2359 3949 -987 -1522 2228 2461 2988 5111 47 -4262 1268 6129 3161
1220 3161 1366 1485 830 5080 7555 2344 -2055 527 2631 5047 6904 1245 -2311 5105 8503
1235 8503 1811 -350 1653 -553 1000 5988 4607 -367 -87 1394 4087 5843 -1067 -7795 -179
1250 -179 7657 2677 -1393 -196 -1186 653 4698 133 -5813 -2427 965 1488 3752 962 -4976 -1293
1266 -1293 4869 1028 -2702 -1285 -2876 -654 6721 4681 -3503 -2596 1740 2418 3054 354 -5960 -1237
1282 -1237 7891 4465 -2187 394 720 -1213 2278 2231 -2809 -1438 1736 633 2211 3624 -3730 -5298
1298 -5298 2278 2137 -3501 -2669 -1640 -2016 2830 2276 -5951 -5768 900 -791 -4276 -2522 -3016 -2064 2447
1315 2447 -1081 -5816 -791 637 -5964 -3377 2400 -1323 -4658 247 2076 412 -551 -4020 -3063
1330 -3063 4834 2990 -5829 -1674 7530 3770 -730 974 -124 427 4776 2591 -1265 2418 4516
1345 4516 2934 5205 4078 -2118 533 6250 2430 449 4671 1954 -973 5965 7977 -683 -4288
1360 -4288 -201 3821 5887 1894 -5482 -794 8343 4248 -3248 -700 -703 -3083 2948 5671 -1675 -3962
1376 -3962 957 2842 3651 2174 -5029 -6437 2703 5916 2644 144 -3925 -3319 7431 9930 -3924
1391 -3924 -9515 471 7200 5471 2036 -2326 -2236 4603 5329 716 706 -779 -3629 2811 10216 3345
1407 3345 -4571 -2281 2503 5083 4189 -4024 -7112 2468 8070 1474 -2599 -1221 -2166 242 3593
1422 3593 -661 -5962 -2926 811 2187 2717 -1977 -7167 -3149 2122 293 -1472 -3269 -7250 -2247
1437 -2247 8196 4128 -8250 -8308 -313 3692 2019 -2749 -5517 -1166 3101 2212 1665 -376 -5681
1452 -5681 -3913 5113 4262 -2919 -2034 1872 901 1875 2794 -1235 -3837 -342 2691 2452 244 -2147
1468 -2147 1294 5614 -134 -5666 113 4106 -2180 -3339 2794 2894 -1089 -1255 437 1344 -306 -3960
1484 -3960 -3226 2376 2241 -1489 -959 148 -1950 -337 2104 -1600 -3659 -483 593 938 3219 1253
1500 1253 -2827 -1272 1750 641 769 161 -2004 248 4018 2948 859 612 -1581 -1294 3183 2278
1516 2278 -1183 1277 2642 -756 719 4781 1715 -4040 -2805 955 3397 2958 -1224 -2253 1573
1531 1573 1414 -1338 229 -222 -4804 -1536 4905 1092 -4344 -361 1973 -819 -2019 -1828 -2245 -382
1547 -382 619 -99 287 -881 -3111 1581 4852 -3248 -7100 1260 4874 -92 -231 1885 -782 -771
1563 -771 1982 1913 -138 -1311 -1944 2218 6275 1802 -2345 1264 1032 -1600 2579 4153 -2390 -2690
1579 -2690 3338 3268 715 1250 -985 -3531 -306 1834 519 449 -1337 -2745 2274 3688 -3227 -4153
1595 -4153 961 -901 -3292 651 583 -2557 341 1871 -2899 -2980 -226 -1353 -952 458 -1470 -1678
1611 -1678 2201 1073 -1786 -279 -1347 -3376 1692 3512 -2411 -1396 4139 676 -2369 1984 1313
1626 1313 -2837 -683 1946 867 1751 1436 -850 628 1286 -2216 503 3566 -3402 -5582 4286 5722
1642 5722 -2763 -2762 991 -1334 -2137 524 -952 -1645 -401 -1375 -90 2000 -2249 -4466 993 -82
1658 -82 -4943 -640 3205 -1553 -2349 2039 -636 -3617 44 649 -2198 -615 643 401 1889 529
1674 529 -2581 826 2627 -2397 -1904 3372 1093 -1571 3070 3060 -1619 300 2447 -1284 -1146 2225
1690 2225 1356 719 1828 -224 -275 2815 422 -2564 180 383 -1772 1914 3257 -1948 -1720 2675
1706 2675 -361 -3862 277 1113 -1826 -328 1378 -298 -292 112 -1475 -293 -411 -3256 -221 4208
1722 4208 -702 -3479 2378 3107 -2775 -2041 1510 -425 -399 1695 692 49 1648 1076 854 1228 -1650
1739 -1650 -1865 2792 2254 -1743 1303 3892 -537 -1626 1991 13 -2206 708 1440 -444 101 697
1755 697 50 184 -1024 -2801 -191 874 -2284 -1009 2293 -445 -2586 333 44 -3660 -2015 444
1771 444 -1237 -1450 -44 -238 -138 -159 -1275 -1365 -246 -1749 -1699 1718 1259 -1313 849 1720 -2220 -1210
1789 -1210 2477 -141 -2470 795 2559 1331 746 362 60 828 -419 -992 1257 1442 -1316 1335
1805 1335 3650 -887 -2816 1560 1532 -2012 -1563 288 191 876 968 -513 -798 -658 -1370 -158 38 -2867
1823 -2867 -1818 2636 1381 -2021 -367 -327 -2703 -895 1618 -1039 -2084 450 1311 1082 494 -977
1839 -977 -1072 382 -422 -892 2169 1290 -1347 1501 3770 -273 -2049 1219 957 -189 1130 1000 111
1856 111 1699 2359 226 -4 -331 -852 1277 2201 -1122 -538 2550 759 -975 1426 -525 -4069 -735
1873 -735 3053 -26 -2084 -593 167 599 164 -2234 -2426 -348 -1011 -1026 2072 -33 -4022 308 3305
1890 3305 -1576 -3651 206 51 -1032 1303 724 -759 563 751 -119 845 -876 -2489 1976 4019
1906 4019 -410 -1162 2520 1193 -958 1689 727 -2638 270 3374 1407 522 721 -1065 416 2348
1922 2348 -1019 -2228 378 35 63 3261 730 -3969 -1214 2299 -939 -2524 -322 -1312 -831 2316
1938 2316 760 -2599 -782 -542 -1380 530 403 -3052 -885 2900 442 -572 235 -1899 -1609 2903
1954 2903 1053 -3463 197 3420 946 201 1111 -547 -771 1376 568 287 1898 -85 -156 4110 2760
1971 2760 -2880 -747 2641 -3 -349 2003 69 -955 2666 1867 -1460 -1155 -291 -905 1034 696
1987 696 -2169 -16 2547 -1305 -1963 1288 -1034 -3820 109 1504 -1417 -806 436 -516 83 296
2003 296 -2676 -1742 1635 -93 -1262 1206 503 -702 1706 709 -2859 -941 2410 473 -384 1766
2019 1766 581 78 2223 745 -1341 328 -11 -809 2116 3203 -1138 -1294 2187 1767 -263 -507
2035 -507 -2297 -1340 3223 1902 -2249 -592 1648 -333 -744 290 -2213 -1912 685 677 60 534 -1545
2052 -1545 -2430 1271 1202 -2929 -2668 -125 295 1430 1567 -1978 -2576 1482 1853 -865 -1403 -999 -201 2542
2070 2542 2491 -689 -609 944 -574 494 2749 -147 -2243 1142 3490 1890 525 -1209 -1716 1359
2086 1359 2750 -213 -1378 514 1013 1551 2547 -607 -2762 -328 1509 -249 -319 -59 -1139 201
2102 201 1766 16 -1408 -1426 -2347 -222 2507 113 -3653 -794 2438 794 -1539 -1996 -1641 81
2118 81 1045 -505 -544 555 -148 -320 1983 716 -2394 -1198 1342 922 1198 1056 -466 -47 2210 1138
2136 1138 -897 -182 45 418 1971 1522 -342 366 1074 -1060 31 1307 -689 -1619 538 1046 338
2153 338 587 -735 -2133 -202 851 -1570 -1514 -183 -95 342 799 -1623 -1955 5 -642 -2040 27
2170 27 170 -1636 141 1878 -411 -958 -227 -1282 -860 1046 452 -813 903 707 297 1295 470 -1668
2188 -1668 321 1737 -518 388 3230 693 -1844 1105 2356 43 -1028 -685 -64 2052 1587 -896
2204 -896 -141 1416 -795 -1156 1006 -943 -2450 1172 2134 -1003 -1216 61 -1316 -898 54 -1920 -2533
2221 -2533 -272 -92 -131 658 -1590 -2976 437 545 -2870 -1657 699 -995 -947 1652 177 -1455 -286
2238 -286 -469 -1110 398 1135 -998 287 1569 -188 989 1226 -2066 -1590 2088 1051 -989 1136
2254 1136 1390 -562 885 1673 -1425 -1339 834 284 -148 976 164 -398 1443 -12 -2006 -112 104
2271 104 -1730 691 1830 -1822 -1557 2257 528 -2652 -1097 181 -1257 -393 348 -676 404 382
2287 382 -1682 -410 1046 -1666 -1586 1628 79 -1404 1833 2425 -1726 -1062 1419 277 -394 847
2303 847 198 302 1578 1053 331 1317 -663 -1610 1898 1951 -1764 146 2846 516 -768 1254 448
2320 448 -1817 90 759 -544 211 890 -75 527 -12 -1885 -430 1324 -1396 -2272 1286 809 -1514
2337 -1514 223 378 -1912 -1223 131 -1498 -1512 787 174 -691 137 -605 -1027 -15 -1039 -2256 236
2354 236 766 -1414 294 1698 -1591 -1994 1070 504 -2059 -575 579 -25 119 384 -589 -71 -334
2371 -334 -1852 -574 382 -922 -750 1590 -162 -2280 316 720 -2316 -2221 390 -406 -969 93 -150
2388 -150 -740 -174 -766 -1012 -627 -1703 -1487 1208 1124 -1772 -671 1488 -745 -1454 595 -57 -1191 419
2406 419 1372 525 258 451 319 910 -112 -1180 518 1888 -47 -9 2124 839 -1239 1188 1197 -797
2424 -797 -15 1364 478 -4 1124 1077 329 -65 -992 -202 712 -329 -710 1326 694 -1230 292 872
2442 872 -1590 -1482 999 111 -1447 -113 897 509 -230 -938 -831 -50 -547 -1264 999 1120 -949 -57
2460 -57 1963 -239 -1931 342 754 -662 -66 857 331 795 1075 272 132 -156 -684 776 996 -873
2478 -873 -185 2484 830 -2052 -171 1154 -846 -1129 136 -469 -445 410 323 -318 -986 -2212 -1422 192
2496 192 -751 -2047 -54 71 -2029 -546 607 -1976 -2737 -335 -275 -1908 -524 160 -392 -663 -669 -1197
2514 -1197 -600 -739 -1699 25 1611 -942 -1041 1740 399 -1715 496 575 -1502 16 2439 848 -387
2531 -387 647 913 909 122 -1261 -862 1810 1130 -328 1182 1310 -1655 242 2361 -913 -2424 571
2548 571 786 -306 716 479 -1228 -818 -152 -550 -408 -672 -1801 239 1915 -1375 -1857 1204 211
2565 211 -2582 -297 659 -1696 -303 1732 321 -722 51 -351 38 446 -964 -646 1696 762 -704
2582 -704 1733 1327 -1863 -241 2357 -51 -1170 962 1051 96 1602 1044 -1039 -389 440 58 771
2599 771 521 -1306 327 2270 -369 -1173 1143 -678 -2493 753 1436 -1758 -1273 1253 66 -1296
2615 -1296 -754 -1618 -838 642 -823 -1233 781 -31 -983 664 404 -2833 -1033 1650 -518 -1393 1248
2632 1248 858 -1126 291 708 -699 -770 -393 -71 1472 929 -1219 389 2214 -43 -1110 1084 39
2649 39 -1544 1052 2217 -474 -144 1230 67 -629 136 -759 -522 633 -329 -102 1215 -31 -1813
2666 -1813 576 672 -2262 -1529 819 -335 -853 794 -210 -1686 -352 3 -1579 -905 97 -414 676
2683 676 558 -877 -241 857 -762 -1124 664 -18 -1295 1212 1839 -317 -452 995 123 -154 543
2700 543 -185 154 1059 733 424 1178 262 -979 855 959 -1286 -342 1883 600 -559 743 189 -1110
2718 -1110 -386 -49 -401 -326 -311 -67 698 309 -1567 -880 360 -1010 -1258 431 -374 -1441 426 1591
2736 1591 -960 -1525 -383 -611 9 -110 -894 -146 1016 -72 -68 1014 -264 -1327 333 1204 -2
2753 -2 266 1156 14 566 1739 107 -1095 122 997 607 961 389 134 1315 887 -600 -408 311
2771 311 -677 -351 1176 165 -807 512 383 -580 -386 -472 -1525 -612 736 135 -418 -139 -743 -184 713
2790 713 -1447 -1839 439 427 -858 407 958 -703 -820 379 -151 -119 152 -484 -50 1372 862 -212
2808 -212 360 -156 -911 900 1051 -878 164 1973 749 -201 926 518 -630 70 444 206 946 785
2826 785 -396 835 1610 -1268 -1182 606 -25 -807 540 111 -359 735 511 -855 -574 259 -1135 -501
2844 -501 781 -247 -502 765 -187 -565 651 262 -1452 -93 888 -185 390 1186 -366 -267 1581
2861 1581 321 -1090 279 496 -420 1218 1728 -256 33 1280 -60 171 1165 -509 -410 1973 1024
2878 1024 -503 533 598 -1008 -76 836 -898 -415 961 107 -385 754 -387 -1460 48 -203 -1680
2895 -1680 -196 699 -1073 -319 1080 -831 -1741 -150 -467 -1183 71 109 -869 491 724 -1054 -314
2912 -314 901 -1106 -776 1617 356 -577 1356 821 -493 983 809 -848 145 1370 180 750 2001
2929 2001 60 -135 1624 571 -1146 504 1082 -275 659 1043 -149 483 1136 -713 -646 1171 -30
2946 -30 -893 691 829 -1002 360 705 -1522 -1013 410 -958 -701 428 -144 -660 700 -167 -972 -95
2964 -95 -3 -1245 404 1640 -597 -442 1670 705 -660 371 153 -221 1047 1318 -218 1373 2039
2981 2039 160 541 1551 105 -157 1725 1099 380 1638 1562 -92 1244 1174 -206 29 1292 135
2998 135 269 1651 612 -297 773 124 -1010 49 172 -1097 -39 546 -476 -350 311 -1523 -1452
3015 -1452 54 -491 -1829 -572 435 -770 -471 -303 -1109 -749 -280 -998 -682 229 -416 -594 985 392
3033 392 -1441 -20 651 -967 -508 1003 325 186 1088 432 179 797 -71 -338 595 249 -237 1236
3051 1236 1280 -461 136 1316 -198 -1092 249 351 -168 443 613 -255 21 -86 -840 -60 178 -1246
3069 -1246 -632 1015 -110 -903 357 -251 -918 -188 -215 -1106 -24 869 -102 121 523 -2 -293 237 -491
3088 -491 -122 927 216 -239 1263 1163 -439 196 1042 -129 -231 1360 606 342 1106 1060 282 636 482
3107 482 -216 636 749 36 1097 1232 -488 222 1630 -117 -1452 649 1114 -291 87 768 222 542
3125 542 45 -707 -417 69 -413 -256 1045 -313 -651 1056 344 -1634 -365 846 -839 -765 819 402
3143 402 -327 410 -96 -143 23 -413 -529 867 497 -901 386 1124 -635 -560 484 -486 -966 720 578
3162 578 -609 342 510 -182 -128 -92 -874 -390 341 -683 -109 911 -445 -1168 804 -21 -1757 -263
3180 -263 307 -917 -506 968 -166 -629 -8 -415 -803 -92 -465 -575 1003 685 -760 414 841 -1165
3198 -1165 -384 1320 -222 -1260 828 1278 235 371 639 -335 122 812 -245 306 652 -350 782
3215 782 1977 -236 -1205 1358 808 -1334 7 1347 -247 -162 907 289 -614 65 -665 -402 412 -477
3233 -477 -827 653 551 -844 256 378 -1661 -765 1107 -99 -1355 379 1062 -401 -415 -112 -834
3250 -834 76 152 -512 458 971 -592 74 1817 22 -1100 345 239 -687 1073 1918 -420 -43 1745
3268 1745 764 -672 44 -44 31 847 324 -124 1293 365 -902 347 1007 -1363 -1024 1123 251 -788
3286 -788 450 361 -1124 30 103 -1065 -975 43 -473 -68 223 -810 -175 1013 -916 -1887 261 437
3304 437 -1243 -51 1382 -407 -882 35 68 63 79 -454 -269 635 539 -134 798 291 -925 594 1074 -608
3324 -608 -317 1912 718 -391 912 659 -165 -62 594 -146 -113 343 -121 732 652 -574 -549 705 -553
3343 -553 -1193 550 446 -879 79 1152 -889 -967 -164 -418 -695 26 -639 -343 469 -171 -464 420 -461
3362 -461 -1278 237 560 -960 -164 1206 47 -756 372 730 -617 -251 107 213 400 202 394 1114
3380 1114 741 -655 -264 960 -69 -530 890 927 -222 507 965 -484 -486 357 58 -102 -148 44 251
3399 251 303 -578 -328 439 -623 -1685 201 846 -666 -672 660 -55 -555 -229 -369 -689 -343 -278 -445 310
3419 310 145 -105 551 -152 -912 211 921 -542 -172 1302 817 -607 315 1197 219 -167 -70 -30 953
3438 953 773 24 340 1024 159 -161 589 -204 -661 959 637 -603 540 868 -637 -646 209 -28 -635
3457 -635 -381 -213 244 258 -745 -1185 25 -166 -1773 -557 397 -939 -876 520 -10 -1271 -506 -264
3475 -264 -1098 -416 -35 -545 -175 129 -296 139 295 -1036 -333 1081 -5 -680 714 1068 -402 243
3493 243 941 -215 -126 640 112 248 818 -52 516 1179 40 -706 580 573 -885 612 1211 -188 -502
3512 -502 714 164 -721 180 15 -883 41 228 -310 -19 146 -1139 -357 445 -954 -974 430 -375 -1231
3531 -1231 784 590 -845 -210 521 -438 -507 358 -206 106 655 349 -14 406 -25 -587 702 561 -288
3550 -288 600 1390 -208 -139 1303 217 -721 544 714 -103 335 707 121 771 513 -1029 -43 523 -444
3569 -444 -233 962 220 -745 533 471 -861 -113 225 -872 -510 446 -304 -509 15 -321 -670 24 -754
3588 -754 -1337 95 403 -879 12 577 -710 -969 172 -316 -935 117 -237 -465 323 235 -752 -124 153
3607 153 -715 -418 321 -416 -250 885 -233 -715 444 48 -979 -286 501 -449 15 562 -206 -15 290
3626 290 -266 -733 364 -86 -765 505 446 -562 223 548 -577 -592 271 -273 -546 613 414 -15 193
3645 193 634 -278 251 -55 -412 31 837 -32 -98 1235 334 -340 423 526 -476 360 384 -4 431 1056
3665 1056 25 100 516 -186 -413 563 178 -279 533 444 -273 99 254 -948 -343 343 -260 -332 261 356
3685 356 -61 396 -80 -665 -99 223 -638 -180 621 -228 -462 577 -333 -460 164 -1 -538 456 476 -185
3705 -185 223 489 -161 -188 27 -303 -144 399 47 -86 944 447 -485 28 339 -297 -416 156 -138 -58
3725 -58 728 -266 -595 364 15 -695 -253 -189 -635 246 115 -361 -216 15 -1099 -1111 -6 -600 -766 31
3745 31 104 -314 -100 -252 -771 -457 316 -927 -671 237 -107 -545 278 -6 -503 -41 -223 -575 666 757
3765 757 -141 -140 931 360 92 347 15 -230 884 791 -156 830 924 116 375 621 -77 138 544 79 96
3786 96 1029 288 -463 518 438 -664 -396 421 -347 91 595 -228 -677 287 -487 -619 42 -322 -710 31
3806 31 267 -347 -195 408 -678 -668 489 -135 -606 171 325 -266 298 609 -484 -253 484 -407 -81 755
3826 755 -56 340 1298 295 -567 433 409 -471 257 855 -140 258 953 311 -122 541 -160 -756 567
3845 567 249 -290 192 359 -276 172 289 -810 -831 717 -244 -1047 323 537 -631 -425 -236 -808 -226
3864 -226 37 -1053 -352 689 -280 -338 176 -176 -848 254 114 -933 216 859 -380 -282 773 209
3882 209 -532 71 -130 70 539 -50 -167 906 832 -639 26 825 -68 -471 772 226 -280 669 545
3901 545 -437 23 501 -671 -450 360 -97 -248 198 -579 -339 386 -403 -1459 302 580 -800 -208 452
3920 452 -314 -512 59 -205 -733 58 -194 -355 439 80 -316 243 328 -690 55 423 -787 -241 1035
3939 1035 465 -414 461 713 -74 -168 306 55 284 647 66 757 935 -95 -246 683 75 -715 433
3958 433 479 -361 170 887 -511 -690 268 -312 -400 -122 -298 -33 234 -127 -588 58 -84 -1121 -454 584
3978 584 -886 -776 547 163 -528 19 -16 -772 -191 3 -233 210 386 -144 374 343 -526 -355 467 13
3998 13 -177 724 654 -97 235 654 -35 -459 388 174 -338 307 404 362 533 -111 -243 436 -178 -724 223
4019 223 864 -400 -465 550 -16 -725 97 33 -749 -58 87 -18 64 -179 -548 187 -179 -870 -408 17
4039 17 -685 -775 644 668 -527 -244 321 -364 -460 -98 77 -86 332 98 62 738 -74 -341 589 3 -538
4060 -538 610 952 -122 220 810 206 -272 167 240 13 300 284 213 564 -116 -490 280 389 -764 -310
4080 -310 410 -70 -477 543 43 -1035 -195 -63 -596 -711 -172 -331 -55 126 -272 -322 130 -756 -490 359
4100 359 -241 -838 288 838 -462 -100 751 -5 -502 236 570 19 393 8 3 521 75 -323 317 523
4120 523 -528 301 869 -222 -437 863 218 -673 -246 170 -490 -248 256 37 146 -27 -573 -45 66
4139 66 -805 -676 443 144 -999 203 554 -677 -416 34 -522 -631 50 -237 -114 296 -263 -480 448
4158 448 -454 -657 325 371 -498 309 976 -292 -285 673 452 -550 101 519 76 447 877 250 309 530 -539
4179 -539 123 665 -288 -638 674 333 -294 630 425 -594 -555 848 -298 -295 267 311 51 342 -235 -453
4199 -453 73 -359 -1005 238 303 -663 -199 1112 -7 -597 208 -101 -578 159 522 -213 -60 638 -76
4218 -76 111 168 -357 182 749 -271 -206 945 411 -294 655 1054 -479 -271 722 153 -200 542 348 107
4238 107 361 -136 -345 406 -245 -639 335 550 -659 -137 491 -720 -870 -15 -266 -999 -130 152 -512
4257 -512 -306 -288 -855 -422 -420 -949 -446 47 -626 -481 582 -250 -1063 -21 316 -1011 -348 497 48 -213
4277 -213 199 -159 -101 323 -176 -352 395 292 -101 870 756 -174 491 691 -81 -528 474 263 -392 411
4297 411 496 38 85 105 -384 -118 -139 -596 -172 670 -321 -310 457 -103 -862 -14 76 -741 -326 600 -248 -361
4319 -361 35 -62 -243 -137 -413 -272 481 28 -417 518 800 -522 -58 342 -254 -187 521 219 -70 758
4339 758 812 -105 559 157 -177 105 416 225 820 849 -8 129 762 235 -643 465 441 51 109 485 12
4360 12 12 298 -174 -443 72 -320 -331 402 -172 -320 254 -137 -932 -324 163 -636 -419 339 -182 -341 -98
4381 -98 -374 -267 -378 -178 -318 -139 169 -335 163 411 -448 -273 209 -128 -425 446 583 -301 257 591
4401 591 -166 -44 84 -338 55 137 -288 25 586 -45 -502 285 83 -926 -142 169 -369 -34 379 -172
4421 -172 -269 104 -325 -569 5 -366 -422 249 287 -596 103 356 -471 -321 199 -299 -529 487 99 -275 133
4442 133 99 -89 52 256 -391 142 396 136 88 691 -104 -231 626 353 -446 317 535 -131 401 688 -98
4463 -98 -36 698 115 -303 327 -73 -384 424 322 -86 266 251 -737 -182 481 -315 -387 474 314 -335 -31
4484 -31 99 -668 55 127 -303 240 515 -186 -354 539 -302 -501 179 -41 -485 269 506 -510 179 475
4504 475 -105 -296 56 -51 -99 589 125 -171 674 500 -228 120 579 4 -44 518 -26 -125 580 173 -273
4525 -273 316 -55 -733 170 430 -309 -22 470 -116 -119 151 -410 -605 141 -70 -803 60 211 -458 13 532
4546 532 -767 -515 109 -259 -445 240 224 -226 335 49 -588 -20 257 -362 -83 572 344 -118 629 103
4566 103 -206 375 93 -425 207 609 -115 191 591 -97 -243 458 75 -360 313 -14 -19 486 598 -511
4586 -511 -142 298 -412 -292 117 -377 -234 441 -75 -685 -271 -49 -543 -325 -163 -539 -412 350 -82 -112
4606 -112 168 -257 -220 170 -136 -432 337 671 -262 221 509 -329 -349 88 96 -182 462 177 142 285 236 -404
4628 -404 48 390 -292 -215 680 21 -86 576 178 -292 13 -48 -399 -41 353 67 -50 138 -256 -200 192
4649 192 -570 -466 21 -135 -178 304 37 -340 -271 149 -635 -465 66 -195 -114 490 -122 -323 62 22 -237
4670 -237 135 161 -457 109 551 -65 -44 582 244 -200 61 100 -317 354 290 57 270 382 14 110 378 -251
4692 -251 -226 392 6 -275 498 502 -678 -190 297 -573 -348 -58 -224 24 211 -54 -302 251 -654 -528 282
4713 282 -21 -604 207 145 -313 -176 317 -325 -419 86 153 -19 14 133 -53 396 203 -223 -11 200 -164
4734 -164 4 781 237 -122 549 329 -453 150 317 -217 146 609 391 192 443 -149 17 33 -341 -564
4754 -564 346 473 -443 175 302 -638 -399 164 -286 -484 81 161 -330 272 71 -594 47 -290 -691 35
4774 35 241 -532 -44 556 -181 -586 196 288 -561 -185 269 7 60 499 -72 81 279 -183 -12 536 -128
4795 -128 -389 780 473 -245 211 703 -423 -279 623 -87 -129 86 211 164 516 157 -449 222 4 -598
4815 -598 -119 255 -522 -164 557 -307 -866 -10 -103 -633 -228 449 -78 -10 129 -121 -55 2 -680 -242 468
4836 468 -221 -463 411 477 -356 120 503 -448 -360 685 17 -153 586 271 188 418 111 -136 359 113 -539
4857 -539 576 519 -187 -11 834 12 -745 349 60 -253 183 545 28 -41 -19 -96 -44 154 -441 -194 383
4878 383 -372 -423 411 365 -1048 -30 199 -822 -672 547 168 -205 246 -3 -320 -34 0 -356 59 175
4898 175 -384 337 521 -293 -5 692 -66 -608 588 359 -116 395 464 -41 -66 248 21 127 68 -179 -4
4919 -4 547 -86 -88 373 -66 -720 153 33 -494 -560 310 92 -89 -97 -236 -335 -303 -240 -369 -18 -42 -439 244 487
4943 487 -615 -499 39 -304 -533 282 245 -383 7 481 -55 -118 59 -64 263 118 -357 60 716 -22
4963 -22 -307 582 180 -349 178 368 242 50 440 117 12 151 -79 -44 199 -28 -121 202 -80 -361 300
4984 300 409 -737 -603 188 -261 -406 60 -125 -350 4 -54 -204 5 -237 -502 190 -15 -139 25 484
5004 484 -457 -156 442 -285 -697 183 699 -133 -45 328 73 40 147 -109 66 362 -41 -70 642 69 63 640
5026 640 330 -308 88 667 -370 82 611 53 -179 -68 -83 -232 -25 -211 -307 447 22 -572 126 400
5046 400 -602 -543 320 -193 -470 -32 302 -491 -138 -26 -602 -82 -105 -165 -282 187 -260 42 333 -144 -140
5067 -140 488 200 -303 93 455 26 -37 480 64 -178 142 29 -298 197 178 -184 388 398 -153 198 417
5088 417 -509 -354 704 221 -336 153 31 -249 124 50 -532 -230 128 -283 -45 128 -159 -218 317 -606
5108 -606 -521 345 43 -471 -44 608 -237 -169 217 -198 -442 59 -30 -144 249 -28 -172 461 361 -508 253
5129 253 271 -343 -101 604 234 -400 429 454 -174 124 116 -120 72 172 9 294 428 -16 25 316 -126 -494
5151 -494 233 351 -328 88 236 -93 -132 289 -194 -537 -48 -290 -165 -27 118 -280 56 45 -680 -307 286
5172 286 -541 -430 512 97 -332 333 418 -111 86 84 -117 186 80 162 207 330 -93 -117 642 -74 -361 361
5194 361 435 -499 270 527 -96 -69 240 155 -368 67 -57 146 231 148 -178 156 136 -455 -151 353 -228 -166
5216 -166 521 135 -218 -71 -170 -357 -110 92 -281 83 105 -129 205 64 -246 -325 267 -133 -72 208 299 -281
5238 -281 135 385 -180 -48 230 178 -84 367 -148 135 297 174 -229 299 534 -382 172 363 -240 -47
5258 -47 356 20 -231 2 -122 -506 -59 77 -88 192 17 -220 -146 -79 -474 -546 187 -212 -441 172 -66
5279 -66 -273 -31 157 -363 -248 329 -442 -69 97 -57 -72 261 -132 -337 112 22 -180 357 578 -112 -64
5300 -64 272 240 -117 316 142 -135 441 144 -81 444 248 57 160 26 -182 -57 149 -185 -24 442 20
5321 20 -273 39 241 65 -168 -151 38 48 233 -326 -89 -23 -266 -605 -128 -127 -152 153 176 25 -107 148 -426
5344 -426 -331 231 -207 -168 247 60 -302 283 127 -339 -20 319 -10 -259 385 -1 243 351 -7 -53 157
5365 157 38 -154 156 358 -62 359 401 220 93 133 -211 -464 306 206 -249 273 19 -204 -95 -131 -659
5386 -659 -335 227 -343 -223 273 -116 -384 -14 40 -448 -103 -23 -252 -195 156 74 -228 149 -85 -514 162
5407 162 269 -107 578 531 -5 71 365 -70 -95 355 -152 162 433 221 52 479 147 -179 44 0 -61 -26
5429 -26 181 -121 4 497 134 -565 136 171 -539 -119 264 -222 -51 151 -248 -25 40 -444 -513 -19 -165
5450 -165 -477 136 178 -223 -188 257 -311 -231 227 25 -190 308 286 75 271 105 -248 31 54 -253 127 615
5472 615 45 59 409 23 -378 7 173 -201 180 397 225 237 586 82 -150 207 -303 -221 272 164 -592
5493 -592 418 16 -737 -209 42 -402 -172 289 -118 -97 264 -87 -41 76 56 -329 118 174 -231 255 516
5514 516 -199 -83 422 144 -393 216 460 -185 101 295 109 82 280 -191 -250 -130 -267 82 594 264 -267
5535 -267 244 340 -224 115 302 25 -259 469 219 -124 80 -49 -352 92 -126 -287 4 7 -170 143 575
5556 575 -243 -325 284 -46 -586 18 298 -219 65 63 -209 -1 -105 -50 -20 259 -158 10 385 -82 -164 237
5578 237 201 -476 195 244 28 -31 457 24 -29 186 -24 92 240 -61 -143 337 190 -94 184 284 -210 -182
5600 -182 98 -21 -445 -67 69 157 11 -58 -327 -133 -108 -350 -221 132 -215 24 438 -124 -454 173 -212
5621 -212 -633 -27 336 -86 7 254 -18 41 -46 -92 -253 152 -50 46 287 39 48 93 412 -468 7 438 244
5644 244 -149 279 180 21 64 -26 -111 -174 -200 -309 242 399 -71 276 422 -264 -396 258 -268 -407 -81 159
5666 159 -140 -142 58 65 -117 -113 -128 -249 26 -264 -195 411 -62 -240 117 201 -330 -259 199 -1 -225 290 -223
5689 -223 -182 150 96 -172 32 122 -183 280 302 -133 32 348 15 -186 287 348 131 433 592 -288 -67 197
5711 197 -234 -160 241 86 61 382 -60 91 204 -171 -421 -115 -44 -479 -76 193 -172 -361 6 -75 -467
5732 -467 28 -185 -462 8 30 108 -88 218 -569 -125 329 -235 -397 400 33 -329 388 413 -238 -178 324
5753 324 66 58 140 270 154 325 -30 -58 366 110 -360 240 479 -314 -32 605 79 -260 221 8 -400
5774 -400 146 166 -12 244 -20 -322 184 108 -625 -429 -102 -277 -94 423 2 -321 258 274 -339 -9 260
5795 260 -137 30 237 -280 231 422 -146 -304 256 -91 -534 239 309 -67 74 470 -159 177 191 -69 -181
5816 -181 116 362 139 326 212 -204 354 158 -438 26 269 -77 -238 383 144 -410 54 153 -382 -152
5836 -152 190 -24 -129 207 -280 -215 -6 -219 -316 180 -203 -234 340 202 -254 -91 536 -181 -268 289 -211
5857 -211 -120 45 132 14 308 16 -278 -32 158 -328 159 258 42 20 535 80 -242 268 339 -45 -239 30
5879 30 1 118 107 58 89 350 -353 -284 280 -209 -401 240 245 -311 119 -64 -81 -523 187 46 -338 196 -168
5902 -168 -124 81 -55 -294 264 2 -411 143 416 -72 -45 351 -30 -383 -24 92 -156 -139 223 184 321
5923 321 184 -33 210 180 -141 -28 566 112 -182 280 231 -137 222 156 -410 -115 221 -164 -60 149 -142
5944 -142 -101 57 -417 -220 -128 34 -430 109 191 -597 -187 97 -219 -377 -21 226 105 -11 14 -169 118
5965 118 32 -42 -124 125 -231 -109 385 -178 -239 299 141 -196 -25 442 -12 257 263 176 289 -111 -235 3
5987 3 130 -113 -205 486 242 -76 428 201 -291 -98 133 -356 -241 194 53 -141 201 154 -300 -129 -208 -258
6009 -258 -158 -101 -392 -164 265 -124 -331 0 -110 -178 -30 -84 -227 -146 238 -219 214 140 -179 -111 59 -184
6031 -184 -18 361 312 -163 208 353 -172 -4 372 321 -137 276 11 129 354 -7 -159 182 131 -339 182
6052 182 237 -205 -11 446 -23 -183 -24 28 -330 173 135 -405 33 154 -150 64 369 -597 -356 352 -157
6073 -157 -284 146 259 -72 323 163 -254 -233 109 -133 -156 381 218 -195 315 141 -14 164 41 7 412
6094 412 617 -138 3 341 -74 30 217 -130 -179 346 241 -198 189 256 -190 258 156 16 -156 219 -60
6115 -60 9 379 -41 -292 253 106 -265 -75 241 -267 -250 188 -131 -163 127 2 -245 47 88 -221 121 297
6137 297 -148 85 126 -197 -345 368 -124 82 281 4 -53 500 302 15 -6 213 56 27 402 88 -146
6158 -146 175 34 -226 298 86 -351 199 219 -22 -52 221 -222 -203 141 -350 -320 144 249 -339 -215 -52
6179 -52 -211 -61 117 -495 -302 42 -290 -271 125 -76 -251 -83 135 -170 -137 305 -251 -218 359 194 -226
6200 -226 108 72 -231 67 -53 -314 246 311 -104 63 137 -93 -89 -64 -119 -119 109 246 -14 114 283 -315 -65
6223 -65 -49 -206 -176 239 -92 -214 118 23 -330 -30 15 -288 135 98 -45 -133 152 41 -315 152 -165 -244 87
6246 87 -31 69 -39 93 -130 -307 202 300 -270 155 116 -171 501 20 -218 286 108 -93 -96 311 14 -60
6268 -60 230 114 255 95 -147 -266 130 97 -139 23 162 -193 4 187 -34 -280 -83 -325 -167 -66 73
6289 73 -339 182 259 -320 -25 160 -378 -362 170 0 -256 230 -65 -194 -2 -15 -259 209 118 -187 283 163
6311 163 -195 62 408 35 -280 350 316 -58 254 330 57 4 295 -112 -54 172 171 -125 432 34 37 -11 80
6334 80 -164 55 163 143 -7 250 239 11 -116 133 -79 -49 -21 -202 -99 -253 -380 -13 46 -593 -223 160
6356 160 -115 -422 204 412 -440 -132 391 -311 -80 84 -255 118 299 -121 -102 304 -10 -55 276 23 -6
6377 -6 180 338 -22 -64 609 -38 103 69 78 -215 118 -25 48 164 129 -133 43 35 -285 -266 148 -65 -270 55
6401 55 -211 -603 77 457 -265 -273 -20 -442 -22 -167 -24 -102 297 -46 -385 152 -185 -603 26 201 -51
6422 -51 95 211 24 -198 75 196 -73 167 264 306 417 332 14 157 146 -271 42 640 -66 -251 549 63
6444 63 -184 262 352 -252 -29 99 114 166 120 22 -173 19 -65 -261 179 32 -615 -27 243 -234 -206 295 143
6467 143 -242 8 202 -493 110 252 -228 246 49 -154 5 199 -304 -336 586 -63 -140 335 283 -96 161
6488 161 346 -38 25 151 6 -43 324 165 92 233 -117 -121 77 88 -249 264 -24 -114 53 291 -312 -200
6510 -200 184 -66 -352 -45 143 -184 6 36 -359 178 -14 -327 -1 243 -6 -248 -140 478 -324 -106
6530 -106 107 -94 14 100 44 218 -154 -253 117 299 -377 -200 288 44 -375 147 232 -36 26 -87 40 -193
6552 -193 58 162 63 110 -221 53 201 -49 -149 143 205 -301 -35 298 -250 -96 105 104 -257 -34 -316 -176
6574 -176 -235 -115 -7 40 217 -214 -125 105 -269 -398 307 -83 -113 370 176 -259 123 140 -65 -188 118 96
6596 96 140 -12 -89 56 77 199 -49 194 248 -68 166 336 -68 -304 115 131 -175 25 244 -200 4 -82
6618 -82 -26 114 -12 -109 -144 91 -78 -125 257 -15 -309 10 77 -197 -128 55 -196 -118 -150 64 -196 -1 -17
6641 -17 -104 -114 -73 -156 232 90 -480 -33 188 -280 -273 140 36 -40 147 102 -268 315 142 103 177 121 29 208
6665 208 19 -222 -141 346 155 -190 105 172 -175 85 59 -199 32 112 -108 120 166 -433 -205 -6 -260 -323
6687 -323 15 -31 -307 43 -48 -369 -109 41 -192 -153 -19 268 -119 -66 112 -85 28 -38 -227 -43 258 -190
6709 -190 44 280 -102 -171 427 -9 -295 213 386 248 142 304 28 -255 59 -33 98 132 -107 -152 292
6730 292 326 -310 63 248 -249 -283 226 -73 75 70 16 -93 -174 -222 -344 98 15 -305 -184 181 -307 -130 71
6753 71 -158 -279 204 117 -255 54 148 40 139 203 32 -39 138 -194 77 216 150 -69 315 2 -114 -206 335
6776 335 -127 -101 134 111 -92 166 -147 -167 93 -116 -46 269 215 68 62 129 68 -177 129 -86 -345 171 31
6799 31 -154 -54 184 -5 -224 63 -150 -64 3 -68 86 320 -87 -312 53 -20 -152 47 99 -491 -114 315
6821 315 107 -188 219 -111 64 313 57 23 163 194 -142 171 256 -135 -181 287 -35 -45 291 -22 -147 198
6843 198 289 -124 -152 -143 -268 -40 -114 -167 10 212 -244 -85 -172 -223 -445 20 11 -262 -95 -127 -100 -184 -76 -171 6
6868 6 -90 -169 13 -87 168 -107 223 117 -286 30 22 -132 -40 150 -28 -47 258 246 31 100 192 -125 -20 422
6892 422 349 25 217 52 -324 1 30 -213 43 161 -184 10 24 -173 -266 267 -90 88 177 -262 -62 -81
6914 -81 134 -249 -51 -181 -187 -134 22 -242 -203 -122 137 -255 -70 41 34 183 21 53 203 122 -29 -32 135 -108
6938 -108 -130 165 74 245 324 196 45 350 155 -20 11 17 -129 -33 255 -134 -73 235 61 -205 184 212 -260
6961 -260 -104 282 -134 -17 200 -59 -109 -48 -209 -305 171 -172 -211 -64 157 -360 -164 251 -91 74 331
6982 331 124 9 187 16 -157 37 175 -214 15 144 -34 141 379 38 -235 129 -167 -251 -55 -166
7002 -166 32 65 342 170 -15 135 -37 41 -74 88 3 321 -12 -119 -166 64 -200 -8 190 -212 -74
7023 -74 -25 -91 -330 -201 -292 -26 -82 90 -246 13 -107 -380 -202 174 -147 -440 66 -10 -67 107 118 134 198
7046 198 308 -98 113 121 13 96 270 -16 55 -14 113 95 181 7 -53 -187 238 -120 -208 360 21 -36 244
7069 244 132 -31 154 -63 -177 5 321 -178 -97 53 18 -142 329 129 -303 -34 -92 -126 -148 157 -280 -48
7091 -48 -27 -235 -279 215 -214 -149 103 9 -412 -173 -48 -150 -2 377 275 114 261 72 -89 158 27 -127
7113 -127 201 202 -99 80 192 -11 141 150 -141 1 321 85 69 51 46 -88 83 93 -286 -123 96 -144 -124
7136 -124 39 248 -134 44 24 -342 -203 -148 -62 -296 -113 -42 -93 -19 -36 -81 -120 -95 -351 266 79 -83 131
7159 131 381 -42 -45 245 -43 167 -30 23 43 106 74 31 104 254 -300 214 157 -11 -64 368 83 -9 -60 -16
7183 -16 -209 18 81 -75 -118 150 -241 -4 -203 -98 -124 81 -58 -272 -50 -49 -189 128 82 -208 -59 -108 -42
7206 -42 -374 -58 -32 57 428 -68 178 30 42 -209 60 193 -79 336 318 -58 -91 158 69 -222 -344 130
7228 130 -182 272 380 158 -16 163 -107 -21 458 -241 -61 -63 103 -184 206 49 -125 10 100 70 -64 -11
7250 -11 -167 159 -68 -259 -321 -39 -57 -256 188 140 -306 -110 84 -405 -153 -117 -82 28 58 -146 -167 129 193
7273 193 219 138 132 70 -19 296 7 -209 105 138 -48 27 255 -238 -42 0 -104 116 123 -12 127 -157 -115 -263
7297 -263 -66 20 -295 126 31 -358 -57 111 -98 -116 116 50 -299 181 -58 -2 -76 -13 -283 58 14 -293 92
7320 92 145 -299 -256 297 25 -339 140 276 -441 26 316 -60 8 21 67 49 180 -56 -142 256 -204 127 250
7343 250 190 -94 65 275 -4 5 125 -174 -61 124 -83 -261 32 -231 -103 188 62 -132 -106 241 25
7364 25 -119 39 -186 -461 -102 -205 -326 -72 302 22 -21 169 -93 -234 51 -294 -146 208 44 -152 199
7385 199 379 -202 -33 181 -38 27 237 177 259 89 199 27 163 77 42 147 116 -66 150 353 -63 -138
7407 -138 148 -141 1 243 -154 -221 -55 95 -226 -111 -94 -326 -134 75 16 -285 -42 84 -381 34 85
7428 85 -342 0 59 -186 -121 310 -27 -241 23 164 -7 -349 42 -125 113 34 -118 -122 47 -115 -77 199
7450 199 196 -74 1 21 50 -31 301 -81 232 210 -123 92 130 54 -80 532 -23 -115 243 -31 -242 70 218
7473 218 -92 -79 131 -135 43 -66 -108 -208 -5 -4 -188 88 -185 -306 -139 61 -253 -328 11 -117 -216 36
7495 36 149 -205 80 10 -8 19 29 -252 320 68 -72 -29 83 -4 -124 217 172 -141 147 219 -5 93 396
7518 396 108 24 76 34 -151 18 -158 116 111 83 -173 41 130 -312 119 48 -52 85 -38 72 -6 -202 -153
7541 -153 -71 40 -66 -136 156 -36 -35 -207 226 -119 -199 -130 -78 -16 37 253 -28 110 -22 10 62 263 92 -117
7565 -117 228 249 -18 238 -114 -58 -20 9 -6 -51 251 -49 152 200 109 -20 65 -199 -85 11 263 48 -66
7588 -66 82 -89 27 84 -167 -285 64 28 -119 -123 60 -73 -161 19 -104 -88 38 -253 -95 -167 141 -18 267
7611 267 337 7 169 83 -266 -67 252 -228 219 35 -217 -229 86 236 -377 109 207 -68 297 -7 -236
7632 -236 2 129 -50 -239 -170 163 -89 -76 -26 -279 106 24 -167 105 69 -144 -268 83 -10 21 -46 -167 -332
7655 -332 -47 14 -144 77 47 -89 -171 139 -5 -259 -96 1 -43 -42 46 -140 -67 -26 -103 -23 -48 -85 34 446 -77
7680 -77 24 351 100 -181 -27 199 302 77 245 164 -257 13 -173 -396 -4 16 -158 -91 125 -112 201
7701 201 120 -212 65 88 -14 -111 107 -125 -100 241 112 -62 -109 30 -84 39 50 93 49 249 -172 -458 81
7724 81 182 80 96 164 25 175 375 1 -6 -110 179 73 188 301 -128 85 203 -158 -9 64 210 -149
7746 -149 291 64 -202 -81 90 -95 -3 100 -158 286 168 -296 -181 242 -226 -139 79 141 -193 -74 -177
7767 -177 -148 44 67 -71 -5 34 -284 16 -49 64 -137 254 -138 8 360 67 -274 103 113 40 171 257 20
7790 20 -75 262 3 -13 77 170 -122 248 100 27 88 202 -89 -36 155 -198 -317 101 -69 -170 116 95 -207
7813 -207 -43 63 -18 -286 89 -139 -230 206 -88 -183 -16 60 -247 -114 -58 -107 108 128 -296 93 84 -236 -277
7836 -277 210 -71 198 171 212 273 245 172 -81 -235 147 -252 166 1 88 -16 173 -58 35 71 186 -135 -99
7859 -99 222 -155 -117 -136 -116 -166 -82 -11 -71 -199 135 -244 -99 -108 -128 -63 -92 -31 -261 -120 -94 -245 318 -199 -16
7884 -16 307 172 -355 -276 -8 -70 -146 -142 48 95 -26 182 -55 228 -24 -80 -81 33 231 17 134 -12 -108 51
7908 51 29 -76 -72 190 -100 -63 229 -72 -52 -34 -29 -184 8 -60 51 98 200 50 43 -249 -148 -95 -140 -217 -19
7933 -19 46 -122 -136 85 41 -57 -136 213 -119 -112 140 -145 2 -124 -76 -124 168 -39 -261 278 -42 -48 -7 240
7957 240 -302 20 318 -92 -32 150 194 -38 199 157 -113 -64 -96 98 -66 161 111 -61 196 -198 -167 -132 1
7980 1 -111 -112 219 -245 132 128 -153 -66 55 -147 -131 -159 -2 -279 -28 157 -272 120 73 -312 -126 201 -121
8003 -121 -145 -11 241 -174 32 -26 -51 170 10 -14 145 -11 -45 7 48 -31 5 140 143 -141 11 271 -89 65
8027 65 84 -40 -305 264 -281 102 55 13 -245 91 83 -115 -150 269 29 -266 107 -39 70 -78 -246 -289 -93
8050 -93 -181 -106 96 87 -94 133 235 -79 162 -12 -99 -244 128 -66 163 166 212 -78 111 164 -171 5 351
8073 351 67 178 147 164 -31 -187 145 -128 236 -114 159 70 157 -89 41 175 28 -81 78 46 38 -31 7
8096 7 -134 -10 76 -165 -182 -13 -230 -313 170 -422 -302 -74 181 -161 -212 137 -228 160 82 101 84 168 107 9
8120 9 157 -85 24 209 166 -118 142 343 -108 164 71 25 113 342 48 -199 105 -18 16 -80 -90 -150 -48
8143 -48 22 24 -17 148 -89 -29 126 -5 -286 -118 -132 21 -57 48 38 26 -89 -229 -79 -78 -200 47 -14 -53 -231
8168 -231 4 145 -73 34 218 -121 101 26 101 -101 -54 -156 -192 186 255 -45 160 170 128 204 101 -18 -163
8191a63
##END NTUPLES=NMR FID
##END=
