##TITLE=1H_Pr 5-4-iPrO
 CDCl3, 8 sc, 
 24.10.2019
##JCAMPDX= 6.0         $$ Bruker NMR JCAMP-DX V2.0
##DATA TYPE= NMR FID
##DATA CLASS= NTUPLES
##ORIGIN= UXNMR, Bruker Analytische Messtechnik GmbH
##OWNER= root
$$ XWIN-NMR		Version 3.5
$$ Thu Oct 24 16:34:30 2019 Russian Standard Time (UT+4h)  she@DPX200
##.OBSERVE FREQUENCY= 200.1315
##.OBSERVE NUCLEUS= ^1H
##.DELAY= (6, 6)
##.ACQUISITION MODE= SIMULTANEOUS
##.ACQUISITION SCHEME= undefined
##.AVERAGES= 8
##.DIGITISER RES= 18
##SPECTROMETER/DATA SYSTEM= spect
##.PULSE SEQUENCE= zg30
##.SOLVENT NAME= CDCl3
##.SHIFT REFERENCE= (INTERNAL, CDCl3, 0, 15.7039)
##AUDIT TRAIL= $$ (NUMBER, WHEN, WHO, WHERE, WHAT)
$$ ##TITLE= Audit trail, XWIN-NMR		Version 3.5
$$ ##JCAMPDX= 5.01
$$ ##ORIGIN= Bruker BioSpin GmbH
$$ ##OWNER= she
$$ F:/spectra/data/she/nmr/H-F/1/audita.txt
$$ ##AUDIT TRAIL=  $$ (NUMBER, WHEN, WHO, WHERE, WHAT)
(   1,<2019-10-24 16:33:18.34 +0400>,<she>,<DPX200>,
      <created by zg, POWCHK disabled, PULCHK disabled
       configuration hash MD5:
       00 E9 B6 7A A2 85 ED C7 34 08 36 98 17 FE 4E 26
       data hash MD5: 16K
       CE 40 28 FA E2 35 2F CC DC FD BE A4 3B D3 E5 B6>)
$$ ##END=
$$ 
$$ hash MD5
$$ B1 27 42 35 92 71 AF BC C5 3C F0 B1 23 AA BF 4A
##$RELAX= 
##$RELAX= 
##$RELAX= 
##$RELAX= 
##$RELAX= 
##$RELAX= 
$$ Bruker specific parameters
$$ --------------------------
##$DU= <F:/spectra>
##$EXPNO= 1
##$NAME= <H-F>
##$PROCNO= 1
##$TYPE= <nmr>
##$USER= <she>
##$AMP= (0..31)
100 100 100 100 100 100 100 100 100 100 100 100 100 100 100 100 100 100 
100 100 100 100 100 100 100 100 100 100 100 100 100 100 
##$AQSEQ= 0
##$AQ_mod= 1
##$AUNM= <au_zg>
##$AUTOPOS= <>
##$BF1= 200.13
##$BF2= 200.13
##$BF3= 200.13
##$BF4= 200.13
##$BF5= 200.13
##$BF6= 200.13
##$BF7= 200.13
##$BF8= 200.13
##$BYTORDA= 1
##$CFDGTYP= 0
##$CFRGTYP= 5
##$CHEMSTR= <none>
##$CNST= (0..31)
1 1 145 1 1 1 1 1 1 1 1 1 1 1 1 1 1 1 1 1 1 1 1 1 1 1 1 1 1 1 1 1 
##$CPDPRG= <>
##$CPDPRG1= <>
##$CPDPRG2= <>
##$CPDPRG3= <>
##$CPDPRG4= <mlev>
##$CPDPRG5= <mlev>
##$CPDPRG6= <mlev>
##$CPDPRG7= <mlev>
##$CPDPRG8= <mlev>
##$CPDPRGB= <>
##$CPDPRGT= <>
##$D= (0..31)
0 1.2 0 0 0 0 0 0 0 0.06 0 0.03 0 0 0 0 0.0002 0 0 0 0 0 0 0 0 0 0 0 0 
0 0 0 
##$DATE= 1571920397
##$DBL= (0..7)
120 120 120 120 120 120 120 120 
##$DBP= (0..7)
150 150 150 150 150 150 150 150 
##$DBP07= 0
##$DBPNAM0= <>
##$DBPNAM1= <>
##$DBPNAM2= <>
##$DBPNAM3= <>
##$DBPNAM4= <>
##$DBPNAM5= <>
##$DBPNAM6= <>
##$DBPNAM7= <>
##$DBPOAL= (0..7)
0.5 0.5 0.5 0.5 0.5 0.5 0.5 0.5 
##$DBPOFFS= (0..7)
0 0 0 0 0 0 0 0 
##$DE= 6
##$DECBNUC= <off>
##$DECIM= 24
##$DECNUC= <off>
##$DECSTAT= 4
##$DIGMOD= 1
##$DIGTYP= 9
##$DL= (0..7)
0 120 120 120 120 120 120 120 
##$DP= (0..7)
150 150 150 150 150 150 150 150 
##$DP07= 0
##$DPNAME0= <>
##$DPNAME1= <>
##$DPNAME2= <>
##$DPNAME3= <>
##$DPNAME4= <>
##$DPNAME5= <>
##$DPNAME6= <>
##$DPNAME7= <>
##$DPOAL= (0..7)
0.5 0.5 0.5 0.5 0.5 0.5 0.5 0.5 
##$DPOFFS= (0..7)
0 0 0 0 0 0 0 0 
##$DQDMODE= 0
##$DR= 18
##$DS= 0
##$DSLIST= <SSSSSSSSSSSSSSS>
$$ [...]
##$SUBNAM2= <"">
##$SUBNAM3= <"">
##$SUBNAM4= <"">
##$SUBNAM5= <"">
##$SUBNAM6= <"">
##$SUBNAM7= <"">
##$SUBNAM8= <"">
##$SUBNAM9= <"">
##$SW= 24.0689530833862
##$SWIBOX= (0..15)
0 0 2 0 0 0 0 0 0 0 0 0 0 0 0 0 
##$SW_h= 4816.95568400771
##$TD= 16384
##$TD0= 1
##$TE= 0
##$TE2= 300
##$TE3= 300
##$TEG= 300
##$TL= (0..7)
0 120 120 120 120 120 120 120 
##$TP= (0..7)
150 150 150 150 150 150 150 150 
##$TP07= 0
##$TPNAME0= <>
##$TPNAME1= <>
##$TPNAME2= <>
##$TPNAME3= <>
##$TPNAME4= <>
##$TPNAME5= <>
##$TPNAME6= <>
##$TPNAME7= <>
##$TPOAL= (0..7)
0.5 0.5 0.5 0.5 0.5 0.5 0.5 0.5 
##$TPOFFS= (0..7)
0 0 0 0 0 0 0 0 
##$TUNHIN= 0
##$TUNHOUT= 0
##$TUNXOUT= 0
##$USERA1= <user>
##$USERA2= <user>
##$USERA3= <user>
##$USERA4= <user>
##$USERA5= <user>
##$V9= 5
##$VALIST= <valist>
##$VCLIST= <CCCCCCCCCCCCCCC>
##$VD= 0
##$VDLIST= <DDDDDDDDDDDDDDD>
##$VPLIST= <PPPPPPPPPPPPPPP>
##$VTLIST= <TTTTTTTTTTTTTTT>
##$WBST= 1024
##$WBSW= 4
##$XGAIN= (0..3)
0 0 0 0 
##$XL= 0
##$YL= 0
##$YMAX_a= 502021
##$YMIN_a= -705392
##$ZGOPTNS= <>
##$ZL1= 120
##$ZL2= 120
##$ZL3= 120
##$ZL4= 120
##$ABSF1= 10
##$ABSF2= 0
##$ABSG= 5
##$ABSL= 3
##$ALPHA= 0
##$AQORDER= 0
##$ASSFAC= 0
##$ASSFACI= 0
##$ASSFACX= 0
##$ASSWID= 0
##$AUNMP= <proc_1d>
##$AZFE= 0.1
##$AZFW= 0.1
##$BCFW= 1
##$BC_mod= 2
##$BYTORDP= 1
##$COROFFS= 0
##$CY= 11.3945322036743
##$DATMOD= 1
##$DC= 2
##$DFILT= <>
##$DTYPP= 0
##$F1P= 20.1720416913024
##$F2P= 0.152960286110954
##$FCOR= 0.5
##$FTSIZE= 0
##$FT_mod= 4
##$GAMMA= 1
##$GB= 0.15
##$INTBC= 1
##$INTSCL= 1
##$ISEN= 128
##$LB= 0.24
##$LEV0= 0
##$LPBIN= 0
##$MAXI= 10000
##$MC2= 0
##$MEAN= 0
##$ME_mod= 0
##$MI= 1.114404
##$NCOEF= 0
##$NC_proc= 0
##$NLEV= 6
##$NOISF1= 3.799351
##$NOISF2= 2.8
##$NSP= 1
##$NTH_PI= 0
##$NZP= 0
##$OFFSET= 15.70392
##$PC= 1
##$PHC0= -9582.217
##$PHC1= 29.40084
##$PH_mod= 1
##$PKNL= yes
##$PPARMOD= 0
##$PSCAL= 0
##$PSIGN= 0
##$REVERSE= no
##$SF= 200.130013532006
##$SI= 16384
##$SIGF1= 3
##$SIGF2= 2
##$SINO= 400
##$SIOLD= 16384
##$SREGLST= <1H.CDCl3>
##$SSB= 0
##$STSI= 0
##$STSR= 0
##$SW_p= 3612.71676300578
##$SYMM= 0
##$S_DEV= 0
##$TDeff= 0
##$TDoff= 0
##$TI= <>
##$TILT= no
##$TM1= 0
##$TM2= 0
##$TOPLEV= 0
##$USERP1= <user>
##$USERP2= <user>
##$USERP3= <user>
##$USERP4= <user>
##$USERP5= <user>
##$WDW= 1
##$XDIM= 8192
##$YMAX_p= 0
##$YMIN_p= 0
$$ End of Bruker specific parameters
$$ ---------------------------------
##NTUPLES= NMR FID
##VAR_NAME=  TIME,          FID/REAL,        FID/IMAG
##SYMBOL=    X,             R,               I
##VAR_TYPE=  INDEPENDENT,   DEPENDENT,       DEPENDENT
##VAR_FORM=  AFFN,          ASDF,            ASDF
##VAR_DIM=   8192,          8192,            8192
##UNITS=     SECONDS,       ARBITRARY UNITS, ARBITRARY UNITS
##FACTOR=    0.0002076,     1,               1
##FIRST=     0,             0,               0
##LAST=      1.7004516,     0,               0
##MIN=       0,             -705392,         0
##MAX=       1.7004516,     502021,          0
$$ Real data points
##PAGE= N=1
##DATA TABLE= (X++(R..R)), XYDATA
$$ plain form
0 0 0 0 0 -8 8 -8 8 -16 24 -32 40 -48 64 -80 90 -112 136 -160 188 -224 263 -305 354 -408 469 -537 614
27 614 -696 789 -893 1006 -1131 1268 -1419 1582 -1764 1962 -2181 2420 -2682 2970 -3289 3643
43 3643 -4032 4467 -4955 5505 -6130 6848 -7680 8661 -9837 11279 -13086 15443 -18651
56 -18651 23298 -30679 44227 -77343 325494 196226 -519092 -39404 370570 213838 -38190
67 -38190 159227 91514 -208152 -102110 399112 347240 -168001 -328152 13375 167265 67987
78 67987 41607 66251 -56701 -61517 118523 134842 -95586 -125254 91784 142915 -41728
89 -41728 -78819 54547 74345 -19107 -13502 11406 -63476 -72939 98951 196299 41314 -140966
101 -140966 -91686 91286 165084 67365 -64186 -81648 16527 103863 104875 44581 -60434
$$ packed form
0@%%%qJ6j6J6k4M0n6P2q8J12j44J70k02K48k96L48m12M87n68O59p62Q77j006J151
27F14j310J485j682J899k137K399k687L001l346L726m143M601n102N652o259O932
43C643p675Q499r422J0460j1635J2978j4528J6341j8498K1116k4365K8529l4094
56a8651M1949n3977P4906j21570M02837j29268p15318M79688M09974j56732k52028
67c8190J97417o7713k99666J06042N01222n1872n15241j60151L41527J53890r9278
78F7987k6380K4644j22952m816J80040J6319k30428k9668K17038N1131j84643
89d1728l7091J33366J9798r3452N605K4908p4882r463J71890R7348j54985j82280
101a40966M9280J82972P3798r7719j31551j7462R8175Q7336J012o0294j05015
$$ plain form
112 -60434 -157705 -80524 160031 208672 -82324 -269690 -29429 224469 78810 -138647 -52238
123 -52238 54287 -61569 -51621 191427 162099 -203119 -248749 141414 261407 -70162 -211102
134 -211102 13704 86340 -62387 -18571 114269 -41503 -218442 -13602 207275 17106
144 17106 -191244 -15960 150405 -15622 -115914 62893 98929 -106101 -88783 155803
154 155803 115247 -158895 -124233 150423 132822 -110108 -105122 74815 55054 -52286 25676
165 25676 100247 -39265 -125711 36840 152872 16998 -106642 -23871 63797 14615 -24796
176 -24796 12953 3210 -60449 -45562 34692 38617 -38487 -66669 -8565 39949 11033 -43972
188 -43972 -34736 30659 50382 -2761 -29397 9115 26971 1499 17156 50000 -3930 -69305
$$ packed form
112f0434r7271P7181K40555M8641k90996j87366K40261K53898j45659k17457Q6409
123e2238J06525j15856R948K43048k9328l65218m5630L90163J19993l31569j40940
134b11102K24806P2636j48727M3816J32840j55772j76939K04840K20877j90169
144A7106k08350J75284J66365j66027j00292J78807L6036k05030J7318K44586
154A55803m0556k74142L4662K74656j7601k42930M986J79937j9761j07340P7962
165B5676P4571j39512q6446J62551J16032j35874j23640Q2771Q7668m9182l9411
176b4796L7749r743o3659J4887Q0254L925p7104k8182N8104M8514k8916n5005
188d3972R236O5395J9723n3143k6636L8512J7856k5472J5657L2844n3930o5375
$$ plain form
200 -69305 -735 100093 44784 -67549 -37803 41969 10743 -21937 49893 55715 -72073 -86775
212 -86775 75135 113094 -48914 -98678 35086 59890 -58916 -44178 75946 26381 -112342
223 -112342 -55246 86818 31869 -93703 -33360 69877 -4146 -85392 7157 80037 -15521
234 -15521 -75327 15698 56325 -28589 -42469 45659 38535 -59544 -49698 46936 41588 -40048 -37559
247 -37559 18992 5391 -29380 2322 29896 -13518 -44294 -852 35371 7305 -22997 -11945
259 -11945 3452 1517 2128 4753 -4995 -15931 -10268 4170 10435 -1273 -20764 -18952 6768 15100
273 15100 -9013 -19050 4338 9467 -15973 -10455 23882 11028 -32147 -14696 34131 15366
285 15366 -33344 -10337 35640 5315 -37771 456 42684 1323 -35223 8591 38153 -6888
$$ packed form
200f9305O8570J00828n5309j12333K9746P9772l1226l2680P1830N822j27788j4702
212h6775J61910L7959j62008m9764J33764K4804j18806J4738J20124m9565j38723
223a12342N7096J42064n4949j25572O0343J03237p4023q1246R2549P2880r5558
234a5521n9806R1025M0627q4914j3880Q8128p124r8079R846R6634n348q1636K489
247c7559N6551j3601l4771L1702K7574m3414l0776M3442L6223k8066l0302J1052
259a1945J5397j935O11K625r748j0936N663J4438O265j1708j9491J812K5720Q332
273A5100k4113j0037K3388N129k5440N518L4337j2854m3175J7451M8827j8765
285A5366m8710K3007M5977l0325m3086L8227M2228m1361l6546M3814K9562m5041
$$ plain form
297 -6888 -24605 25570 35844 -18010 -22163 30459 31120 -14773 -9616 25302 9196 -19322 7394
310 7394 31289 -3315 -26032 8227 27484 -4198 -15270 12797 13253 -13195 -4508 23103 9178
323 9178 -17598 -2320 20148 6315 -9891 3047 11013 -1702 -2493 10118 4905 -6969 1302
336 1302 10451 398 -4178 6917 5556 -7955 -1251 13586 2317 -13233 404 13035 -2803
349 -2803 -12244 5158 9218 -10469 -10631 10083 5505 -14235 -6109 11207 -2045 -16300 446
362 446 11610 -9128 -17401 5733 9728 -14135 -13765 9490 4180 -18031 -8939 11530 -456 -18198
376 -18198 -4330 9641 -5912 -15317 1358 5383 -11960 -11865 5379 882 -15481 -7347 6883
389 6883 -4291 -14895 -241 7513 -8660 -12611 5394 7668 -9008 -8551 7842 5331 -8989
$$ packed form
297f888j7717N0175J0274n3854m153N2622O61m5893N157L4918j6106k8518K6716
310G394K3895l4604k2717L4259J9257l1682j1072K8067M56k6448Q687K7611j3925
323I178k6776J5278K2468j3833j6206J2938P966j2715p91J2611n213j1874Q271
336A302R149j0053m576J1095j361j3511O704J4837j1269j5550J3637J2631j5838
349b803r441J7402M060j9687j62K0714m578j9740Q126J7316j3252j4255J6746
362D46J1164k0738q273K3134L995k3863L70K3255n310k2211R092K0469j1986j7742
376a8198J3868J3971j5553r405J6675M025j7343R5J7244m497j6363Q134J4230
389F883j1174j0604J4654P754j6173l951J8005K274j6676M57J6393k511j4320
$$ plain form
402 -8989 -3011 8812 1234 -8529 458 7929 -1554 -5480 4411 4756 -4773 -1898 7860 3564 -4596
417 -4596 1482 8369 1850 -2365 5286 7916 -712 -2598 5888 7009 -658 -917 3780 2588 128
432 128 3471 4109 132 1296 5573 3884 1525 6099 7448 1592 931 9555 10112 353 -31 8901
448 8901 9086 896 1547 8367 5258 -1284 3595 9932 3975 -2479 3860 10249 4492 -470 4258 7579
464 7579 2303 299 6283 5887 -2661 -3824 6289 7697 -4788 -9488 2383 7671 -4074 -9162
478 -9162 1440 4877 -6923 -7502 8031 7610 -12575 -12970 11679 13881 -11605 -15127 7781 8882
492 8882 -11337 -6913 12217 -703 -22197 -3310 23044 1610 -27818 -6640 21745 1798
504 1798 -19567 2987 16263 -13674 -19851 18385 21885 -24006 -29248 17339 23392 -19938 -24199
$$ packed form
402h989N978J1823p578r763Q987P471r483l926R891L45r529K875R758m296q160
417d596O078O887o519m215P651K630q628j886Q486J121p667k59M697j192k460
432A28L343O38l977J164M277j689k359M574J349n856o61Q624N57r759l84Q932
448H901J85q190O51O820l109o542M879O337n957o454O339O389n757m962M728L321
464G579n276k004N984l96q548j163J0113J408j2485m700J1871N288j1745n088
478i162J0602L437j1800n79J5533m21k0185l95K4649K202k5486l522K2908J101
492H882k0219M424J9130j2920k1494J8887K6354k1434k9428K1178K8385j9947
504A798k1365K2554J3276k9937o177L8236L500m5891n242M6587O053m3330m261
$$ plain form
517 -24199 11506 8130 -22516 -9327 20836 -2124 -34363 -6333 30455 4544 -31369 -10339
529 -10339 19220 4625 -13458 1849 7946 -12640 -11701 16458 17326 -14879 -22847 6644 21040
542 21040 2731 -11303 -3923 4519 4229 4936 9122 3547 -9004 -6879 15320 25011 -941 -24599
556 -24599 -3671 28698 15243 -18196 -10803 14713 3851 -11997 10818 21830 -18220 -33031
568 -33031 22700 47715 -12643 -46137 9365 42302 -3093 -22151 18582 14264 -34049 -8646
580 -8646 56226 21122 -61111 -30354 57243 35412 -40182 -19237 33980 293 -33520 25255
592 25255 53505 -28930 -63676 27930 72119 -12267 -57853 9339 39375 -15284 -21519 30795
604 30795 11896 -50451 -18479 54966 22150 -57047 -31860 40180 23388 -32411 -16425 18729
$$ packed form
517b4199L5705l376l0646J3189L0163k2960l2239K8030L6788k5911l5913K1030
529a0339K9559j4595j8083J5307O097k0586R39K8159Q68l2205p968K9491J4396
542B1040j8309j4034P380Q442k90P07M186n575j2551K125K2199R691k5952k3658
556b4599K0928L2369j3455l3439P393K5516j0862j5848K2815J1012m0050j4811
568c3031N5731K5015o0358l3494N5502L2937m5395j9058M0733m318m8313K5403
580h646O4872l5104q2233L0757Q7597k1831p5594K0945N3217l3687l3813N8775
592B5255K8250q2435l4746R1606M4189q4386m5586O7192L0036n4659o235N2314
604C0795j8899o2347L1972P3445l2816p9197K5187P2040j6792n5799J5986L5154
$$ plain form
616 18729 -5380 -25003 13271 28483 -23880 -47581 8361 45705 -708 -47405 -22329 20402
628 20402 15218 -9642 -11195 -5845 -14890 -10746 19242 26640 -17203 -49455 -8312 46697 25363
641 25363 -35211 -34890 10803 15882 -7060 3550 11095 -29241 -40765 24959 55966 -19367 -70022
654 -70022 -2174 53684 2206 -39661 3935 18828 -31967 -19905 51641 25863 -69411 -45605
666 -45605 63862 50953 -54076 -48781 36906 26053 -35839 -2248 46061 -15928 -65288 19335
678 19335 82859 -5685 -79379 -3139 68373 11244 -39855 6459 28258 -22508 -19802 46850
690 46850 34277 -48645 -42084 45268 51985 -24954 -40136 15175 25746 -6969 -825 20845 -6908
703 -6908 -33270 9582 52771 10412 -50502 -25311 40294 38599 -15329 -27436 2302 8439 -2900
$$ packed form
616A8729k4109j9623L8274J5212n2363k3701N5942L7344m6413m6697K5076M2731
628B0402n184k4860j553N350r045M144K9988P398m3843l2252M1143N5009k1334
641B5363o0574L21M5693N079k2942J0610P545m0336j1524O5724L1007p5333n0655
654g0022O7848N5858n1478m1867M3596J4893n0795J2062P1546k5778r5274K3806
666d5605J09467j2909j05029N295Q5687j0853o1892L3591M8309o1989m9360Q4623
678A9335O3524q8544p3694P6240P1512n7129n1099M6314K1799n0766K706O6652
690D6850j2573q2922O561Q7352O717p6939j5182N5311J0571l2715O144K1670k7753
703f908k6362M2852M3189m2359o0914K5191O5605j695n3928j2107K9738O137j1339
$$ plain form
716 -2900 13954 26309 -15551 -49296 1016 64306 26924 -51773 -39046 31947 34475 -11581
728 -11581 -7323 14878 -17209 -34081 28566 59331 -20119 -72346 2836 64773 4818 -49215
740 -49215 -452 30574 -19919 -27425 36598 28981 -52567 -41928 51000 43470 -50537 -48361 36099
753 36099 33899 -35094 -25936 25448 1000 -38531 4976 42314 -16491 -61226 861 54246
765 54246 3768 -48040 -15818 19171 -951 -8572 15914 2116 -40746 -23402 38139 35727
777 35727 -28248 -46768 451 29012 6923 -12496 -6467 -7919 -16373 1632 28496 11345 -35241
790 -35241 -34784 20440 40954 -6924 -39555 -6063 23392 235 -15412 10904 10999 -29128 -20667
803 -20667 37084 31174 -38793 -40459 32527 40445 -24812 -30168 24744 18224 -28234 -3512 41636
$$ packed form
716b900J6854J2355m1860l3745N0312O3290l7382p8697J2727P0993K528m6056
728a1581M258K2201l2087j6872O2647L0765p9450n2227P5182O1937n9955n4033
740d9215M8763L1026n0493p506O4023p617q1548J0639R2928p530r4007K176Q4460
753C6099k200o8993R158N1384k4448l9531M3507L7338n8805m4735O2087N3385
765E4246n0478n1808L2222L4989k0122p621K4486j3798m2862J7344O1541k412
777C5727o3975j8520M7219K8561k2089j9419O029j452q454J8005K6864j7151m6586
790c5241M57N5224K0514m7878l2631L3492K9455k3157j5647K6316R5m0127Q461
803b0667N7751n910o9967j666P2986P918o5257n356N4912o520m6458K4722M5148
$$ plain form
816 41636 231 -49185 2527 57482 4113 -49597 -328 44068 -2039 -29366 18993 27566
828 27566 -28078 -21897 43858 29375 -42879 -27367 44900 30214 -33038 -16226 31582 7053
840 7053 -26402 11900 36399 -15202 -40717 16981 47636 -4581 -37252 121 24053 2117
852 2117 -4579 10876 92 -19905 -1809 25616 13835 -14058 -16308 -894 10849 14485 3279
865 3279 -15578 -12901 8906 12711 -2324 -3407 2486 -7969 -10927 12019 17532 -12600 -21246 9333
879 9333 14860 -12905 -10880 15517 3446 -23192 -2666 22365 -6214 -27231 10077 26486 -20788
892 -20788 -33908 19814 31061 -24752 -30672 22028 17002 -33119 -12842 38769 5866 -50421
904 -50421 -12400 45305 9061 -41429 -6915 28406 -9047 -27881 18579 25869 -28294 -31575
$$ packed form
816D1636m1405m9416N1712N4955n3369n3710M9269M4396m6107k7327M8359Q573
828B7566n5644O181O5755j4483p2254J5512P2267j4686o3252J6812M7808k4529
840G053l3455L8302K4499n1601k5515N7698L0655n2217l2671L7373K3932k1936
852B117o696J5455j0784j9997J8096K7425j1781k7893k250J5414J1743L636j1206
865C279j8857K677K1807L805j5035j083N893j0455k958K2946N513l0132q646L0579
879I333N527k7765K025K6397j2071k6638K0526K5031k8579k1017L7308J6409m7274
892b0788j3120N3722J1247n5813n920N2700n026n0121K0277N1611l2903n6287
904e0421L8021N7705l6244n0490L4514L5321l7453j8834M6460P290n4163l281
$$ plain form
916 -31575 24966 25997 -23116 -18161 19513 3581 -24677 4745 28358 -10116 -30876 10191
928 10191 27401 -11999 -21294 15253 15405 -19115 -10133 22507 7273 -21230 -1823 20881 -1068
941 -1068 -16863 7124 15923 -7429 -8789 12107 5778 -11863 2973 17641 -3603 -15290 10000
954 10000 17274 -8843 -9480 16170 8649 -16484 -1255 24148 2400 -20989 4720 23228 -5282
967 -5282 -16678 14045 18174 -15117 -11458 21941 11510 -20318 -3524 25544 1865 -23088 5766
980 5766 26231 -6563 -20955 13477 19995 -15866 -14547 21946 13228 -23266 -9649 24299 5728
993 5728 -21670 193 20509 -6790 -20452 11227 19386 -14491 -18254 14242 12047 -17101 -7777
1006 -7777 17419 894 -21977 -78 19152 -5128 -20258 4657 12791 -11829 -12486 12400 6553
$$ packed form
916c1575N6541J031m9113M955L7674j5932k8258K9422K3613l8474k0760M1067
928A0191J7210l9400r295L6547J52l4520Q982L2640j5234k8503J9407K2704k1949
941a068j5795K3987Q799k3352j360K0896o329j7641J4836J4668k1244j1687K5290
954A0000P274k6117o37K5650p521k5133J5229K5403k1748k3389K5709J8508k8510
967e282j1396L0723M129l3291L659L3399j0431l1828J6794K9068k3679k4953K8854
980E766K0465l2794j4392L4432O518l5861J319L6493q718l6494J3617L3948j8571
993E728k7398K1863K0316k7299j3662L1679Q159l3877l763L2496k195k9148R324
1006g777K5196j6525k2871K1899J9230k4280j5130K4915Q134k4620o57K4886n847
$$ plain form
1019 6553 -18104 -8148 14559 1251 -16495 -519 11544 -8247 -14737 8006 10403 -14085 -11965
1032 -11965 11124 4284 -15262 -3617 12514 -3480 -16860 3319 13266 -8133 -14209 6717
1044 6717 8311 -11695 -7028 11578 1596 -15735 -1211 13893 -2986 -14658 3829 10970 -8244
1057 -8244 -10060 10483 8098 -12804 -6097 13782 4588 -12718 -371 12729 -1386 -10963 6352
1070 6352 11778 -6321 -9233 9756 9047 -8099 -3085 11877 3008 -10365 2848 14422 -724
1083 -724 -10086 5677 11762 -3332 -6026 10030 8520 -7860 -3751 12082 6539 -7363 -913 9343
1097 9343 978 -5082 4936 8850 -3350 -5836 5634 7423 -2346 -1691 5684 1793 -4522 2254
1111 2254 8316 -136 -5760 1716 5995 420 -1646 2464 685 -3141 796 4509 226 -2870 368
$$ packed form
1019F553k4657R956K2707j3308j7746J5976J2063j9791o490K2743K397k4488K120
1032a1965K3089o840j9546J1645J6131j5994j3380K0179R947k1399o076K0926
1044F717J594k0006M667J8606r982j7331J4524J5104j6879j1672J8487P141j9214
1057h244j816K0543k385k0902O707J9879r194j7306J2347J3100j4115r577J7315
1070F352N426j8099k912J8989p09j7146N014J4962q869j3373J3213J1574j5146
1083g24r362J5763O085j5094k694J6056j510j6380M109J5833n543j3902O450J0256
1097I343q365o060J0018L914j2200k486J1470J789r769O55P375l891o315O776
1111B254O062q452n624P476M279n575k066M110j779l826L937L713m283l096L238
$$ plain form
1126 368 1249 -1199 698 2853 -2319 -4871 1956 4599 -3702 -5289 2821 2752 -6147 -4062 4514 929
1142 929 -7735 -2264 5211 -2132 -8825 164 6182 -4389 -9327 1230 4436 -5764 -6631 3634
1156 3634 1336 -9912 -4698 8526 1551 -12057 -6052 7115 1701 -8976 -2744 4994 -3584 -9073
1170 -9073 2471 8394 -4865 -12340 856 8941 -1427 -8331 -982 3551 -3494 -3562 4121 2374
1184 2374 -7899 -5810 6353 6798 -5263 -7787 2831 5568 -2105 -3098 3912 1664 -5733 -1186
1198 -1186 8955 3855 -8924 -4963 9779 7947 -6527 -6049 7185 5953 -4463 -1010 8673 1336
1212 1336 -8475 2345 14656 2613 -12426 -1506 13828 5848 -7537 -913 8131 -245 -4397
1225 -4397 8085 10239 -7560 -11257 9737 16158 -3594 -12537 3888 11107 -1657 -3965 8032
$$ packed form
1126C68Q81k448J897K155n172k552O827K643q301j587Q110o9q899K085Q576l585
1142I29q664N471P475p343o693Q989O018j0571m938J0557L206j0200q67J0265
1156C634k298j1248N214J3224o975j3608O005J3167n414j0677O232P738q578n489
1170i073J1544N923j3259p475J3196Q085j0368o904P349M533p045o8P683j747
1184B374j0273K089J2163M45j2061k524J0618K737p673r93P010k248p397M547
1198a186J0141n100j2779L961J4742j832j4474M78J3234j232j0416L453R683p337
1212A336r811J0820J2311j2043j5039J0920J5334p980j3385O624R044q376m152
1225d397J2482K154j7799l697K0994O421j9752q943J6425P219j2764k308J1997
$$ plain form
1238 8032 4390 -10708 -3637 16367 9595 -14565 -11265 12666 12743 -7600 -8318 6488 3578 -7904
1252 -7904 1412 12835 -1267 -17027 -1424 18887 5077 -16717 -6819 11473 4136 -8668 471
1265 471 6725 -7974 -11540 9616 15152 -10784 -20542 5135 17566 -4050 -15727 1138 7487
1278 7487 -7594 -6558 11054 4207 -19040 -10678 17309 12191 -17425 -16630 8931 10426 -7624
1291 -7624 -7083 4981 -2848 -12650 2691 16290 -2948 -21999 -4861 17773 6756 -13526 -8541
1304 -8541 5104 842 -4660 4983 6380 -10382 -14518 8345 18828 -3404 -20280 -2813 15324
1317 15324 4403 -9437 -1297 5353 -4718 -5962 11344 12102 -12939 -17248 11720 22091 -5509
1330 -5509 -19243 2841 15540 -2057 -6900 9658 5589 -15227 -4610 24144 12247 -22549
$$ packed form
1238H032l642j5098P071K0004o772k4160L300K3931P7k0343p18J4806k910j1482
1252g904R316J1423j4102j5760J5603K0311j3810k1794R898J8292p337j2804R139
1265D71O254j4699l566K1156N536k5936r758K5677J2431k1616j1677J6865O349
1278G487j5081J036J7612o847k3247Q362K7987n118k9616P95K5561J495j8050
1291g624N41J2064p829r802J5341J3599j9238j9051J7138K2634j1017k0282M985
1304h541J3645m262n502R643J397j6762m136K2863J0483k2232j6876J7467J8137
1317A5324j0921j3840Q140O650j0071j244J7306P58k5041m309K8968J0371k7600
1330e509j3734K2084J2699j7597m843J6558m069k0816J0617K8754j1897l4796
$$ plain form
1342 -22549 -14095 22341 17223 -13582 -8432 13812 2708 -13133 8329 23413 -7444 -26892
1354 -26892 7970 31976 -83 -25046 1406 20541 -1134 -10514 11939 10705 -16797 -10111
1366 -10111 23706 17239 -19758 -17037 16745 17355 -8929 -8050 8421 926 -9528 6173 16194
1379 16194 -5666 -19871 2675 20732 3611 -15008 -6211 7073 3285 -1353 3049 744 -8748
1392 -8748 -6424 8762 11767 -5048 -15849 -3869 12064 7715 -8180 -9684 1377 3241 -3138
1405 -3138 -699 5208 -4808 -14104 1186 16805 -124 -21961 -6040 17200 4003 -16782 -4282
1418 -4282 10590 -4692 -12595 9247 12725 -17620 -20601 16067 21553 -15949 -23415 10303 14998
1431 14998 -12669 -8567 15472 36 -25305 -732 29622 2074 -31539 -6819 24488 3819
$$ packed form
1342b2549Q454L6436n118l0805N150K2244j1104j5841K1462J5084l0857j9448
1354b6892L4862K4006l2059k4963K6452J9135k1675r380K2453j234k7502O686
1366a0111L3817o467l6997K721L3782O10k6284Q79J6471p495j0454J5701J0021
1379A6194k1860j4205K2546J8057j7121j8619Q797J3284l788m638M402k305r492
1392h748K324J5186L005j6815j0801J1980J5933m349j5895j504J1061J864o379
1405c138K439N907j0016r296J5290J5619j6929k1837J5921K3240j3197k0785J2500
1418d282J4872j5282p903K1842L478l0345k981L6668N486l7502p466L3718M695
1431A4998k7667M102K4039j5436k5341K4573L0354k7548l3613K4720L1307k0669
$$ plain form
1443 3819 -18372 1974 13567 -12131 -15024 17615 18103 -19254 -20007 16141 18139 -12719 -11854 11640
1457 11640 5668 -12760 260 16453 -1632 -17236 2711 18479 -71 -14832 468 12122
1469 12122 1747 -4942 2011 2804 -3523 790 8597 3286 -5991 -3720 4681 7420 4221 -1950 -5948
1484 -5948 -134 8543 6580 -2793 -3173 2213 1318 410 7229 4939 -8591 -7431 11164 11770 -7769
1499 -7769 -8046 8675 6514 -8402 -324 12797 -1672 -15224 4209 18565 -4148 -18963 5072
1512 5072 18653 -5426 -15658 7725 12169 -11480 -9531 15320 7847 -19260 -8857 18859 7775
1525 7775 -17735 -6721 13357 39 -13048 4167 12045 -10335 -16351 9149 14597 -10298 -14678
1538 -14678 6803 7502 -9647 -5217 9598 261 -14023 -2358 11865 -178 -12577 -1846 7730
$$ packed form
1443C819k2191K0346J1593k5698k893L2639M88l7357p53L6148J998l0858Q65K3494
1457A1640n972j8428J3020J6193j8085j5604J9947J5768j8550j4761J5300J1654
1469A2122j0375o689O953P93o327M313P807n311r277K271Q401K739l199o171l998
1484e948N814Q677j963r373l80N386q95r08O819k290j3530J160J8595O06j9539
1499g769k77J6721k161j4916Q078J3121j4469j3552J9433J4356k2713j4815K4035
1512E072J3581k4079j0232K3383M444k3649J949K4851p473k7107J0403K7716j1084
1525G775k5510J1014K0078j3318j3087J7215P878k2380o016K5500N448k4895m380
1538a4678K1481O99j7149M430J4815r337j4284J1665J4223j2043j2399J0731R576
$$ plain form
1551 7730 -1921 -7483 993 3221 -4846 -3578 3206 -82 -5676 -1080 3276 -1226 -3625 -363 -281
1566 -281 -2545 628 2928 -3255 -5635 1448 4418 -1716 -2909 1468 -734 -3763 2106 5912 -3083
1581 -3083 -7358 3296 6503 -3460 -4594 5422 3518 -6674 -1814 9856 2404 -9601 -555 11271
1595 11271 1151 -9389 1413 10009 -1221 -6956 4917 7843 -4990 -5054 8458 6742 -6339
1608 -6339 -3491 7358 3824 -4135 1174 6628 -1367 -5261 5137 8177 -2189 -4781 4642 5134
1622 5134 -2474 -587 6130 1679 -5305 -240 6446 2385 -3034 44 2557 -847 -646 3224 2633
1637 2633 -1640 -1490 802 416 1034 2525 -39 -4120 -1379 3268 1406 -1302 461 15 -4031 -2133
1653 -2133 4816 2880 -4761 -4670 1437 777 -1941 1359 1868 -4922 -6420 2169 5288 -2008 -4919 -366
$$ packed form
1551G730r651n562Q476K228q067J268O784l288n594M596M356m502k399L262Q2
1566b81k264L173K300o183k380P083K970o134j193M377k202l029N869L806q995
1581c083m275J0654L207r963j134J0016j904j0192M860J1670p452j2005R046J1826
1595A1271j0120j0540J0802Q596j1230n735J1873K926j2833o4J3512j716j3081
1608f339K848J0849l534p959N309N454p995l894J0398L040j0366k592R423M92
1622E134p608J887O717m451o984N065O686m061n419L078K513l404K01L870n91
1637B633m273J50K292l86O18J491k564m081K741M647j862k708J763m46m046J898
1653b133O949j936p641R1O107o60k718L300N09o790j498Q589L119p296k911M553
$$ plain form
1669 -366 -779 -3820 972 5088 -1909 -8522 -1875 4129 -268 -3398 682 -662 -6398 -2987 5956
1684 5956 2824 -6306 -4850 1925 -124 -2942 1634 2765 -5339 -6590 2245 4963 -1766 -3296 -58
1699 -58 -1112 -3336 2475 4687 -2525 -5952 109 3005 -747 -56 3219 -1671 -6035 955 7314 879
1715 879 -5341 -38 3180 -1675 -1381 5673 2518 -5997 -2891 5980 3756 -2741 489 3411 -2322
1730 -2322 -2852 5789 6140 -4671 -4227 5431 3606 -3806 1514 7417 -1338 -7565 3885 10306 -1010
1745 -1010 -6445 3481 5948 -3378 -1922 7921 3747 -7728 -2279 9046 3543 -6116 641 5775
1759 5775 -2555 -4084 6457 6629 -6189 -5491 6815 5292 -5553 -1868 6707 -441 -7266 1967
1773 1967 9046 -2112 -8212 1767 6586 -2748 -4399 4356 2076 -6278 -2145 6403 857 -6300 -557
$$ packed form
1669c66m13l041M792M116o997o613O647O004m397l130M080j344n736L411Q943
1684E956l132r130J456O775k049k818M576J131q104j251Q835K718o729j530L238
1699e8j054k224N811K212p212l427O061K896l752O91L275m890m364O990O359o435
1715H79o220N303L218m855K94P054l155q515L106Q871k224o497L230K922n733
1730b322n30Q641L51j0811M44R658j825p412N320N903q755o227J1450O421j1316
1745a010n435R926K467r326J456R843m174j1475N449J1325n503r659O757N134
1759E775q330j529J0541J72j2818O98J2306j523j0845L685Q575p148o825R233
1773A967P079j1158o100R979M819r334j651Q755k280q354M133Q548n546p157N743
$$ plain form
1788 -557 3745 -2410 -4152 3360 2867 -5893 -4088 4043 1322 -5403 -970 3272 -3035 -5984 2740
1803 2740 4454 -4667 -5307 2261 610 -4799 8 4642 -3478 -8238 1575 6307 -3226 -6376 2575
1818 2575 2060 -6980 -2242 8277 578 -11309 -2635 9204 640 -8801 383 5999 -5105 -6853
1832 -6853 6792 6668 -8881 -7669 8076 5838 -7745 -3527 7992 190 -8979 2238 10343 -3101
1846 -3101 -10308 4142 10022 -4214 -7684 6144 7253 -5973 -4527 8050 4335 -7014 -1712
1859 -1712 8814 2208 -7539 230 8280 1116 -5627 1554 5402 -929 -2016 4394 2933 -3914 -1471
1874 -1471 5903 3567 -2653 -1460 2135 2043 862 2373 1098 -1970 -284 3304 2539 151 -678 -1423
1890 -1423 -679 4032 4671 -2348 -5390 1936 5712 -606 -2782 2291 1591 -4689 -293 7688 1087 -8956
$$ packed form
1788e57M302o155j742P512m93q760J805Q131k721o725M433M242o307k949Q724
1803B740J714r121o40P568j651n409M807M634q120m760R813M732r533l150Q951
1818B575n15r040M738J0519p699j1887Q674J1839q564r441R184N616j1104j748
1832f853J3645j24j5549J212J5745k238j3583M218J1519p802r169J1217Q105j3444
1846c101p207J4450N880j4236l470J3828J109j3226J446J2577l715j1349N302
1859a712J0526o606r747P769Q050p164o743P181L848o331j087O410j461o847K443
1874a471P374k336o220J193L595r2j181J511j275l068J686L588p65k388q29p45
1890a423P44M711O39p019l042P326L776o318k176N073p00o280M396P981o601j0043
$$ plain form
1906 -8956 -2430 8655 2216 -7320 -763 5947 -2119 -5954 4044 5837 -6733 -7641 6936 7116 -8032
1921 -8032 -7706 6367 4640 -7645 -4246 6495 -43 -9683 35 9515 -1785 -12319 -380 10386
1935 10386 -965 -10075 -920 5157 -3010 -5288 4299 3862 -8271 -6710 6785 6799 -6426 -8031
1949 -8031 2392 4281 -2980 -2573 2380 -1335 -6145 -59 6873 593 -8525 -4081 5545 3821 -3868
1964 -3868 -3611 1618 1028 -2124 934 3718 -1531 -5951 194 7817 2286 -6908 -3228 5601 4449
1979 4449 -3060 -1877 3447 202 -3183 2703 6124 -2433 -7377 2703 9399 540 -7460 -410 6523
1994 6523 533 -2640 3705 3945 -5269 -3269 8409 7183 -6568 -7131 6070 8598 -2543 -4769
2008 -4769 3944 2806 -3870 585 8098 1027 -8923 -1212 10701 4365 -7344 -3852 5657 3052
$$ packed form
1906h956O526J1085o439r536O557O710q066l835R998J793j2570r08J4577J80j5148
1921h032L26J4073j727j2285L399J0741o538r640R718R480j1300j0534J1939J0766
1935A0386j1351r110R155O077q167k278R587m37j2133J561J3495J4j3225j605
1949h031J0423J889p261M07M953l715m810O086O932o280r118M444R626j724p689
1964c868K57N229n90l152L058K784n249m420O145P623n531r194L680Q829j152
1979D449p509J183N324l245l385N886L421q557m944J0080O696q859q000P050O933
1994F523n990l173O345K40r214K000J1678j226j3751n63J3201K528j1141k226
2008d769Q713j138o676M455P513p071r950P711J1913o336j1709L492R509k605
$$ plain form
2022 3052 -3081 646 4101 -2976 -5401 4469 8383 -3039 -9474 1196 8482 698 -6069 -54
2036 -54 3539 -2313 -2467 4782 3118 -7207 -6278 6450 7295 -5567 -8182 2483 5674 -2753 -3980
2051 -3980 2967 594 -6275 -1512 7157 1383 -9740 -4789 6866 3974 -6110 -4561 2902 231
2065 231 -4267 1176 4395 -4076 -8011 1892 7977 -2095 -8904 -956 5707 -759 -5079 368 2392
2080 2392 -4248 -3898 4735 4123 -6342 -7043 4060 6658 -3253 -6829 1084 3357 -1550 -1970 2734
2095 2734 395 -5549 -1644 6650 3531 -6703 -4932 4911 4576 -2463 -2659 2201 -14 -3307 1923
2110 1923 6475 -887 -7533 400 8384 2266 -5896 -918 5317 686 -3120 2971 4734 -2872 -4332
2125 -4332 4561 6947 -2702 -5959 3392 6696 -865 -3497 2602 3425 -2030 -656 5102 1679 -4731
$$ packed form
2022C052o133L727L455p077k425R870L914j1422o435J0670P286p784o767O015
2036e4L593n852j54P249j664j0325R29J2728Q45j2862k615J0665L191q427j227
2051c980O947k373o869M763Q669n774j1123M951J1655k892j0084J549P463k671
2065B31m498N443L219q471l935R903O085j0072o809P948O663o466m320N447K024
2080B392o640L50Q633o12j0465p01J1103K598r911l576P913K273m907m20M704
2095B734k339n944L905Q294l119j0234J771R843l35p039j96M860k215l293N230
2110A923M552p362o646P933P984o118q162M978O235m631l806O091J763p606j460
2125d332Q893K386r649l257R351L304p561k632O099Q23n455J374N758l423o410
$$ plain form
2140 -4731 -1026 6546 3315 -4374 -2161 3827 2641 -1122 372 2655 -882 -2474 2223 5034 -541
2155 -541 -4844 -695 4603 2086 -2612 -1402 1372 492 -868 880 2446 -967 -3859 651 4305
2170 4305 220 -4777 -1853 3647 1012 -3553 -738 2130 -927 -3399 1249 3139 -3486 -5157 2230
2185 2230 4781 -3211 -5635 1605 2981 -3586 -3270 3577 668 -6709 -2085 6006 924 -7707 -2937
2200 -2937 5131 393 -5870 -439 3951 -2946 -5528 2225 4320 -3640 -5543 2678 3441 -4031 -3363
2215 -3363 2749 1248 -4284 -1151 3469 -865 -4168 1082 3966 -2013 -4465 1680 3143 -1373 -1730
2230 -1730 1531 149 -2304 320 3271 -254 -2769 35 1825 155 623 1548 -803 -2298 1915
2245 1915 3854 -605 -2158 1800 1967 -1694 503 4196 803 -3940 472 5467 532 -3339 2204
$$ packed form
2140d731L705P572l231p689K213N988j186l763J494K283l537j592M697K811n575
2155e41m303M149N298k517m698J210K774q80j360J748J566l413k892M510L654
2170D305m085m997K924N500k635m565K815K868l057k472M648J890o625j671P387
2185B230K551p992k424P240J376o567L16O847k909p377M624Q091n082q631M770
2200b937Q068m738o263N431M390o897k582P753K095p960j903Q221P63p472O68
2215c363O112j501n532L133M620m334l303N250K884n979k452O145J463m516l57
2230a730L261j382k453K624K951l525k515K804J790j670M68R25k351j495M213
2245A915J939m459j553L958J67l661K197L693l393m743M412M995m935l871N543
$$ plain form
2260 2204 4131 -2383 -2490 4599 3700 -3520 -2018 5519 1964 -4787 794 7055 -391 -6072 1992
2275 1992 6978 -1569 -4900 4029 4355 -4360 -2823 6813 4100 -5874 -2460 5867 1316 -5039 1291
2290 1291 5966 -2638 -6004 3529 5948 -3649 -4462 3796 2889 -5063 -1829 5702 601 -6796 -669
2305 -669 5416 -1060 -5328 1719 4007 -4090 -4250 3705 2793 -4953 -2306 3954 -411 -5432 718 4211
2321 4211 -2873 -5490 2125 3232 -4341 -3178 3858 627 -6405 -1117 5373 -796 -5948 282 4075
2336 4075 -3477 -4549 3593 2734 -5669 -3255 5013 1033 -5957 -330 5098 -1961 -6303 2352 5676
2351 5676 -3637 -5248 3904 3620 -5467 -2430 6536 1505 -7441 -910 6924 16 -5965 1720 5516
2366 5516 -2915 -4492 4923 4789 -4958 -3281 5795 2291 -4861 351 6534 -739 -6150 2731 6983
$$ packed form
2260B204J927o514j07P089q99p220J502P537l555o751N581O261p446n681Q064
2275A992M986q547l331Q929L26q715J537R636k713r974L414Q327m551o355O330
2290A291M675q604l366R533K419r597q13Q258r07p952L234P531n101p397O127
2305f69O085o476m268P047K288q097j60P955r12p746K647O260m365n021O150L493
2321D211p084k617P615J107p573J163P036l231p032N288O490o169n152O230L793
2336D075p552j072Q142q59q403K414Q268l980o990N627N428p059m342Q655L324
2351E676r313j611R152k84r087L037Q966n031q946O531P834o908n981P685L796
2366E516q431j577R415j34r747J677R076l504p152N212O183p273n411Q881M252
$$ plain form
2381 6983 -2369 -4816 3853 4815 -3964 -2260 6057 2978 -5377 -950 6359 1170 -4019 1730 4810
2396 4810 -2131 -3087 4329 4207 -3264 -2285 4566 1782 -3462 999 5212 -1115 -4484 2667 5082 -1978
2412 -1978 -3650 3185 2779 -3410 -1042 4920 557 -4545 185 4651 -435 -3482 1880 2390 -3498
2427 -3498 -1870 4578 1348 -4965 -1407 4713 -229 -4405 983 3461 -3260 -4688 3626 3710 -4318
2442 -4318 -3899 3490 1922 -4713 -996 4036 -935 -5721 457 4376 -2000 -4621 1644 2419 -4216
2457 -4216 -3205 4050 2196 -5731 -2593 4075 217 -4821 -121 4086 -2477 -5357 1785 4602 -2280
2472 -2280 -4706 861 2308 -2402 -1562 2753 -73 -4542 -818 4109 735 -3173 -918 1293 -583
2487 -583 -1058 2030 1228 -3059 -1899 1883 2232 -701 -952 554 -341 -167 1609 1097 -585 -688 535
$$ packed form
2381F983r352k447Q669R62q779J704Q317l079q355M427P309n189n189N749L080
2396D810o941r56P416j22p471R79O851k784n244M461M213o327l369P151K415p060
2412a978j672O835m06o189K368N962m363n102M730M466n086l047N362N10n888
2427c498J628O448l230o313L558O120m942m176N388K478o721j428Q314Q4q028
2442d318M19P389j568o635L717N032m971m786O178L919o376k621O265P75o635
2457d216J011P255j854p927L138O668l858n038M700M207o563k880P142K817o882
2472b280k426N567J447m710Q40M315k826m469L724M927l374l908K255K211j876
2487e83m75L088q02m287J160L782L49k933k51J506q95J74J776n12j682j03J223
$$ plain form
2504 535 533 334 1320 577 -1233 261 2180 747 -667 1078 2276 -536 -1514 2039 2878 -620 -1020
2521 -1020 1689 1336 -1236 328 3640 898 -3372 148 4060 1600 -1813 921 2239 -1322 -1207
2536 -1207 3725 3302 -3395 -3380 3012 4105 -1550 -1649 1850 908 -2202 345 4194 638 -3755 -810
2552 -810 3766 1363 -2445 -1177 1167 84 -1035 886 1426 -1406 -2430 810 2077 -748 -2512
2567 -2512 -186 1403 -827 -1817 -74 1089 -707 -2012 342 1000 -1816 -2737 972 2172 -1941 -3821
2583 -3821 612 2606 -1247 -3144 -35 1222 -2106 -1797 2204 1225 -4484 -3122 3144 2885 -3869 -3377
2599 -3377 1812 963 -2673 130 2630 -1984 -4835 898 4959 -963 -5587 -257 3331 -496 -2493
2614 -2493 1604 1677 -3362 -2132 4201 2781 -4090 -3120 2718 2908 -1962 -1454 1565 699 -1890 641
$$ packed form
2504E35kj99R86p43j810J494J919j433j414J745J198k812r78L553Q39l498m00
2521a020K709l53k572J564L312k742m270L520L912k460l413K734J318l561J15
2536a207M932m23o697J5O392J093n655r9L499r42l110K547L849l556m393K945
2552h10M576k403l808J268K344j083j119J921N40k832j024L240J267k825j764
2567b512K326J589k230r90J743J163j796j305K354O58k816r21L709J200m113j880
2583c821M433J994l853j897L109J257l328L09M001r79n709J362O266k59o754M92
2599c377N189q49l636K803K500m614k851N733M061n922m624N330L588l827j997
2614b493M097P3n039J230O333j420o871R70N838J90m870N08L019q66k589K531
$$ plain form
2630 641 2876 65 -2750 558 3100 576 -2051 153 2200 1020 -685 -253 596 426 326 1329
2646 1329 1964 -154 -1883 531 3740 1876 -1999 -1999 2272 3022 -122 -722 1481 260 -1562 1082
2662 1082 4520 201 -4700 -391 5168 1849 -3234 -341 2789 -449 -2360 2920 3361 -3526 -3843
2677 -3843 3958 4767 -2936 -4016 2958 2751 -3110 -1470 3981 371 -4950 -217 5945 -188 -6309
2692 -6309 -291 5128 159 -4830 -277 3143 -1576 -3084 2165 2414 -3802 -3762 3136 3179 -3288 -3822
2708 -3822 1163 1691 -1718 -972 1257 -1170 -3506 20 2793 -659 -3857 -1569 1919 1054 -1609 -1553
2724 -1553 -220 -511 -742 395 900 -1312 -2655 -251 2194 871 -2668 -2102 1111 1633 -1190 -1726
2740 -1726 599 58 -1348 -122 2097 -246 -2983 -772 3157 1299 -3123 -1255 2507 562 -1618
$$ packed form
2630F41K235k811k815L308K542k524k627K204K047j180j705M32Q49j70j00J003
2646A329O35k118j729K414L209j864l875%M271P50l144o00K203j221j822K644
2662A082L438m319m901M309N559l319n083K893L130l238j911N280M41o887l17
2677c843P801Q09p703j080O974k07n861J640N451l610n321M733O162o133o121
2692f309O018N419m969m989M553L420m719j508N249K49o216M0O898M3o467n34
2708c822M985N28l409P46K229k427k336L526K773l452l198K288L488q65k663N6
2724a553J333k91k31J137N05k212j343K404K445j323l539N66L213N22k823n36
2740a726K325n41j406J226K219k343k737K211L929j858m422J868L762j945k180
$$ plain form
2755 -1618 428 2136 -1527 -2211 2416 3472 -2044 -3332 2369 3785 -1293 -2046 2187 2374 -2002 -432
2771 -432 3514 1415 -3472 -1043 4591 2315 -2955 -1075 3157 1564 -1482 333 2570 -516 -2058
2786 -2058 1594 3538 -703 -2819 903 3269 166 -1124 784 1481 -647 -419 2158 1390 -1574 -1495
2802 -1495 2362 2224 -1309 -1973 1369 1577 -640 -798 1285 598 -1380 -771 2163 1025 -2454 -1270
2818 -1270 1988 1671 -1682 -1709 951 651 -1430 -212 1025 -685 -2173 -5 1837 -472 -2406 -881
2834 -881 1255 -311 -1524 87 365 -1453 -1302 1102 715 -2100 -2438 921 1429 -1309 -1838 -156 477
2851 477 -1328 -843 263 -159 -1563 -1119 707 562 -1492 -1431 265 426 -350 -1168 4 258 -522 -457
2869 -457 545 226 -1211 -831 868 392 -1013 -889 803 702 -869 -517 931 450 -1308 -83 2101
$$ packed form
2755a618K046J708l663o84M627J056n516j288N701J416n078p53M233J87m376J570
2771d32L946k099m887K429N634k276n270J880M232j593l046J815K237l086j542
2786b058L652J944m241k116L722K366l103j290J908O97k128K28K577p68k964P9
2802a495L857j38l533o64L342K08k217j58K083o87j978O09K934j138l479J184
2818a270L258l17l353k7K660l00k081J218J237j710j488K168J842k309j934J525
2834h81K136j566j213J611K78j818J51K404l87k815l38L359N08k738n29J682O33
2851D77j805M85J106m22j404M44J826j45k054O1J696J61p76q18J172K54p80O5
2869d57J002l19j437L80J699m76j405J24J692j01j571L52J448m81j758J225K184
$$ plain form
2886 2101 259 -2018 -157 2237 384 -1744 209 2238 265 -1160 1062 1759 -430 -1538 1464
2901 1464 2237 -888 -1341 1556 1641 -476 -230 1502 616 -1357 652 2383 331 -1564 480 2142
2917 2142 131 -627 1065 1470 -558 -570 1478 1451 -662 -282 1169 1088 -491 71 983 600 -182 230
2935 230 697 -72 132 512 482 -652 -132 475 49 -187 342 -222 -461 -138 534 165 -790 -428 -217 -151
2955 -151 -116 353 -289 -1167 -593 696 -132 -822 -48 252 -823 -1140 256 561 -1251 -1547 424 555 -1440
2974 -1440 -924 565 -342 -1803 -1045 751 -126 -1366 -478 211 -494 -1594 159 105 -972 -1323 245
2991 245 119 -770 -853 477 -189 -1163 -233 796 -8 -981 -480 357 105 -421 -107 383 21 -784 -161 243
3011 243 645 -81 -183 59 -107 61 309 272 115 30 83 590 565 -9 1 561 187 -123 583 1070 251 -351
$$ packed form
2886B101j842k277J861K394j853k128J953K029j973j425K222O97k189j108L002
2901A464P73l125m53K897Q5k117K46J732q86j973K009J731k052j895K044J662
2917B142k011p58J692M05k028j2K048k7k113L80J451q1j579N62R12l83p82M12
2935B30M67p69K04L80l0j134N20O07m26k36N29n64k39L23O72l69r55L62K11O6
2955a51L5M69o42q78N74J289q28o90P74L00j075l17J396L05j812k96J971J31j995
2974a440N16J489r07j461P58J796q77j240Q88O89p05j100J753n4j077l51J568
2991B45j26q89q3J330o66r74R30J029q04r73N01Q37k52n26L14M90l62q05O23M04
3011B43M02p26j02K42j66J68K48l7j57q5N3N07k5n74J0N60l74l10P06M87q19o02
$$ plain form
3033 -351 447 1080 359 4 798 1332 -301 -719 1019 1249 -299 -422 937 623 -457 514 1516 597
3051 597 -556 296 1012 520 -335 782 912 -643 -103 1075 908 -950 -20 836 23 -595 685 860
3069 860 -657 -923 790 1341 -213 -157 363 260 -658 212 635 -240 -725 366 430 -709 -588 706 -114
3088 -114 -1259 -426 665 -709 -1284 104 634 -1181 -1360 711 539 -1607 -949 704 -329 -1665 -99
3105 -99 1532 -1401 -2409 646 1436 -2042 -1667 1237 100 -2639 -459 2391 -131 -3403 -716 2146
3121 2146 -463 -2901 579 1794 -1880 -2280 1889 1732 -2670 -1781 2098 909 -2604 -496 2761 -34
3137 -34 -2953 618 2378 -1109 -2479 1736 2350 -1985 -2117 2278 1698 -2073 -1149 2631 652 -2177
3153 -2177 855 2774 -48 -2350 1114 2475 -753 -824 1757 726 -1762 356 2758 604 -1904
$$ packed form
3033c51P98O33p21l55P94N34j633m18J738K30j548j23J359l14j080R71J002r19
3051E97j153Q52P16m92q55J117J30j555N40J178j67j858R30Q56q13o18J280J75
3069H60j517k66J713N51j554N6N20j03r18Q70M23q75m85J091O4j139J21J294q20
3088a14j145Q33J091j374n75J388N30j815j79K071j72k146O58J653j033j336J566
3105i9J631k933j008L055P90l478L75K904j137k739K180K850k522l272K687K862
3121B146k609k438L480J215l674m00M169j57m402Q89L879j189l513K108L257k795
3137c4k919L571J760l487j370M215O14m335j32M395n80l771R24L780j979k829
3153b177L032J919k822k302L464J361l228p1K581j031k488K118K402k154k508
$$ plain form
3168 -1904 576 2362 -276 -739 1756 1304 -1356 -314 2640 652 -1873 460 2224 -368 -970 1669
3184 1669 1536 -1333 -655 2667 824 -2385 215 3235 -72 -2665 1008 2901 -1442 -1974 2551 2060
3200 2060 -3359 -1719 3744 1737 -3653 -1041 3462 334 -3233 823 3473 -1967 -3722 2326 3541
3215 3541 -3044 -3384 2875 2023 -3545 -1461 3461 279 -4585 -270 4150 -1003 -4704 681 3365
3230 3365 -1606 -3589 1581 2291 -2985 -2396 2644 1144 -4019 -1553 3225 478 -3521 -567 2071
3245 2071 -1100 -2103 1090 1366 -2337 -2360 2174 1440 -1941 -1541 1440 115 -1700 484 1280 -1697
3261 -1697 -1670 1372 1061 -1463 -931 683 -301 -898 812 1001 -1753 -1166 2230 1534 -2080 -517 2187
3278 2187 329 -2058 703 2539 -1128 -2406 2400 2666 -2060 -2288 2632 2369 -1938 -857 3131 319
$$ packed form
3168a904K480J786k638m63K495m52k660J042K954j988k525K333J764k592o02K639
3184A669j33k869O78L322j843l209K600L020l307k593L673J893m343n32M525m91
3200B060n419J640N463k007n390K612M503l128l567M056K650n440j755O048J215
3215C541o585l40O259q52n568K084M922l182m864M315M420n153l701N385K684
3230C365m971j983N170P10n276N89N040j500n163K466M778k747l999K954K638
3245B071l171j003L193K76l703k3M534p34l381M00K981j325j815K184P96k977
3261a697K7L042l11k524N32J614r84n97J710J89k754N87L396o96l614J563K704
3278B187j858k387K761J836l667j278M806K66m726k28M920k63m307J081L988k812
$$ plain form
3294 319 -2837 814 4215 -778 -3770 1804 4317 -1186 -3171 2484 2680 -2221 -1687 3812 1721 -4113
3310 -4113 -1005 4739 1783 -3288 -894 3104 381 -2113 1689 2871 -2165 -2507 2605 3045 -2022
3325 -2022 -2040 2399 1914 -1901 -345 2353 196 -2473 265 2501 -22 -2618 198 1660 -239 -1293
3341 -1293 225 690 -622 -626 778 -82 -1008 56 598 -319 -681 -44 -208 -181 618 59 -1470 -1062 530
3360 530 1031 -923 -955 -33 -818 -1207 766 742 -1726 -2553 676 1674 -639 -1587 397 149 -1909 -179
3378 -179 2005 -478 -3454 -726 2691 457 -2917 -327 1981 -975 -2169 1075 1933 -1788 -1987 1519
3394 1519 1912 -1779 -1624 1698 1182 -1668 -974 1557 383 -1526 349 1862 -276 -1771 776 2414
3410 2414 -325 -1639 380 1594 -81 -615 1189 900 -1007 -444 1774 1662 -1164 -1150 992 1634 -244
$$ packed form
3294C19l156L651L401m993k992N574K513n503j985N655J96m901N34N499k091n834
3310d113L108N744k956n071K394L998k723k494L802J182n036l42N112M40n067
3325b022j8M439m85l815J556K698k157k669K738K236k523k596K816J462j899j054
3341a293J518M65j312mJ404q60r26J064N42r17l62O37j64K7P99n59j529M08J592
3360E30N01j954l2R22p85l89J973k4k468q27L229R98k313r48J984k48k058J730
3378a79K184k483k976K728L417k234l374K590K308k956j194L244Q58l721j99L506
3394A519L93l691J55L322n16k850O94K531j174j909J875J513k138j495K547J638
3410B414k739j314K019J214j675n34J804k89j907N63K218j12k826J4K142O42j878
$$ plain form
3427 -244 -204 254 422 -94 621 1281 627 -882 -253 1030 1448 -14 -538 444 1024 372 -106 828 536
3446 536 -575 152 1106 539 -916 -366 889 484 -639 -165 656 266 -888 387 1158 -318 -1241 125
3464 125 1507 -217 -1410 -137 898 -323 -1021 -118 947 -678 -1014 558 340 -974 -1095 562
3480 562 526 -648 -1163 45 89 -557 -550 16 -443 -1184 -274 866 67 -1401 -1029 299 514 -763 -851 -384
3500 -384 -435 -861 -514 776 -527 -1426 -704 1020 451 -755 -883 336 -53 -729 -102 329 -317 -1305 117
3519 117 1016 -438 -1350 180 869 -386 -851 514 822 -424 -847 960 728 -695 -139 1046 719
3536 719 -961 -270 1250 584 -630 -230 732 183 -170 386 1145 -70 -641 515 944 198 -153 307
3554 307 261 -136 351 812 363 -487 -184 650 862 -134 165 510 409 440 143 707 321 241 -53 903 838
$$ packed form
3427b44M0M58J68n16P15O60o54j509O29J283M18j462n24R82N80o52m78R34k92
3446E36j111P27R54n67j455N50J255m05j123M74Q21l90j154J275P71j476r23J366
3464A25J382j724j193J273J035j221o98R03J065j625l36J572k18j314j21J657
3480E62l6j174n15J208M4o46PN66m59p41R10J140p99j468L72J328K15j277q8M67
3500c84n1m26L47J290j303q99P22J724n69j206j28J219l89o76O27M31o46r88J422
3519A17Q99j454r12J530O89j255m65J365L08j246m23J807k32j423N56J185l27
3536G19j680O91J520o66j214M00R62n49l53N56P59j215n71J156M29p46l51M60
3554C07m6l97M87M61m49q50L03Q34K12r96K99L45j01L1k97N64l86q0k94R56o5
$$ plain form
3575 838 87 -277 -20 584 20 -176 121 680 27 -163 483 722 164 -239 220 333 36 -291 388 74
3595 74 -328 -240 122 320 -181 -130 156 -203 -475 164 422 -126 -464 -236 400 -369 -535 -34 -39 -176 -462 -53
3617 -53 278 -272 -592 -290 88 -25 -577 -557 17 -365 -403 -62 253 -151 -476 -494 95 -191 -500 106 -214
3638 -214 -561 -355 192 130 -639 -590 87 0 -668 -242 391 66 -667 -187 456 -115 -996 -296 513 -398 -839
3659 -839 97 723 -431 -574 303 249 -328 -304 506 461 -615 44 548 72 -402 269 651 -115 -501 580
3679 580 847 -239 -553 823 507 -112 9 990 187 -335 419 848 162 -439 409 358 197 -74 654 137
3699 137 -346 215 769 -27 -137 770 473 -271 -165 726 95 -521 -26 754 424 -459 423 612 -61 -386
3719 -386 541 485 -463 -524 602 252 -981 121 1373 -299 -1137 434 1103 -387 -685 909 709 -1226
$$ packed form
3575H38p51l64K57O04n64j96K97N59o53j90O46K39n58m03M59J13k97l27O79l14
3595G4m02Q8L62J98n01N1K86l59k72O39K58n48l38K28O36p69j66N01nj37k86M09
3617e3L31n50l20L02L78j13n52K0N74l82l8L41L15m04l25j8N89k86l09O06l20
3638b14l47K06N47o2p69M9O77q7o68M26O33l25p33M80O43n71q81P00Q09r11m41
3659h39R36O26j154j43Q77n4n77K4Q10m5j076O59N04m76m74O71L82p66l86J081
3679E80K67j086l14J376l16o19J21R81q03n22P54M29o86o01Q48n1j61k71P28n17
3699A37m83N61N54p96j10R07k97p44J06Q91o31o16M95P80l30q83Q82J89o73l25
3719c86R27n6r48o1J126l50j233J102J252j672q38J571O69j490k98J594k00j935
$$ plain form
3737 -1226 -720 826 532 -1265 -519 780 -81 -1122 298 1177 -952 -1336 362 695 -954 -1087 652
3754 652 239 -1299 -734 1152 26 -1596 -236 868 -287 -1715 117 1083 -699 -1408 230 558
3770 558 -901 -1077 406 -54 -1098 -361 755 -108 -1082 262 499 -123 -480 739 217 -1083 -388 777
3788 777 267 -586 -34 302 -536 -377 200 603 -345 -134 509 129 -496 95 594 -61 -470 631 397 -467
3808 -467 -166 1043 420 -852 -207 1349 52 -737 744 877 -267 -597 781 1412 -458 -824 773
3825 773 1250 -304 -419 1326 188 -1001 576 1767 -33 -1011 703 1506 -608 -860 1012 1169 -1114
3842 -1114 -527 1557 703 -1186 -306 1129 635 -998 -163 1260 -82 -829 446 897 -459 -885 595
3859 595 772 -715 -654 349 555 -443 -438 337 -281 -797 -172 674 -310 -1019 -280 486 212 -633 -468 -75
$$ packed form
3737a226N06J546k94j797P46J299q61j041J420Q79k129l84J698L33j649j33J739
3754F52m13j538N65J886j126j622J360J104j155j428J832R66j782p09J638L28
3770E58j459j76J483m60j044P37J116q63r74J344K37o22l57J219n22j300O95J165
3788G77n10q53N52L36q38J59N77M03r48K11O43l80o25N91M99o55m09J101k34q64
3808d67L01J209o23j272O45J556j297p89J481J33j144l30J378O31j870l66J597
3825G73M77j554j15J745j138j189J577J191j800r78J714Q03k114k52J872J57k283
3842a114N87K084q54j889Q80J435m94j633Q35J423j342p47J275M51j356m26J480
3859E95J77j487O1J003K06r98NP75o18n16O25Q46r84p09P39P66k74q45J65L93
$$ plain form
3879 -75 -661 -569 -97 -94 -199 -657 -295 163 65 -173 -748 -172 208 -113 -619 -334 -154 -209 -418 -273 103 -563
3901 -563 -562 221 105 -531 -607 304 -73 -459 -645 201 41 -460 1 710 -534 -898 273 1094 99 -1050
3921 -1050 183 435 -95 -322 322 511 -509 -469 791 971 -166 -493 262 417 72 -191 502 415 -311
3940 -311 76 875 325 -703 39 740 433 -272 -241 1034 461 -332 282 854 248 -827 397 1341 224
3959 224 -832 200 1362 518 -976 136 783 57 -850 806 1054 -701 -653 1012 1162 -919 -817
3976 -817 818 584 -787 -43 1051 158 -1255 87 1657 -345 -1546 -213 1076 27 -801 94
3992 94 492 -504 -743 1084 831 -904 -729 351 308 -470 -432 466 -176 -774 188 251 -336 -645 221 333
4012 333 -724 -162 223 -161 -162 85 -79 -420 -383 254 69 -622 -294 53 -400 -289 306 -81 -1175 -185
$$ packed form
3879g5n86R2M72Lj05m58L62M58r8k38n75N76L80l21n06K85J80n5k09J45L76o66
3901e63JP83j16o36p6R11l77l86j86Q46j60n01M61P09j244l64J171Q21r95j149
3921a050J233K52n30k27O44J89j020M0J260J80j137l27P55J55l45k63O93q7p26
3940c11L87P99n50j028P42P01l07p05L1J275n73p93O14N72o06j075J224R44j117
3959B24j056J032J162q44j494J112O47p26r07J656K48j755M8J665J50k081J02
3976h17J635k34j371P44J094q93j413J342J570k002j201J333J289j049q28Q95
3992I4L98r96k39J827k53j735J75J080m3p78L8Q98o42n98R62O3n87l09Q66J12
4012C33j057N62L85l84jK47j64l41L7O37j85o91L28L47m53J11N95l87j094R90
$$ plain form
4032 -185 879 62 -1132 -240 776 -22 -1191 689 762 -1305 -1582 790 903 -797 -1370 708 841
4049 841 -1277 -579 1214 -53 -1576 34 1790 -311 -1306 489 1791 -740 -1354 1032 1348 -1459
4065 -1459 -966 1666 930 -1796 -510 2058 478 -1708 -188 1721 193 -1301 576 1394 -729 -1032
4081 -1032 1747 1310 -810 -797 914 905 -315 216 1239 -136 -1032 712 1662 -251 -963 835 1070 -591
4099 -591 -149 1001 -6 -949 91 1136 11 -502 674 451 -516 237 874 123 -815 9 794 -400
4117 -400 -1079 582 719 -1219 -715 1117 393 -1148 -534 911 -286 -1573 97 1365 -807 -1516 450
4134 450 611 -1036 -865 976 463 -2317 -731 1622 122 -1998 -483 1518 -398 -1628 279 922
4150 922 -1255 -1486 843 678 -1390 -1149 928 461 -1531 -361 1512 -269 -1394 141 1213 -395
$$ packed form
4032a85J064q17j194Q92J016p98j169J880P3k067k77K372J13j700n73K078J33
4049H41k118O98J793j267j523J610J756k101r95J795J302k531o14K386L16k807
4065a459M93K632p36k726J286K568j580k186J520J909j528j494J877Q18k123l03
4081a032K779m37k120J3J711rj220N31J023j375q96J744R50j913p12J798K35j661
4099e91M42J150j007r43J040J045j125n13J176k23r67P53O37p51r38Q24P85j194
4117d00o79J661J37j938N04J832p24j541O14J445j197j287J670J268k172p09J966
4134D50J61j647J71J841n13k780J586K353j500k120J515K001j916j230J907O43
4150I22k177k31K329j65k068K41K077m67j992J170J873j781j125J535J072j608
$$ plain form
4166 -395 -1562 507 1113 -804 -838 690 353 -1299 -551 1378 312 -1429 -27 1064 -53 -1186
4182 -1186 440 444 -586 -333 488 474 -688 -38 730 -106 -592 471 742 -205 -377 764 746 -742 280
4201 280 1122 500 -953 210 999 324 -162 507 328 -468 -68 1181 664 -717 -69 736 259 -437 583
4220 583 933 -369 -636 1104 1004 -543 -699 521 772 -420 -34 1233 405 -1367 -231 1000 166
4237 166 -713 180 752 -564 -537 418 761 -784 -485 889 407 -894 -91 544 -332 -1051 -32 1071
4255 1071 -202 -640 118 568 -244 -125 477 9 -647 -553 267 236 -124 -229 54 -410 -169 33 -58 -285
4275 -285 -70 -77 -172 -683 -270 11 -339 -456 -1 151 -282 -210 -218 -212 -250 -142 -188 -348 -380 -131 94 -163 -222 214
4299 214 79 -733 217 343 -175 -545 -98 361 -426 -425 -6 129 -460 -242 300 550 86 -337 279 347 -202
$$ packed form
4166c95j167K069O06j917l4J528l37j652P48J929j066j741J402J091j117j133
4182a186J626Mj030K53Q21j4j162O50P68q36m86J063K71r47j72J141j8j488J022
4201B80Q42o22j453J163P89o75m86O69j79p96M00J249n17j381O48Q05m77o96J020
4220E83L50j302k67J740j00j547j56J220K51j192L86J267q28j772J136J231q34
4237A66q79Q93N72j316K7R55L43j545K99J374m82j301Q03O35q76p19J019J103
4255A071j273m38P58M50q12J19O02m68o56R4Q20l1l60j05K83m64K41K02r1k27
4275b85K15pr5n11M13K81l50j17M55J52m33P2qOl8J08m6j60l2K49K25k57n9M36
4299B14j35q12R50J26n18l70M47M59p87JM19J35n89K18N42K50m64m23O16O8n49
$$ plain form
4320 -202 -197 387 45 -44 121 412 52 -76 67 309 -219 -104 408 456 -57 -262 295 479 -11 21 226 142
4342 142 -243 3 515 408 -199 -6 221 259 -200 315 363 122 119 -46 1 165 123 -277 313 98 -187 20
4364 20 264 -63 -112 189 190 90 -324 -128 190 -230 -306 140 217 68 -249 34 247 -134 -137 99 108 -237 -96
4387 -96 33 159 -162 -152 32 -92 -212 -276 145 -287 -220 -211 -77 -13 -286 -51 -200 98 -484 -115 72 -183
4409 -183 -176 -96 189 -153 -385 125 -41 -56 -305 -199 104 -299 -85 -26 122 47 -226 -216 91 -133 -204 -146 -83
4432 -83 -193 31 138 -285 -112 41 274 66 -84 234 118 -201 -318 108 203 -199 -345 362 117 219 326
4453 326 -9 143 -170 -62 157 103 312 -55 -60 141 337 -109 269 239 271 -76 300 463 338 -19 273 351
4475 351 235 152 447 324 -224 -309 211 469 -166 -273 368 780 -91 -59 614 124 -166 26 755 411 -508
$$ packed form
4320b02NN84l42q9J65K91l60j28J43K42n28J15N12M8n13k05N57J84m90L2K05q4
4342A42l85K46N12j07o07J93K27L8m59N15M8k41lj65M7J64m2m00N90k15k85K07
4364B0K44l27m9L01Jj00m14J96L18m20p6M46P7j49l17K83K13l81lK36Rl45J41
4387i6J29J26l21J0J84j24j20o4M21m32O7RJ34O4k73K35j49K98n82L69J87k55
4409a83PQ0K85l42k32N10j66j5k49J06L03m03K14N9J48p5k73J0L07k24p1N8O3
4432h3j10K24J07m23J73J53K33k08j50L18j16l19j17M26R5m02j46P07k45J02J07
4453C26l35J52l13J08K19n4K09l67nK01J96m46L78l0L2l47L76J63j25l57K92P8
4475C51j16q3K95j23n48q5N20K58o35j07O41M12q71L2O73m90k90J92P29l44r19
$$ plain form
4496 -508 -91 667 386 -225 -230 594 -444 -433 190 532 -152 -420 377 444 -354 -194 366 441 -274 -228 495 -37
4518 -37 -680 126 330 -256 -626 111 437 -415 -635 603 114 -445 -653 345 -53 -761 -454 224 32 -503
4538 -503 -236 106 -69 -274 379 -187 -627 -248 396 -51 -336 -42 123 -87 -331 -204 105 -472 -220 -7
4558 -7 -102 -606 260 108 -300 -58 342 188 -567 -106 509 -79 -871 111 701 -127 -561 -11 603 -737 -329
4579 -329 379 656 -524 -373 507 610 -676 159 1122 0 -854 -40 1114 -132 -1028 393 1134 -159
4597 -159 -481 701 740 -506 -327 1207 535 -724 -158 1075 595 -853 53 797 -112 -698 514 713
4615 713 -343 -545 523 612 -549 -453 986 324 -321 -4 577 56 -474 282 743 -395 -577 155 302
4634 302 -527 -218 447 73 -157 96 515 -228 -529 30 34 -210 -231 439 -524 -735 307 334 -630 -857 341
$$ packed form
4496e08M17P58k81o11nQ24j038J1O23L42o84k68P97O7p98J60N60P5p15M6P23n32
4518c7o43Q06K04n86l70P37L26q52k20J238m89n59k08R98l98p08L07O78j92n35
4538e03K67L42j75k05O53n66m40L79O44m47k85K94J65k10k44J27L09n77K52K13
4558gr5n04Q66j52m08K42M00j54p55M61O15n88p92R82N90q28m34N50O14j340M08
4579c29P08K77j180J51Q80J03j286Q35R63j122q54Q14J154j246q96J421P41j293
4597a59l22J182L9j246J79J534o72j259N66J233m80j448R06P44r09n86J212J99
4615G13j056k02J068Q9j161R6J439o62o45L17N81n21n30P56M61j138j82P32J47
4634C02q29L09O65l74k30K53M19p43l01N59Mk44k1O70r63k11J042K7r64k27J198
$$ plain form
4655 341 600 -463 -369 442 202 -1134 -150 688 -154 -933 -36 620 -314 -832 337 543 -583 -670 775
4674 775 -17 -1111 -400 801 346 -1194 -131 891 -294 -987 624 691 -525 -947 638 860 -639
4691 -639 -900 888 436 -850 -268 907 -38 -762 137 852 -326 -873 191 549 -381 -836 851 464
4709 464 -438 -148 911 276 -774 -150 828 269 -600 127 348 -172 -18 533 408 -337 378 768 510
4728 510 -52 207 444 107 -35 524 469 35 204 576 268 -145 133 183 -93 -204 230 448 -104 -10 409
4749 409 202 -179 -99 552 -127 -356 155 437 -413 -545 497 676 -741 -640 563 477 -359 -356 739 91
4769 91 -701 24 655 -54 -657 90 576 -158 -425 389 536 -642 -234 678 13 -749 -355 249 65 -574
4789 -574 -286 395 -238 -604 -1 294 -49 -443 -263 407 -645 -718 274 96 -330 -817 -49 137 -239 -75
$$ packed form
4655C41K59j063R4Q11k40j336R84Q38q42p79Q97O56r34n18J169K06j126q7J445
4674G75p92j094P11J201m55j540J063J022j185o93J611O7j216m22J585K22j499
4691f39k61J788m52j286N82J175r45p24Q99P15j178n47J064L58r30m55J687l87
4709D64r02K90J059o35j050O24R78n59q69P27K21n20J54N51j25p45P15L90k58
4728E10n62K59K37l37j42N59n5m34J69L72l08m13K78N0k76j11M34K18n52R4M19
4749D09k07l81Q0O51o79k29N11K82q50j32J042J79j417J01J203q6q36LJ095o48
4769I1p92P25O31p09o03P47M86p34k67Q14J47j178M08R12o65p62L94O04j84o39
4789e74K88O81o33l66O03K95l43l94J80O70j052p3R92j78m26m87P68J86l76J64
$$ plain form
4809 -75 347 -239 -148 -57 413 -179 -453 -197 202 86 -142 -249 -253 -168 -84 -50 3 -25 -557 -23 125 -2 94 -52
4833 -52 -92 280 -197 20 89 250 132 -3 5 116 32 -188 26 202 409 204 247 239 49 100 345 161 -59
4856 -59 -376 262 141 -154 102 135 256 -173 -164 372 349 -107 86 274 10 62 208 441 118 -421 211 262
4878 262 296 -307 -72 605 191 -530 466 509 41 -131 145 367 -267 138 348 345 -320 171 -158 11 -395
4899 -395 -279 257 22 -490 370 393 -156 -221 316 376 -356 -377 358 195 -801 -350 229 142 -295 -381 -49 -189
4921 -189 -428 -299 225 -227 -193 -12 101 -661 -410 -2 -57 -373 33 254 -148 -583 -226 190 -254 -344 12
4942 12 123 43 -128 389 -23 -287 52 68 -202 -491 538 33 -282 -318 173 165 -428 75 410 -418 -367 213
4964 213 447 -248 -258 18 198 -136 200 513 154 -646 106 219 -1 -262 -200 431 -275 -787 306 521
$$ packed form
4809g5M22n86R1R1M70n92k74K56L99j16k28j07mQ5Q4L4N3k8n32N34J48j27R6j46
4833e2m0L72m77K17O9J61j18j35QJ11q4k20K14J76K07k05M3qj90N1K45j84k20
4856e9l17O38j21k95K56L3J21m29RN36k3m56J93J88k64N2J46K33l23n39O32N1
4878B62L4o03K35O77m14p21R96M3m68j72K76K22o34M05K10lo65M91l29J69m06
4899c95J16N36k35n12Q60K3n49o5N37O0p32k1P35j63r96M51N79q7m37q6L32j40
4921a89k39J29N24m52L4J81J13p62K51M08n5l16M06K21m02m35L57M16m44r0L56
4942A2J11q0j71N17m12k64L39J6k70k89J029n05l15l6M91qn93N03L35q28N1N80
4964B13K34o95j0K76J80l34L36L13l59q00P52J13k20k61O2O31p06n12J093K15
$$ plain form
4984 521 -471 -404 677 137 -539 -287 852 45 -465 139 486 249 -375 78 459 -259 -268 727 210 -304
5004 -304 -207 645 251 -352 114 539 219 -316 82 603 -231 -308 420 -29 -222 147 300 137 -472 353 99
5025 99 48 -158 3 206 4 -161 149 119 -231 -48 424 -124 -373 -399 151 -614 -564 54 207 -381 -12 334
5047 334 120 -484 -166 142 -451 -384 -148 94 -156 -588 199 70 -349 -104 215 -24 -536 -219 480 -497
5067 -497 -375 -51 54 -336 -684 -29 304 -479 -49 259 351 -209 -123 43 110 -420 132 288 -30 -270 -224
5088 -224 21 -8 -159 287 224 -34 -143 13 97 -168 -193 273 -61 -431 239 356 -2 -9 -124 113 139 -123
5110 -123 33 130 -127 13 160 -49 433 -8 165 102 335 246 358 142 -99 286 347 175 23 257 86
5131 86 9 14 177 265 111 226 61 101 3 182 105 179 128 113 -66 -2 157 99 41 184 380 40 -218 171 280
$$ packed form
4984E21r92O7J081n40o76K52J139q07n10O04L47k37o24M53L81p18rR95n17n14
5004c04R7Q52l94o03M66M25l20n35L98N21q34p7P28m49j93L69J53j63o09Q25k54
5025I9n1k06J61K03k02j65L10l0l50J83M72n48k49k6N50p65N0O18J53n88L69L46
5047C34k14o04L18L08n93O7K36K42k50m32P87j29m19K45L19k39n12L17O99r77
5067d97J22L24J05l90l48O55L33p83M30L08R2n60Q6J66O7n30N52J56l18k40M6
5088b24K45k9j51M46o3k58j09J56Q4k65k5M66l34l70O70J17l58pj15K37K6k62
5110a23J56R7k57J40J47k09M82m41J73o3K33q9J12k16k41L85O1j72j52K34j71
5131H6p7NJ63Q8j54J15j65M0r8J79p7P4n1j5j79O4J59n8n8J43J96l40k58L89J09
$$ plain form
5156 280 -5 -27 -81 182 -85 -159 207 -158 -29 -74 10 136 -198 88 68 -15 -172 186 58 -159 -341 -186
5178 -186 221 144 -20 25 257 -308 -189 -64 0 -176 -58 -73 -70 -146 127 -152 -89 -547 -202 352 241 -402 -307
5201 -307 256 -198 -48 -164 -320 -324 -21 273 16 -119 -182 -115 119 40 -203 -189 225 -19 -51 -96 -38 -91 120
5224 120 102 400 -208 -286 128 91 -245 12 5 235 -113 63 218 111 5 280 592 44 70 165 432 211
5246 211 -20 37 317 -142 -240 181 390 -51 -198 -105 237 37 139 125 136 133 -219 -112 47 -234 -29 -257
5268 -257 210 29 -51 30 146 76 4 199 -191 -116 -176 212 -46 -313 -95 -145 152 -226 -72 84 -76 -255
5290 -255 -24 30 32 -350 0 142 309 -352 -293 205 -206 -96 -98 43 1 -490 -183 332 -28 -71 141 4 -246
5313 -246 -588 -24 -151 -275 -188 -8 -110 30 -240 70 -42 -245 -181 431 90 -207 -548 295 -103 -444 -150
$$ packed form
5156B80k85k2n4K63k67p4L66l65J29m5Q4J26l34K86k0q3j57L58j28k17j82J55
5178a86M07p7j64M5K32n65J19J25O4j76J18j5Lp6K73k79O3m58L45N54j11o43R5
5201c07N63m54J50j16j56mL03K94k57j35o3O7K34p9k43J4M14k44l2m5N8n3K11
5224A20j8K98o08p8M14l7l36K57pK30l48J76J55j07j06K75L12n48K6R5K67k21
5246B11k31N7K80m59r8M21K09m41j47R3L42k00J02j4J1ll52J07J59k81K05k28
5268b57M67j81q0Q1J16p0p2J95l90P5o0L88k58k67K18n0K97l78J54J56j60j79
5290b55K31N4Kl82L50J42J67o61N9M98m11J10kJ41m2m91L07N15l60m3K12j37k50
5313b46l42N64j27j24Q7J80j02J40k70L10j12k03O4O12l41k97l41Q43l98l41K94
$$ plain form
5334 -150 194 -66 -608 -340 443 354 -484 -238 349 244 -69 266 254 -140 -243 255 700 138 -333 79 -64
5355 -64 61 -200 156 -142 -419 -185 576 131 7 254 323 185 -236 -11 372 -437 -19 103 115 111 -84 155
5377 155 287 -282 192 156 -47 -128 166 179 -59 229 271 222 -21 -203 145 -65 53 205 399 248 75 57
5399 57 136 137 -11 182 218 -136 -270 332 -225 -37 164 342 -501 -204 291 361 -381 -337 301 378 -289 65 281
5422 281 -259 -407 221 329 -9 -135 321 403 -762 -75 426 -137 -378 -103 397 -53 -709 -312 410 -259
5442 -259 -691 -58 413 -556 -468 348 180 -448 -156 604 65 -465 -92 463 -359 -483 67 195 -357 -450 231
5463 231 183 -520 -52 364 -135 -522 -85 603 -115 -525 -90 177 -198 -352 90 74 -188 57 30 -158 -302
5484 -302 17 262 -110 -221 -25 115 -234 -175 366 -104 -695 73 735 -81 -354 133 240 -300 -219 236 233
$$ packed form
5334a50L44k60n42K68P83q9q38K46N87j05l13L35j2l94j03M98M45n62m71M12j43
5355f4J25k61L56k98k77K34P61m45j24K47O9j38m21K25L83q09M18J22J2mj95K39
5377A55J32n69M74l6k03q1K94J3k38K88M2m9k43j82L48k10J18J52J94j51j73j8
5399E7P9Jj48J93L6l54j34O02n57J88K01J78q43K97M95P0p42M4O38P7o67L54K16
5422B81n40j48O28J08l38j26M56Q2j165O87N01n63k41K75N00m50o56L97P22o69
5442b59m32O33M71r69Q8Q16j68o28K92P60n39n30L73N55q22j24N50J28n52r3O81
5463B31m8p03M68M16m99l87M37O88p18m10M35K67l75j54M42j6k62K45k7j88j44
5484c02L19K45l72j11J96J40l49N9N41m70n91P68O62q16k73M87J07n40Q1M55l
$$ plain form
5505 233 -369 -109 471 15 -355 165 555 -95 -472 308 402 -352 -260 354 254 -316 -300 380 26 -560 -387
5526 -387 589 130 -381 200 372 5 -490 583 467 -409 -474 585 243 -347 158 538 -77 -567 269 565
5546 565 -199 -560 227 409 -274 -576 86 194 -242 -511 629 -111 -268 -349 286 -98 -413 -71 190 -438
5566 -438 -250 555 153 -370 -286 356 -70 -368 262 378 -128 -305 -24 33 -358 -445 166 101 -581 -110 255
5587 255 53 -359 84 162 -134 -678 159 -45 -293 -59 447 281 -366 -173 121 -265 -800 60 276 -273
5607 -273 -622 210 231 -202 -282 348 398 -468 -99 334 -70 -487 272 283 -145 -242 246 355 9 -178 249 284
5629 284 -434 -138 176 99 -300 124 553 -71 107 166 273 14 -64 574 531 -129 -66 446 196 -291 62 558
5651 558 91 -301 -73 168 -38 -213 393 120 -48 -123 153 283 79 -124 208 -29 -324 170 171 -165 -183
$$ packed form
5505B33o02K60N80m56l70N20L90o50l77P80R4p54R2O14j00n70J6O80l54n86J73
5526c87R76m59n11N81J72l67m95J073j16q76o5J059l42n90N05L80o15m90Q36K96
5546E65p64l61P87J82o83l02O62J08m36k69J140p40j57q1O35l84l15L42K61o28
5566d38J88Q05m02n23Q4O42m26k98O30J16n06j77K81N7l91q7O11o5o82M71L65
5587B55k02m12M43P8k96n44Q37k04k48K34N06j66o47J93K94l86n35Q60K16n49
5607b73l49Q32K1m33q0O30N0q66L69M33m04m17P59J1m28r7M88J09l46j87M27L5
5629B84p18K96L14p7l99M24M29o24J78N9J07k59p8O38m3o60O3N12k50m87L53M96
5651E58m67l92K28K41k06j75O06k73j68p5K76J30k04k03L32k37k95M94Jl36j8
$$ plain form
5672 -183 -148 371 -296 -44 254 49 -113 -21 276 -91 -152 -44 54 -188 -47 150 174 -259 -204 368 157 93
5694 93 -147 277 142 -437 -132 217 -22 -336 -51 120 -450 -136 179 -93 -171 -25 94 -17 -399 -53 78
5715 78 -91 -282 122 -209 -197 -161 -251 -133 -178 -89 -279 -59 -123 -23 -195 -309 -122 -100 342 36 -174 0 174
5738 174 -66 -170 327 -192 -37 -321 164 391 -195 -63 188 176 151 -267 422 -3 127 -219 -172 86 72
5759 72 72 124 118 -133 218 182 -1 -185 121 180 0 146 65 105 67 -56 -28 17 -42 -106 -74 56 95 -189 4 19
5785 19 -34 189 500 112 315 13 20 -130 255 -127 -100 140 43 60 -8 -19 249 -9 -82 98 0 91 -292 114
5809 114 308 127 -181 20 -24 -75 216 -21 163 -47 138 39 130 -439 158 403 -181 -195 105 180 -185 -168
5831 -168 269 -151 -489 -88 261 -64 -247 72 -233 -115 -152 -72 -7 -67 79 121 67 -538 -268 16 -24 -89 -104
$$ packed form
5672a83L5N19o67K52K98k05j62R2K97l67o1J08R8k42J41J97K4m33N5N72k11o4
5694I3k40M24j35n79L05L49k39l14K85J71n70L14L15k72p8J46J19j11l82L46J31
5715G8j69j91M04l31J2L6r0J18m5Q9j90K20o4J00j72j14J87K2M42l06k10J74J74
5738A74k40j04M97n19J55k84M85K27n86J32K51j2k5m18O89m25J30l46M7K58j4
5759G2%N2ok51L51l6j83j84L06N9j80J46q1M0l8j23K8M5n9o4L2J30L9k84J93J5
5785A9n3K23L11l88K03l02Pj50L85l82K7K40r7J7o8j1K68k58p3J80r8R1l83M06
5809A14J94j81l08K01m4n1K91k37J84k10J85r9R1n69N97K45n84j4L00P5l65J7
5831a68M37m20l38M01L49l25j83L19l05J18l7Q0O5o0J46M2n4o05K70K84m0o5j5
$$ plain form
5854 -104 135 -79 -357 -170 149 -252 27 309 -41 -180 -296 234 7 -244 83 383 -214 -135 -374 -122
5874 -122 -31 69 157 -8 -103 80 164 -2 -107 -62 112 181 94 3 -5 12 -95 155 -81 -77 132 220 120 -128 241
5899 241 -157 -28 -111 115 69 52 -133 155 -219 -250 99 263 -111 -203 -83 -194 23 -288 196 42 74 66 132
5922 132 195 -147 -85 112 -287 123 423 326 1 -14 -18 -49 122 -303 81 -143 -79 51 165 22 -94 -50 -167
5945 -167 -199 24 -57 73 -143 10 -550 72 32 22 274 85 51 -251 -10 -60 1 -218 -397 -216 139 -127
5967 -127 70 83 87 -163 -48 58 91 -8 176 -29 53 -127 -151 95 -47 -353 -134 -79 -232 -291 -93 -71 94
5990 94 164 -142 -14 -12 227 -71 -17 -219 -11 24 -227 -256 66 21 48 -72 247 56 -291 -15 -31 -13 59 -45
6014 -45 99 142 72 -81 -344 10 37 -126 -170 153 38 -56 100 344 281 188 217 222 104 90 15 283 98 -51
$$ packed form
5854a04K39k14k78J87L19m01K79K82l50j39j16N30k27k51L27L00n97P9k39K52
5874a22R1J00Q8j65r5J83Q4j66j05M5J74O9q7r1qJ7j07K50k36MK09Q8j00k48L69
5899B41l98J29q3K26m6j7j85K88l74l1L49J64l74r2J20j11K17l11M84j54L2qO6
5922A32O3l42O2J97l99M10L00r7l25j5ml1J71m25L84k24O4J30J14j43j16M4j17
5945a67l2K23q1J30k16J53n60O22m0j0K52j89l4l02K41n0O1k19j79J81L55k66
5967a27J97J3Mk50J15J06L3r9J84k05Q2j80k4K46j42l06K19N5j53n9J98K2J65
5990I4P0l06J28KK39k98N4k02K08L5k51k9L22m5K7j20L19j91l47K76j6J8P2j04
6014d5J44M3p0j53k63L54K7j63m4L23j15r4J56K44o3r3K9Nj18j4p5K68j85j49
$$ plain form
6038 -51 -238 105 369 -167 -191 106 75 -61 -31 124 235 -90 192 127 -140 9 -63 175 -34 -99 -157 262 -28
6061 -28 30 217 -110 -199 -265 198 504 -147 -283 252 -146 -64 210 -241 -173 -237 191 -71 -387 60 202 3
6083 3 -217 122 92 -181 -402 131 208 -234 -161 -136 212 -277 -171 -27 216 -8 -47 -282 11 -74 -128 99 -167
6106 -167 -50 0 -312 204 197 -71 -100 9 -21 140 35 -231 -164 -206 84 25 97 -48 -28 -16 71 36 91 -170 259
6131 259 -117 -93 -80 305 13 55 206 13 -195 147 524 -27 -50 98 -118 165 -160 13 23 -214 -8 74
6153 74 -19 -74 -185 102 254 -137 -111 109 48 -142 228 158 15 -208 -130 395 199 -99 140 155 57 -351 57
6176 57 221 -78 -121 -155 93 -28 60 43 26 -280 150 24 -276 231 -26 -22 -88 55 9 -82 -141 19 86 -244
6200 -244 89 132 49 -57 -33 264 -90 223 -17 11 -146 46 101 -53 83 -106 63 180 -408 -216 -231 -111
$$ packed form
6038e1j87L43K64n36k4K97l1j36L0J55J11l25K82o5k67J49p2K38k09o5n8M19k90
6061b8N8J87l27q9o6M63L06o51j36N35l98Q2K74m51O8o4M28k62l16M47J42j99
6083Ck20L39l0k73k21N33P7m42P3K5L48m89J06J44K43k24l9k35K93q5n4K27k66
6106a67J17N0l12N16pk68k9J09l0J61j05k66O7m2K90n9P2j45K0J2Q7l5N5k61M29
6131B59l76K4J3L85k92M2J51j93k08L42L77n51k3J48k16K83l25J73J0k37K06Q2
6153G4r3n5j11K87J52l91K6K20o1j90L70p0j43k23P8N25j96k98K39J5r8m08M08
6176E7J64k99m3l4K48j21Q8j7j7l06M30j26l00N07k57Mo6J43m6r1n9J60O7l30
6200b44L33M3q3j06K4K97l54L13k40K8j57J92N5j54J36j89J69J17n88J92j5J20
$$ plain form
6222 -111 29 171 121 158 -187 -171 -31 -277 2 -72 103 -87 -31 -207 185 -285 -145 121 -159 -134 -229 185
6244 185 7 -192 -98 -28 -193 -470 48 68 -74 157 -42 200 -297 9 56 -168 -442 -81 56 -96 -307
6265 -307 175 91 79 -132 309 435 15 144 177 268 1 95 281 121 -176 165 123 20 -20 113 199 -67 -136
6288 -136 65 376 1 -84 251 131 -102 96 358 185 90 73 371 95 -133 451 92 180 -19 172 21
6309 21 152 73 219 305 -103 38 217 -33 -201 326 222 -132 -56 343 192 19 -66 24 -5 -163 43 3 115
6332 115 111 15 202 -62 107 404 -83 -278 -66 448 48 -75 28 316 -102 -69 133 -17 -449 -331 201
6353 201 -4 -312 -109 40 -95 -240 272 531 -59 -116 109 16 -324 -325 73 -43 -364 -82 -48 -26 26 231
6375 231 243 -330 6 89 124 -186 -451 38 279 -83 -135 351 146 -171 165 90 155 -376 51 147 240 -513 59
$$ packed form
6222a11J40J42n0L7l45J6J40k46K79p4J75j90N6j76L92m70J40K66k80K5r5M14
6244A85j78j99R4P0j65k77N18K0j42K31j99K42m97L06M7k24k74L61J37j52k11
6265c07M82q4j2k11M41J26m20J29L3R1k67R4J86j60k97L41m2j03m0J33Q6k66o9
6288a36K01L11l75q5L35j20k33J98K62j73r5j7K98k76k28N84l59Q8j99J91j51
6309B1J31p9J46Q6m08J41J79k50j68N27j04l54P6L99j51j73q5R0k9j58K06m0J12
6332A15mr6J87k64J69K97m87j95K12N14m00j23J03K88m18L3K02j50m32J18N32
6353B01k05l08K03J49j35j45N12K59n90n7K25r3l40jL98j16l21K82L4K2N2K05
6375B31J2n73L36Q3L5l10k65M89K41l62n2M86k05l17L36p5O5n31M27R6R3p53N72
$$ plain form
6398 59 49 -169 203 139 29 -208 207 71 -94 164 132 402 68 11 833 -35 -36 270 27 -36 -73 110 559
6421 559 -50 123 253 218 28 -69 85 23 -5 312 -76 33 -240 -139 401 322 -22 -8 345 50 62 130 -208
6444 -208 -668 190 68 40 -254 -41 -51 85 -102 7 369 -27 -99 136 260 -104 -62 -217 105 -227 132
6465 132 156 -16 -450 -129 241 -374 -172 39 20 -276 147 293 -48 -345 -104 -14 -143 -406 -65 288 -85
6486 -85 -94 -93 134 -70 -407 -65 -67 -285 -64 250 259 -264 128 49 -178 -302 64 -171 -364 38 135 -44 -118 -254
6510 -254 71 40 -25 109 211 104 -6 100 -120 -340 125 -8 -123 -104 -199 -21 -54 -104 31 45 40 230 10
6533 10 167 136 405 294 -133 -197 75 234 -221 -310 90 -38 73 -189 155 -174 -185 171 -7 176 -200 -61
6555 -61 166 121 -116 -43 80 -13 -13 341 488 57 76 193 38 40 43 12 12 -39 76 -59 224 -5 90 239 155 -8
$$ packed form
6398E9j0k18L72o4j10k37M15j36j65K58l2K70l34n7Q22q68jL06k43o3l7J83M49
6421E59o09J73J30l5j90r7J54o2k8L17l88J09k73J01N40p9l44J4L53k95J2O8l38
6444b08m60Q58j22k8k94K13j0J36j87J09L62l96p2K35J24l64M2j55L22l32L59
6465A32K4j72m34L21L70o15K02K11j9k96M23J46l41k97K41R0j29k63L41L53l73
6486h5rJK27k04l37L42kk18K21L14Rn23L92p9k27j24L66k35j93M02R7j79p4j36
6510b54L25l1o5J34J02j07j10J06k20k20M65j33j15J9r5J78l3n0J35J4nJ90k20
6533A0J57l1K69j11m27o4K72J59m55q9M00j28J11k62L44l29j1L56j78J83l76J39
6555f1K27m5k37P3J23r3%L54J47m31J9J17j55KLl1%n1J15j35K83k29R5J49q4j63
$$ plain form
6581 -8 134 190 -132 -397 32 187 182 33 -132 92 -138 -128 45 15 -180 114 61 -75 -368 -9 73 -175 -311
6604 -311 87 20 -45 2 -16 24 53 144 -140 -120 -60 -113 18 -33 -162 45 -9 -135 35 -70 -475 -48 97 -6
6628 -6 -396 -91 26 -73 160 -54 220 -246 -354 299 -35 25 -131 127 -240 -79 34 -77 279 -188 39
6649 39 -187 -215 -229 12 20 248 -101 22 311 -36 -75 -181 -162 -383 -130 -222 160 90 155 363 133 -152 -70 41
6673 41 36 167 -147 360 343 -13 81 -85 225 175 -177 -168 195 -135 72 102 19 23 85 -9 172 207 -56 246 -166
6698 -166 -175 127 116 -348 -116 226 197 114 92 20 167 -105 128 -88 -30 108 -8 -56 -40 69 9 -150 274 216
6722 216 -96 -21 -55 103 36 -127 -269 282 -210 -114 146 -278 -290 -115 -192 -73 224 55 -58 -92 -116 -229 325
6745 325 -224 -507 60 211 -163 -189 10 142 -102 -85 -46 -294 -53 -263 -70 8 -161 -76 -139 38 -105 -186
$$ packed form
6581hJ42N6l22k65M29J55nj49j65K24k30J0J73l0j95K94n3j36k93L59Q2k48j36
6604c11L98o7o5M7j8M0K9R1k84K0O0n3J31n1j29K07n4j26J70j05m05M27J45j03
6628fl90L05J17r9K33k14K74m66j08O53l34O0j56K58l67J61J13j11L56m67K27
6649C9k26k8j4K41QK28l49J23K89l47l9j06J9k21K53r2L82p0O5K08k30k85Q2J11
6673D1nJ31l14N07j7l56R4j66L10n0l52RL63l30K07L0q3MO2r4J81L5k63L02m12
6698a66rL02j1m64K32L42k9q3k2p2J47k72K33k16N8J38j16m8J6J09o0j59M24n8
6722B16l12P5l4J58o7j63j42N51m92R6K60m24j2J75p7J19K97j69j13l4k4j13N54
6745C25n49k83N67J51l74k6J99J32k44J7L9k48K41k10J93P8j69Q5o3J77j43q1
$$ plain form
6767 -186 -89 35 -138 204 52 -159 62 -12 -162 -95 142 -189 189 -166 -68 -44 -251 45 -202 -115 -6 -213
6789 -213 -135 -73 -67 22 248 69 81 -111 72 153 -120 10 -216 398 -52 -79 -16 -220 -110 -40 339 -147 -224 116
6813 116 310 -203 -86 -199 -200 17 8 -256 154 62 -197 80 129 -90 -164 81 97 -20 -42 133 -341 90 297
6836 297 -134 -80 -123 20 42 111 4 123 -18 215 -52 32 265 9 7 174 47 -338 -161 -268 -207 -102 76
6859 76 126 114 -226 162 142 -174 -133 -110 173 -120 -163 245 -30 -162 167 222 33 -127 -36 372 -108 -35 -104 -146
6883 -146 87 -89 14 -141 -50 -22 115 -315 -52 -38 -146 -39 -66 13 -105 -129 -159 63 -67 -88 -21 167 -225
6906 -225 -213 91 57 82 -32 -6 130 67 46 147 -3 -117 -397 53 129 -388 -127 9 -462 71 35 -87 55
6929 55 160 -6 -111 36 -238 -53 71 86 -13 -16 -159 -38 17 174 -132 157 202 -314 -197 152 188 39 203
$$ packed form
6767a86R7J24j73L42j52k11K21p4j50O7K37l31L78l55R8K4k07K96k47Q7J09k07
6789b13P8O2OQ9K26j79J2j92J83Q1k73J30k26O14m50k7O3k04J10P0L79m86p7L40
6813A16J94n13J17j13jK17rk64M10r2k59K77M9k19p4K45J6j17k2J75m74M31K07
6836B97m31N4m3J43K2O9j07J19j41K33k67Q4K33k56kJ67j27l85J77j07O1J05J78
6859G6N0j2l40L88k0l16M1K3K83k93m3M08k75j32L29N5j89j60R1M08m80P3o9m2
6883a46K33j76J03j55R1K8J37m30K63J4j08J07k7P9j18k4l0K22j30k1O7J88l92
6906b25J2L04l4K5j14K6J36o3k1J01j50j14k80M50P6n17K61J36m71N33l6j22J42
6929E5J05j66j05J47k74J85J24J5r9lj43J21N5J57l06K89M5n16J17L49L6j49J64
$$ plain form
6952 203 208 119 48 247 -134 22 -232 -122 -96 118 -49 223 -313 306 147 98 244 -278 171 236 -237 222
6974 222 65 184 -390 -48 87 179 60 40 140 -28 -18 172 -115 21 -203 -79 9 -40 -35 -434 140 -430
6996 -430 -282 41 171 -356 29 231 -83 -118 -21 116 -171 -5 -153 39 -124 -5 189 -75 59 -122 -189
7017 -189 -168 -213 -192 204 -51 -91 -103 101 -334 -36 -30 13 4 88 105 -88 -620 -56 84 -134 114 143 214 -26 -190
7042 -190 -175 -98 -90 -148 0 52 -172 13 -225 -185 2 -249 243 -73 -224 -7 307 -50 -145 95 269 -328 -36
7065 -36 285 154 -110 102 -16 -66 -16 270 -41 -232 181 -2 158 -151 27 -83 -348 -54 319 403 -73
7086 -73 -55 -10 65 -25 -31 -173 89 18 -40 -81 83 42 -151 22 126 48 -92 -103 -394 -11 -49 239 46 -104 -45
7111 -45 -76 -291 56 289 64 -64 336 1 -103 -12 237 37 -217 -96 131 -204 -464 -211 42 101 167 -98
$$ packed form
6952B03Nq9p1J99l81J56k54J10K6K14j67K72n36O19j59m9J46n22M49O5m73M59
6974B22j57J19n74L42J35R2j19k0J00j68J0J90k87J36k24J24Q8m9Nl99N74n70
6996d30J48L23J30n27L85K02l14l5R7J37k87J66j48J92j63J19J94k64J34j81o7
7017a89K1m5K1L96k55m0j2K04m35K98OM3rQ4J7j93n32N64J40k18K48K9P1k40j64
7042a90J5P7Qn8J48N2k24J85k38M0J87k51M92l16j51K17L14l57r5K40J74n97K92
7065c6L21j31k64K12j18n0N0K86l11j91M13j83J60l09J78j10k65K94L73Q4m76
7086g3J8M5P5r0oj42K62p1n8m1J64m1j93J73J04p8j40j1k91L83l8K88j93j50N9
7111d5l1k15L47K33k25j28M00l35j04R1K49k00k54J21K27l35k60K53K53N9O6k65
$$ plain form
7133 -98 80 19 -288 236 189 -115 -95 -20 -158 -205 -207 258 -249 -238 -154 -77 240 30 28 -212 12 -75 108 -26 294
7158 294 95 84 332 -147 -35 84 108 -82 -217 -133 -62 -256 -12 46 -266 81 168 -5 61 -10 275 115 27
7181 27 -109 200 -25 55 343 37 -45 -104 81 58 23 -37 175 171 152 232 -62 192 -16 -200 128 -37 -8 -52
7205 -52 375 -262 -95 -70 92 50 -71 -296 226 83 -116 210 -50 -119 98 217 -14 57 -46 -54 38 267 200
7228 200 388 143 -86 -82 112 123 87 -177 -92 25 231 33 -1 -87 19 -49 31 -138 72 149 12 -115 212
7251 212 179 205 130 193 -319 -37 30 -91 72 5 148 -22 -61 130 73 -26 -234 -37 84 -43 -270 63 87
7274 87 -153 53 -217 39 -239 -113 256 82 -347 40 -108 -188 -152 3 -291 -190 -1 -112 267 -209 -209 33
7296 33 102 -175 22 410 -397 -203 -13 17 -184 107 -133 237 15 -16 45 -55 -103 75 178 -66 45 -29
$$ packed form
7133i8J78o1l07N24m7l04K0P5j38m7kM65n07J1Q4P7L17k10kk40K24q7J83j34L20
7158B94j99j1K48m79J12J19K4j90j35Q4P1j94K44N8l12L47Q7j73O6p1K85j60q8
7181B7j36L09k25Q0K88l06q2n9J85k3l5o0K12mj9Q0k94K54k08j84L28j65K9m4
7205e2M27o37J67K5J62m2j21k25N22j43j99L26k60o9K17J19k31P1j03qR2K29o7
7228B00J88k45k29MJ94J1l6k64Q5J17K06j98l4q6J06o8Q0j69K10P7j37j27L27
7251B12l3K6p5O3n12K82O7j21J63o7J43j70l9J91n7r9k08J97J21j27k27L33K4
7274H7k40K06k70K56k78J26L69j74m29L87j48q0L6J55k94J01J89j11L79m76%K42
7296C3O9k77J97L88q07J94J90L0k01K91k40L70k22l1O1j00m8J78J03k44J11p4
$$ plain form
7318 -29 196 -220 15 -31 81 -76 -37 40 -43 138 98 231 -98 157 72 -76 -278 179 230 -108 125 -152 -16
7341 -16 134 -213 98 49 -221 -313 -99 144 -31 -307 25 -253 -52 109 140 151 -199 -170 105 73 14 -8 -207
7364 -207 264 -119 275 139 -107 104 -105 -148 -9 85 -3 -18 223 14 43 94 146 159 239 63 175 136 -233
7387 -233 151 216 -62 60 62 -10 245 156 -441 -52 -48 32 94 -166 83 -166 -53 59 -75 -263 -284 -248 54 -19
7411 -19 29 -117 151 124 -310 -10 -137 -41 157 -107 -147 -148 270 -268 -112 -37 41 184 -9 4 -55 147 17 -212
7435 -212 -173 96 -96 -179 -70 -67 315 -165 172 -180 131 247 267 35 -48 221 -404 -91 2 143 -141 58
7457 58 -93 -4 -21 -32 214 -85 -143 -71 -230 134 78 -121 109 134 7 14 28 -126 333 46 -109 37 172 -40
7481 -40 -124 -126 -20 176 71 176 -183 -112 -166 119 -120 30 -269 285 125 -248 107 15 -53 4 30 219 7
$$ packed form
7318b9K25m16K35m6J12j57L9P7q3J81m0J33l29K55q5j48k02M57N1l38K33k77J36
7341a6J50l47L11m9k70r2K14K43j75k76L32k78K01J61L1J1l50K9K75l2n9k2j99
7364b07M71l83L94j36k46K11k09m3J39R4q8j5K41k09K9N1N2J3Q0j76J12l9l69
7387b33L84O5k78J22Kp2K55q9n97L89MQ0O2k60K49k49J13J12j34j88k1L6L02p3
7411a9M8j46K68k7m34L00j27R6J98k64m0jM18n38J56P5P8J43j93J3n9K02j30k29
7435b12L9K69j92q3J09LL82m80L37l52L11J16K0k32q3K69o25L13R3J41k84J99
7457E8j51Q9j7j1K46k99n8P2j59L64n6j99K30K5j27PJ4j54M59k87j55J46J35k12
7481d0q4kJ06J96j05J05l59P1n4K85k39J50k99N54j60l73L55r2o8N7K6J89k12
$$ plain form
7504 7 -209 -15 105 69 -164 -100 43 -222 -96 -134 27 -160 -73 -36 -90 101 -7 -102 -463 93 -247 -158 82
7527 82 58 -114 -98 386 -56 48 220 -444 -77 -35 -86 377 86 48 -382 214 201 -247 48 -179 88 -152
7549 -152 -184 80 217 -215 -20 84 263 294 -98 -18 -77 -226 129 -174 -179 -57 54 -244 -38 -137 -8 -200
7571 -200 -68 262 148 -134 -178 -93 -274 172 71 -74 3 45 -116 -60 241 -154 -375 105 269 6 344 29
7593 29 114 -111 365 56 -45 -38 -76 219 163 24 -291 45 -200 -262 -28 66 189 -59 -55 260 151 -90 319
7616 319 -80 25 224 -259 -197 -330 -4 -356 116 129 55 206 58 153 -234 -16 252 -209 -326 -80 348
7637 348 -60 -41 -196 -128 114 35 -53 -275 -295 129 202 -60 -235 -45 31 -429 -63 -234 180 107 123 -198 69
7660 69 -109 -123 27 44 -57 -41 169 -13 -100 -290 17 152 -193 -196 33 -41 -97 -37 68 3 215 -23 -136 -51
$$ packed form
7504Gk16J94J20l6k33O4J43k65J26l8J61j87Q7L7n4J91j08r5l61N56l40Q9K40
7527H2k4j72J6M84m42J04J72o64L67M2n1M63k91l8m30N96j3m48K95k27K67k40
7549a52l2K64J37m32J95J04J79L1l92Q0n9j49L55l03nJ22J11k98K06r9J29j92
7571b00J32L30j14k82m4Q5j81M46j01j45P7M2j61N6L01l95k21M80J64k63L38l15
7593B9Q5k25M76l09j01Pl8K95n6j39l15L36k45o2K34R4J23k48ML15j09k41M09
7616C19l99J05J99m83O2j33L26l52M72J3p4J51j48R5l87K18K68m61j17K46M28
7637C48m08J9j55O8K42p9q8k22k0M24P3k62j75J90P6m60L66j71M14p3J6l21K67
7660F9j78j4J50J7j01J6K10j82q7j90L07J35l45lK29p4n6O0J05o5K12k38j13Q5
$$ plain form
7684 -51 -53 -54 -13 331 -211 -198 138 168 -81 165 -24 -184 25 46 46 239 100 -219 -105 -244 -71 -248 -130 -161
7708 -161 -118 91 -369 266 -128 -129 -49 -32 116 68 -198 -71 -176 -201 -124 -236 249 -18 93 211 182 189 37 -159
7732 -159 -77 50 -119 -59 42 288 -170 22 -44 172 38 126 -347 -43 -57 -186 231 130 -192 71 181 -83
7754 -83 85 -57 225 -65 -63 264 13 194 109 -10 14 67 -9 347 -9 -408 -371 -195 -252 -154 -129 105 -76 -213
7778 -213 294 95 28 167 294 212 -193 -322 -20 25 -66 120 250 -198 -82 7 180 -48 -145 89 -24 118
7800 118 -156 -72 -39 38 -42 16 -99 -191 -22 -113 -126 55 -59 41 -261 -146 -76 -46 -271 -110 156 -161 117
7823 117 128 136 104 -149 -250 158 -222 172 64 173 -92 -129 -114 18 -324 -65 29 3 -5 -138 33 -207 12
7846 12 289 255 0 128 111 86 -9 42 166 -168 -16 299 -2 129 232 -146 118 127 144 283 -274 -165 146
$$ packed form
7684e1kjM1L44n42J3L36L0k49K46j89j60K09K1%J93j39l19J14j39J73j77J18l1
7708a61M3K09m60O35l94jQ0J7J48m8k66J27j05k5P7j12M85k67J11J18k9Pj52j96
7732a59Q2J27j69O0J01K46m58J92o6K16j34Q8m73L04j4j29M17j01l22K63J10k64
7754h3J68j42K82k90KL27k51J81q5j19K4N3p6L56l56l99L7J76n7R8K5K34j81j37
7778b13N07j99o7J39J27q2m05j29L02M5r1J86J30m48J16Q9J73k28r7K34j13J42
7800A18k74Q4L3P7q0N8j15r2J69r1j3J81j14J00l02J15P0L0k25J61K66l17K78
7823A17J1Ql2k53j01M08l80L94j08J09k65l7J5J32l42K59R4k6qj33J71k40K19
7846A2K77l4k55J28j7k5r5N1J24l34J52L15l01J31J03l78K64RJ7J39n57J09L11
$$ plain form
7869 146 106 -119 170 54 162 36 -247 104 285 69 91 93 96 -128 -50 131 -117 -72 263 -29 292 -186 7
7892 7 109 110 113 83 -98 395 251 1 -98 -56 -215 200 51 -92 140 -6 -169 -90 138 -116 -231 105 -49
7915 -49 364 -86 -58 210 108 -396 -10 -297 63 54 134 -92 -462 287 71 151 -219 65 -135 -2 -192 5
7937 5 -179 -208 35 -15 228 50 -73 -116 -8 -186 327 -128 -7 -207 -80 117 -258 -127 264 131 -205 -35
7959 -35 130 -143 -131 73 299 -101 -334 -74 250 -207 -363 230 57 -50 20 -55 -118 -47 -40 322 119 117 267
7982 267 169 115 -34 304 -45 -49 -350 361 76 181 250 -76 -62 -357 -8 350 159 140 240 189 93 -104 46
8005 46 249 133 62 -49 228 -221 -122 -119 -32 87 176 51 -20 -66 38 123 118 -117 51 -121 -89 167 -53 -37 -161
8030 -161 -123 25 -110 178 181 -169 34 -309 -166 457 -243 -259 418 -478 -255 138 23 140 -324 141 -27
$$ packed form
7869A46m0k25K89j16J08j26k83L51J81k16K2KLk24P8J81k48M5L35k92L21m78J93
7892GJ02JLl0j81M93j44k50r9M2j59M15j49j43K32j46j63P9K28k54j15L36j54
7915d9M13m50K8K68j02n04L86k87L60rQ0k26l70P49k16Q0l70K84k00J33j90J97
7937Ej84k9K43n0K43j78j23m3J08j78N13m55J21k00J27J97l75J31L91j33l36J70
7959c5J65k73J2K04K26m00k33K60L24m57j56N93j73j07P0p5o3P1PL62k03kJ50
7982B67r8n4j49L38l49ml01P11k85J05O9l26J4k95L49L58j91j9J00n1r6j97J50
8005D6K03j16p1j11K77m49R9LQ7J19Q9j25p1m6J04Q5nk35J68j72L2K56k20J6j24
8030a61L8J48j35K88Ll50K03l43J43O23p00j6O77q96K23L93j15J17m64M65j68
$$ plain form
8051 -27 -12 272 -186 -292 15 193 94 155 166 58 0 -7 -210 -103 115 -205 54 199 -48 -182 -292 357 -180
8074 -180 45 127 164 -1 -93 97 -83 81 157 -233 142 58 -19 -20 -183 -263 -61 3 208 -81 -146 3 -142 -118
8098 -118 224 294 3 47 220 8 -225 124 149 -45 23 -21 12 61 49 -152 157 -82 -40 -49 -76 119 91 123 -88
8123 -88 162 -79 -63 214 -186 145 156 385 -110 -6 -205 165 224 -14 48 66 -103 38 -208 -3 13 70 166
8146 166 -175 126 -130 -128 -37 57 -114 -244 -213 -115 217 -167 192 -186 -40 -103 97 74 -65 272 -77 -160 77
8169 77 -207 -307 27 134 138 -63 233 -240 118 -51 23 131 264 110 71 -288 134 27 -296 93 64 -286
$$ packed form
8051b7J5K84m58j06L07J78r9O1J1j08n8pk03J07K18l20K59J45k47j34j10O49n37
8074a80K25Q2L7j65r2J90j80J64P6l90L75q4p7jj63q0K02O4K05k89o5J49j45K4
8098a18L42P0k91M4J73k12k33L49K5j94O8m4L3M9j2k01L09k39M2rk7J95k8L2k11
8123h8K50k41J6K77m00L31J1K29m95J04j99L70N9k38O2J8j69J41k46K05J6N7R6
8146A66l41L01k56KR1R4j71j30L1R8L32l84L59l78J46o3K00k3j39L37l49q3K37
8169G7k84j00L34J07Mk01K96m73L58j69P4J08J33j54l9l59M22j07l23L89k9l50
8191b86
$$ Imaginary data points
##PAGE= N=2
##DATA TABLE= (X++(I..I)), XYDATA
$$ plain form
0 0 0 0 0 4 -8 0 -8 8 -8 8 -16 16 -24 25 -32 40 -48 56 -66 80 -92 106 -124 140 -164 187 -211 238 -270
29 -270 305 -341 382 -430 480 -531 593 -658 733 -812 899 -995 1100 -1218 1350 -1496 1661
46 1661 -1849 2065 -2315 2607 -2957 3385 -3917 4606 -5529 6836 -8831 12221 -19061 38218
60 38218 -196655 -705392 -65253 502021 226121 -170389 -43399 -1082 -222640 -90546
70 -90546 365387 293518 -225960 -308995 104861 238133 -2633 -117668 -56386 -84474 -58779
81 -58779 117620 129139 -101191 -150484 51460 84531 -112105 -136370 45892 91030 -25572
92 -25572 -52596 -21774 -81215 -103358 26066 84634 -72314 -198693 -77523 116080 122699
103 122699 -39010 -159637 -117121 24131 106987 71951 -7709 -70582 -91070 1422 163734
$$ packed form
0@%%%Mj2QqJ6j6J6k4L2m0M9n7P2q8J04j22J46j72J98k30K64l04L51l98M49n08
29b70N75o46P23q12R10j011J124j251J391j545J711j894K095k318K568k846L157
46A661l510L914m380M922n564O342p302Q523j0135J2365j5667K1052l1282N7279
60C8218k34873n08737O40139N67274k75900l96510J26990M2317k21558J32094
70i0546M55933p1869n19478q3035M13856J33272k40766j15035O1282k8088K5695
81e8779J76399J1519k30330m9293K01944L3071j96636k4265J82262M5138j16602
92b5572k7024L0822n9441k2143J29424N8568j56948j26379J21170J93603O619
103A22699j61709j20627M2516J41252Q2856l5036p9660o2873k0488R2492J62312
$$ plain form
114 163734 133574 -145489 -260491 24597 264443 70468 -185490 -88823 69709 -21351
124 -21351 -58376 125479 105759 -194054 -188864 202712 284314 -93432 -239388 38847 158672
135 158672 -15630 -28647 103596 -5194 -164774 14568 210782 5173 -214207 -26500
145 -26500 170712 7733 -124935 44392 108773 -83784 -90459 137202 110017 -146564 -102198
156 -102198 177735 149061 -119030 -114918 96942 89124 -50262 -901 87819 -20025 -94799
167 -94799 62011 163083 8557 -114558 -977 113657 54876 -7720 30352 39127 -14947
178 -14947 -3242 66926 55615 -28451 -46512 20290 56216 8767 -47568 -31576 28534 34564
190 34564 -24028 -46736 3266 31146 2264 53 25788 -9483 -55385 11082 97480 33659
$$ packed form
114A63734l0160k79063j15002K85088K39846j93975k55958R6667J58532r1060
124b1351l7025J83855j9720k99813N190L91576Q1602l77746j45956K78235J19825
135A58672j74302j3017J32243j08790j59580J79342J96214k05609k19380J87707
145b6500J97212j62979j32668J69327O4381j92557o675K27661k7185k56581M4366
156a02198K79933k8674k68091M112K11860p818j39386M9361Q8720j07844p4774
167i4799J56810J01072j54526j23115J13581J14634n8781o2596L8072Q775n4074
178a4947J1705P0168j1311q4066j8061O6802L5926m7449n6335J5992O0110O030
190C4564n8592k2708N0002K7880k8882k211K5735l5271m5902O6467Q6398o3821
$$ plain form
202 33659 -77313 -36287 62820 35288 -22155 25331 40624 -57739 -62431 88373 115576 -50401
214 -50401 -98283 50187 90889 -32954 -38314 78190 42723 -88116 -33776 106073 46897
225 46897 -91247 -36622 76409 9420 -81032 3253 79289 -16406 -83404 11817 64446 -21336
237 -21336 -46565 40270 43279 -49150 -38531 60738 52447 -39445 -37028 32074 25444 -19053 2891
250 2891 31994 -7667 -36387 9481 43943 8211 -25719 -5699 19069 14937 8049 9406 3488
263 3488 -2955 6167 19678 19457 4382 -9464 -2757 20130 23264 -3368 -13938 9870 18188 -5496
277 -5496 -5364 24201 14059 -24819 -9061 37466 19966 -29340 -9202 37951 10656 -34172 -147
290 -147 42092 1264 -38817 3565 36992 -7079 -30774 16975 30443 -21170 -27374 27155 30103
$$ packed form
202C3659j10972M1026R9107k7532n7443M7486J5293r8363m692J50804K7203j65977
214e0401m7882J48470M0702j23843n360J16504l5467j30839N4340J39849n9176
225D6897j38144N4625J13031o6989r0452Q4285P6036r5695o6998R5221N2629q5782
237b1336k5229Q6835L009r2429J0619R9269q291r1892K417O9102o630m4497K1944
250B891K9103l9661k8720M5868L4462l5732l3930K0020K4768m132o888J357n918
263C488o443R122J3511k21j5075j3846O707K2887L134k6632j0570K3808Q318k3684
277e496J32K9565j0142l8878J5758M6527j7500m9306K0138M7153k7295m4828L4025
290a47M2239m0828m0081M2382L3427m4071k3695M7749J3468n1613o204N4529K948
$$ plain form
303 30103 -19022 -17081 23605 13479 -18037 3130 28381 -3475 -26937 7419 28513 -5627
315 -5627 -22098 6735 12719 -14817 -10853 15811 3422 -23896 -9168 16185 1152 -18687 -5681
328 -5681 6109 -6594 -10674 2043 -570 -13221 -6730 4132 -4837 -12533 -1494 291 -12149
341 -12149 -7579 6886 -2489 -17758 -5017 9381 -5171 -16469 598 6999 -11686 -13560 7107
354 7107 4662 -15687 -9126 9476 -945 -16813 -1068 11651 -7535 -17206 4818 11416 -11708
367 -11708 -13560 10104 7708 -14866 -7523 14081 3411 -15249 -1692 14631 -240 -11280 4563
380 4563 11939 -4773 -6897 10664 8063 -8734 -2263 12856 3190 -9307 3415 12665 -2828
393 -2828 -8694 8384 11549 -5472 -6180 10834 9690 -5161 -958 12542 6039 -4610 3640 12744
$$ packed form
303C0103m9125J941M0686j0126l1516K1167K5251l1856k3462L4356K1094l4140
315e627j6471K8833N984k7536L964K6664j2389k7318J4728K5353j5033j9839J3006
328e681J1790j2703m080J2717k613j2651O491J0862q969p696J1039J785j2440
341a2149M570J4465r375j5269J2741J4398j4552j1298J7067O401j8685j874K0667
354G107k445k0349O561J8602j0421j5868J5745J2719j9186r671K2024O598k3124
367a1708j852K3664k396k2574P343K1604j0670j8660J3557J6323j4871j1040J5843
380D563P376j6712k124J7561k601j6797O471J5119r666j2497J2722R250j5493
393b828n866J7078L165j7021p08J7014j144j4851M203J3500o503j0649Q250R104
$$ plain form
407 12744 3218 -2291 7390 9216 -432 432 10023 6356 -2579 2608 10079 4077 -1353 5992 9549
422 9549 1320 -620 8032 9055 824 -36 5827 4963 1135 2702 3221 -777 -1506 2750 758 -2970
438 -2970 -45 1526 -3785 -4358 2835 3414 -5371 -5949 3318 3684 -4910 -4476 3039 702 -6468 -2837
454 -2837 3517 -2127 -8986 -3142 3183 -2652 -8180 -3009 1242 -3450 -5327 332 1594 -5585 -5834
469 -5834 3700 4375 -7026 -10263 1464 6068 -5998 -11966 -1907 2592 -8961 -11029 2211 2128
483 2128 -15784 -15253 7798 9376 -15740 -18977 6260 9355 -11849 -10452 8653 342 -19687 -3981
497 -3981 20109 -537 -28898 -7181 22406 2054 -22586 -1064 16705 -8363 -16739 17546
509 17546 22453 -19515 -23389 24289 29722 -15094 -20871 18373 19302 -13814 -5964 23390 4437
$$ packed form
407A2744r526n509R681J826r648Q64R591l667q935N187P471o002n430P345L557
422I549q229j940Q652J023q231q60N863q64l828J567N19l998p29M256j992l728
438b970K925J571n311n73P193N79q785n78R267L66q594M34P515k337p170L631
454b837O354n644o859N844O325n835n528N171M251m692j877N659J262p179k49
469e834R534O75j1401l237J1727M604j2066n968J0059M499j1553k068J3240q3
483B128j7912N31K3051J578k5116l237K5237L095k1204J397J9105q311k0029J5706
497c981K4090k0646k8361K1717K9587k0352k4640K1522J7769k5068q376L4285
509A7546M907m1968l874M7678N433m4816n777L9244R29l3116P850K9354j8953
$$ plain form
522 4437 -26653 -524 33921 6394 -30703 -7168 26685 9710 -14440 214 12106 -5073
534 -5073 -6624 18119 17283 -14025 -18037 13655 24481 261 -14947 -2826 9090 6542 2936
547 2936 4467 366 -6852 -1410 16526 20192 -4319 -20840 3489 32986 15110 -18897 -9228
560 -9228 20511 12206 -8977 6537 18301 -13708 -25637 22479 41882 -17674 -48654 10500
572 10500 45854 -4427 -32268 10279 17833 -24724 -9648 46163 13851 -60893 -26797 59453
584 59453 33064 -50744 -31189 33687 7886 -34586 11404 40502 -30689 -61017 28488 69317
596 69317 -19993 -66697 9719 49950 -10176 -28597 23385 16333 -40364 -13850 54510 20240
608 20240 -57744 -28508 48356 27997 -36804 -21754 23466 4828 -21182 10026 26247 -20037
$$ packed form
522D437l1090K6129L4445k7527l7097K3535L3853j6975k4150J4654J1892j7179
534e073j551K4743q36l1308m012L1692J0826k4220j5208J2121J1916k548l606
547B936J531m101p218N442J7936L666k4511j6521K4329K9497j7876l4007R669
560i228K9739q305k1183J5514J1764l2009j1929M8116J9403n9556l0980N9154
572A0500L5354n0281k7841M2547P554m2557J5076N5811l2312p4744L4096Q6250
584E9453k6389q3808J9555O4876k5801m2472M5990K9098p1191l0328Q9505M0829
596F9317q9310m6704P6416M0231o0126j8421N1982p052n6697K6514O8360l4270
608B0240p7984K9236P6864k0359o4801J5050M5220j8638k6010L1208J6221m6284
$$ plain form
620 -20037 -37801 18437 48516 -4709 -47822 -11571 35072 20689 -14605 -15207 -706 -2441 -937
633 -937 18674 18333 -20383 -38804 7141 52466 20292 -40135 -29495 26578 31585 -2559 -1874
646 -1874 11564 -13158 -20446 33683 54334 -19246 -61038 12178 67736 8254 -42733 3289
658 3289 32169 -12395 -12901 47187 26040 -57767 -31366 72591 54019 -55592 -48048 48545
670 48545 41844 -31634 -10904 41843 -6332 -53143 21766 77440 -11637 -81394 3156 78023
682 78023 11620 -51440 -1052 36122 -10678 -19183 38654 29210 -46478 -35712 51340 50952 -33699
695 -33699 -45793 20560 34907 -8560 -12659 12628 -4372 -26478 10216 43687 -845 -53664
707 -53664 -18704 46657 33214 -29296 -36368 5246 16911 -2190 1152 9867 -20544 -41911 6623
$$ packed form
620b0037j7764N6238L0079n3225m3113L6251M6643j4383l5294o02J4501j735J504
633i37J9611l41l8716j8421M5945M5325l2174o0427J0640N6073N007l4144O85
646a874J3438k4722p288N4129K0651p3580m1792P3216N5558n9482n0987M6022
658C289K8880m4564n06O0088k1147q3807K6401J03957j8572j09611P544R6593
670D8545o701p3478K0730N2747m8175m6811P4909N5674q9077o9757Q4550P4867
682G8023o6403o3060N0388L7174m6800q505N7837r444p5688J0766Q7052l88q4651
695c3699j2094O6353J4347m3467m099K5287j7000k2106L6694L3471m4532n2819
707e3664L4960O5361j3443o2510p072M1614J1665j9101L342Q715l0411k1367M8534
$$ plain form
720 6623 55265 8893 -64361 -39162 38605 35836 -23804 -25866 6802 -9397 -26143 22110 44282
733 44282 -29422 -71076 8269 67356 -759 -61281 -8097 35378 -12468 -30947 25293 24187
745 24187 -49095 -38273 49964 40391 -53963 -49363 40927 39753 -37161 -32834 26956 11164 -33496
758 -33496 258 37540 -14801 -55121 7514 56855 -712 -55210 -13706 31511 7570 -13972
770 -13972 6564 1586 -30887 -11874 41369 29887 -34964 -43717 14230 40331 5438 -20462
782 -20462 -8074 1203 -3421 8087 24836 4762 -32439 -22214 31027 41393 -11419 -39673
794 -39673 964 34533 6869 -16918 6836 14061 -18069 -13101 35792 27564 -37896 -35746 38149
807 38149 43258 -27533 -35344 25006 25749 -24428 -9042 35382 1880 -45091 3414 55582 1817
$$ packed form
720F623M8642m6372p3254K5199P7767k769n9640k062L2668j6199j6746M8253K2172
733D4282p3704m1654P9345N9087o8115o0522N3184M3475m7846j8479N6240j106
745B4187p3282J0822Q8237r573r4354M600R0290j174p6914M327N9790j5792m4660
758c3496L3754L7282n2341m0320O2635M9341n7567n4498M1504M5217k3941k1542
770a3972K0536m978l2473J9013N3243j1482o4851q753N7947K6101l4893k5900
782b0462J2388R277m624J1508J6749k0074l7201J0225N3241J0366n2812k8254
794c9673M0637L3569k7664k3787K3754P225l2130M968M8893q228o5460K150P3895
807C8149N109p0791p811O0350P43n0177J5386M4424l3502m6971M8505N2168n3765
$$ plain form
820 1817 -53519 -1780 48229 984 -35930 10464 28503 -23084 -23423 37255 25631 -44083 -28541
833 -28541 44466 29148 -39527 -24159 31294 11655 -28607 2217 29962 -15616 -39716 16119
845 16119 43732 -12445 -45524 -294 29222 1029 -15922 1345 -1564 -17991 -1936 22043
857 22043 5817 -23377 -18535 4626 12967 6885 -6528 -18810 -11564 10254 11947 -7425 -11172
870 -11172 -925 -4918 -8532 8888 12244 -14935 -22233 8865 16924 -12357 -14558 12330 5695
883 5695 -20783 -4183 22106 -2622 -25776 6967 25965 -16277 -30989 20219 32720 -23029
895 -23029 -31926 23067 24006 -27104 -14300 36167 8722 -45226 -8325 49638 11893 -43386 -8006
908 -8006 35659 626 -26168 15568 27907 -23024 -27484 28768 31165 -22116 -20701 22680 12661
$$ packed form
820A817n5336N1739N0009m7245l6914M6394J8039n1587l39O0678j1624o9714J5542
833b8541P3007j5318o8675J5368N5453j9639m0262L0824K7745m5578k4100N5835
845A6119K7613n6177l3079M5230K9516k8193j6951J7267k909j6427J6055K3979
857B2043j6226k9194M842K3161Q341o082j3413j2282P246K1818J693j9372l747
870a1172J0247l993l614J7420L356k7179p298L1098Q059k9281k201K6888o635
883E695k6478J6600K6289k4728k3154L2743J8998m2242j4712N1208J2501n5749
895b3029q897N4993R39n1110J2804N0467k7445n3948L6901N7963l7745n5279L5380
908h006M3665l5033k6794M1736J2339n0931m460N6252K397n3281J415M3381j0019
$$ plain form
921 12661 -20025 3216 28932 -5829 -28040 12254 31926 -8829 -22375 15672 20275 -14977
933 -14977 -10287 23119 10882 -19685 -2707 23053 2512 -17236 5844 18547 -5476 -10839
945 -10839 11737 8882 -10266 -240 15983 -2609 -15650 7991 17449 -8293 -12844 13155 9821
958 9821 -15891 -4335 20877 2120 -22519 988 22311 -4892 -20480 9030 16631 -15350
970 -15350 -15322 17439 10451 -22114 -8690 21723 1196 -25490 454 23499 -7809 -25218 8380
983 8380 18940 -16379 -19183 17277 12196 -24840 -13427 21476 5877 -24535 -4870 19103 -5760
996 -5760 -22156 7277 18379 -14779 -20729 12684 13138 -17285 -11674 15880 2144 -21807 -1819
1009 -1819 19285 -4122 -21473 3284 15156 -9732 -13991 10914 8547 -16327 -8203 15693 4171
$$ packed form
921A2661l2686K3241K5716l4761k2211M0294J9672m0755j3546L8047M603l5252
933a4977M690L3406j2237l0567J6978K5760k0541j9748K3080J2703k4023n363
945a0839K2576k855j9148J0026J6223j8592j3041K3641R458k5742m551K5999l334
958I821k5712J1556K5212j8757k4639K3507K1323k7203j5588K9510P601l1981
970a5350K8L2761o988l2565J3424L0413k0527k6686K5944K3045l1308j7409L3598
983H380J0560l5319k804L6460n081l7036J1413L4903j5599l0412J9665K3973k4863
996e760j6396K9433J1102l3158n950L3413M54l0423N611K7554j3736k3951J9988
1009a819K1104k3407j7351K4757J1872k4888m259K4905k367k4874Q124K3896j1522
$$ plain form
1022 4171 -16216 -1307 13660 -4361 -13428 8221 12346 -11506 -10903 12726 8586 -12856 -3462
1035 -3462 14559 776 -13982 4335 16097 -4529 -12760 8829 12739 -7966 -6214 13310 5745
1048 5745 -12230 104 16599 963 -12491 4939 14262 -4304 -8958 10916 10425 -10150 -5443
1061 -5443 14956 7026 -11583 -958 14721 1381 -9975 5650 12718 -5126 -9059 9999 10356
1074 10356 -8191 -4844 11469 3931 -10338 1052 13535 -891 -11504 3679 11591 -3742
1086 -3742 -8373 7077 7927 -8607 -5725 10473 5572 -9463 -3940 7856 708 -7586 1729 6362
1100 6362 -5153 -8315 3751 5816 -5498 -6214 2566 356 -6357 -710 4860 -3056 -9220 -463
1114 -463 4442 -2343 -5623 -636 -576 -4573 -1948 2057 -2344 -5843 -1717 413 -2372 -2259 213 -3206
$$ packed form
1022D171k0387J4909J4967j8021r067K1649M125k3852O03K3629m140k1442R394
1035c462J8021j3783j4758J8317J1762k0626q231K1589L910k0705J752J9524p565
1048E745j7975J2334J6495j5636j3454J7430R323j8566m654J9874m91k0575M707
1061e443K0399p930j8609J0625J5679j3340j1356J5625P068j7844l933J9058L57
1074A0356j8547L347J6313p538j4269J1390J2483j4426j0613J5183P912j5333
1086c742m631J5450Q50j6534K882J6198m901j5035N523J1796p148q294R315M633
1100F362j1515l162J2066K065j1314p16Q780k210o713N647N570p916o164Q757
1114d63M905o785l280M987O0l997K625M005m401l499M126K130k785J13K472l419
$$ plain form
1130 -3206 -5557 225 3069 -4030 -6159 1773 2846 -5604 -4756 4231 1105 -7343 -2831 5287 -1384
1145 -1384 -8426 -144 6469 -3236 -8536 1970 6105 -3723 -5892 4024 3202 -7173 -2929 9012
1159 9012 2880 -10610 -3856 10201 4104 -7651 -1749 7223 -229 -6060 3820 9344 -3393 -9647
1173 -9647 4392 11999 179 -7446 1282 7141 350 -1607 5362 4154 -4895 -2931 9166 8321
1187 8321 -4534 -5941 5177 8472 -476 -2724 4315 3627 -2968 146 8884 3622 -7733 -3215
1201 -3215 11041 8002 -7463 -6214 7667 7312 -4452 -2587 6859 1622 -7799 1529 12241 353
1215 353 -13347 -1864 13748 4572 -10580 -3415 7911 628 -6158 4264 7060 -8232 -11182
1228 -11182 8646 13506 -7338 -15295 3176 11369 -3079 -8298 3142 2688 -10274 -4524 12599
$$ packed form
1130c206k351N782K844p099k129P932J073q450Q48Q987l126q448M512Q118o671
1145a384p042Q282O613r705n300J0506M135r828k169R916q22j0375M244J1941
1159I012o132j3490O754J4057o097j1755N902Q972p452n831R880N524j2737o254
1173i647J4039P607j1820p625Q728N859o791j957O969j208r049J964J2097q45
1187H321j2855j407J1118L295q948k248P039o88o595L114Q738n262j1355M518
1201c215J4256l039j5465J249J3881l55j1764J865R446n237r421R328J0712j1888
1215C53j3700J1483J5612r176j5152P165J1326p283o786J0422K796j5292k950
1228a1182J9828M860k0844p957J8471Q193j4448n219J1440m54j2962N750J7123
$$ plain form
1241 12599 4818 -17492 -11631 12685 11082 -11681 -12397 4814 4108 -8256 -2374 8135 -3670
1254 -3670 -17002 -1090 16881 1389 -19964 -8349 12563 4641 -11303 -3502 6028 -5877 -10066
1267 -10066 8032 12381 -11670 -19297 7223 18669 -5307 -17826 908 10768 -4220 -7471 8334
1280 8334 4292 -15960 -7423 18398 11234 -17979 -15211 13079 14207 -7528 -8723 5977 2117
1293 2117 -8188 3668 15044 -3016 -19059 23 21354 7157 -14961 -7319 10183 6057
1305 6057 -3151 2871 6255 -6623 -8944 11130 18410 -5161 -18829 1649 19451 5702 -10935
1318 -10935 -2099 8215 67 -3745 9955 10273 -11302 -13643 13992 21984 -7127 -19985 5123
1331 5123 18781 -832 -9702 6509 6879 -11381 -3621 21241 9067 -23066 -12543 23565 16921
$$ packed form
1241A2599p781k2310N861K4316j603k2763p16J7211p06j2364N882J0509j1805
1254c670j3332J5912J7971j5492k1353J1615K0912p922j5944P801R530j1905m189
1267a0066J8098M349k4051p627K6520J1446k3976j2519J8734R860j4988l251J5805
1280H334m042k0252Q537K5821p164k9213K768K8290J128k1735j195J4700l860
1293B117j0305J1856J1376j8060j6043J9082K1331j4197k2118P642J7502m126
1305F057r208O022L384j2878k321K0074P280k3571j3668K0478J7802j3749j6637
1318a0935Q836J0314q148l812J3700L18k1575k341K7635P992k9111j2858K5108
1331E123J3658j9613q870J6211L70j8260P760K4862j2174l2133J0523L6108o644
$$ plain form
1344 16921 -17134 -13236 13481 6106 -12429 3473 18271 -8365 -25324 8244 29855 -4276
1356 -4276 -29694 -412 22670 -1098 -15578 5714 9484 -14842 -10945 20045 12720 -23328 -18416
1369 -18416 17354 16699 -13659 -13987 6824 3286 -9421 1798 11500 -8047 -19907 3262 19869
1382 19869 -132 -19793 -7021 9599 4191 -5047 -2119 -1075 -7614 -4365 8628 7782 -8822
1395 -8822 -15583 -796 13649 5427 -11557 -10369 3531 6222 -2634 -2666 3455 -2961 -10110 2938
1409 2938 15543 -1441 -20240 -3054 19937 5203 -17198 -4463 13312 173 -11276 7516
1421 7516 12843 -13568 -16483 17775 22222 -16296 -22848 13724 20513 -10284 -10997 14279 4454 -19459
1435 -19459 1342 29271 2405 -30212 -3653 29490 7167 -20059 -536 16248 -5713 -12189
$$ packed form
1344A6921l4055L898K6717p375j8535J5902J4798k6636j6959L3568K1611l4131
1356d276k5418K9282K3082k3768j4480K1292L770k4326L897L0990p325l6048M912
1369a8416L5770o55l0358l28K0811l538j2707J1219R702j9547j1860K3169J6607
1382A9869k0001j9661J2772J6620n408r238K928J044o539L249J2993q46j6604
1395h822o761J4787J4445q222j6984J188J3900K691q856l2O121o416p149J3048
1409B938J2605j6984j8799J7186K2991j4734k2401J2735J7775j3139j1449J8792
1421G516N327k6411k915L4258M447l8518o552L6572O789l0797p13K5276r825k3913
1435a9459K0801K7929k6866l2617K6559L3143k2323k7226J9523J6784k1961o476
$$ plain form
1447 -12189 16812 17483 -17625 -17956 19383 20893 -12736 -13828 13314 9991 -10992 -1175 15855
1460 15855 189 -15612 3558 19424 -337 -16144 1012 14885 1895 -7585 1120 4369
1472 4369 -2290 -156 7183 1456 -7356 -3060 6007 5811 -45 -5222 -5376 838 7815 3961 -6403
1487 -6403 -5928 2310 2137 -893 2379 1683 -8989 -6843 9688 9034 -10132 -10917 6895 6424 -9155
1502 -9155 -4370 9467 -1746 -15116 1818 16241 -5355 -20146 3372 17815 -6293 -18511
1514 -18511 5277 12900 -10477 -11727 12078 7127 -18756 -9255 18353 7419 -19845 -8501 14500
1527 14500 2612 -13870 874 11011 -8817 -14882 9364 14739 -10302 -15660 7714 10687 -8702
1540 -8702 -6921 9296 2417 -12173 -1138 13398 1190 -12616 -928 10325 225 -7544 1760
$$ packed form
1447a2189K9001O71l5108l31L7339J510l3629j092K7142l323k0983R817J7030
1460A5855j5666j5801J9170J5866j9761j5807J7156J3873j2990r480Q705L249
1472D369o659K134P339n727q812M296R067j96n856n177j54O214O977l854j0364
1487f403M75Q238j73l030L272o96j0672K146J6531o54j9166p85J7812m71j5579
1502i155M785J3837j1213j3370J6934J4423k1596j4791K3518J4443k4108j2218
1514a8511K3788P623k3377j250K3805m951k5883R501K7608j0934k7264J1344K3001
1527A4500j1888j6482J4744J0137j9828o065K4246N375k5041n358K3374K973j9389
1540h702J781J6217o879j4590J1035J4536j2208j3806J1688J1253j0100p769R304
$$ plain form
1553 1760 5523 -2492 -2970 4490 2337 -3941 -8 5497 801 -2875 1279 2533 -19 1523 3631
1568 3631 -964 -3445 3213 6206 -538 -2440 2350 2338 -1490 2640 6128 -1571 -5792 4328 8077
$$ packed form
1553A760L763q015m78P460k153o278L933N505m696l676M154J254k552J542K108
1568C631m595k481O658K993o744j902M790j2l828M130L488p699m221J0120L749
$$ [...]
8191D2
##END NTUPLES=NMR FID
##END=
