##TITLE=1H_Pr 5-4-d
 CDCl3+DMSO, 8 sc, 
 1.7.2019
##JCAMPDX= 6.0         $$ Bruker NMR JCAMP-DX V2.0
##DATA TYPE= NMR FID
##DATA CLASS= NTUPLES
##ORIGIN= UXNMR, Bruker Analytische Messtechnik GmbH
##OWNER= root
$$ XWIN-NMR		Version 3.5
$$ Mon Jul  1 16:17:46 2019 Russian Standard Time (UT+4h)  she@DPX200
##.OBSERVE FREQUENCY= 200.13155
##.OBSERVE NUCLEUS= ^1H
##.DELAY= (6, 6)
##.ACQUISITION MODE= SIMULTANEOUS
##.ACQUISITION SCHEME= undefined
##.AVERAGES= 8
##.DIGITISER RES= 18
##SPECTROMETER/DATA SYSTEM= spect
##.PULSE SEQUENCE= zg30
##.SOLVENT NAME= CDCl3
##.SHIFT REFERENCE= (INTERNAL, CDCl3, 0, 15.7039)
##AUDIT TRAIL= $$ (NUMBER, WHEN, WHO, WHERE, WHAT)
$$ ##TITLE= Audit trail, XWIN-NMR		Version 3.5
$$ ##JCAMPDX= 5.01
$$ ##ORIGIN= Bruker BioSpin GmbH
$$ ##OWNER= she
$$ F:/spectra/data/she/nmr/H-F/1/audita.txt
$$ ##AUDIT TRAIL=  $$ (NUMBER, WHEN, WHO, WHERE, WHAT)
(   1,<2019-07-01 16:16:21.25 +0400>,<she>,<DPX200>,
      <created by zg, POWCHK disabled, PULCHK disabled
       configuration hash MD5:
       00 E9 B6 7A A2 85 ED C7 34 08 36 98 17 FE 4E 26
       data hash MD5: 16K
       19 D8 54 94 31 D0 8C 78 57 16 E1 75 A8 86 95 22>)
$$ ##END=
$$ 
$$ hash MD5
$$ E6 F8 70 17 9C 98 E2 A7 9C 7E EE 26 14 DC 67 F9
##$RELAX= 
##$RELAX= 
##$RELAX= 
##$RELAX= 
##$RELAX= 
##$RELAX= 
$$ Bruker specific parameters
$$ --------------------------
##$DU= <F:/spectra>
##$EXPNO= 1
##$NAME= <H-F>
##$PROCNO= 1
##$TYPE= <nmr>
##$USER= <she>
##$AMP= (0..31)
100 100 100 100 100 100 100 100 100 100 100 100 100 100 100 100 100 100 
100 100 100 100 100 100 100 100 100 100 100 100 100 100 
##$AQSEQ= 0
##$AQ_mod= 1
##$AUNM= <au_zg>
##$AUTOPOS= <>
##$BF1= 200.13
##$BF2= 200.13
##$BF3= 200.13
##$BF4= 200.13
##$BF5= 200.13
##$BF6= 200.13
##$BF7= 200.13
##$BF8= 200.13
##$BYTORDA= 1
##$CFDGTYP= 0
##$CFRGTYP= 5
##$CHEMSTR= <none>
##$CNST= (0..31)
1 1 145 1 1 1 1 1 1 1 1 1 1 1 1 1 1 1 1 1 1 1 1 1 1 1 1 1 1 1 1 1 
##$CPDPRG= <>
##$CPDPRG1= <>
##$CPDPRG2= <>
##$CPDPRG3= <>
##$CPDPRG4= <mlev>
##$CPDPRG5= <mlev>
##$CPDPRG6= <mlev>
##$CPDPRG7= <mlev>
##$CPDPRG8= <mlev>
##$CPDPRGB= <>
##$CPDPRGT= <>
##$D= (0..31)
0 1.2 0 0 0 0 0 0 0 0 0 0.03 0 0 0 0 0 0 0 0 0 0 0 0 0 0 0 0 0 0 0 0 
##$DATE= 1561983380
##$DBL= (0..7)
120 120 120 120 120 120 120 120 
##$DBP= (0..7)
150 150 150 150 150 150 150 150 
##$DBP07= 0
##$DBPNAM0= <>
##$DBPNAM1= <>
##$DBPNAM2= <>
##$DBPNAM3= <>
##$DBPNAM4= <>
##$DBPNAM5= <>
##$DBPNAM6= <>
##$DBPNAM7= <>
##$DBPOAL= (0..7)
0.5 0.5 0.5 0.5 0.5 0.5 0.5 0.5 
##$DBPOFFS= (0..7)
0 0 0 0 0 0 0 0 
##$DE= 6
##$DECBNUC= <off>
##$DECIM= 24
##$DECNUC= <off>
##$DECSTAT= 4
##$DIGMOD= 1
##$DIGTYP= 9
##$DL= (0..7)
0 120 120 120 120 120 120 120 
##$DP= (0..7)
150 150 150 150 150 150 150 150 
##$DP07= 0
##$DPNAME0= <>
##$DPNAME1= <>
##$DPNAME2= <>
##$DPNAME3= <>
##$DPNAME4= <>
##$DPNAME5= <>
##$DPNAME6= <>
##$DPNAME7= <>
##$DPOAL= (0..7)
0.5 0.5 0.5 0.5 0.5 0.5 0.5 0.5 
##$DPOFFS= (0..7)
0 0 0 0 0 0 0 0 
##$DQDMODE= 0
##$DR= 18
##$DS= 0
##$DSLIST= <SSSSSSSSSSSSSSS>
##$DSPFIRM= 0
$$ [...]
##$SUBNAM2= <"">
##$SUBNAM3= <"">
##$SUBNAM4= <"">
##$SUBNAM5= <"">
##$SUBNAM6= <"">
##$SUBNAM7= <"">
##$SUBNAM8= <"">
##$SUBNAM9= <"">
##$SW= 24.9336996594482
##$SWIBOX= (0..15)
0 0 2 0 0 0 0 0 0 0 0 0 0 0 0 0 
##$SW_h= 4990.01996007984
##$TD= 16384
##$TD0= 1
##$TE= 0
##$TE2= 300
##$TE3= 300
##$TEG= 300
##$TL= (0..7)
0 120 120 120 120 120 120 120 
##$TP= (0..7)
150 150 150 150 150 150 150 150 
##$TP07= 0
##$TPNAME0= <>
##$TPNAME1= <>
##$TPNAME2= <>
##$TPNAME3= <>
##$TPNAME4= <>
##$TPNAME5= <>
##$TPNAME6= <>
##$TPNAME7= <>
##$TPOAL= (0..7)
0.5 0.5 0.5 0.5 0.5 0.5 0.5 0.5 
##$TPOFFS= (0..7)
0 0 0 0 0 0 0 0 
##$TUNHIN= 0
##$TUNHOUT= 0
##$TUNXOUT= 0
##$USERA1= <user>
##$USERA2= <user>
##$USERA3= <user>
##$USERA4= <user>
##$USERA5= <user>
##$V9= 5
##$VALIST= <valist>
##$VCLIST= <CCCCCCCCCCCCCCC>
##$VD= 0
##$VDLIST= <DDDDDDDDDDDDDDD>
##$VPLIST= <PPPPPPPPPPPPPPP>
##$VTLIST= <TTTTTTTTTTTTTTT>
##$WBST= 1024
##$WBSW= 4
##$XGAIN= (0..3)
0 0 0 0 
##$XL= 0
##$YL= 0
##$YMAX_a= 94296
##$YMIN_a= -61564
##$ZGOPTNS= <>
##$ZL1= 120
##$ZL2= 120
##$ZL3= 120
##$ZL4= 120
##$ABSF1= 10
##$ABSF2= 0
##$ABSG= 5
##$ABSL= 3
##$ALPHA= 0
##$AQORDER= 0
##$ASSFAC= 0
##$ASSFACI= 0
##$ASSFACX= 0
##$ASSWID= 0
##$AUNMP= <proc_1d>
##$AZFE= 0.1
##$AZFW= 0.1
##$BCFW= 1
##$BC_mod= 2
##$BYTORDP= 1
##$COROFFS= 0
##$CY= 11.3945322036743
##$DATMOD= 1
##$DC= 2
##$DFILT= <>
##$DTYPP= 0
##$F1P= 18.9103706918063
##$F2P= -1.10871071338519
##$FCOR= 0.5
##$FTSIZE= 0
##$FT_mod= 4
##$GAMMA= 1
##$GB= 0.15
##$INTBC= 1
##$INTSCL= 1
##$ISEN= 128
##$LB= 0.24
##$LEV0= 0
##$LPBIN= 0
##$MAXI= 10000
##$MC2= 0
##$MEAN= 0
##$ME_mod= 0
##$MI= 1.114404
##$NCOEF= 0
##$NC_proc= 0
##$NLEV= 6
##$NOISF1= 3.799351
##$NOISF2= 2.8
##$NSP= 1
##$NTH_PI= 0
##$NZP= 0
##$OFFSET= 15.70392
##$PC= 1
##$PHC0= -8662.447
##$PHC1= 18.40097
##$PH_mod= 1
##$PKNL= yes
##$PPARMOD= 0
##$PSCAL= 0
##$PSIGN= 0
##$REVERSE= no
##$SF= 200.130013532006
##$SI= 16384
##$SIGF1= 3
##$SIGF2= 2
##$SINO= 400
##$SIOLD= 16384
##$SREGLST= <1H.CDCl3>
##$SSB= 0
##$STSI= 0
##$STSR= 0
##$SW_p= 3612.71676300578
##$SYMM= 0
##$S_DEV= 0
##$TDeff= 0
##$TDoff= 0
##$TI= <>
##$TILT= no
##$TM1= 0
##$TM2= 0
##$TOPLEV= 0
##$USERP1= <user>
##$USERP2= <user>
##$USERP3= <user>
##$USERP4= <user>
##$USERP5= <user>
##$WDW= 1
##$XDIM= 8192
##$YMAX_p= 0
##$YMIN_p= 0
$$ End of Bruker specific parameters
$$ ---------------------------------
##NTUPLES= NMR FID
##VAR_NAME=  TIME,          FID/REAL,        FID/IMAG
##SYMBOL=    X,             R,               I
##VAR_TYPE=  INDEPENDENT,   DEPENDENT,       DEPENDENT
##VAR_FORM=  AFFN,          ASDF,            ASDF
##VAR_DIM=   8192,          8192,            8192
##UNITS=     SECONDS,       ARBITRARY UNITS, ARBITRARY UNITS
##FACTOR=    0.0002004,     1,               1
##FIRST=     0,             0,               0
##LAST=      1.6414764,     0,               0
##MIN=       0,             -61564,          0
##MAX=       1.6414764,     94296,           0
$$ Real data points
##PAGE= N=1
##DATA TABLE= (X++(R..R)), XYDATA
$$ [...]
$$ plain form
1507 5 472 -217 -104 741 -142 -70 1093 -8 -523 879 322 -929 -110 198 -128 485 -88 -608 443
1526 443 216 -1175 -175 158 -743 -178 446 -597 -436 171 -749 -365 50 -847 -134 724 -404 -738 266
1545 266 -206 -544 268 -192 -321 724 283 -232 562 -191 -463 909 430 -575 484 760 -92 398 473
1564 473 -593 297 726 5 304 454 -396 338 938 -652 -589 569 43 -78 489 -396 -279 519 -473
1583 -473 -674 197 -210 -556 648 7 -1003 193 80 -785 -122 -170 -497 273 288 -1012 -50 458 -746
1602 -746 -275 374 -517 -161 562 -179 -43 338 -450 -51 659 -325 -140 868 90 -154 658 177 -398 442
1622 442 294 -4 819 155 -420 770 409 -624 167 302 -300 239 553 -296 105 42 -579 -235 147 -898
1642 -898 -122 577 -631 -637 244 -483 -744 168 -569 -435 403 -230 -410 184 -327 -690 487 91 -694 409
$$ packed form
1507EM67o89J13Q45q83P2J163j101n15J402n57j251Q19L08l26O13n73n20J051
1526D43k27j391J000L33r01N65O24j043J61O07r20L84M15q97P13Q58j128l34J004
1545B66m72l38Q12m60j29J045m41n15P94p53k72J372m79j005J059K76q52M90P5
1564D73j066Q90M29p21K99J50q50P34O00j590O3J158n26j21N67q85J17P98r92
1583d73k01Q71m07l46J204o41j010J196j13q65O63m8l27P70J5j300R62N08j204
1602g46M71O49q91L56P23p41J36L81p88L99P10r84J85J008p78k44Q12m81n75Q40
1622D42j48k98Q23o64n75J190l61j033P91J35o02N39L14q49M01o3o21L44L82j045
1642h98P76O99j208oQ81p27k61R12p37J34Q38o33j80N94n11l63J177l96p85J103
$$ plain form
1662 409 622 -87 323 49 -514 423 478 -410 358 797 -331 251 672 -430 -234 495 -140 98 524 -253
1682 -253 113 613 -440 -517 449 -124 -568 312 118 -395 150 -171 -727 107 -257 -664 247 11 -795 68
1702 68 125 -952 -412 22 -553 -226 271 -518 -46 155 -742 -373 339 -341 -313 678 13 -126 537 -188 -345
1723 -345 562 -44 -178 841 245 -259 711 309 -496 210 444 -264 311 546 -203 352 253 -575 -67 406
1743 406 -497 2 561 -307 -159 393 -319 -323 250 -352 -128 562 -322 -482 383 -175 -659 191 -110 -410 407
1764 407 58 -493 212 16 -788 144 20 -599 188 447 -491 23 273 -560 -85 241 -373 66 525 -290
1784 -290 -162 535 -297 -279 480 -88 -295 530 113 37 452 14 -305 403 128 -438 472 291 -437 327 166
1805 166 -532 -47 249 -411 19 301 -596 -108 341 -604 -313 251 -481 -278 330 -319 -306 308 -403 -395 299
$$ packed form
1662D09K13p09M10k74n63R37N5q88P68M39j128N82M21j102J96P29o35K38M26p77
1682b53L66N00j053p7R66n73m44Q80j94n13N45l21n56Q34l64m07R11k36q06Q63
1702F8N7j077N40M34n75L27M97p89M72K01q97L69P12o80K8R91o65j39O63p25j57
1723c45R07o06j34J019n96n04R70m02q05P06K34p08N75K35p49N55r9q28N08M73
1743D06r03M99N59q68J48N52p12mN73o02K24O90q84j60Q65n58m84Q50l01l00Q17
1764D07l49n51P05j96q04R32j24o19P87K59r38N14K50q33M75L26o14M39M59q15
1784b90J28O97q32J8P59n68k07Q25m17p6M15m38l19P08k75n66R10j81p28P64j61
1805A66o98M85K96o60M30K82q97M88M49r45K91N64p32K03O08o49J3O14p11QO94
$$ plain form
1826 299 -423 -524 569 9 -429 310 43 -473 181 59 -441 367 532 -99 304 311 -394 244 445 -357
1846 -357 192 746 -49 325 418 -363 -24 561 -209 -139 650 50 -160 579 -194 -494 404 -2 -412 371 -140
1867 -140 -299 372 -140 -727 -74 23 -574 41 29 -630 -3 277 -727 -452 74 -341 106 346 -613 -86
1887 -86 599 -250 -389 183 -175 19 676 -29 -131 650 110 -327 345 47 -186 849 501 -385 323 468
1907 468 -262 298 1 -474 471 664 -389 174 264 -553 178 297 -553 -257 563 -138 -224 267 -581 -222
1927 -222 410 -473 -573 198 -110 -168 151 -409 -626 318 -200 -712 49 251 -192 481 94 -700 6 407
1947 407 -363 68 328 -282 406 606 -377 -291 356 14 235 359 -293 99 849 -56 -364 244 159 70 429
1968 429 -84 -297 447 176 -398 160 -106 -414 442 316 -690 -145 157 -280 -78 -162 -757 146 453 -442
$$ packed form
1826B99p22j01J093n60m38P39k67n16O54j22n00Q08J65o31M03Pp05O38K01q02
1846c57N49N54p95L74R3p81L39N85p70P0P89o00k10P39p73l00Q98m06m10P83n11
1867a40j59O71n12n87O53R7n97O15j2o59O27K80j004K75N26m15M47K40r59N27
1887h6O85q49j39N72l58J94O57p05j02P81n40m37O72k98k33J035l48q86P08J45
1907D68p30N60k97m75R45J93j053N63R0q17P31J19q50K96Q20p01q6M91q48L59
1927b22O32q83j00P71l08n8L19n60k17R44n18n12P61K02m43O73l87p94P06M01
1947D07p70M31K60o10O88K00r83Q6O47l42K21J24o52L92P50r05l08O08q5q9L59
1968D29n13k13P44k71n74N58k66l08Q56j26j006N45L02m37K02q4n95R03L07q95
$$ plain form
1988 -442 -330 144 -299 -39 125 -568 -245 474 -32 -159 184 -182 -292 488 -74 -490 395 270 -9 437
2008 437 -104 -359 571 464 -290 118 409 -52 399 228 -454 208 537 -337 -64 450 58 208 490 -399
2028 -399 -254 375 -150 -168 290 -203 -89 432 -279 -719 29 -90 -316 83 -328 -475 451 81 -860 -270
2048 -270 102 -242 52 22 -593 135 351 -516 -231 18 -298 222 587 -335 -155 591 56 -23 68 -375 2
2069 2 813 101 -258 313 222 110 445 -275 -418 705 560 -142 161 113 -209 429 139 -702 -48 429 -77
2090 -77 201 41 -775 -48 372 -419 -507 56 -82 59 283 -461 -620 418 -278 -541 -49 -335 -201 448
2110 448 -36 -735 15 154 -248 193 -21 -249 373 227 -429 21 107 -135 291 553 -186 91 352 -124
2130 -124 45 334 -375 -12 717 59 27 372 37 -127 403 -149 -302 293 43 -121 353 -39 -510 127
$$ packed form
1988d42J12M74m43K60J64o93L23P19n06j27L43l66j10P80n62m16Q85j25k79M46
2008D37n41k55R30j07p54M08K91m61M51j71o82O62L29q74K73N14l92J50K82q89
2028c99J45O29n25j8M58m93J14N21p11m40P48j19k26L99m11j47R26l70r41N90
2048b70L72l44K94l0o15P28K16q67K85K49l16N20L65r22J80P46n35p9R1m43L77
2069BQ11p12l59N71r1j12L35p20j43J123j45p02L03m8l22O38k90q41O54M77n06
2090g7K78j60q16P27M20p91q8N63j38J41K24p44j59J038o96k63M92k86J34O49
2110D48m84o99P50J39m02M41k14k28O22j46o56M50Q6k42M26K62p39K77K61m76
2130a24J69K89p09L63P29o58l2L45l35j64N30n52j53N95k50j64M74l92m71O37
$$ plain form
2150 127 82 -537 -2 133 -297 -26 40 -431 78 54 -503 -97 336 -300 -220 270 -156 -285 109 -304 -121
2171 -121 342 18 -272 410 -64 -213 412 -49 -391 258 301 -10 353 -62 -290 535 275 -312 164 376
2191 376 -131 257 284 -319 -86 317 -266 -202 233 -198 64 397 -256 -410 156 -235 -245 222 -115 -363 152
2212 152 -39 -451 78 -299 -456 242 -54 -443 55 183 -286 -98 -69 -455 110 325 -253 -4 332 -258
2232 -258 28 245 -375 16 592 38 -127 440 27 -91 465 -87 -49 546 164 -112 441 208 -311 154
2252 154 99 -199 423 100 -266 332 246 -317 67 -57 -419 -10 249 -255 -209 211 -418 -202 -79 -468 -282
2273 -282 118 -213 -206 279 -289 -431 -10 -170 -524 112 41 -188 285 37 -306 150 -66 -395 194 149 -119
2294 -119 215 399 -283 96 279 -55 15 308 -173 86 520 -248 -219 371 -49 -97 242 -121 -37 298 -243
$$ packed form
2150A27m5o19N35J35m30K71O6m71N09k4n57M06M33o36Q0M90m26j29L94m13J83
2171a21M63l24k90O82m74j49O25m61l42O49M3l11L63m15k28Q25k60n87M76K12
2191C76n07L88K7o03K33M03n83O4M35m31K62L33o53j54N66l91j0M67l37k48N15
2212A52j91m12N29l77j57O98k96l89M98J28m69J88K9l86N65K15n78K49L36n90
2232b58K86K17o20L91N76n54j65N67m13j18N56n52L8N95l82k76N53k33n19M65
2252A54n5k98O22l23l66N98q6n63L84j24l62M09K59n04M6M20o29K16J23l89J86
2273b82M00l31PM85n68j42M21j60l54O36p1k29M73k48l43M56k16l29N89m5k68
2294a19L34J84o82L79J83l34P0K93m81K59M34p68K9N90m20m8L39l63Q4L35n41
$$ plain form
2315 -243 -367 188 -91 -289 125 -76 -230 162 73 -449 -25 1 -350 -11 33 -350 164 284 -392 -80 363
2336 363 -295 46 176 -166 65 526 68 -187 429 -10 -49 452 106 38 475 23 -240 307 161 -152 242
2357 242 193 -152 446 73 -194 129 74 -383 130 263 -204 56 155 -282 -87 87 -257 -111 185 -350 -124
2378 -124 241 -265 -404 170 -269 -478 180 -128 -245 122 -135 -410 96 -129 -467 57 160 -284 20 -12
2398 -12 -389 52 124 -401 57 287 -112 89 346 -207 -7 355 -190 -71 522 62 14 404 -117 102 431
2419 431 -12 -275 291 76 -164 299 94 -52 293 69 -336 281 302 -123 250 262 -173 36 174 -324 -4
2440 -4 380 -158 73 242 -200 -43 256 -383 -162 436 -127 -74 360 -35 -312 115 -88 -215 226 102 -85
2461 -85 336 155 -282 210 210 -144 342 148 -114 269 487 -235 83 296 -81 54 313 -116 -20 447 -172
$$ packed form
2315b43j24N55k79j98M14k01j54L92q9n22M24K6l51L39M4l83N14J20o76L12M43
2336C63o58L41J30l42K31M61m58k55O16m39l9N01l46o8M37m52k63N47j46l13L94
2357B42m9l45N98l73k67L23n5m57N13J33m67K60R9m37J95J74l44J46K96n35K26
2378a24L65n06j39N74m39k09O58l08j17L67k57k75N06k25l38N24J03m44L04l2
2398a2l77M41P2n25M58K30l99K01K57n53K00L62n45J19N93m60m8L90n21K19L29
2419D31m43k63N66k15k40M63k05j46L45k24m05O17K1m25L73J2m35K09J38m98L20
2440dL84n38K31J69m42J57K99o39K21N98n63N3M34l95k77M27k03j27M41j24j87
2461h5M21j81m37M92%l54M86j94k62L83K18p22L18K13l77J35K59m29R6M67o19
$$ plain form
2482 -172 -157 109 -304 -203 152 -270 -187 237 -139 -458 98 -291 -436 108 -119 -416 137 -10 -379 -81 -190
2503 -190 -303 36 85 -230 208 283 -278 -38 138 -126 107 309 -67 119 522 -37 -16 448 130 155 372
2524 372 82 -91 583 142 -217 288 159 -17 386 151 18 307 148 -82 53 194 -224 -16 408 -147
2544 -147 72 193 -385 -39 125 -279 -220 215 -164 16 115 -295 -238 175 -177 -221 -40 -137 -137 329 -177 -369
2566 -369 148 12 -203 -6 61 -139 163 269 -298 142 85 -311 -14 220 -138 133 480 -58 -1 302 -153
2587 -153 -52 355 28 90 287 -114 -199 213 -161 -408 261 49 -311 227 39 -278 243 -84 -540 7 96
2608 96 -240 67 -21 -349 6 181 -393 -183 224 40 36 -19 -295 -116 335 -241 -352 194 110 -43 247 -52
2630 -52 -113 442 38 -175 151 153 38 383 61 -224 225 192 -172 206 183 -47 144 320 -126 4 259 -254
$$ packed form
2482a72J5K66m13J01L55m22Q3M24l76l19N56l89j45N44k27k97N53j47l69K98j09
2503a90j13L39M9l15M38P5n61K40J76k64K33K02l76J86M03n59K1M64l18K5K17
2524C72k90j73O74m41l59N05j29j76M03k35j33K89j59k30J35J41m18K08M24n55
2544a47K19J21n78L46J64m04N9M35l79J80R9m10N7M13l52m4J81r7%M66n06j92
2566c69N17j36k15J97O7k00L02J06n67M40n7l96K97K34l58K71L47n38N7L03m55
2587a53J01M07l27O2J97m01q5M12l74k47O69k12l60N38j88l17N21l27m56N47Q9
2608I6l36L07q8l28L55J75n74K10M07j84mn5k76J79M51n76j11N46q4j53K90k99
2630e2o1N55m04k13L26Kj15L45l22k85M49l3l64L78k3k30J91J76m46J30K55n13
$$ plain form
2652 -254 0 341 -110 -3 393 -96 -71 84 -315 -205 57 -125 -246 209 -77 -353 -21 -170 -308 157
2672 157 74 -386 102 -40 -321 58 -84 -371 164 246 -263 -40 161 -43 129 210 -339 37 459 -46 31
2693 31 270 198 154 269 -120 -161 442 184 -50 278 35 -167 146 16 -260 128 78 -215 123 55 -306 -14
2715 -14 40 -479 -35 132 -425 47 276 -218 -76 144 -104 -173 101 -298 -97 323 -148 -228 59 -176 -43
2736 -43 278 -90 -311 385 169 -254 -34 27 -242 328 101 -171 438 349 -184 55 220 -141 151 67 -218
2757 -218 148 370 -117 -47 195 -198 -15 283 -209 2 281 -86 -185 122 -74 -282 11 -155 -192 297 -24
2778 -24 -311 70 -8 -325 58 63 -194 179 178 -274 46 235 -217 -192 171 -123 -4 247 -243 28 260 15
2800 15 -109 120 -76 126 527 72 -131 385 182 -102 179 96 -66 443 75 -270 231 195 -263 62 92
$$ packed form
2652b54K54L41m51J07L96m89K5J55l99J10K62j82j21M55k86k76L32j49j38M65
2672A57q3m60M88j42k81L79j42k87N35Q2n09K23K01k04J72Q1n49L76M22n05P7
2693C1K39p2m4J15l89m1O03k58k34L28k43k02L13j30k76L88n0k93L38o8l61K92
2715a4N4n19M44J67n57M72K29m94J42K20k48o9K74l99K01M20m71q0K87k35J33
2736d3L21l68k21O96k16m23K20O1k69N70k27k72O09q9n33K39J65l61K92q4k85
2757b18L66K22m87P0K42l93J83K98m92K11K79l67r9L07j96k08K93j66l7M89l21
2778b4k87L81p8l17L83Nk57L73jm52L20J89m52K5L63k94J19K51m90K71K32k45
2800A5j24K29j96K02M01m55k03N16k03k84K81q3j62N09l68l45N01l6m58L25L0
$$ plain form
2821 92 -194 242 172 -342 -47 98 -263 -246 139 -303 -137 92 -310 -166 124 -224 -351 73 -134 -326 165
2842 165 -201 -218 116 -37 -322 -49 55 -231 79 99 -281 205 127 -362 23 53 -119 142 305 -162 193
2863 193 211 -261 -8 168 -26 41 228 -92 -104 314 -77 -5 245 26 -154 210 100 -87 195 47 -204
2884 -204 211 252 -105 156 97 -162 131 20 -362 30 270 -247 66 134 -129 -61 93 -286 -189 191 -88 -19
2906 -19 86 -187 -95 258 -228 -354 185 -35 -208 187 99 -169 176 -15 -258 162 183 -149 162 231 84 168
2928 168 20 -292 84 80 -232 -2 235 -192 -179 124 -372 -206 186 -193 -160 -35 -130 -99 -14 -181 -397 166
2950 166 -148 -188 98 98 -357 99 -59 -248 43 -40 -166 -57 110 -288 -160 32 -180 -114 258 -209 87 417
2972 417 10 -25 106 -108 37 373 62 77 381 299 75 280 132 -92 293 195 -5 311 248 5 194 80
$$ packed form
2821I2k86M36p0n14K95J45l61J7L85m42J66K29m02J44K90l48j27M24k07j92M91
2842A65l66j7L34j53k85K73J04k86L10K0l80M86p8m89L85L0j72K61J63m67L55
2863A93J8m72K53J76j94O7J87l20j2M18l91P2K50k19j80L64j10j87K82j48k51
2884b04M15M1l57K61n9k59K93j11l82L92K40n17L13O8k63O8J54l79R7L80k79O9
2906a9J05k73R2L53m86j26N39k20j73L95q8k68L45j91k43M20K1l32L11O9j47Q4
2928A68j48l12L76ml12K30K37m27J3L03m96J66L92l79L3J25r5L1Q5j67k16N63
2950A66l14m0K86%m55M56j58j89K91q3j26J09J67l98J28J92k12O6L72m67K96L30
2972D17m07l5J31k14J45L36l11J5L04q2k24K05j48k24L85r8k00L16o3k43J89j14
$$ plain form
2994 80 -221 63 138 -312 51 232 -178 -108 71 -261 -106 32 -362 -139 183 -277 -241 79 -275 -391 37
3015 37 -164 -199 183 -115 -228 73 -17 -355 6 97 -185 202 177 -141 178 137 -196 148 260 -122 147 263
3037 263 -224 -33 249 -126 -84 141 -116 -15 218 -53 -114 132 -168 -220 137 -162 -230 136 -43 -339 70
3058 70 -87 -378 -119 85 -291 123 143 -314 217 78 -233 76 169 -125 118 324 -112 110 270 -34 0
3079 0 220 -8 63 460 113 6 306 23 -67 153 108 84 229 227 -48 252 157 -354 140 70 -93 51 165
3102 165 -205 101 156 -273 -141 106 -190 31 276 -199 -138 229 -210 -133 94 -188 -207 205 -96 -86 169 -201
3124 -201 -301 14 -73 -294 122 17 -166 131 25 -318 -94 174 -227 48 175 -186 -6 167 -181 -70
3144 -70 279 -101 -32 92 -60 85 160 -182 -169 209 -64 -185 254 40 -133 263 -41 -170 184 110 -132 88
$$ packed form
2994H0l01K84P5m50L63J81m10P0J79l32J55J38l94K23L22m60L6L20l54j16M28
3015C7k01l5L82k98j13L01r0l38L61R1k82L87k5l18L19m1l33L44J12l82K69J16
3037B63m87J91K82l75M2K25k57J01K33k71o1K46l00n2L57k99o8L66j79k96M09
3058G0j57k91K59K04l76M14K0m57N31j39l11L09R3k94K43K06m36K22J60l04L4
3079@K20k28P1L97l47j07L00k83r0K20m5k4J45kk75L00r5n11M94p0j63J44J14
3102A65l70L06N5m29J32K47k96K21K45m75O1L67m39P7K27k82j9M12l01J0K55l70
3124b01j00L15q7k21M16j05j83K97j06l43K24K68m01K75J27l61J80J73l48J11
3144g0L49l80O9J24j52J45P5l42J3L78k73j21M39k14j73L96l04j29L54p4k42K20
$$ plain form
3166 88 173 -158 117 232 -175 -19 102 -247 86 221 -169 -13 45 -212 -184 64 -185 -84 100 -36 -134 155
3188 155 -59 -125 225 -37 -133 183 74 -193 109 -1 -193 67 153 -106 233 263 -55 42 122 -149 166 271
3210 271 -57 105 229 -79 -45 248 -72 -102 130 -76 -76 324 -33 -226 102 -152 -230 -60 -174 -292 97 -85
3232 -85 -210 22 -85 -212 32 -66 -257 33 10 -167 57 0 -264 17 99 -89 26 215 -179 102 127 -115
3254 -115 -10 300 -67 -12 362 -21 6 256 91 -187 128 92 -112 267 135 -21 143 68 -157 109 65 -286
3276 -286 81 177 -271 -23 39 -133 -40 124 -227 -85 126 -127 -106 8 -264 -145 85 -173 -235 111 -33 -135
3298 -135 204 -58 -207 13 -83 -155 241 67 -144 165 149 -139 76 89 -95 50 157 -85 -4 152 -227 -23
3320 -23 107 11 39 256 -52 -51 289 -72 -193 159 -37 -87 122 -17 -129 51 22 -221 49 -35 -159 168 118
$$ packed form
3166H8Q5l31K75J15m07J56J21l49L33J35l90J56N8k57K8K48k49J01J84j36r8K89
3188A55k14o6L50k62r6L16j09k67L02j10j92K60Q6k59L39L0l18R7Q0k71L15J05
3210B71l28J62J24l08L4K93l20l0K32k06%M00l57j93L28k54p8J70j14j18L89j82
3232h5j25K32j07j27K44r8j91K90k3j77K24n7k64K81Q2j88J15J89l94K81K5k42
3254a15J05L10l67N5L74l83K7K50j65k78L15l6k04L79j32j56J64p5k25K66m4l51
3276b86L67R6m48K48O2j72R3J64l51J42K11k53K1J14k72J19K30k58o2L46j44j02
3298a35L39k62j49K20r6p2L96j74k11L09j6k88K15J3j84J45J07k42Q1J56l79K04
3320b3J30r6K8K17l08JL40l61j21L52j96n0K09j39j12J80k9k43K70q4j24L27n0
$$ plain form
3343 118 -258 -39 91 -182 -1 56 -212 -49 193 -107 -6 70 -169 -2 153 -165 -187 172 -72 15 136
3364 136 9 -61 193 23 -140 217 149 -75 180 156 -214 133 133 -133 162 179 -199 111 162 -161 37 115 -139
3387 -139 -65 109 -135 -20 140 -229 -162 21 -132 -19 175 96 -107 125 -126 -289 94 -154 -124 115 31 -104
3409 -104 109 31 -236 -17 18 -121 5 80 -109 114 122 -229 -1 154 -131 77 186 -43 32 77 -14 -22 221
3432 221 -90 62 395 16 -37 211 18 -133 198 68 -61 338 132 -141 132 8 -141 6 54 -41 -85
3453 -85 84 -135 -1 92 -198 -111 34 -282 -149 119 -198 -109 -32 -192 -161 56 -147 -144 79 72 -107 70 42 -144
3477 -144 69 112 -89 159 255 -163 221 57 -81 132 6 -145 191 183 -71 23 304 -85 -19 145 -98 -20
3499 -20 197 -69 -65 116 -77 12 108 -87 -115 128 -2 -231 179 -53 -188 105 52 -236 91 77 -160 8 53
$$ packed form
3343A18l76K19J30k73J81N7k68J63K42l00J01P6k39J67J55l18k2L59k44Q7J21
3364A36j27p0K54j70j63L57o8k24K55k4l70L47%k66K95J7l78L10N1l23J98P8k54
3387a39P4J74k44J15J60l69O7J83j53J13J94p9k03K32k51j63L83k48L0K39q4j35
3409a04K13p8k67K19L5j39J26P5j89K23Ql51K28J55k85K08J09k29P5M5r1qK43
3432B21l11J52L33l79n3K48j93j51L31j30j29L99k06k73K73j24j49J47M8r5m4
3453h5J69k19J34R3k90Q7J45l16J33K68l17Q9P7j60L1K17k03LK23pj79J77k8j86
3477a44K13M3k01K48R6m18L84j64j38K13j26j51L36qk54R4K81l89O6J64k43P8
3499b0K17k66MJ81j93Q9R6j95k8K43j30k29M10k32j35K93n3k88L27j4k37J68M5
$$ plain form
3522 53 -115 38 -40 -253 112 41 -128 37 305 68 23 243 -75 9 218 75 -123 201 178 -32 276 107
3544 107 -88 326 221 -89 200 106 -43 72 96 -151 11 62 -74 -25 13 -213 -118 -148 -209 -135 90 -80 -75 163
3568 163 -163 -191 -17 -113 -81 131 -77 -140 84 35 13 84 -23 -254 85 31 -137 210 291 -137 -80 60 -236
3591 -236 133 183 -110 16 77 -48 -165 19 -116 19 33 -21 68 43 -70 -90 83 -55 27 300 73 -62 150
3614 150 53 -105 60 7 -88 173 56 -8 147 41 -246 41 10 -175 42 129 -92 12 72 -164 -74 86 -76
3637 -76 -63 213 -105 -18 219 -44 -68 40 -142 -117 81 -34 -13 117 -123 -51 202 36 -218 135 196 -120 220
3660 220 91 -104 -108 80 -123 44 37 28 19 83 -157 -3 98 -219 -70 124 10 -60 143 72 -59 -38 -76 -94 166
3685 166 -55 -56 161 -34 -246 -114 -22 -164 -45 64 -195 -59 101 -123 20 40 -129 41 118 -112 -72 154
$$ packed form
3522E3j68J53p8k13L65p1j69J65K68k37m5K20l18Q4K09j43j98L24k3k10L08j69
3544A07j95M14j05l10K89r4j49J15K4k47J62N1j36M9L8k26R5l0o1P4K25j70NK38
3568A63l26k8J74r6L2K12k08o3K24m9k2P1j07k31L39n4j68L47Q1m28N7J40k96
3591b36L69N0k93J26O1j25j17J84j35J35J4n4Q9k5j13k0J73j38Q2K73k27j35K12
3614A50r7j58J65n3r5K61j17o4J55j06k87K87l1j85K17Q7k21J04O0k36R0J60j62
3637g6J3K76l18Q7K37k63k4J08j82K5J98j15K1J30k40P2K53j66k54L53O1l16L40
3660B20j29j95mJ88k03J67prrO4k40J54J01l17J49J94j14p0K03p1j31K1l8j8K60
3685A66k21jK17j95k12J32R2j42J19J09k59J36J60k24J43K0j69J70P7k30M0K26
$$ plain form
3707 154 19 -109 35 -13 2 358 -79 37 282 165 21 70 33 123 250 165 -28 142 96 -41 197 105 -138
3730 -138 10 142 -173 37 160 -224 -83 12 -185 -30 90 -162 -73 143 -252 -150 39 -70 -151 170 -59
3751 -59 -193 104 118 -61 -24 34 -102 131 153 -108 158 63 -97 -42 99 -203 58 122 -84 18 109 21 -7 59
3775 59 -20 31 219 15 82 91 -12 -40 -16 -117 -127 6 -50 -24 95 75 -233 -66 -38 -182 -32 63 -131 60 11
3800 11 -258 52 -74 -157 31 186 -44 13 206 -84 56 -20 3 -3 182 -105 -7 157 25 -119 184 -100 -65
3823 -65 201 52 51 62 87 -135 142 140 -105 148 86 -72 54 130 -120 29 -3 -104 -68 30 -92 15 4 -104
3847 -104 -129 -72 -149 -161 65 -146 2 102 -50 -250 68 19 -94 9 33 -96 -11 -28 -107 75 1 -120 -105 67
3871 67 -131 -56 166 -133 27 120 -173 17 108 -23 66 89 43 0 309 -73 -43 206 -56 -43 263 -15 -127
$$ packed form
3707A54j35j28J44m8J5L56m37J16K45j17j44M9l7R0J27q5j93J70m6j37K38r2k43
3730a38J48J32l15K10J23l84J41R5j97J55J20k52Q9K16l95J02J89j09q1L21k29
3751e9j34K97J4j79L7N8j36K33K2k61K66r5j60N5J41l02K61O4k06J02R1q8k8O6
3775E9p9N1J88k04O7Rj03k8K4j01j0J33n6K6J19k0l08J67K8j44J50R5j94J91m9
3800A1k69L10j26q3J88J55k30N7J93k90J40p6K3oJ85k87R8J64j32j44L03k84L5
3823f5K66j49jJ1K5k22K77kk45K53o2j58J26P6k50J49l2j01L6R8j22J07j1j08
3847a04k5N7p7j2K26k11J48J00j52k00L18m9j13J03K4j29Q5j7p9J82p4j21J5J72
3871F7j98P5K22k99J60R3k93J90R1j31Q9K3m6m3L09l82L0K49k62J3L06k78j12
$$ plain form
3894 -127 121 34 -8 130 19 -98 138 -65 2 -111 27 -42 9 151 -125 -17 181 -135 -65 24 -156 -56
3916 -56 30 14 -54 231 -10 -18 47 -17 -26 88 83 -59 99 19 25 191 -98 -89 125 46 0 75 -25 -52 123 110 -103
3943 -103 -115 189 -36 67 151 -33 13 46 -85 -180 199 -23 -19 164 -75 -173 145 -202 -141 58 -88 -1 16 -2
3967 -2 -219 66 -129 -228 6 99 -188 69 79 -230 -8 35 -150 -38 84 -125 -17 133 -14 -30 166 -157
3989 -157 -110 20 0 34 158 -52 -27 80 -137 -88 96 114 -62 160 61 -27 9 25 -62 111 -28 -93 12 105
4013 105 -130 -13 -6 -133 65 183 -21 -52 144 -83 -126 68 -92 -76 60 -117 -133 149 90 -189 72 -10 -138
4036 -138 131 -98 -238 76 95 -96 147 16 -287 123 59 -37 5 61 -148 27 135 -136 61 147 -146 -64
4058 -64 120 20 -29 198 -168 -157 -16 80 -49 133 9 6 2 21 -137 -51 89 -95 117 -47 -140 -36 155 -199
$$ packed form
3894a27K48q7m2J38j11j17K36k03O7j13J38o9N1J42k76J08J98l16P0Q9j80J00
3916e6Q6j6o8K85k41qO5o4rJ14nj42J58q0OJ66k89RK14p9m6P5j00k7J75j3k13
3943a03j2L04k25J03Q4j84M6L3j31r5L79k22MJ83k39r8L18l47O1J99j46Q7J7j8
3967bk17K85j95r9K34R3k87K57J0l09K22M3j85J12J22k09J08J50j47j6J96l23
3989a57M7J30k0L4J24k10K5J07k17M9J84J8j76K22r9q8L6J6q7J73j39o5J05R3
4013A05k35J17Pj27J98J18k04l1J96k27m3J94j60J6J36j77j6K82n9k79K61q2j28
4036a38K69k29j40L14J9j91K43j31l03M10o4r6M2N6k09J75J08k71J97Q6k93Q2
4058f4J84j00m9K27l66J1J41R6j29J82j24lmJ9j58Q6J40j84K12j64r3J04J91l54
$$ plain form
4082 -199 -26 14 -69 86 26 -59 -57 105 -132 -144 95 8 -39 221 112 -84 186 -117 -161 84 103 -5 114 130
4106 130 -6 77 4 -126 48 105 -71 4 99 -99 107 81 -105 71 50 10 -94 80 -81 -101 36 -13 23 112
4130 112 -45 -60 66 -96 -120 7 -68 -110 51 -149 -244 168 83 -136 27 34 -125 2 183 -124 5 64 8
4153 8 95 33 21 -66 152 -7 131 280 -86 49 126 -27 -150 219 43 -58 139 -65 -173 233 -18 -112 170
4176 170 116 -103 95 70 -151 106 27 -83 93 149 -79 -3 52 -91 71 14 -50 22 64 -204 -138 114 -63 -14
4200 -14 162 39 6 8 -69 -43 74 -13 -46 -53 36 -108 75 -50 -9 213 120 -134 -46 77 -18 121 100 -228 70
4225 70 115 -188 33 89 -187 17 113 34 23 212 -53 -110 139 -21 -38 -14 76 -22 103 52 -122 -58 -52 -55 23 110
4251 110 21 64 -185 -186 -2 -63 -161 -140 16 -263 98 11 -11 54 33 -58 18 194 35 -18 178 59 -37 141 -82
$$ packed form
4082a99J73M0q3J55o0q5KJ62k37j2K39q7m7K60j09j96K70l03m4K45J9j08J19J6
4106A30j36Q3p3j30J74N7j76P5R5j98K06k6j86J76k1m0j04J74j61k0J37m9L6Q9
4130A12j57j5J26j62k4J27p5m2J61k00r5M12q5k19J63Pj59J27J81l07J29N9n6
4153HQ7o2j2q7K18j59J38J49l66J35P7j53j23L69j76j01J97k04j08M06k51r4K82
4176A70n4k19J98k5k21K57p9j10J76N6k28P6N5j43J62n7o4P2M2k68O6K52j77M9
4200a4J76j23l3Kp7K6J17q7l3pQ9j44J83j25M1K22r3k54Q8J23r5J39k1l28K98
4225G0M5l03K21N6k76K04R6p9j1J89k65n7K49j60j7K4R0r8J25n1j74O4OlP8Q7
4251A10q9M3k49jJ84o1r8K1J56k79L61q7k2O5k1r1P6J76j59n3J96j19r6J78k23
$$ plain form
4276 -82 14 128 80 -38 70 104 12 134 157 -64 128 87 -81 104 107 19 -76 -46 -82 -42 1 -98 -4 -24 -152 -2
4302 -2 -22 -100 -58 -10 -28 40 97 -6 -89 63 -228 -72 -44 27 -89 121 -80 78 57 -39 -68 114 33 -33 125 158
4328 158 -18 -152 67 -24 -47 86 -117 -2 31 -94 85 184 131 -19 152 -167 22 122 30 -124 166 75
4350 75 -170 5 24 1 191 111 9 127 18 -187 46 38 -132 9 50 -70 -76 136 -56 -13 114 -132 -40 57
4374 57 -179 -124 31 -205 -60 105 29 -56 59 35 -98 136 -23 -133 106 87 8 85 49 -91 138 22 -178
4397 -178 93 104 -38 78 210 -79 104 -73 -166 -59 -14 -2 -53 18 -51 -54 16 -75 6 54 -14 -30 113 -198 -62
4422 -62 105 -177 -72 -10 -9 -137 3 55 15 25 104 -59 -128 11 -13 -188 60 -6 110 115 -78 41 174 -20
4446 -20 18 137 -123 22 72 77 -109 161 126 -23 54 142 31 139 137 -84 83 78 -139 84 42 -145 107 -13
$$ packed form
4276h2R6J14m8j18J08L4r2J22K3k21J92m1j68J85Lq8r5L0l6M0M3r9R4k0j28J50
4302bk0p8M2M8j8O8N7j03q3J52k91J56K8P1j16K10k01J58k1r6k9J82q1o6J58L3
4328A58j76j34K19r1k3J33k03J15L3j25J79R9n3j50J71l19J89J00r2j54K90r1
4350G5k45J75J9k3J90q0j02J18j09k05K33qj70J41M1j20oK12j92M3J27k46R2R7
4374E7k36N5J55k36J45J65p6q5J15k4j33K34j59j10K39j9p9P7l6j40K29j16k00
4397a78K71J1j42J16J32k89J83j77r3J07M5J2n1P1o9lP0r1Q1M8o8j6J43l11J36
4422f2J67k82J05O2Jj28J40N2m0J0P9j63o9J39k4j75K48o6J16Nj93J19J33j94
4446b0L8J19k60J45N0Nj86K70l5j49P7Q8j11J08kk21J67nk17K23m2j87K52j20
$$ plain form
4470 -13 -243 -73 -41 -174 -18 121 -38 31 33 10 -69 -89 -87 -135 55 -159 -161 21 -94 -91 10 -3 -90 102 -74 -144
4496 -144 104 70 -84 150 75 16 -6 43 -102 52 156 -3 -121 120 8 54 236 -79 29 158 18 -59
4518 -59 78 -65 -110 98 -158 -54 59 -35 -218 183 -49 -118 62 56 -24 29 -58 -196 -86 -76 -89 36 60 -158
4542 -158 -11 -48 -70 -124 9 -53 -80 23 -52 -22 91 -146 -27 -7 -100 -78 63 61 -121 117 69 -36 58 38 5
4567 5 80 63 -51 -26 77 -124 7 -5 18 36 64 -91 46 -18 -41 -68 68 -16 -129 63 -115 11 -18 7 -209
4592 -209 23 15 -89 22 25 -73 116 78 -107 15 -67 -65 71 34 -37 90 17 -46 91 23 -16 15 17 14 -11 70 -13 90
4620 90 68 15 1 85 44 -65 96 -77 -66 64 -24 12 60 91 -175 7 57 -243 -122 57 -24 61 112 -263 -38
4645 -38 30 -117 -16 -20 -160 26 134 -52 -69 -6 -178 -140 34 12 -100 141 93 51 219 -88 -51 26 -130 -64
$$ packed form
4470a3k30J70L2j33J56J39j59O9Kk3p9k0Km8J90k14kJ82j15LJ01j3q7J92j76p0
4496a44K48l4j54K34p5n9k2M9j45J54J04j59j18K41j12M6J82l15J08J29j40p7
4518e9J37j43m5K08k56J04J13r4j83M01k32o9J80oq0N3q7j38J10J0j3J25K4k18
4542a58J47l7k2n4J33o2k7J03p5L0J13k37J19K0r3K2J41kj82K38m8j05R4k0l3
4567EP5j7j14K5J03k01J31j2K3J8K8j55J37o4k3k7J36q4j13J92j78J26k9K5k16
4592b09K32qj04J11Lr8J89l8j85J22q2KJ36l7p1J27p3o3J37o8l9L1Klk5Q1q3J03
4620I0k2n3j4Q4m1j09J61j73J1J30q8L6M8L1k66J82N0l00J21J79q1Q5N1l75K25
4645c8O8j47J01mj40J86J08j86j7O3j72L8J74k2j12K41m8m2J68l07L7P7j56O6
$$ plain form
4669 -64 42 159 -10 38 43 -54 -28 65 7 47 100 9 5 39 -57 83 -78 -75 19 6 -125 -94 113 -51 38 77 10 -151
4697 -151 90 -29 -94 192 -69 -48 -22 -72 -107 143 -35 -189 61 -12 -181 117 226 15 1 114 -3 -3 67
4720 67 -43 -43 82 -123 -60 15 53 56 123 -69 78 122 -36 -68 77 29 -102 71 -66 -64 71 69 -234 43 -43 -170
4746 -170 -33 -15 18 -33 -15 -72 19 -7 -57 50 -25 -115 -2 13 -120 -87 0 8 -15 45 -112 -63 -2 -77 -111 37 -69
4773 -69 -46 14 125 -155 24 87 -40 -38 -31 -47 93 92 -170 48 28 40 99 133 -21 -28 154 -92 -5 97 55 15 76
4800 76 -156 13 40 -23 -152 44 -145 -94 91 -21 -82 10 25 -58 -170 -43 -207 86 -37 -106 61 28 -75
4823 -75 -60 71 -38 -62 -18 -30 -136 61 23 39 24 -47 22 -14 69 98 129 -48 -81 156 -15 78 133 75 -40 137
4849 137 -30 -137 -32 -65 -168 159 75 22 20 -92 -34 -67 31 -75 -12 41 -12 10 29 -83 -142 179 -47 -120 63
$$ packed form
4669f4J06J17j69M8Nr7K6R3n8M0N3r1mL4r6J40j61LR4j3j31L1K07j64Q9L9o7j61
4697a51K41j19o5K86k61K1K6n0l5K50j78j54K50p3j69K98J09k11j4J13j17%P0
4720F7j10%J25k05O3P5L8LO7j92J47M4j58l2J45m8j31J73j37KJ35kl03K77q6j27
4746a70J37J8L3n1J8n7R1k6n0J07p5r0J13J5j33L3Q7Qk3O0j57M9O1p5l4J48j06
4773f9K3O0J11k80J79O3j27KPj6J40jk62K18k0J2N9L4j54pJ82k46Q7J02m2m0O1
4800G6k32J69K7o3j29J96j89N1J85j12o1R2J5q3j12J27j64K93j23o9J67l3j03
4823g5J5J31j09k4M4j2j06J97l8J6j5p1O9l6Q3K9L1j77l3K37j71R3N5n8j15J77
4849A37j67j07J05l3j03L27q4n3kj12N8l3R8j06O3N3n3K2J9j12n9L21k26p3J83
$$ plain form
4874 63 -52 22 22 45 -68 58 91 64 16 62 -79 30 8 -86 79 145 -24 147 57 -145 35 166 38 -1 56
4899 56 -31 10 95 28 -68 74 -2 135 102 88 -138 123 39 -79 119 -71 -109 4 26 -71 85 -2 -158 57 -45
4924 -45 -81 -4 -1 -70 -25 63 -210 42 24 -84 -64 -24 -88 -27 49 41 -84 89 -72 -19 19 -48 -76 42 23 49 119 12
4952 12 6 22 33 -99 143 41 20 -31 38 -62 30 156 61 -69 -54 -22 3 -2 -11 -4 41 -96 5 80 22 -7 58 -82
4980 -82 -224 -62 -138 -42 -49 47 -2 -2 14 -18 -9 -78 -55 -72 59 -50 66 20 -46 124 -66 -63 71 -20 100 95 23 -102
5008 -102 -67 131 -8 -39 21 -57 -28 66 55 -42 120 3 -59 14 75 -31 166 12 -87 26 33 -59 66 38 -165
5033 -165 63 -43 -77 19 59 -116 4 90 2 -47 -61 -162 -108 107 -118 -127 102 10 -80 -63 -91 33 67 -62 -87
5058 -87 122 -42 -13 111 56 -33 72 59 -4 103 72 -73 55 81 62 -112 -1 54 65 57 40 89 62 -56 -9 17
$$ packed form
4874F3j15P4%K3j13J26L3k7m8M6j41J09k2r4J65O6j69J71r0k02J80J31j28l9N7
4899E6q7M1Q5o7r6J42p6J37l3j4k26K61q4j18J98j90l8J13K2r7J56q7j56K15j02
4924d5l6P7Lo9M5Q8k73K52j8j08K0M0o4O1P6qj25J73j61N3L8o7k8J18j9K6P0j07
4952A2oJ6J1j32K42j02k1n1O9j00R2J26r5j30J5L2K5nrPM5j37J01P5n8k9O5j40
4980h2j42J62p6R6pR6m9%J6l2Ro9K3j7J31j09J16m6o6J70j90LJ34r1J20np2j25
5008a02L5J98j39l1O0p8K9R4j1r7J62j17o2P3O1j06J97j54r9J13Pr2J25k8k03
5033a65K28j06l4R6M0j75J20Q6q8m9j4j01N4K15k25rK29r2r0J7k8J24L4j29k5
5058h7K09j64K9J24n5q9J05j3o3J07l1j45J28K6j9j74J11N5J1qj7M9k7j18M7K6
$$ plain form
5084 17 98 -65 78 -59 -104 18 -43 -121 140 2 -124 56 -94 -115 84 -2 -40 64 23 -137 -19 44 -42 -93
5108 -93 -61 12 -26 12 -139 -115 -20 -47 101 33 52 -69 9 8 2 155 -38 23 151 -16 61 1 61 -79 30 95 4
5135 4 166 44 -49 9 -59 -102 -42 85 -104 65 69 -19 -76 83 -78 -77 55 7 -183 140 32 -69 2 -156 -18
5160 -18 89 117 -90 -40 -53 -134 -72 -48 -72 -11 84 -89 -69 58 36 28 -26 -24 153 -5 -66 57 35 97 -31 62 43
5187 43 -54 -51 0 -32 109 16 -76 21 -57 -36 79 14 44 99 77 -83 4 19 -53 19 2 -124 49 96 -30 48 -60
5214 -60 -19 -110 62 -19 -51 87 -80 -160 -87 -90 -115 66 -137 32 9 53 -146 76 10 -33 -72 20 5 18 -8 -43 49
5241 49 -2 44 -8 216 25 81 66 -24 -31 68 88 -63 11 -116 -8 56 38 18 32 -20 9 51 -70 -71 1 -112 31
5268 31 -12 1 54 109 -4 -78 -40 36 19 114 4 -84 116 112 -9 13 139 -7 3 -15 -122 105 26 -38 55 45 -79
$$ packed form
5084A7Q1j63J43j37m5J22o1p8K61j38j26J80j50k1J99q6l8J04m1j60J18O3q6n1
5108i3L2P3l8L8j51K4R5k7J48o8J9j21P8joJ53j93O1J28j67P7o0O0j40J09O5r1
5135DJ62j22r3N8o8m3O0J27j89J69Mq8n7J59j61JJ32m8j90L23j08j01P1j58J38
5160a8J07K8k07N0j3q1O2K4k4O1R5j73K0J27k2qn4KJ77j58o1J23k2O2j28R3j9
5187D3r7LN1l2J41r3r2R7p8K1J15o5L0N5k2j60Q7J5p2P2j7j26J73M7j26P8j08
5214f0M1r1J72q1l2J38j67q0P3lk5J81k03J69k3M4j99K22o6m3l9R2j5J3k6l5R2
5241D9n1M6n2K24j91N6j5r0pR9K0j51P4j27J08O4j8k0J4n2K9M2j21jP2j13J43
5268C1m3J3N3N5j13p4L8P6j7R5j10q8K00mj21K2J26j46J0j8j07K27p9o4R3j0j24
$$ plain form
5295 -79 5 47 -61 -33 106 5 -48 59 39 -2 -58 21 -85 -27 130 -92 -11 40 -94 -64 -25 -101 93 131 -182
5320 -182 67 46 -98 -62 79 -68 64 24 94 -74 53 -55 -138 -8 -54 -64 -30 90 -37 83 -59 -86 59
5343 59 129 38 150 -18 -14 5 56 8 -40 -10 49 -25 -40 -30 -44 128 3 40 44 -14 20 32 -125 64 154 -133 5
5370 5 -8 70 -44 67 7 46 21 167 -110 -18 67 -77 -39 37 85 14 145 -62 -24 88 46 -127 88 -42 -23
5395 -23 75 -66 -85 6 -17 -10 -43 101 12 62 -3 124 123 130 -83 89 0 74 105 -35 -48 51 57 -49 -21 39 -84 73
5423 73 58 -24 -94 75 -75 28 138 4 71 147 -145 -9 74 -68 -65 42 -97 39 0 87 -86 64 75 6
5447 6 -55 36 -40 38 -53 -78 -42 -15 -81 -34 114 34 14 19 179 74 116 -140 -132 85 -41 30 48 -42 -20 127 16 107
5475 107 108 23 -3 -72 36 95 2 42 -126 -66 54 -71 -80 139 -3 -88 15 -17 -39 -26 -85 108 132 -187 -6 103
$$ packed form
5295g9Q4M2j08K8J39j01n3J07k0m1n6P9j06N8J57k22Q1N1j34L0L9p6J94L8l13
5320a82K49k1j44L6J41j47J32m0P0j68J27j08q3J30m6j0L4J20j27J20j42k7J45
5343E9P0r1J12j68MJ9N1m8m8L0N9p4j5J0j4J72j25L7Mn8L4J2j57J89R0k87J38
5370Ej3P8j14J11o0L9k5J46k77R2Q5j44L8P6M8p1J31k07L8J12m2j73K15j30J9
5395b3R8j41j9R1k3Pl3J44q9N0o5J27jPk13J72q9P4L1j40j3R9Oj06K8O0j23J57
5423G3j5q2p0J69j50J03J10j34O7P6k92J36Q3j42LJ07j39J36l9Q7j73J50J1o9
5447Fo1R1p6P8r1k5L6K7o6M7J48q0k0NJ60j05M2k56QK17j26P1J8r0K2J47j11R1
5475A07Jq5k6o9J08N9r3M0j68O0J20j25rK19j42q5J03l2k2J3n9J93K4l19J81J09
$$ plain form
5501 103 -4 -3 109 95 -26 -70 21 1 -50 -58 -20 111 82 -171 88 143 11 -55 -11 -52 76 136 1 41 144 -29
5527 -29 3 -28 -81 -34 -62 -79 119 41 -96 -37 32 34 -68 39 -77 -39 49 33 -47 -9 -221 13 57 5 7 40 6 47
5555 47 153 0 -20 79 135 -33 20 104 -117 -33 -39 -52 144 -46 -109 -204 91 -29 25 109 36 64 138 -43 73 197
5581 197 -163 -59 -20 31 20 72 33 -84 -130 54 33 71 -132 18 -110 -34 0 4 37 -86 -37 19 -62 -15 -18 -50 -6
5608 -6 -33 -9 -21 -12 -23 -75 -3 47 -65 82 -112 -46 -128 -28 -69 19 -8 76 14 65 -25 1 116 24 -34 -112 0 88
5636 88 59 -42 12 81 53 102 -1 -33 -28 79 -96 -81 82 39 -35 143 -16 -29 118 -35 -67 160 7 32 0
5661 0 89 -169 26 -12 -91 8 -18 -42 -34 31 -75 -20 -23 -38 -23 26 -25 23 -10 39 18 57 -15 23 -29 17 -42 193 -26
5690 -26 -62 45 -74 4 105 36 73 123 63 -55 -58 -46 -24 -99 -35 -52 42 25 26 61 -68 -33 -74 -10 -13 -61 -28 -25 -83 -18
$$ packed form
5501A03j07JJ12j4j21m4R1k0n1qL8J31k9k53K59N5j32o6M4m1J28O0j35M0J03j73
5527b9L2l1n3M7k8j7J98p8j37N9O9Kj02J07j16L8Q8j6q0L8k12K34M4n2KL3l4M1
5555D7J06j53k0R9N6j68N3Q4k21Q4oj3J96j90o3r5K95j20N4Q4p3K8P4j81J16J24
5581A97l60J04L9N1j1N2l9j17m6J84k1L8k03J50j28P6L4ML3j23M9N6q1M7ll2M4
5608fk7K4j2Rj1n2P2N0j12J47j94O6q2J00m1Q8k7Q4o2N1r0K6J15r2n8p8J12Q8
5636H8k9j01N4O9k8M9j03l2NJ07j75J5J63m3p4J78j59j3J47j53l2K27j53K5l2
5661@Q9k58J95l8p9R9k6k4QO5j06N5lj5J5M9n1M8l3M9k1L9p2L8n2M6n9K35k19
5690b6l6J07j19P8J01o9L7N0o0j18lJ2K2p5O4j7R4j7JL5j29L5m1O4lm8L3Ln8O5
$$ plain form
5720 -18 -23 -183 -81 -22 -30 -5 14 -48 7 69 42 37 -113 -122 -8 -21 -3 -9 -13 -40 -16 93 -113 60 51 -104 -77 122 -23
5749 -23 34 -3 -48 -66 27 13 -13 138 90 -166 -26 -28 -64 121 -60 -92 -115 13 -213 -76 -9 37 46 13 9 10 -28 -30 14
5778 14 82 3 -54 -31 -46 47 20 -55 57 -17 -122 15 93 102 46 59 8 2 2 -56 -25 105 119 7 67 -3 -57 88 138
5807 138 -26 27 116 -107 38 28 145 -8 12 15 -30 -43 -30 32 -1 54 -59 -71 -113 -29 -20 60 39 -4 0 -89 -21 -85
5835 -85 29 5 17 -42 42 -30 -118 -105 -31 -31 -35 -7 -5 62 85 -78 11 172 -4 68 -32 212 70 -23 45 -43 80 47
5863 47 23 42 -41 77 52 -87 128 35 -72 -18 61 21 -30 127 8 -49 84 30 -71 -36 40 27 28 139 0 -105
5889 -105 -88 -5 2 12 12 -159 15 -25 -28 -47 -11 -83 -88 -14 65 106 21 -42 27 87 -56 75 44 89 20 13 53 -39 60 -32
5919 -32 -63 52 -99 103 53 -138 74 73 -123 79 78 78 76 -79 -54 8 36 12 -15 -37 -6 -31 135 31 69 19 97
$$ packed form
5720a8nj60J02N9qK5J9o2N5O2k7nj50rJ14j3J8omk7K4J09k06J73rj55K7J99j45
5749b3N7l7m5j8R3j4k6J51m8k56J40kl6J85j81l2k3J28k26J37O7M6Rl3mJl8kM4
5778A4O8p9n7K3j5R3k7p5J12p4j05J37P8Rn6J3n1o%n8L1J30J4j12O0p0n4J45N0
5807A38j64N3Q9k23J45j0J17j53K0Lm5j3J3O2l3N5j13j2m2Q4RQ0k1m3Mq9O8o4
5835h5J14k4J2n9Q4p2q8J3P4%mK8KO7K3j63Q9J61j76P2j00K44j42r3O8q8J23l3
5863D7k4J9q3J18k5j39K15r3j07N4P9m0n1J57j19n7J33n4j01L5P6j3JJ11j39j05
5889a05J7Q3PJ0%j71J74m0lj9L6p2nP4P9M1q5o3O9O0j43J31l1M5o9pM0r2R9r2
5919c2l1J15j51K02n0j91K12jj96K02j%kj55K5O2K8k4k7k2L1k5J66j04L8n0P8
$$ plain form
5946 97 -128 -42 -36 -14 115 51 -88 7 36 -19 43 93 -24 -2 127 13 -65 19 -23 -28 59 -153 -167 34 53 -13 11
5973 11 32 8 5 101 -33 -85 53 10 -96 118 1 70 -3 27 68 -6 15 -45 45 -179 47 38 -84 52 124 -65
5999 -65 -41 -108 -83 -106 -28 -58 -146 11 -138 61 31 -52 7 26 76 127 33 31 -89 100 -43 -38 -95 110 -80 27 7
6026 7 -77 -39 -133 -47 -178 41 -34 65 152 -7 -7 62 60 12 58 -31 19 29 49 -70 -13 -31 -157 53 -5 -83 -19 -48 35
6055 35 -99 14 -59 7 65 -65 -1 96 68 62 -29 -111 -67 45 -154 -14 61 65 56 59 -21 -95 -49 10 71 82 -9 17 44
6084 44 26 -54 128 68 -101 92 254 -100 -24 -17 -25 43 65 93 -82 -106 -6 -48 152 113 37 55 -27 -39 54 2 15
6111 15 0 -112 -166 -20 -8 -157 105 51 -132 87 19 -176 13 5 -47 -111 4 -19 21 42 2 38 118 17 87 64
6137 64 -48 -58 88 -123 -3 65 24 1 -21 -49 -3 -18 -42 -22 -16 73 -84 -5 -14 -13 -20 53 -50 39 110 11 -94 68
$$ packed form
5946I7k25Q6OK2J29o4j39R5K9n5O2N0j17K2J29j14p8Q4m2nQ7k12j4K01J9o6K4
5973A1K1k4lR6j34n2J38m3j06K14j17O9p3L0M1p4K1o0R0k24K26rj22J36P2j89
5999f5K4o7K5k3P8l0q8J57j49J99l0q3N9J9N0N1r4kj20J89j43Nn7K05j90J07k0
6026Gq4L8r4Q6j31K19p5R9Q7j59%O9km8M6q9N0J0K0j19N7j8j26K10n8p8O4k9Q3
6055C5j34J13p3O6N8j30O4R7k8or1q2M4J12j99J40P5MrLq0p4M6N9O1J1r1K6K7
6084D4j8q0J82o0j69J93J62l54P6PqO8K2K8j75k4J00m2K00l9p6J8q2j2R3n2J3
6111A5j5j12n4J46J2j49K62n4j83K19o8j95J89qn2o4J15k3M0K1m0L6Q0j01P0k3
6137F4j12j0J46k11J20O8m1k3k2k8M6j5k4K0OQ9j57P9rJpP3j03Q9P1r9j05J62
$$ plain form
6165 68 -42 -70 -127 -17 -51 49 25 -105 -41 12 -94 3 2 -61 86 -55 -65 -95 40 -22 -7 17 -162 93 -5 -43
6191 -43 -47 21 -107 4 22 18 136 84 12 14 7 -20 -3 87 -18 -89 23 -22 23 -59 45 1 46 43 14 39 78 -60 4
6220 4 -44 -53 51 42 -83 -98 14 0 -2 53 32 -30 -32 -43 14 123 -80 -123 68 39 104 5 -152 35 -27 41 -14 80 0
6249 0 90 87 -15 20 -9 -121 -102 41 -19 -74 21 12 41 130 88 -86 102 165 -83 78 -23 74 -107 26 -53 51
6275 51 -2 -110 51 -140 20 48 80 -15 -110 202 -12 -135 29 -35 -140 36 110 36 24 76 17 76 -96 -75 -105
6300 -105 -27 75 28 137 -78 84 -117 -37 3 40 -76 7 148 -81 -46 -39 69 38 46 204 -88 12 11 7 140
6325 140 112 52 -65 -79 -23 15 20 34 66 -56 -82 3 -8 -93 4 140 -38 3 3 -157 -5 -40 -120 -24 -27 -82 35 -61
6353 -61 4 -108 93 101 -3 63 10 -27 -11 -73 67 75 85 5 17 78 -35 -29 -35 -33 66 64 -16 20 50 -23 -89 -131 -60 -50 13
$$ packed form
6165F8j10k8n7J10l4J00k4j30O4N3j06R7jo3J47j41j0l0J35o2J5K4j79K55r8l8
6191d3mO8j28J11J8mJ18n2p2Kpk7J7R0j05p1J12m5M5q2J04m4M5lk9K5L9j38O4
6220Dm8rJ04rj25j5J12j4kN5k1o2kj1N7J09k03m3J91k9O5r9j57J87o2O8n5R4q0
6249@R0lj02L5k9j12J9J43o0n5R5rK9Q9m2j74J88O3k48J61j01R7j81J33p9J04
6275E1n3j08J61j91J60K8L2r5r5L12k14j23J64o4j05J76P4p4j2N2n9N9j72K1l0
6300a05P8J02m7J09k15J62k01Q0M0L7j16Q3J41k29L5PJ08l1QJ58k92J00jmJ33
6325A40k8o0j17j4N6L8NJ4L2j22k6Q5j1q5R7J36j78M1%j60J52l5q0R6ln5J17r6
6353f1O5j12K01Qj04O6n3l7J6o2J40QJ0q0J2O1j13OoKR9kq0L6L0p3o6m2P1J0O3
$$ plain form
6384 13 10 22 -96 -1 -24 103 66 -61 63 92 -20 -64 47 -84 -84 17 -85 52 -60 8 -88 -91 62 29 -73
6409 -73 -52 -12 -12 6 61 -57 -38 1 -16 -42 -67 -42 -137 -78 -28 58 -21 -19 42 -17 56 39 -166 20 -127 11 26 64 33
6438 33 24 -51 30 165 19 120 44 48 42 -131 148 -37 41 96 1 18 -46 -27 -104 -87 1 -105 -10 -124 -23 14 16 -2
6466 -2 -93 -120 -62 147 47 9 5 79 -17 141 -32 36 -10 41 137 -34 0 -10 21 155 -13 -58 60 -33 -54 -6 -64
6493 -64 -44 -22 97 -156 -45 28 -91 125 -102 67 89 -153 -58 -8 29 30 73 -29 -76 -2 -87 -102 78 -70 -6
6518 -6 61 132 -133 9 42 -24 46 73 -48 -29 21 -114 31 -59 13 -48 103 -33 -64 -37 -8 3 -22 -101 -30 -8 111
6545 111 -62 59 12 96 28 49 -27 -65 91 47 115 -36 -26 20 75 94 -39 80 -19 -27 23 -8 -4 33 32 -100 -45 -8
6573 -8 24 -18 41 -33 -157 73 -59 119 151 64 -22 -39 45 -21 133 25 -21 78 -120 -39 70 -33 -40 69 -35 -4
$$ packed form
6384A3lJ2j18R5k3J27l7j27J24K9j12m4J11j31%J01j02J37j12O8r6lJ53l3j02
6409g3K1M0%J8N5j18J9L9j7k6k5K5r5N9N0Q6p9KO1n9P3j7k05J86j47J38J5L8l1
6438C3rp5Q1J35j46J01p6Moj73K79j85P8N5r5J7o4J9p7J7Q8j06R5j14J01L7Kj8
6466br1k7N8K09j00l8mP4r6J58j73O8m6N1R6j71L4j0L1J34j68m5J18r3k1M8n8
6493f4K0K2J19k53J11P3j19K16k27J69K2k42R5N0L7JM3j02m7P4q5j5J80j48O4
6518fO7P1k65J42L3o6P0K7j21J9N0j35J45r0P2o1J51j36l1K7K9J1k5p9P1K2J19
6545A11j73J21m7Q4o8K1p6l8J56m4O8j51J0M6N5J9j33J19r9qN0l1ML7jj32N5L7
6573hL2m2N9p4j24K30j32J78L2q7q6j7Q4o6J54j08m6R9j98Q1J09j03pJ09j04L1
$$ plain form
6599 -4 66 -18 -132 22 -44 -2 -89 11 -16 47 66 -64 33 -21 -160 19 -28 -23 -4 111 -9 -9 167 -153 -3 16
6625 16 87 -63 -134 -117 86 33 -70 90 84 71 -65 19 17 -91 63 -17 -14 36 -22 -13 -4 -52 16 23 52 -76 142 -114
6653 -114 -57 147 30 -22 1 -16 -90 61 15 50 -49 50 64 -31 -28 15 -102 168 -86 -46 130 -34 -76 -85 -18 -16 -45
6680 -45 -77 -76 -1 64 -45 -24 -96 5 -24 16 -54 86 -23 -32 60 -68 -31 -44 -71 -50 -20 97 100 -45 -13 16 -80 212
6708 212 20 11 -29 41 -12 -14 -36 -8 -89 -32 -84 -10 -14 9 -41 -43 -48 129 5 -201 -37 32 29 87 -29 -165 -88 -108 -29
6737 -29 39 -29 113 63 -1 83 67 37 12 -70 60 -86 -8 -59 -15 80 -47 -31 96 -93 -16 -116 15 13 -2 -51 40
6764 40 -118 -52 -47 -46 25 123 -143 -3 20 -59 -22 27 -20 -128 24 14 2 -11 -77 18 6 36 78 -25 -33 -30 -12 109 -103
6793 -103 -19 -20 -5 75 154 -176 -37 6 -24 -15 17 -43 -87 34 -93 101 15 43 -77 13 -82 -73 128 51 -50 -33 -52
$$ packed form
6599dP0q4j14J54o6M2q7J00k7O3J9j30R7n4j39J79m7NJ9J15j20%J76l20J50J9
6625A6P1j50p1J7K03n3j03J60oj3j36Q4kj08J54q0LN0n8RRm8O8PK9j28K18k56
6653a14N7K04j17n2K3j7p4J51m6L5r9R9J4r5LM3j17K70k54M0J76j64m2rO7Kk9
6680d5l2JP5O5j09K1p2J01k9M0p0J40j09rR2j28L7j3k7K1L0J17Lj45L2K9r6K92
6708B12j92rm0P0n3kk2K8q1N7n2P4mK3n0knJ77j24k06J64O9lN8j16j36P7k0P9
6737b9O8o8J42n0o4Q4j6l0k5q2J30j46P8n1M4R5j27J6J27j89P7j00J31kj5m9R1
6764D0j58O6NJP1R8k66J40K3p9L7M9m7j08J52j0j2j3o6R5j2L0M2j03qLJ8J21k12
6793a03Q4jJ5Q0P9l30J39M3l0RL2o0m4J21j27J94q6K8j20R0r5RK01p7j01J7j9
$$ plain form
6820 -52 -3 183 99 97 90 80 -53 -69 -60 -111 -49 120 -42 54 11 -77 -80 138 29 16 -21 21 105 -21 -23 8 -23 -191 -19
6849 -19 22 43 17 -29 49 -8 -38 -60 -119 42 140 57 -64 1 31 -20 -53 -18 87 -32 -87 38 98 77 29 127 133 -89
6877 -89 3 103 -47 131 -73 -29 6 -72 -22 85 -76 -95 178 -89 -128 -25 27 73 -104 -51 -131 -42 32 15 11 25
6903 25 -84 -272 -38 119 -35 37 -192 -84 101 -119 -93 67 -48 -100 37 -57 45 20 -31 -91 162 -27 26
6926 26 84 -8 -105 27 -71 -63 102 -61 77 72 -97 7 -87 114 20 -75 146 10 -76 -29 -9 -16 26 9 -41 72 47
6953 47 60 101 -26 -124 66 -193 -109 22 41 -3 -10 -141 -118 -59 20 -3 78 -62 -56 120 -67 -38 -4 -22 7 -15 27
6980 27 -36 45 132 26 93 51 -85 -10 120 141 -39 66 83 -8 84 17 6 -58 -166 -45 -14 65 -91 -4 8 -182
7006 -182 30 90 56 -69 -31 -19 -21 24 -59 147 43 65 -96 -180 -64 -34 30 -50 -115 68 10 -4 34 25 97 -61 -6
$$ packed form
6820e2M9J86q4kpj0j33j6Rn1O2J69j62R6m3q8lK18j09j3l7M2Q4j26kL1l1j68J72
6849a9M1K1k6m6P8n7l0k2n9J61R8q3j21O5L0n1l3L5J05j19n5J25O0k1m8R8Ok22
6877h9R2J00j50J78k04M4L5p8N0J07j61j9K73k67l9J03N2M6j77N3q0Q9P4j7mJ4
6903B5j09j88K34J57j54P2k29J08J85k20K6J60j15n2J37r4J02k5n1o0K53j89N3
6926B6N8r2r7J32r8QJ65j63J38nj69J04r4K01r4r5K21j36q6M7K0pM2j7n0J13k5
6953D7J3M1j27r8J90k59Q4J31J9m4pj31K3N9P9k3Q1j40OJ76j87K9L4j8K9k2M2
6980B7o3Q1Q7j06O7m2j36P5J30K1j80J05J7r1R2o7j1o4j08J21L1P9j56Q7J2j90
7006a82K12O0l4j25L8J2kM5q3K06j04K2j61q4J16L0O4q0o5J83n8j4L8rP2j58N5
$$ plain form
7033 -6 -86 13 -48 42 50 101 -43 -135 101 -70 113 116 -78 66 -1 15 -4 11 0 21 -117 -10 -28 130 -13 43 139
7060 139 -55 -78 -108 -24 13 -110 96 57 -103 35 8 -25 -30 -100 -1 65 62 -1 38 -91 57 132 11 -42 19 -3 43
7087 43 -12 52 9 72 89 -112 9 -73 -59 -109 -66 -84 5 -36 -26 49 -2 71 33 -28 -9 -2 -43 -99 123 -57 -169 51
7115 51 -45 101 -64 81 -5 20 58 99 -17 45 -80 -66 -7 -57 15 -18 86 55 -35 28 -75 102 36 -19 -67 78
7141 78 50 54 -55 -77 -12 -15 -6 148 7 46 -61 84 3 113 141 -63 -25 -20 -37 65 -33 -6 13 75 43 -78 -55 66
7169 66 68 179 10 -29 49 58 -10 -32 97 -43 96 63 10 74 -46 5 98 8 103 -40 19 -74 8 101 7 -84 -74 49
7197 49 75 -29 -7 79 -6 29 34 22 13 -85 82 -47 38 4 37 -147 95 -31 -5 56 83 -80 -158 105 -3 50 20
7224 20 85 -69 -15 -48 38 126 -54 63 20 -29 90 63 41 48 -29 69 -49 22 35 -7 -13 7 121 94 62 -69 -65 -17
$$ packed form
7033fq0R9o1R0QN1j44r2K36j71J83Lj94J44o7J6j9J5j1K1j38J07j8J58j43N6R6
7060A39j94k3l0Q4L7j23K06l9j60J38k7l3np0R9O6lo3L9j29J48P5j21n3O1k2M6
7087D3n5O4m3O3J7k01J21q2J4n0M3j8Q9m1J0P5n1P3l8o1J9Pm1n6K22j80j12K20
7115E1r6J46j65J45q6K5L8M1j16O2j25J4N9n0P2l3J04l1r0O3j03J77o6n5m8J45
7141G8k8Mj09k2O5lRJ54j41L9j07J45q1J10K8k04L8Nj7J02r8K7J9O2l2j21K3J21
7169F6KJ11j69l9P8Ro8k2J29j40J39l3n3O4j20N1R3r0R5j43N9r3Q2R3r4r1J0J23
7197D9K6j04K2Q6q5L5Nj2rr8J67j29Q5l4L3j84K42j26K6O1K7j63p8K63j08N3l0
7224B0O5j54N4l3Q6Q8j80J17m3m9J19k7k2Pp7R8j18P1J3m2oK0J14k7l2j31MM8
$$ plain form
7252 -17 34 -21 93 -110 -10 48 -3 113 116 68 64 25 1 7 147 -1 23 60 55 -6 15 -49 -64 -167 -19 -13 46 -4 -60
7281 -60 42 13 -37 -33 55 20 33 44 21 6 -82 -80 -48 29 59 -151 -85 -22 -67 -66 -23 7 49 2 -86 82 50 -204 58
7310 58 68 17 29 -16 19 -35 -82 -106 3 14 -56 17 33 -50 26 -65 -75 -57 -23 -124 24 148 59 6 75 -1 49 2
7338 2 -32 33 123 -53 -64 -103 12 17 3 -100 -172 -2 56 114 24 -49 47 27 -36 68 100 89 -21 80 -57 17 0
7365 0 -34 -40 -76 136 1 23 -31 50 -16 28 63 4 74 -100 -64 51 -63 83 -21 7 36 59 76 -62 68 16 45
7392 45 -2 -28 59 -16 -82 -72 -109 -4 -53 9 39 -42 -43 69 -134 -117 27 51 -66 -3 91 73 71 88 2 -103 27 -41
7420 -41 57 22 -109 -66 62 24 -55 38 -61 122 -36 61 -22 20 11 -22 63 141 -37 30 16 178 36 19 87 -53 104
7447 104 -89 32 -66 -45 113 48 -97 -16 90 1 63 -43 -93 -25 -148 37 -109 49 -158 -19 144 -117 27
$$ packed form
7252a7N1n5J14k03J00N8n1J16Lm8ml9k4OJ40j48K4L7no1K1o4j5j03J48ON9n0n6
7281f0J02k9n0MQ8l5J3J1k3j5q8KL2P7L0k10O6O3m5JM3L0M2m7q8J68l2k54K62
7310E8J0n1J2m5L5n4m7k4J09J1p0P3J6q3P6r1j0J8L4j01J48J24q9n3O9p6N0m7
7338Bl4O5R0j76j1l9J15Nj4j03p2J70N8N8r0p3R6k0o3J04L2j1j10J01j37P4j7
7365@l4ol6K12j35K2n4Q1o6M4L5n9P0j74L6J15j14J46j04K8K9K3J7j38J30n2K9
7392D5m7k6Q7p5o6J0l7J05m9O2L0q1jJ12k03J7J44K4j17O3R4j8kJ7q6j05J30o8
7420d1R8l5j31M3J28l8p9R3r9J83j58R7q3M2rl3Q5P8j78O7j4J62j42j7O8j40J57
7447A04j93J21r8K1J58o5j45Q1J06q9O2j06n0O8j23J85j46J58k07J39J63k61J44
$$ plain form
7470 27 69 -35 -89 4 -45 -150 3 -54 -10 -82 10 55 -70 28 65 7 67 20 18 -26 36 9 126 -104 -148 -39 -27
7497 -27 -3 123 50 151 85 176 40 26 23 110 144 1 -27 -51 -42 51 22 -31 -17 82 45 -24 178 -68 59 -84 -20
7524 -20 29 8 -26 -17 -48 -23 -30 -68 1 -76 -19 -25 -159 36 95 5 22 83 36 -86 48 -21 -87 -2 -35 -52 38 -64 -17
7553 -17 -36 121 -15 92 174 61 24 -79 -68 22 41 48 -129 87 43 -34 -4 -23 -29 -5 -53 54 -23 -34 -58 -12 141
7580 141 -82 89 43 31 -11 25 10 -22 -33 -53 -123 -118 -101 -110 8 60 -74 -115 -48 69 30 -44 165 47 -119 -50 17
7607 17 -83 17 9 1 59 22 -25 36 -6 59 -15 109 66 -37 100 91 -95 23 8 -87 55 -47 -77 -74 28 -35 15
7634 15 -10 13 -50 79 40 -14 42 -18 -19 52 101 -41 -136 41 12 90 -12 -11 -105 -33 -31 180 115 77 -3 131 12 -9
7662 -9 56 -54 -73 -80 -74 114 -96 -1 -48 80 -99 -63 33 -92 -14 108 102 -58 127 127 8 -89 68 104 4 -35 -41
$$ packed form
7470B7M2j04n4R3m9j05J53n7M4p2R2M5j25R8L7n8O0m7km4O2k7J17k30m4J09J2
7497b7K4J26p3J01o6R1j36j4lQ7L4j43k8k4RR3k9n3J4R9l7o9K02k46J27j43O4
7524b0M9k1l4Rl1K5pl8O9p7N7oj34J95N9r0J7O1m7j22J34o9o6Q5l3j7R0j02M7
7553a7j9J57j36J07Q2j13l7j03J1R0J9Pj77K16m4p7L0j9oK4m8J07p7j1k4M6J53
7580A41k23J71m6j2m2L6j5l2j1k0p0NJ7rJ18N2j34m1O7J17l9p4K09j18j66O9O7
7607A7j00J00qqN8l7m7O1m2O5p4J24m3j03J37rj86J18j5r5J42j02l0LJ02o3N0
7634A5k5K3o3J29l9n4N6o0jP1M9j42r5J77k9P8j02Jr4P2KK11o5l8q0J34j19k1
7662iO5j10j9pOJ88k10R5m7J28j79L6R6j25P8J22oj60J85%j19r7J57L6j00l9o
$$ plain form
7689 -41 75 -62 -55 65 -64 33 21 -110 -97 59 -64 -57 30 120 32 -79 29 -24 50 -6 89 55 24 0 114 -20
7715 -20 92 -111 -7 -48 -51 19 -13 -28 72 54 68 -48 94 -53 23 39 -43 22 79 -6 75 143 40 42 67 20 -128
7742 -128 11 -5 7 7 97 85 72 75 18 12 -23 -186 -28 -55 40 69 -31 16 -22 -25 65 29 -27 11 -76 101 -49 49 -16
7771 -16 -74 -40 -5 -57 10 -1 93 -42 86 -20 -95 129 -63 -72 -95 -58 47 36 100 62 -26 -30 21 49 -28 -18 6 -14
7799 -14 -9 28 -11 -54 79 53 -31 14 39 -62 -71 2 -86 39 26 -75 62 -17 59 -90 -11 -100 30 112 -41 70 60
7826 60 1 7 34 -38 -77 92 200 -17 53 -43 -51 17 -30 -83 135 19 -61 -94 16 19 -84 110 45 13 -97 71 -102
7853 -102 43 86 -90 -64 -7 29 -3 24 36 -121 49 155 141 -14 -23 80 -55 92 28 -17 -21 -38 9 -44 34 40 16
7880 16 -9 56 45 93 -24 -13 -66 -54 40 43 -32 -49 80 -36 22 -10 42 33 -36 -33 -31 82 -51 -50 -102 91 -48 17 -17
$$ packed form
7689d1J16j37PJ20j29R7j2j31J3J56j23PQ7R0q8j11J08n3P4n6R5l4l1k4J14j34
7715b0J12k03J04m1lP0l2j5J00j8J4j16J42j47P6J6q2O5N7q5Q1O8j03KK5m7j48
7742a28J39j6J2%R0j2j3Ln7ol5j63J58k7R5K9j00M7l8lR0l6n6L8q7J77j50R8o5
7771a6n8L4L5n2O7j1R4j35J28j06p5K24j92rk3L7J05j1O4l8q8mN1K8p7J0K4k0
7799a4NL7l9m3J33k6q4M5K5j01rP3q8J25j3j01J37p9P6j49P9q9J30Q2j53J11j0
7826F0n9OK7p2l9J69J08k17P0r6qO8m7n3K18j16q0l3J10Lj03J94o5l2j10J68j73
7853a02J45M3j76K6N7L6l2K7J2j57J70J06j4j55rJ03j35J47o4m5mj7M7n3P8Ok4
7880A6k5O5j1M8j17J1n3J2R4Lp5j7J29j16N8l2N2ro9LKJ13j33Jn2J93j39O5l4
$$ plain form
7909 -17 -3 -22 -80 27 -94 -115 -21 -17 -15 84 67 76 -45 -84 -8 56 -26 -61 27 91 -19 52 -39 -40 -18 128 32 3 -21 11
7939 11 31 32 -30 -71 10 -63 -57 73 12 64 143 -1 5 104 14 35 29 21 -87 91 -44 134 176 -87 -10 158 19 73
7967 73 19 15 16 -62 -35 4 -4 -46 -168 -18 1 -93 51 -110 -13 -21 -19 -40 17 -7 -34 -49 23 -11 -63 72 -26 -175 -15
7996 -15 61 59 -6 121 9 221 21 30 22 56 -46 -9 81 45 36 37 163 63 80 -120 69 -103 -44 62 -66 -130 132
8023 132 -90 23 3 -14 -112 -8 36 -185 29 113 -34 45 37 -58 -11 23 9 -15 -20 -110 -75 4 45 -128 23 67 -178
8050 -178 10 2 -86 57 1 95 -121 -12 132 31 -32 -50 154 87 1 -30 75 157 77 -78 -73 -54 80 -23 52
8075 52 232 48 -16 -67 -62 -117 -33 57 4 19 105 -56 123 -9 -110 38 -33 -7 -21 -52 7 -18 73 -160 26 -19
8101 -19 -12 6 38 45 -12 4 3 2 -38 26 115 -67 112 -50 100 -61 34 2 -23 -57 128 143 64 99 88 21 -56 51 -85
$$ packed form
7909a7J4j9n8J07j21k1R4MKR9j7Rj21l9P6O4q2l5Q8O4j10P1r1jK2J46r6k9k4L2
7939A1K0Jo2m1Q1p3OJ30o1N2P9j44OR9r0K1oqj08J78j35J78M2k63P7J68j39N4
7967G3n4mJp8K7L9qm2j22J50J9r4J44j61R7qKk1N7k4k7j5P2l4n2J35r8j49J60
7996a5P6ko5J27j12K12k00RqL4j02L7R0l6rJJ26j00J7k00J89j72N9J06j28o4K62
8023A32k22J13k0j7r8J04M4k21K14Q4j47P9qr5M7L4j4k4nr0L5P9M1j73J51M4k45
8050a78J88qq8J43n6R4k16J09J44j01o3j8K04o7q6l1J05Q2q0j55NJ9J34j03P5
8075E2J80j84o4n1Nn5Q4R0n3J5Q6j61J79j32j01J48p1K6j4l1N9k5R1k33J86m5
8101a9PJ8L2Pn7J6jjm0O4Q9j82J79j62J50j61R5l2k5l4J85J5p9L5j1o7p7J07j36
$$ plain form
8130 -85 -23 109 67 93 -136 -26 62 138 105 -12 73 -128 45 -83 -23 -89 44 -85 36 56 67 13 -2 25 69
8155 69 -24 -39 32 79 -52 62 87 84 -15 162 66 -2 62 117 89 -5 -72 -36 13 134 16 74 54 75 -56 -105 9
8182 9 13 13 56 45 -43 32 -26 153 17
$$ packed form
8130h5O2J32m2K6k29J10Q8P6l3j17Q5k01J73j28O0o6J33j29J21K0J1n4j5K7M4
8155F9r3j5P1M7j31J14K5lr9J77r6o8O4N5k8r4o7L6M9J21j18N8k0K1j31m9J14
8182IM%M3j1q8P5n8J79j36
8191A7
$$ Imaginary data points
##PAGE= N=2
##DATA TABLE= (X++(I..I)), XYDATA
$$ plain form
0 0 0 0 0 0 0 0 0 0 0 0 0 0 0 0 0 0 0 0 4 -8 8 -8 8 -8 8 -10 11 -15 16 -16 19 -21 24 -27 29 -34 36 -41 45 -49 56
41 56 -62 67 -76 83 -92 103 -114 129 -148 167 -193 227 -270 330 -416 559 -807 1344 -2974 16816
61 16816 94296 50888 -34694 -45060 5785 43521 40624 15081 -7802 -21917 -9636 34912
73 34912 54762 12692 -24381 -8135 16613 18526 17143 14121 -3804 -26521 -24217 14239 41997
86 41997 9801 -38048 -33013 5333 29015 26451 -3413 -37865 -32052 9097 35358 19640 -18754
99 -18754 -33475 -3736 27181 24772 8829 -8747 -25360 -11491 25679 30856 -1432 -24140 -14615
112 -14615 8983 17792 7204 330 -5066 -20741 -14604 21329 25778 -14256 -34013 -10321 15555
125 15555 13740 -3595 -8690 -2632 -9099 -11954 10184 18899 -10378 -27550 -7501 12663 11674 960
$$ packed form
0@%%%%%%%%%%%%%%%%%%Mj2J6j6J6j6J6j8K1k6L1l2L5m0M5n1N6o3P0p7Q6r4J05
41E6j18J29j43J59j75J95k17K43k77L15l60M20m97O00p46R75j366K151m318J9790
61A6816P7480m3408q5582j0366N0845L7736k897k5543k2883j4115J2281M4548
73C4912J9850m2070l7073J6246K4748J913j383l022j7925k2717K304L8456K7758
86D1997l2196m7849N035L8346K3682k564k9864l4452N813M1149K6261j5718l8394
99a8754j4721K9739L0917k409j5943j7576j6613J3869L7170N177l2288k2708R525
112a4615K3598Q809j0588o874n396j5675O137L5933M449m0034j9757K3692K5876
125A5555j815j7335n095O058o467k855K2138Q715k9277j7172K0049K0164r89j0714
$$ plain form
139 960 -8338 -11155 -11552 -5524 12638 13419 -18444 -32177 -3377 18257 7178 -9404 -15256 -10974
153 -10974 -1464 4521 6748 2352 -13671 -17709 4238 17260 6070 -2218 -2396 -3008 5152 15239
167 15239 11993 1070 -6731 -4742 9180 15741 7522 4043 2883 -7524 -3756 17457 18776 -4861
181 -4861 -20721 -11571 11692 20947 2271 -16040 -13151 -3043 7966 16994 3578 -20407 -16660
194 -16660 7291 17229 6543 -9021 -10964 1724 7785 5440 9713 7154 -9606 -11424 6372
207 6372 14386 7237 -3293 -10321 -5581 6384 11043 8080 -4228 -20560 -14104 12164 16384 -5077
221 -5077 -19363 -15862 -1965 10603 6107 -9410 -15936 -11844 -353 11357 4089 -14276 -14234 -2831
235 -2831 1337 4375 5632 -3050 -10179 -7031 3275 13398 7381 -12506 -15484 1874 11804 9441
$$ packed form
139I60r298k817l97O028J8162P81l1863j3733K8800K1634j1079j6582n852M282
153a0974R510N985K227m396j6023m038K1947J3022j1190q288j78o12Q160J0087
167A5239l246j0923p801J989J3922O561q219l479j160j0407L768K1213J319k3637
181d861j5860R150K3263R255j8676j8311K889J0108J1009R028j3416k3985L747
194a6660K3951R938j0686j5564j943J2688O061k345M273k559j6760j818J7796
207F372Q014p149j0530p028M740J1965M659k963j2308j6332O456K6268M220k1461
221e077j4286L501J3897J2568m496j5517o526M092J1491J1710p268j8365M2J1403
235b831M168L038J257q682p129L148J0306J0123o017j9887k978J7358R930k363
$$ plain form
249 9441 2039 -9529 -10348 3676 12079 6450 -3681 -11045 -5245 8085 8222 -223 -1573 -3771 -7046
264 -7046 1952 10859 5550 -4301 -9189 -5206 6952 9996 -967 -6878 -4868 -1755 6752 10801 -655
279 -655 -10134 -5406 1787 5904 5344 -2729 -6490 -1485 1674 4635 6561 -2063 -9396 -1779 5949 5014
295 5014 2528 -1963 -5283 -441 3958 3638 4107 -704 -6947 -537 7414 3782 -763 -2567 -5188 -1063
311 -1063 5297 3670 -245 -2735 -5427 -1203 4997 660 -4303 -2762 -3724 -2975 3833 3761 -3157 -6017
327 -6017 -5339 -844 5409 1471 -6477 -4491 -531 -248 2569 1375 -4861 -4101 526 1098 2819 2388
343 2388 -2961 -3660 -401 414 3851 4629 -3350 -5459 2658 5788 3246 326 -4029 -3004 3768 4538
359 4538 1896 1769 -1742 -3346 2912 4930 570 -549 -1539 -2900 2310 5234 1091 -2125 -3895 -3697
$$ packed form
249I441p402j1568q19J4024Q403n629j0131p364N800J3330J37q445j350k198l275
264g046Q998Q907n309r851m888L983J2158L044j0963n911K010L113Q507M049j1456
279f55r479M728P193M117n60q073l761N005L159K961J926q624p333P617P728r35
295E014k486m491l320M842M399l20M69m811o243O410P951l632m545j804k621M125
311a063O360j627l915k490k692M224O200m337m963J541r62P49O808p2o918k860
327f017O78M495O253l938p948J986L960K83K817j194o236P60M627N72J721m31
343B388n349o99L259Q15L437P78p979k109Q117L130k542k920m355J025O772P70
359D538k642j27l511j604O258K018m360j119r90j361N210K924m143l216j770J98
$$ plain form
375 -3697 3073 5580 -1761 -4509 -1552 -1593 777 2958 -1922 -5272 -2902 -1240 2008 3949 -2319 -6343
391 -6343 -2043 -80 485 2233 -1658 -5679 -1361 2561 1783 1217 -2329 -5084 51 3487 1299 1764
407 1764 -139 -4526 -837 4646 2472 -474 -1638 -2738 1941 5604 1300 -1349 -437 -2074 17
422 17 4980 2306 -1699 -500 -520 342 3971 1558 -2629 -1789 -578 1247 5018 1725 -4669 -2105 1777
439 1777 1210 1731 538 -2693 -715 1850 572 1662 1160 -3559 -2421 2316 1843 1261 994 -3001 -2699
456 -2699 2354 2087 -302 -672 -2779 -1283 3669 1821 -2457 -847 -1166 -2382 1082 1843 -1196 -687
472 -687 -1267 -2199 1439 1731 -2649 -2440 -850 -1764 854 2334 -2254 -3468 -1253 -1415 -5 1332 -2431
489 -2431 -3555 -301 -704 -369 683 -3209 -4864 -312 963 -827 -377 -2158 -3063 8 -153 -2267
$$ packed form
375c697O770K507p341k748K957m1K370K181m880l350K370J662L248J941o268m024
391f343M300J963N65J748l891m021M318L922p78n66l546k755N135L436k188M65
407A764j903m387L689N483k174k946j164j100M679L663m304k649R12j637K091
422A7M963k674m005J199k0Q62L629k413m187Q40J211J825L771l293o394K564L882
439A777n67N21j193l231J978K565j278J090n02m719J138M737m73n82k67l995L02
456b699N053k67k389l70k107J496M952j848m278J610l19j216L464P61l039N09
472f87n80r32L638K92m380K09J590r14K618J480m588j214K215j62J410J337l763
489b431j124L254m03L35J052l892j655M552J275j790M50j781r05L071j61k114
$$ plain form
505 -2267 -179 -622 -3148 -390 1680 -517 -387 -542 -2761 -179 2780 909 363 482 -1252 1316
521 1316 4249 762 -935 1615 1602 1882 3849 2056 723 2117 627 591 4371 2994 -166 1118
537 1118 1890 1478 3528 1647 -2428 -345 2054 1101 1895 505 -2755 -848 1422 -769 -914 -546 -2906
554 -2906 -1399 1221 -895 -2431 -1248 -2729 -2218 -140 -1891 -2065 683 -1590 -3809 -821 -100 -1406
570 -1406 -719 -2387 -3197 1066 2234 -1039 -1794 -2480 -2189 2481 2824 -2934 -3292 469 1597 1697 -443
587 -443 -4169 -1314 2568 334 -1509 -151 -1345 -977 818 -1956 -2983 3 -87 -1772 -1031 -2023 -1583
604 -1583 1214 -1201 -4606 -2054 464 350 836 -1377 -3622 669 3761 608 -1351 -963 387 4398
620 4398 4781 -635 -628 3590 3611 2903 2703 1082 2672 5329 2577 825 2792 2417 1830 2819 319 -44
$$ packed form
505b267K088m43k526K758K070k197J30j55k219K582K959j871n46J19j734K568
521A316K933l487j697K550j3K80J967j793j333J394j490l6L780j377l160J284
537A118P72m12K050j881m075K083K399r53P94j390l260J907K270k191j45L68k360
554b906J507K620k116j536J183j481N11K078j751j74K748k273k219K988P21j306
570a406O87j668q10M263J168l273p55o86K91M670L43n758l58L761J128J00k140
587d43l726K855L882k234j843J358j194L68J795k774j027K986r0j685P41r92M40
604a583K797k415l405K552K518j14M86k213k245M291L092l153j959L88J350M011
620D398L83n416PM218K1p08k00j621J590K657k752j752J967l75n87R89k500l63
$$ plain form
638 -44 4009 3127 -1361 -1598 -167 783 1986 -1221 -4125 -19 2818 -359 -1826 -1941 -1991 808 1319
655 1319 -2396 -1852 1393 539 -475 -389 -1498 377 2578 -628 -1997 902 1050 507 579 -2523 -3020
672 -3020 1535 2165 -1374 -2588 -2273 -236 2444 -1209 -6213 -2779 1723 -145 -2257 -2792 -2122 860
688 860 430 -3436 -2460 133 -433 108 581 -2355 -1479 2663 1622 -1550 -1708 -232 3202 4254 -1330
705 -1330 -3728 1955 4093 790 -867 -882 1076 4303 2394 -958 941 2126 570 1823 2157 33
721 33 1485 3193 1690 1568 1845 448 2270 3321 -185 -408 3279 2648 405 -426 -933 1463 3291
738 3291 -665 -2720 1175 1976 -740 -850 -916 -1312 23 -516 -875 1306 328 -1794 694 1815 -1306
755 -1306 -648 1901 1193 519 620 1032 3556 2595 -2191 -847 4479 3118 -723 -965 -11 1776 1946
$$ packed form
638d4M053q82m488k37J431R50J203l207k904M106K837l177j467j15n0K799N11
655A319l715N44L245q54j014Q6j109J875K201l206j369K899J48n43P2l102m97
672c020M555O30l539j214L15K037K680l653n004L434M502j868k112n35O70K982
688H60m30l866R76K593n66N41M73k936Q76M142j041l172j58J476L434J052n584
705a330k398N683K138l303j657j5J958L227j909l352J899J185j556J253L34k124
721C3J452J708j503j22K77j397J822J051l506k23L687o31k243q31n07K396J828
738C291l956k055L895Q01k716j10o6l96J335n39l59K181r78k122K488J121l121
755a306O58K549p08o74J01M12K524r61m786J344N326j361l841k42R54J787J70
$$ plain form
772 1946 -1830 -2902 80 36 -1301 -171 -1915 -3987 -1399 -464 -2774 -3507 -3354 -2000 993 -676
788 -676 -4925 -2410 1522 15 -2223 -2742 -1427 2561 2962 -1775 -1863 2185 2606 1768 1333 -514 423
805 423 3933 3319 885 254 -408 1838 4993 1662 -2672 486 3898 2967 299 -2450 -1277 3633
821 3633 2730 -2059 -1354 1963 1618 1225 -23 -1952 -443 1989 550 -141 -356 -1274 932 2928 -804
838 -804 -2926 -2 1301 805 37 -1851 -1193 1993 338 -2331 -544 474 -305 785 203 -1040 460
855 460 457 -1104 87 596 -869 652 1995 -44 -23 887 -327 294 1160 -805 -365 1447 -50 -537
873 -537 765 -557 -1164 212 -288 -565 268 -1486 -1948 826 215 -2359 -1405 -419 -788 520 -167 -2078
891 -2078 -499 354 -1074 -387 -166 -1614 196 1746 -128 -612 452 -168 347 957 -920 -241 1957
$$ packed form
772A946l776j072K982m4j337J130j744k072K588R35k310p33J53J354K993j669
788f76m249K515L932j507k238n19J315L988M01m737q8M048M21q38m35j847R37
805D23L510o14k434o31o62K246L155l331m334L158L412r31k668k749J173M910
821C633r03m789P05L317l45l93j248j929J509K432j439o91k15r18K206J996l732
838h04k122K924J303m96p68j888O58L186j655k669J787J018p79J090n82j243J500
855D60lj561J191N09j465J521J343k039K1R10j214O21Q66j965M40J812j497m87
873e37J302j322o07J376n00k77Q33j754m62K774o11k574R54R86l69J308o87j911
891b078J579Q53j428O87K21j448J810J550j874m84J064o20N15O10j877O79K198
$$ plain form
908 1957 550 -619 641 36 -40 1420 113 -936 1302 1154 -3 697 -287 -1141 1029 1329 -579
925 -579 411 736 -372 984 1286 -1273 -748 749 -23 548 825 -836 -322 1326 -426 -931 224 -756
943 -756 -470 945 -204 -1119 101 -418 -1094 328 -605 -1474 787 303 -1364 -210 50 -1044 73
960 73 -128 -1301 312 1010 -390 2 57 -1192 44 1261 -811 -577 1170 205 310 1003 -519 -339
978 -339 1218 145 -164 1320 321 -221 1278 367 -668 812 730 -369 921 628 -418 738 410
995 410 -1164 173 678 -834 86 838 -535 -152 438 -1012 -627 276 -948 -403 872 -750 -648 872
1013 872 -360 -1282 380 -220 -627 627 -54 -661 675 50 -1070 484 119 -999 410 669 -850
1030 -850 144 327 -1117 -285 237 -850 138 749 -782 -209 942 -651 -740 388 -396 -259 927 -164
$$ packed form
908A957j407j169J260o05p6J460j307j049K238j48j157P00r84q54K170L00j908
925e79R90L25j108J356L02k559N25J497p72N71K77j661N14J648j752n05J155r80
943g56K86J415j149r15J220n19o76J422r33q69K261m84j667J154K60j094J117
960G3k01j173J613O98j400L92N5j249J236J217k072K34J747r65J05O93j522J80
978c39J557j073l09J484r99n42J499r11j035J480q2j099J290k93j046J156l28
995D10j574J337N05j512R20P52j373L83N90j450L85R03j224N45J275j622J02J520
1013H72j232r22J662o00m07J254o81o07J336o25j120J554l65j118J409K59j519
1030h50R94J83j444Q32N22j087R88O11j531N73J151j593q9J128p84J37J186j091
$$ plain form
1048 -164 -262 811 -185 -510 916 20 -689 1168 669 -488 757 541 -700 298 349 -443 858 607
1066 607 -791 230 730 -863 -400 485 -800 -133 881 -335 -151 611 -614 -370 811 -493 -441
1083 -441 1287 309 -170 1169 433 -411 725 401 -171 1368 830 -195 1107 981 -471 670 1018
1100 1018 -405 494 1134 -182 303 409 -805 -43 650 -885 -354 775 -489 -775 380 -768 -1351
1117 -1351 -101 -1039 -1138 93 -706 -1172 -125 -932 -1742 -223 -453 -1578 -325 -117 -1067 -48 -472 -1573
1135 -1573 -323 66 -1097 59 600 -793 -26 817 -814 -567 631 -321 -8 825 -178 82 1262
1152 1262 -163 -538 936 208 -300 1178 547 -215 852 521 -439 480 142 -516 1026 849 -603 396
1170 396 782 -470 41 379 -682 247 950 -343 78 544 -711 -209 838 -617 -641 959 308 -226
$$ packed form
1048a64r8J073r96l25J426q96p09J857m99j157J245k16j241R98N1p92J301k51
1066F07j398J021N00j593M63Q85j285O67J014j216J84P62j225K44J181j304N2
1083d41J728r78m79J339p36q44J136l24n72J539n38j025J302j26j452J141L48
1100A018j423Q99O40j316M85J06j214P62O93j535N31J129j264k86J155j148n83
1117a351J250r38r9J231p99m66J047q07q10J519k30j125J253K08r50J019m24j101
1135a573J250L89j163J156N41j393P67Q43j631K47J198r52L13Q33j003K60J180
1152A262j425l75J474p28n08J478o31p62J067l31r60R19l38o58J542j77j452R99
1170C96L86j252N11L38j061R29P03j293M21M66j255N02J047j455k4J600o51n34
$$ plain form
1188 -226 545 -464 -530 746 -3 -704 635 238 -364 946 155 -1170 433 704 -604 -133 208 -332
1206 -332 734 373 -1391 -350 698 -518 -275 328 -793 -241 721 -785 -1306 -200 -746 -201 444
1223 444 -1191 -1215 721 -114 -1444 -571 -663 -776 509 -417 -1634 -260 122 -1098 -456 -684 -1458 92
1241 92 627 -1095 -732 -58 -628 -130 -94 -1230 -425 909 -24 -330 158 -625 37 1129 -521 -868 1019
1260 1019 950 128 615 -13 94 1419 406 -453 1224 1233 36 1068 961 -109 677 1084 -66 379
1278 379 932 46 936 845 -1069 -110 1321 -312 -927 222 56 306 296 -1421 -1221 473 -231 -1293
1296 -1293 -261 -431 -699 704 -397 -1798 -339 206 -424 156 -532 -1030 870 986 -1121 -858 168
1313 168 31 806 566 -1228 -166 1589 372 -451 -482 -580 752 1639 -712 -1391 703 513 -262 -122
$$ packed form
1188b26P71j009o6J276p49p01J339l97o02J310p91j325J603K71j308M71L41n40
1206c32J066l61j764J041J048j216K43O03j121N52R62j506n21J106n46N45O45
1223D44j635k4J936q35j330Q73r2j13J285r26j217J374L82j220O42k28p74J550
1241I2N35j722L63O74n70M98L6j136Q05J334r33l06M88p83O62J092j650l47J887
1260A019o9q22M87o28J07J325j013q59J677Rj197J032j07j070P86M07j150M45
1278C79N53q86Q90r1j914R59J431j633o15J149j66K50j0j717K00J694p04j062
1296a293J032j70k68J403j101j401J459N45o30N80o88m98J900J16k107K63J026
1313A68j37P75k40j794J062J755j217q23l1r8J332Q87k351o79K094j90p75J40
$$ plain form
1331 -122 -1095 -1164 1225 620 -1058 -791 -600 -272 964 -660 -2407 -299 1419 -174 -902 -802 -942 640
1349 640 631 -1325 -802 580 349 470 348 -1236 -474 1494 542 -486 47 158 977 1651 -165 -975 946
1368 946 1304 254 762 163 -190 1747 1346 -684 -169 588 388 1012 201 -953 589 1286 -488 -380
1386 -380 361 -445 243 827 -517 -479 515 -60 -212 15 -941 -533 1243 -103 -1199 208 209 -531 -52
1405 -52 -705 -751 914 110 -976 201 297 -563 187 13 -1114 183 859 -467 -338 327 -211 72 267
1424 267 -1016 -329 984 -40 -331 333 -541 -120 878 -217 -1074 396 810 421 351 -604 -612 1219 578
1443 578 -1124 -55 786 212 690 131 -834 229 755 -180 8 254 -611 508 1309 -819 -1042 449
1461 449 434 157 83 -765 121 1232 -344 -1095 65 -4 -167 558 -250 -694 687 511 -517 -109 -151 -291
$$ packed form
1331a22r73o9K389o05j678K67J91L28J236j624j747K108J718j593p28J00j40J582
1349F40rj956N23J382k31J21j22j584P62J968r52j028N33J11Q19O74j816q10J921
1368I46L58j050N08n99l53J937m01k030N15P57k00O24q11j154J542O97j774J08
1386c80P41q06O88N84j344L8R94n75j52K27r56M08J776j346j096J407Jp40M79
1405e2o53m6J665q04j086J177R6q60P50j74j127J297O76j326J29O65n38K83J95
1424B67j283O87J313j024k91O64q74M21R98j095q57J470M14l89p0r55qJ831o41
1443E78j702J069Q41n74M78n59r65J063N26r35J88K46q65J119Q01k128k23J491
1461D49j5k77p4q48Q86J111j576p51J160o9j63P25q08m44J381j76j028M08m2j40
$$ plain form
1481 -291 885 592 -781 143 773 -160 234 241 -802 358 1096 -39 31 820 -23 192 541 -592 -140
1500 -140 1070 -68 -480 852 182 -573 137 -164 -458 461 -51 -478 550 -257 -1104 358 117 -1167
1518 -1167 -449 401 -233 -119 -198 -895 -26 206 -991 -422 681 -477 -231 453 -424 -447 354 -220 -184 568
1538 568 -211 -206 1147 79 -761 633 490 -378 549 354 -174 741 565 -305 308 126 -305 701 584
1557 584 -545 277 1005 -251 -230 194 -564 -48 616 -243 -235 236 -560 -275 437 -717 -949 561 83 -616
1577 -616 73 -345 -555 298 -400 -923 145 139 -519 383 158 -936 -137 362 -428 -229 210 -157 466 425
1597 425 -796 -89 772 -121 -142 804 -72 -27 766 255 -239 442 -84 -82 913 145 -347 907 373 -625 313
1618 313 261 -751 158 499 -325 363 189 -847 89 275 -883 -468 369 -597 -230 368 -664 -606 109
$$ packed form
1481b91J176k93j373R24O30r33L94Pj043J160P38j135P0P89q43K15L49j133M52
1500a40J210j138m12J332o70p55P10l01k94R19n12m27J028q07q47J462k41j284
1518a167P18Q50o34J14p9o97Q69K32j197N69J103j158K46O84q77k3Q01n74L6P52
1538E68p79NJ353j068q40J394j43q68R27j95n28R15j76q70O13j82m31J006j17
1557E84j129Q22P28j256K1M24p58N16O64q59QM71p96K85P12j154k32J510m78o99
1577f16O89m18k10Q53o98n23J068oo58R02k25j094P99M99p90J99M39l67O23m1
1597D25j221P07Q61q93k1R46q76M5P93n11m94O81n26KR95p68m92J254n34r98R38
1618C13n2j012R09L41q24O88j74j036R36J86j158M15Q37r66L67N98j032N8P15
$$ plain form
1637 109 -496 -387 153 -467 -288 682 -304 -855 458 79 -431 323 260 -146 726 255 -409 457 309 -393
1657 -393 519 517 -552 330 923 -74 22 296 -344 208 602 -263 108 790 -186 -317 457 -464 -587 486
1677 486 -107 -396 253 -280 -496 298 -502 -707 299 161 -756 201 222 -687 -170 -10 -671 107 114 -527 215
1698 215 353 -620 -41 384 -530 -208 620 14 89 662 92 -175 502 -222 -98 905 317 -73 772 355
1718 355 -174 519 240 -347 565 341 -178 540 200 -542 253 291 -793 -87 516 -360 -49 367 -419 -301
1738 -301 167 -572 -347 395 -513 -363 380 -204 -549 342 -261 -536 320 -34 -186 509 -103 -605 286 108
1758 108 -575 177 315 -341 330 429 -443 77 349 -524 185 437 -410 306 656 -208 -219 315 -165 -96 525
1779 525 -151 -53 714 -87 -261 442 -181 -447 556 253 -398 351 215 -433 111 -23 -514 330 226 -529
$$ packed form
1637A09o05J09N40o20J79R70r86n51J313l79n10P54o3m06Q72m71o64Q66j48p02
1657c93R12kj069Q82N93r97R6K74o40N52L94q65L71O82r76j31P74r21j23J073
1677D86n93k89O49n33k16P94q00k05J006j38r17R57K1r09N17J60o61P78Po41P42
1698B15J38r73N79M25r14L22Q28o06P5N73n70k67O77p24J24J003n88l90Q45m17
1718C55n29O93k79n87R12k24n19P18l40p42P95L8j084P06O03q76L11M16p86J18
1738c01M68p39K25P42r08J50P43n84l45Q91o03k75Q56l54j52O95o12n02Q91j78
1758A08o83P52J38o56O71R9q72N20K72q73P09K52q47P16L50q64j1N34m80O9O21
1779E25o76R8P67q01j74P03o23k66J003l03o51P49j36o48N44j34m91Q44j04p55
$$ plain form
1799 -529 288 214 -647 -114 184 -491 -292 349 -390 -93 372 -481 -233 310 -441 -333 449 -172 -285 717
1819 717 33 -461 200 -76 -317 426 168 -267 753 550 -456 261 372 -393 258 430 -334 557 618 -294
1839 -294 -42 362 -423 -19 525 -295 -92 617 -151 -327 174 -298 -353 370 -127 -467 244 -139 -465 15
1859 15 -251 -810 162 30 -625 59 60 -447 46 -58 -758 12 387 -396 -77 256 -366 -48 412 -396 -146
1880 -146 499 -11 91 632 -118 -125 638 38 -359 459 257 70 653 156 -403 455 284 -410 118 139 -341
1901 -341 463 348 -730 -60 406 -443 -107 74 -561 55 559 -485 -493 221 -446 -354 114 -488 -460 532 -6
1922 -6 -439 47 -382 -331 426 -141 -528 325 278 -302 46 -103 -428 446 337 -426 100 545 -33 173 186 -567
1944 -567 114 643 -50 -21 489 -63 195 604 -456 -515 342 251 -183 225 -328 -178 585 -144 -772 85 280
$$ packed form
1799e29Q17p4q61N33K98o75J99O41p39K97M65q53K48N43p51J08P82o21j13J002
1819G17o84m94O61k76k41P43k58m35J020k03j006P17J11p65O51J72p64Q91O1r12
1839b94K52M04p85M04N44q20K03P09p68j76N01m72n5P23m97l40P11l83l26M80
1859A5k66n59R72j32o55O84Jn07M93j04p00P70L75p83L19L33o22L18M60q08K50
1880a46O45n10J02N41p50pP63o00l97Q18k02j87N83m97n59Q58j71o94N28K1m80
1901c41Q04j15j078O70M66q49L36J81o35O16N04j044qP14o67R2M68o02K8R92n38
1922fm33M86m29N1P57n67l87Q53m7n80L48j49l25Q74j09p63N26M45n78K06J3p53
1944e67O81N29o93K9N10n52K58M09j060n9Q57r1m34M08n53J50P63p29o28Q57J95
$$ plain form
1965 280 -145 252 -117 -643 214 137 -587 -127 35 -397 224 324 -675 -264 247 -234 -150 -34 -450 162 837
1986 837 -359 -333 309 105 -216 257 -210 -79 816 252 -297 299 -8 -144 608 126 -417 386 486 -179
2006 -179 167 162 -513 358 683 -443 -12 507 3 105 35 -673 -157 457 -285 -261 462 -139 -185 77 -428
2027 -428 -517 219 -29 -336 195 88 -296 320 -98 -790 -29 307 -240 29 54 -303 381 167 -765 -126 571
2048 571 17 218 306 -225 93 651 -270 -147 251 126 254 526 -75 -309 623 149 -317 104 58 55 712
2069 712 197 -535 237 240 -241 51 -210 -484 437 541 -522 -388 -37 -254 169 43 -608 -273 471 -59
2089 -59 -299 -30 -557 -277 445 -244 -567 218 194 33 272 -382 -403 506 271 -433 41 187 -38 381 250
2110 250 -545 149 500 61 406 253 -284 340 453 -489 -36 344 -5 166 477 -202 -94 355 -203 -140
$$ packed form
1965B80m25L97l69n26Q57p7p24M60J62m32O21J00r99M11N11m81Q4J16m16O12O75
1986H37j196K6O42k04l21M73m67J31Q95n64n49N96l07j36P52m82n43Q03J00o65
2006a79L46no75Q71L25j126M31N19n04J02p0p08N16O14p42K4P23o01m6K62n05
2027d28q9P36k48l07N31j07l84O16m18o92P61L36n47K69K5l57O84k14r32O39O97
2048E71n54K01Q8n31L18N58r21J23L98j25J28K72o01k34R32m74m66M21m6lO57
2069G12n15p32P72Lm81K92k61k74R21J04j063J34L51k17M23j26o51L35P44n30
2089e9k40K69n27K80P22o89l23P85k4j61K39o54k1R09k35p04M74J46k25M19j31
2110B50p95O94L51m39L45j53n37O24J13r42M53L80l49J71L11o79J08M49n58O3
$$ plain form
2130 -140 415 -280 -277 444 -60 -402 37 -69 -341 119 -126 -441 153 63 -334 15 -44 -657 -102 256 -436
2151 -436 35 367 -276 -66 133 -448 -162 286 -237 -43 552 -91 -176 283 -8 -147 371 -2 -138 565
2171 565 155 -222 285 193 -371 339 225 -294 344 413 -168 62 99 -286 219 235 -338 -14 407 -289 -109
2192 -109 176 -574 -423 307 -303 -412 179 -100 -83 237 -255 -569 134 -75 -360 108 1 -458 229 210 -479
2213 -479 76 99 -50 351 419 -241 271 466 -53 63 259 -202 237 549 -31 145 511 -92 -132 453 -42
2234 -42 73 685 145 -304 232 9 -221 226 -60 -400 454 34 -410 101 22 -423 -157 -4 -382 5 94
2255 94 -485 -156 11 -582 -266 137 -366 -150 328 -247 -309 225 -232 -331 79 -189 -224 300 -117 -217 298
2276 298 7 -392 208 157 -200 208 235 -84 297 221 -155 171 293 -113 265 534 -25 100 325 -312 -130
$$ packed form
2130a40N55o95LP21n04l42M39j06k72M60k45l15N94r0l97L49n9o13N55L58o92
2151d36M71L32o43K10J99n81K86M48n23J94N95o43q5M59k91j39N18l73j36P03
2171E65m10l77N07r2n64P10j14n19O38O9n81K30L7l85N05J6n73L24M21o96J80
2192a09K85p50J51P30o10j09N91k79J7L20m92l14P03k09k85M68j07m59O87j9o89
2213d79N55K3j49M01O8o60N12J95n19J16J96m61M39L12n80J76L66o03m0N85m95
2234d2J15O12n40m49N36k23k30M47k86l40Q54m20m44N11p9m45K66J53l78L87Q9
2255I4n79L29J67n93L16M03n03K16M78n75o2N34m57r9M10k68l5N24m17j00N15
2276B98k91l99O00n1l57M08K7l19L81p6l76L26J22m06L78K69n59J25K25o37J82
$$ plain form
2297 -130 278 59 -174 364 -168 -155 216 -364 -481 202 33 -352 -6 91 -339 129 -65 -498 52 6 -317
2318 -317 146 257 -256 42 171 -422 23 263 -31 56 400 -24 50 427 -222 -36 457 17 -13 304 73
2339 73 -52 370 -108 -367 334 85 -223 266 108 -185 245 55 -427 85 37 -315 100 125 -297 -102 -48
2360 -48 -577 -133 95 -318 -188 223 -209 -187 181 -469 -231 105 -359 -247 394 -64 -389 71 -192 -335 136
2381 136 -62 -306 112 36 -234 167 -68 -339 189 42 -274 167 527 -134 96 231 -152 119 198 -180 149
2402 149 507 -12 -79 252 -30 16 281 19 -75 476 45 -289 290 112 -287 77 -40 -307 260 248 -333
2423 -333 141 144 -319 -18 54 -320 44 221 -327 -42 145 -262 -138 164 -370 -204 245 -169 -300 96 -107
2444 -107 -195 78 -250 -195 364 -67 -362 180 44 -315 56 41 -344 216 200 -185 225 274 -351 74 212 -81
$$ packed form
2297a30M08k19k33N38n32J3L71n80j17O83j69l85L46R7m30M68j94m33N50m6l23
2318c17M63J11n13K98J29n93M45K40k94Q7L44m24P4L77o49J86M93m40l0L17k31
2339G3j25M22m78k59P01k49l08M89j58k93M30j90m82N12m8l52M15K5m22J95N4
2360d8n29M44K28m13J30M11m32K2L68o50K38L36m64J12O41m58l25M60k63j43M71
2381A36j98k44M18p6k70M01k35k71N28j47l16M41L60o61K30J35l83K71P9l78L29
2402A49L58n19o7L31k82M6K65k62r4N51m31l34N79j78l99L64j17k67N67j2n81
2423c33M74Lm63L01P2l74L64J77n48K85J87m07J24L02n34J66M49m14j31L96k03
2444a07q8K73l28N5N59m31k95N42j36l59L71j5l85N60j6l85M10M9o25M25J38k93
$$ plain form
2466 -81 94 320 -120 -129 292 -255 -266 133 -266 -185 188 -123 -223 279 -221 -474 -114 -232 -415 86 -112 -402
2488 -402 175 -7 -427 -42 -70 -318 175 198 -373 138 245 -243 -24 234 -5 177 415 34 278 453 -13
2509 -13 -174 384 48 52 246 77 -41 460 161 -173 208 143 -59 375 266 -157 193 215 -500 -60 35 -268
2531 -268 67 236 -373 -23 -25 -514 -178 46 -339 -185 71 -234 -91 120 -338 -260 215 -314 -238 223 -55
2552 -55 -161 204 -157 -330 202 12 -238 142 100 -61 226 71 -432 84 283 -127 -39 266 -160 170 229
2573 229 -260 -32 350 -150 18 464 27 71 286 -245 -179 311 -79 -234 355 13 -199 182 -74 -353 137
2594 137 -193 -341 319 164 -337 24 118 -110 144 77 -333 160 260 -152 -19 139 -51 83 294 -374 -89
2615 -89 307 149 -58 417 -58 -8 421 95 -244 415 403 -13 330 -27 -147 337 101 -228 162 365 -147
$$ packed form
2466h1J75K26m40rM21n47j1L99l99Q1L73l11j00N02n00k53L60j18j83N01j98k90
2488d02N77j82m20L85k8k48M93K3n71N11J07m88K19K58k39J82K38l81K44J75m66
2509a3j61N58l36MJ94j69j18N01k99l34L81o5k02M34j09m23L50K2p15M40R5l03
2531b68L35J69o09L50km89L36K24l85J54K56l05J43K11m58P8M75n29P6M61k78
2552e5j06L65l61j73N32j90k50L80m2j61K87j55n03N16J99m10Q8L05m26L30N9
2573B29m89K28L82n00J68M46m37M4K15n31O6M90l90j55N89l42k12L81k56k79M90
2594A37l30j48O60j55n01L61R4k28K54o7m10M93J00m12J33J58j90J34K11o68K85
2615h9L96j58k07M75m75N0M29l26l39O59j2m16L43l57j20M84k36l29L90K03n12
$$ plain form
2636 -147 77 52 -289 -29 121 -317 72 317 -213 -54 100 -395 -258 32 -275 -108 73 -260 -306 219 -116
2657 -116 -390 -21 -144 -292 169 -74 -315 88 74 -287 26 -38 -237 203 135 -357 134 362 -111 66 246
2678 246 -182 240 580 -57 -185 416 51 8 195 -200 23 564 -35 -99 297 63 -46 124 -116 -239 257
2699 257 127 -300 124 50 -319 1 60 -379 154 108 -336 -103 40 -271 -282 185 -275 -35 278 -196 -48
2720 -48 229 -102 -309 192 68 -138 294 1 -59 371 63 -251 38 129 27 344 109 -125 294 238 -186
2741 -186 5 255 -191 124 288 -252 147 356 -175 -164 172 -195 -112 169 -183 -125 258 -278 -297 4 -266
2762 -266 -121 180 -99 -390 177 39 -253 -39 49 -199 110 94 -171 48 154 -226 38 180 -89 -25 328
2783 328 -141 135 340 -200 -115 246 -83 -172 368 -31 73 322 -167 -264 305 87 -367 210 117 4 255
$$ packed form
2636a47K24k5l41K60J50m38L89K45n30J59J54m95J37K90l07J67J81l33m6N25l35
2657a16k74L69j23j48M61k43k41M03j4l61L13o4j99M40o8m92M91K28m73J77J80
2678B46m28M22L40o37j28O01l65m3J87l95K23N41n99o4L96k34j09J70k40j23M96
2699B57j30m27M24p4l69L20N9m39N33m6m44K33J43l11j1M67m60K40L13m74J48
2720d8K77l31k07N01j24k06M32k93o0M30l08l14K89R1j02L17k35k34M19n6m24
2741a86J91K50m46L15J64n40L99K09n31J1L36l67Q3K81l52N8L83n36j9L01k70
2762b66J45L01k79k91N67j38k92K14Q8k48L09j6k65K19J06l80K64J42k69O4L53
2783C28m69K76K05n40Q5L61l29q9N40l99J04K49m89r7N69k18m54N77r3j13K51
$$ plain form
2804 255 29 -216 168 224 -413 -24 127 -94 66 85 -293 -64 175 -402 -161 146 -204 -5 169 -397 -292
2825 -292 18 -221 -424 195 -99 -164 313 -31 -181 187 -97 -268 295 213 -47 205 215 -163 256 102 -210
2846 -210 159 298 9 -29 235 3 48 226 -150 41 400 27 58 204 -270 10 292 -174 -187 290 131
2867 131 -43 157 -50 -149 88 -5 -169 239 122 -186 153 32 -182 -6 18 -313 153 198 -344 28 105 -245
2889 -245 -82 -8 -395 -56 275 -117 -220 248 10 -192 116 -281 -168 288 -10 -189 276 35 -205 32
2909 32 -24 -180 314 220 -97 175 158 -170 13 25 -141 151 176 -123 19 183 -230 -98 43 -180 -59 218
2931 218 -33 -158 285 -16 -200 190 -148 -188 202 10 -265 208 58 -143 67 -11 -303 104 108 -141 156
2952 156 296 -110 10 108 -160 77 182 -178 29 502 -132 -93 257 58 156 371 37 117 398 114 -2
$$ packed form
2804B55k26k45L84N6o37L89J51k21J60J9l78K29K39n77K41L07l50J99J74n66J05
2825b92L10k39k03O19k94o5M77l44j50L68k84j71N63q2k60K52J0l78M19j54l12
2846b10L69J39k89l8K64k32M5J78l76J91L59l73L1J46m74K80K82m66j3M77j59
2867A31j74K00k07r9K37r3j64M08j17l08L39j21k14J76K4l31M66M5n42L72P7l50
2889b45J63P4l87L39L31l92j03M68k38k02L08l97J13M56k98j79M65k41k40K37
2909C2n6j56M94r4l17K72j7l28J83J2j66K92K5k99J42J64m13J32J41k23J21K77
2931B18k51j25M43l01j84L90l38m0L90j92k75M73j50k01K10p8k92M07Mk49K97
2952A56J40m06J20R8k68K37J05l60K07M73o34L9L50j99R8K15l34Q0K81k84j16
$$ plain form
2973 -2 296 224 -60 289 100 -89 307 146 -342 10 -70 -198 32 82 -300 -38 -4 -389 -91 59 -421 -213
2995 -213 72 -292 -230 62 -129 -393 -55 -300 -229 27 -216 -13 211 -63 -302 229 -90 -213 170 115 -192
3016 -192 292 181 -206 146 216 -166 99 312 -109 180 251 -126 5 155 -215 57 246 -150 15 158 -104
3037 -104 -70 122 -174 -148 81 -89 -116 295 -42 -198 155 13 -205 140 69 -78 122 39 -315 0 319 -183
3059 -183 55 301 29 78 218 -115 -52 349 -86 67 290 -107 48 358 70 19 228 -128 -39 177 31
3080 31 -67 231 5 -124 98 -41 -262 85 69 -125 178 -78 -282 3 106 -467 -163 117 -304 -167 107
3101 107 -288 -83 113 -229 -189 111 -144 -157 194 -169 -224 -98 -209 -307 92 -81 -277 186 56 -156 142
3122 142 59 -253 68 148 -243 145 120 -157 -112 191 -83 -68 329 -47 22 293 -57 7 259 22 4 225 -2
$$ packed form
2973bK98p2k84L49j89j89L96j61m88L52q0j28K30N0l82K62L4l85K98J50m80K08
2995b13K85l64O2K92j91k64L38k45P1K56k43K03K24k74k39N31l19j23L83n5l07
3016a92M84j11l87L52P0l82K65K13m21K89P1l77J31J50l70K72J89l96J65J43k62
3037a04L4J92k96K6K29j70k7M11l37j56L53j42k18L45p1j47K00q3l54L15L19n02
3059a83K38K46k72M9J40l33O3M01m35J53K23l97J55L10k88n1K09l56Q9K16j46
3080C1r8K98k26j29K22j39k21L47j6j94L03k56k04K85J03n73L04K80m21J37K74
3101A07l95K05J96l42M0L00k55j3L51l63n5J26j11r8L99j73j96M63j30k12K98
3122A42q3l12L21Q0l91L88k5k77M5L03k74J5L97l76O9K71l50O4K52k37j8K21k27
$$ plain form
3145 -2 9 220 -48 -97 122 -62 -116 145 77 -260 89 195 -71 118 -52 -293 106 158 -221 46 70 -191 67
3168 67 53 -177 -190 193 -242 -181 256 -210 -217 86 -128 -38 234 -79 -59 260 -69 -212 151 34 -243 204 33
3191 33 -107 146 103 -85 104 149 -145 235 277 -86 107 58 -7 -50 111 -283 -128 133 -148 -162 269 -207 -235
3214 -235 12 -260 -193 35 -109 -157 91 -99 -189 2 -83 -165 28 124 -193 -28 65 -223 17 149 -193 29
3236 29 167 -109 104 242 -86 34 244 -45 -25 240 -29 98 341 -80 -99 176 78 -114 139 -116 -83 274
3258 274 -54 -233 64 -86 -226 79 31 -107 221 102 -232 -124 121 -228 -56 50 -249 -99 83 -153
3278 -153 -270 129 -131 23 165 -86 -148 226 -37 -138 175 -80 -159 159 23 -81 266 134 55 79 65 -169
3300 -169 197 180 -137 110 172 -140 17 57 -203 27 143 -5 -27 150 -138 -47 128 -51 -138 134 -14 -116
$$ packed form
3145bJ1K11k68m9K19j84n4K61o8l37L49J06k66J89j70k41L99N2l79K67K4k61K58
3168F7j4k30j3L83m35O1M37m66pL03k14R0K72l13K0L19l29j43L63j17k77M47j71
3191C3j40K53m3j88J89M5k94L80M2l63J93m9o5m3J61l94J55K61k81j4M31m76k8
3214b35K47k72O7K28j44m8K48j90r0J91q5q2J93R6l17J65R3k88K40J32l42K22
3236B9J38k76K13J38l28J20K10k89K0K65k69J27K43m21j9K75r8j92K53k55L3L57
3258B74l28j79K97j50j40L05m8j38L28j19l34J08K45l49J72J06k99J50J82k36
3278a53j17L99k60J54J42k51o2L74k63j01L13k55p9L18j36j04L47j32p9K4j4k34
3300a69L66j7l17K47O2l12J57M0k60K30J16j48k2J77k88R1J75j79q7K72j48j02
$$ plain form
3322 -116 273 -136 -173 125 -37 -280 238 48 -227 132 -7 -210 6 -68 -247 78 98 -247 69 240 -33
3343 -33 -39 141 -78 -7 62 -115 -17 197 3 -4 200 27 -55 182 22 -89 194 99 -39 161 99 -288 116 103
3367 103 -81 84 98 -64 106 72 -287 13 306 -154 40 170 -220 -21 124 -201 -220 94 -62 -140 181
3388 181 -38 -20 170 -146 -153 130 -81 -253 114 -70 -207 66 72 -138 48 133 -47 171 184 -100 -29 190 -331
3411 -331 69 142 13 54 220 -99 12 168 -18 20 138 -82 33 87 -22 -46 180 -11 -54 168 -47 -183
3433 -183 77 86 -82 -22 -12 -139 -119 -33 -286 15 4 -203 -162 -15 -320 -153 -26 -277 41 96 -201 -187 -80
3456 -80 -204 -221 141 -147 -118 230 39 -146 -39 81 -140 158 119 -8 158 161 -40 137 94 -186 186 197 -27
3479 -27 172 126 -104 0 105 -220 -18 58 4 -18 121 -92 -187 40 -39 -107 53 -117 -35 288 -44 -127 16
$$ packed form
3322a16L89m09l7K98j62k43N18j90k75L59j39k03K16p4j79L25K0l45L16J71k73
3343c3oJ80k19P1O9j77R8K14j94pK04j73q2K37j60j11K83r5j38K00o2l87M04j3
3367A03j84J65J4j62J70l4l59L00K93m60J94J30l90J99J45l25j9L14j56p8L21
3388A81k19J8J90l16pK83k11j72L67j84j37K73Ok10J86Q5j80K18J3k84P1K19n21
3411c31M00P3j29M1J66l19J11J56j86L8J18k20J15N4j09k4K26j91m3K22k15j36
3433a83K60Rj68O0J0j27K0Q6k53L01j1k07M1J47l05J67J27k51L18N5k97J4J07
3456h0j24j7L62k88K9L48j91j85J07J20k21K98l9j27J66Lk01J77m3k80L72J1k24
3479b7J99m6k30J04J05l25K02P6n4k2J39k13r5K27p9o8J60j70Q2L23l32q3J43
$$ plain form
3502 16 -79 -259 8 91 -94 36 118 -83 -4 76 -183 106 77 -166 -1 150 -81 89 215 -60 -40 278 -13
3525 -13 85 286 118 -105 170 48 -114 79 -13 -27 152 106 -146 129 101 -108 155 40 -95 53 8 -161
3547 -161 -70 74 -237 -110 -47 -219 -82 -43 -218 -78 53 -238 -153 138 -217 -138 295 -113 -137 46 -3 -110
3569 -110 102 12 105 154 88 -12 178 3 -73 116 83 10 171 72 -178 61 43 55 9 127 -33 -32 179 -99
3593 -99 9 133 -192 90 148 51 -36 229 -74 -208 208 -4 1 123 126 20 176 77 -140 31 58 -244 111
3616 111 -2 -117 -14 -117 -231 57 102 -233 -120 118 -161 153 185 2 -54 -71 -213 -207 181 -96 -92 144 -61
3639 -61 125 165 -131 -102 65 113 -49 148 90 -203 123 -21 -234 58 210 -262 2 157 -97 -95 76 -50
3661 -50 -47 89 -32 -4 112 -130 107 75 -165 -163 163 20 -108 56 5 -84 8 -87 -164 0 3 -84 -72 37 -141
$$ packed form
3502A6r5j80K67Q3j85J30Q2k01P9Q0k59K89k9k43J65J51k31J70J26k75K0L18k91
3525a3R8K01j68k23K75j22j62J93r2j4J79m6k52K75k8k09K63j15j35J48m5j69
3547a61R1J44l11J27O3j72J37L9j75J40J31k91Q5K91l55P9M33m08k4J83m9j07
3569a10K12r0R3M9o6j00J90j75p6J89l3p3J61r9k50K39j8J2m6J18j60JK11k78
3593i9J08J24l25K82N8r7q7K65l03j34M16k12NJ22Lj06J56r9k17J71K7l02L55
3616A11j13j15J03j03j14K88M5l35J13K38k79L14L2j83n6j7j42OL88k77MK36k05
3639f1J86M0k96K9J67M8j62J97n8k93L26j44k13K92J52m72K64J55k54KJ71j26
3661e0LJ36j21K8J16k42K37l2k40KL26j43j28J64n1q9R2r5p7J64Lq7J2J09j78
$$ plain form
3686 -141 49 45 -238 -87 32 -248 -110 222 44 77 113 -104 116 149 -86 -68 87 129 -73 306 89 -65
3708 -65 218 46 21 176 19 -17 212 130 -83 29 -48 1 52 28 -165 -117 35 -306 -14 -41 -213 -90 8 -185
3732 -185 -145 79 -240 -147 36 -165 -100 115 -78 -79 22 -121 -110 172 8 -103 250 156 -90 104 60 -139 88
3755 88 134 144 86 115 -149 51 90 -210 33 156 -87 -53 125 -52 -55 172 -115 -4 116 -26 -66 0 -62 -82
3779 -82 88 36 -95 44 -51 -86 -98 -42 -192 71 2 -205 -66 67 -111 7 60 -100 54 111 -173 123 203
3802 203 18 36 213 40 -13 209 43 -182 19 62 55 192 11 -18 56 -2 -180 116 47 -100 13 35 -152
3825 -152 -65 62 -125 13 148 -219 -29 111 -66 -84 175 -198 48 78 -149 -28 96 -207 -103 167 -72
3846 -72 -308 -11 -95 -205 228 -70 -45 111 -30 -138 100 -126 -84 105 81 -53 69 13 -99 121 144 -39
$$ packed form
3686a41J90mk83J51J19k80J38L32j78L3L6k17K20L3k35J8J55M2k02L79k17j54
3708f5K83j72k5J55j57l6K29q2k13J12p7M9N1k4j93M8J52l41K92k7j72J23R8j93
3732a85M0K24l19R3J83k01O5K15j93jJ01j43J1K82j64j11L53r4k46J94m4j99K27
3755H8M6J0n8K9k64K00L9l00K43J23k43L4J78j77lK27k87J11J20j42m0O6o2k0
3779h2J70n2j31J39r5l5j2N6j50K63o9k07J39J33j78J18N3j60J54N7k84K96Q0
3802B03j85J8J77j73n3K22j66k25K01M3pJ37j81k9P4n8j78K96o9j47J13K2j87
3825a52Q7J27j87J38J35l67J90J40j77j8K59l73K46L0k27J21J24l03J04K70k39
3846g2k36K97q4j10M33k98K5J56j41j08K38k26M2J89k4j34J22n6j12K20K3j83
$$ plain form
3868 -39 83 212 -72 77 191 43 27 127 -5 40 278 -87 -86 123 -20 -140 116 30 -14 -28 48 -92 166
3891 166 23 -61 15 -3 -63 -58 71 -125 -63 85 -228 -28 172 -102 81 129 -53 -89 14 -123 -87 135 -51
3914 -51 -117 138 -21 -168 104 -3 -143 62 -45 -26 185 154 -125 70 125 -185 -56 205 -43 47 227 -37
3936 -37 5 77 -107 -78 15 -73 21 93 -137 -67 89 -80 -124 30 -104 -99 22 -21 -100 26 -125 -187 112 61 -83
3961 -83 19 20 -81 38 117 -171 -15 70 -32 33 -65 -94 20 -22 -89 -122 56 -56 51 126 -4 79 181 -68
3985 -68 -46 95 19 9 128 8 -16 22 -18 -220 62 47 -67 -3 15 -61 21 61 -122 -36 -66 -194 1 157 7
4010 7 -23 58 -86 -123 66 -133 12 86 -218 -72 142 48 -61 -9 -2 -108 87 19 -184 73 87 -42 80 104
4034 104 -118 162 200 31 0 58 -116 -1 166 -129 93 101 -22 36 185 -48 -50 110 -78 -99 202 -13 -121
$$ packed form
3868c9J22J29k84J49J14j48j6J00j32M5K38l65JK09j43j20K56q6m4j4P6j40K58
3891A66j43q4P6j8o0NJ29j96O2J48l13K00K00k74J83M8j82l6J03j37L6K22j86
3914e1o6K55j59j47K72j07j40K05j07J9K11l1k79J95N5l10J29K61k48R0J80k64
3936c7M2P2j84K9R3q8R4P2k30P0J56j69m4J54j34NJ21m3p9J26j51o2K99n1j44
3961h3J02Jj01J19P9k88J56Q5j02O5r8k9J14m2o7l3J78j12J07P5j30Q3J02k49
3985f8K2J41p6j0J19j20k4L8m0k02K82j5j14O4J8p6Q2M0j83Q6l0j28J95J56j50
4010Gl0Q1j44l7J89j99J45P4l04J46K14r4j09N2Pj06J95o8k03K57J4j29J22K4
4034A04k22K80L8j69l1N8j74J15J67k95K22Qj23N8J49k33kJ60j88k1L01k15j08
$$ plain form
4057 -121 91 -53 -247 -121 -122 -140 -89 70 -125 120 47 -43 -2 66 -195 -54 63 -96 -68 -34 -113 -91 88 -63
4081 -63 -12 190 -113 98 233 -98 -20 97 -16 35 115 -100 -55 64 35 -110 159 -11 -63 81 -7 -98 166
4104 166 22 -89 -59 -43 -29 -51 78 -64 15 105 -129 -84 75 -161 3 76 96 -113 103 -6 -24 -14 -79 73
4128 73 126 36 -123 117 -58 -170 25 -56 -63 54 78 -171 127 48 -217 91 64 -97 100 31 -46 88 7 -53
4152 -53 -20 167 -40 35 193 -93 13 82 2 -91 9 -13 -5 125 141 -50 103 166 -129 92 16 -178 42 43 -141
4177 -141 -86 5 -194 50 -7 -141 -131 -3 -54 -206 95 -93 -83 14 -18 -31 45 -33 -101 -9 -73 -124 73 -5 -75 52
4203 52 151 -120 205 12 -126 137 83 -43 74 151 7 46 124 -125 2 168 51 -5 136 -82 18 87 -149
4226 -149 -103 164 -56 -36 27 -39 -44 39 -44 -60 16 53 -163 34 70 -125 12 -2 -183 -7 -41 -220 108 83 36
$$ packed form
4057a21K12j44j94J26jj8N1J59j95K45p3r0M1O8k61J41J17j59K8L4p9K2J79j51
4081f3N1K02l03K11J35l31P8J17j13N1Q0k15M5J19k9j45K69j70n2J44q8r1K64
4104A66j44j11L0J6J4k2J29j42P9R0k34M5J59k36J64P3K0k09K16j09j8J0o5J52
4128G3N3r0j59K40j75j12J95q1pJ17K4k49K98p9k65L08k7j61J97o9p7J34q1o0
4152e3L3J87k07P5J58k86J06O9q0r3J00k2QJ30J6j91J53O3k95K21p6j94K20Jj84
4177a41N5R1j99K44n7j34J0J28n1j52L01j88J0R7l2j3P6p8o8R2o4n1J97p8p0J27
4203E2R9k71L25j93j38K63n4j26J17P7j44L9P8k49J27J66j17n6J41k18J00O9k36
4226a49M6K67k20K0O3o6nQ3q3j6P6L7k16J97L6j95J37j4j81J76l4j79L28k5m7
$$ plain form
4251 36 66 -38 -150 -14 148 -37 -16 85 21 5 48 -94 -157 112 -54 -79 119 -73 -76 102 29 -31 37 -33 -104
4276 -104 60 65 -79 32 48 -178 -76 109 -64 -73 146 -89 -106 68 -259 -260 9 -236 -18 -56 -24 -111 85 -93
4300 -93 -38 103 -81 -42 72 3 -121 94 53 -198 15 122 -106 128 152 13 51 30 -46 60 -27 -84 20 105
4324 105 -22 -50 40 -90 -44 81 -22 -49 124 -26 29 90 -141 -50 64 -20 -112 -80 -35 -50 25 -66 -39 -20 7 -146
4350 -146 23 134 -28 152 4 -104 50 61 -114 -55 24 -53 -91 66 -91 16 92 -136 45 199 13 -80
4372 -80 155 -62 -167 61 -52 -28 150 -50 -86 96 91 -111 94 100 -42 133 116 -15 66 156 -81 -50 128 -11
4396 -11 -70 72 -55 -25 21 -98 -124 147 -81 -49 -5 1 -38 109 31 -136 -7 -66 -6 41 124 -62 22 -40 -135 10
4422 10 135 -125 104 -18 -126 36 177 -21 -22 211 -128 -73 149 57 -105 105 -145 -69 23 -72 -98 140 94
$$ packed form
4251C6L0j04j12J36J62j85K1J01o4j6M3j42o3K69j66k5J98j92lJ78p3o0O8p0p1
4276a04J64Nj44J11J6k26J02J85j73rK19k35j7J74l27jK69k45K18l8L2q7J96j78
4300i3N5J41j84L9J14o9j24K15m1k51K13J07k28K34K4j39L8k1p6J06q7n7J04Q5
4324A05j27k8R0j30M6J25j03k7J73j50N5O1k31R1J14q4r2L2M5j5P5r1K7J9K7j53
4350a46J69J11j62J80j48j08J54J1j75N9P9p7l8J57j57J07P6k28J81J54j86r3
4372h0K35k17j05K28j13K4J78k00l6J82nk02K05Oj42J75j7j31Q1R0k37L1J78j39
4396a1n9J42j27L0M6j19k6K71k28L2M4Ol9J47p8j67J29n9O0M7Q3j86Q4o2r5J45
4422A0J25k60K29j22j08J62J41j98jK33l39N5K22r2j62K10k50P6R2r5k6K38m6
$$ plain form
4445 94 -56 80 -2 69 30 -12 -102 86 49 -84 73 -37 35 26 41 -190 -20 -3 -33 17 1 -35 -58 -101 -53 -58 22
4472 22 -148 -27 153 28 -136 -26 -34 -109 48 -134 20 98 68 -61 55 32 23 94 93 -103 144 53 -132 11
4496 11 22 -51 -46 98 -24 -27 167 -120 -16 -6 -57 -30 136 -2 -1 152 -143 -92 111 27 -110 91 -16 -126 76
4521 76 -72 -31 28 -18 -73 -4 29 -63 74 47 -102 7 61 -117 -35 -37 -45 61 160 -35 -23 -9 -109 -110 91 74 -72
4548 -72 177 -107 90 136 -64 -106 112 6 -56 84 -117 -91 -28 24 -60 14 44 -86 27 56 29 -66 -16 -67 130
4573 130 60 -64 -78 48 -77 73 184 -148 -154 70 -7 -69 114 -105 -127 126 49 5 -11 12 -79 -3 50 -62 87
4598 87 37 -13 113 98 30 -106 89 -68 26 16 -110 79 142 -15 -55 43 -124 58 80 -11 -12 27 8 -30 13 -59
4624 -59 -6 55 44 -62 27 -1 -83 132 -81 -176 -61 -65 -148 102 67 -104 -15 76 -29 16 42 -59 48 194 -19
$$ packed form
4445I4j50J36q2P1l9m2r0J88l7j33J57j10P2rJ5k31J70J7l0N0j6l6k3m3M8nQ0
4472B2j70J21J80j25j64J10qp5J57j82J54P8l0j29J16k3rP1jj96K47r1j85J43
4496A1J1p3NJ44j22lJ94k87J04J0n1K7J66j38JJ53k95N1K03q4j37K01j07j10K02
4521G6j48M1N9m6n5O9L3r2J37k7j49J09N4j78Q2kqJ06R9j95J2J4j00jK01j7j46
4548g2K49k84J97M6k00m2K18j06o2J40k01K6O3N2q4P4L0j30J13K9k7r5N0n1J97
4573A30p0j24j4J26j25J50J11l32oK24p7o2J83k19k2K53p7m4j6K3r1P6N3j12J49
4598H7n0n0J26j5o8j36J95j57R4j0j26J89O3j57m0R8j67J82K2r1jL9j9l8M3p2
4624e9N3O1j1j06Q9k8q2K15k13r5J15mq3K50l5j71Q9R1j05M5K6j01J07J46k13
$$ plain form
4649 -19 37 254 125 -70 70 -52 -13 97 21 -133 68 7 -37 80 -72 -9 50 84 -158 96 199 -94 28
4672 28 21 24 70 53 -28 166 15 -140 -83 135 -36 63 100 73 -68 9 60 -172 -8 93 -64 231 -28 18 171
4697 171 -91 -177 26 -46 -54 51 5 -103 -12 43 14 61 5 -147 -58 113 21 18 97 18 -84 121 20 -61 68 -149
4723 -149 12 134 -12 -74 45 44 -88 60 -87 -10 61 81 -86 -61 5 -35 113 -35 -149 -147 -18 -142 -14 68
4747 68 62 -99 144 -132 -145 130 -74 -10 -2 66 -67 26 98 -17 38 -68 28 128 -8 -2 128 80 27 61 -6 -54
4773 -54 -12 169 -21 102 6 24 34 119 -60 -27 90 -61 36 -58 -39 82 118 -12 -104 28 -47 -118 20 -123 -217
4798 -217 155 25 -12 23 5 -47 -43 9 -101 1 21 -62 -62 83 -99 29 82 -36 95 62 30 95 58 6 83 39
4824 39 -24 -54 48 -11 -199 80 -7 -45 37 -28 -112 21 47 -48 24 -77 -12 70 -7 -143 62 63 -108 -107 -179 -100 -92 117
$$ packed form
4649a9N6K17j29j95J40j22L9J10p6j54K01o1m4J17j52O3N9L4k42K54J03k93J22
4672B8pLM6j7q1J94j51j55N7K18j71R9L7k7j41P7N1k32J64J01j57K95k59M6J53
4697A71k62q6K03p2qJ05m6j08R1N5k9M7n6j52Q9J71r2lP9p9j02K05j01q1J29k17
4723a49J61J22j46o2J19jj32J48j47P7P1K0j67K5O6m0J48j48j14KJ29j24J28Q2
4747F8oj61K43k76j3K75k04O4QO8j33R3P2j15N5j06R6J00j36OJ30m8n3L4o7m8
4773e4M2J81j90J23r6J8J0Q5j79L3J17j51R7r4J9J21L6j30r2J32p5p1J38j43r4
4798b17L72j30l7L5j8n2MN2j10J02K0q3%J45j82J28N3j18J31l3l2O5l7n2P7m4
4824C9o3l0J02n9j88K79q7l8Q2o5q4J33K6r5P2j01O5Q2p7j36K05Jj71Jp2P9QK09
$$ plain form
4852 117 27 -95 85 -98 -120 -120 -86 -119 26 -55 -58 45 -6 57 -66 -144 -51 96 22 -136 37 44 -62 184 -109
4877 -109 -101 117 69 -23 -4 70 -69 8 124 -152 -84 3 59 100 130 -68 -13 78 -152 -124 77 -61 -87 36 -30 -76
4903 -76 0 -18 -177 -36 34 -6 46 -28 -166 -67 -56 -48 126 14 -141 -191 142 -28 -66 -36 -78 -43 -36 -70 -66 47 -36
4930 -36 93 28 -80 35 181 88 -64 62 38 8 148 59 -18 55 28 -14 2 -2 8 15 -40 0 -16 -58 -70 36 103
4957 103 37 13 9 -148 -1 86 -15 28 25 -100 -80 -13 -146 -182 -88 18 15 -62 44 -114 46 4 -89 72 51 -88
4983 -88 2 -40 10 69 -31 -103 14 -20 -11 50 -44 16 46 185 -58 136 165 -92 -4 29 25 -85 3 10 -1 -41 -15 -94
5011 -94 205 97 -214 99 38 -70 -51 72 -142 -31 78 -92 2 89 -179 -32 90 -151 -102 43 -34 -76 -98
5034 -98 -144 -47 64 126 125 52 -53 -83 121 -3 -2 128 -40 17 102 -125 -62 33 101 33 131 60 -116 71 -14 -48 95
$$ packed form
4852A17r0j22J80j83k2%L4l3J45q1lJ03n1O3j23p8R3J47p4j58J73Pj06K46k93
4877a09QK18m8r2J9P4j39P7J16k76O8Q7N6M1L0j98N5R1k30K8K01j38k6J23o6m6
4903g6P6j8j59J41P0m0N2p4j38R9J1QJ74j12j55n0L33j70l8L0m2L5Pl4MJ13q3
4930c6J29o5j08J15J46r3j52J26k4l0J40q9p7P3k7m2J6mJ0Pn5M0j6m2j2J06O7
4957A03o6k4mj57J47Q7j01M3lj25K0O7j33l6R4J06lp7J06j58J60m2r3J61k1j39
4983h8R0m2N0N9j00p2J17l4RO1r4O0L0J39k43J94K9k57Q8L3mj10Q8Pj1m0K6p9
5011i4K99j08l11L13o1j08J9J23k14J11J09j70R4Q7k68J47J22k41M9J45p7m2k2
5034i8m6R7J11O2jp3j05l0K04j24JJ30j68N7Q5k27O3R5O8o8R8p1j76J87q5l4J43
$$ plain form
5061 95 10 -93 8 41 -8 -33 40 -57 -60 59 -56 34 -84 -35 -21 66 88 -70 61 110 -170 -4 -151 -89 16
5086 16 78 -177 46 97 -95 -15 -62 -98 -29 37 -173 44 90 -68 -52 67 -111 -41 111 -39 22 145 -119 -28
5110 -28 82 -70 -178 45 46 144 -21 83 5 79 17 -118 -8 -2 45 48 101 -106 46 -16 9 37 -38 18 5 -29 -57
5137 -57 -65 43 -50 -19 32 75 -20 24 -121 -41 31 58 -101 157 -23 -115 51 44 -96 9 21 -122 -65 7 10 -33 218
5164 218 12 57 -26 -47 -23 121 -13 -39 66 -42 99 130 3 30 77 25 -7 75 -41 17 48 -53 -82 69 23
5189 23 -175 -82 -67 88 139 49 -16 54 -67 -14 25 62 -127 -101 -103 64 27 93 88 -3 79 -19 45 103 45 140 119 22 12
5218 12 -13 -31 -136 14 15 -54 21 70 -28 -72 -32 -48 -31 164 10 32 138 -50 72 75 -83 50 131 -40 -56 -11
5244 -11 -146 3 -50 -143 -45 149 -82 -79 55 46 -26 8 -111 -49 39 107 -65 -64 39 143 60 77 69 70 -83 12 0 69
$$ packed form
5061I5q5j03J01L3m9k5P3r7lJ19j15R0j18M9J4Q7K2j58J31M9k80J66j47O2J05
5086A6O2k55K23N1j92Q0m7l6O9O6k10K17M6j58J6J19j78P0J52j50O1J23k64R1
5110b8J10j52j08K23JR8j65J04p8P4o2j35J10OM7LN3k07J52o2K5K8p5N6j3l4k8
5137e7qJ08r3L1N1M3r5M4j45Q0P2K7j59K58j80r2J66pj40J05J2j43N7P2Lm3K51
5164B18k06M5q3k1K4J44j34k6J05j08J41L1j27K7M7n2l2Q2j16N8L1j01k9J51m6
5189B3j98R3J5J55N1r0o5P0j21N3L9L7j89K6kJ67l7O6nr1Q2r8O4N8n8R5k1r7j0
5218A2k5j8j05J50Jo9P5M9r8m4M0j6J7J95j54K2J06j88J22Lj58J33Q1j71j6M5
5244a1j35J49n3r3R8J94k31LJ34rp2L4j19O2Q8O8j72JJ03J04q3J7qJj53R5j2O9
$$ plain form
5272 69 -78 25 86 -135 30 36 42 -5 54 -149 53 -59 22 5 83 72 -62 4 62 -26 61 143 -48 -33 100 -126
5298 -126 0 53 5 0 110 -144 -68 38 -51 143 91 -36 44 -63 -103 -2 9 1 -101 -60 -23 -61 52 4 -85 8
5324 8 15 -34 73 95 -55 57 -36 -117 118 107 -59 31 80 44 137 15 -13 43 70 -42 108 89 26 132 87 -33
5350 -33 -137 161 -73 -45 107 4 -31 -18 -25 25 -37 19 -102 41 57 -78 -28 -29 -98 123 -110 7 164 134 40
5375 40 -26 39 -115 41 -109 -25 14 -25 51 3 36 -74 -30 74 -23 -50 59 72 10 -96 -82 -89 -15 -24 30 75 36 -86
5403 -86 200 41 -89 -60 -7 -69 41 57 -137 52 -39 60 31 -14 -3 28 1 -59 31 20 -132 -113 -39 -104 0 104
5429 104 -4 -86 111 4 -16 58 31 -25 -20 146 -135 -7 0 -4 79 -15 -72 -34 67 -28 2 167 -27 -99 -137 -70 98
5456 98 79 -36 20 139 -98 57 65 -37 -34 102 -84 -49 28 -34 67 -56 30 -54 19 22 -12 -50 7 0 140 48 19
$$ packed form
5272F9j47J03O1k21J65OOm7N9k03K02j12Q1j7P8j1j34O6N8q8Q7Q2j91J5J33k26
5298a26J26N3m8nJ10k54P6J06q9J94n2j27Q0j07m0J01J1qj02M1L7l8J13m8q9R3
5324HPm9J07K2j50J12r3q1K35j1j66R0M9l6R3j22k8N6K7j12J50j9o3J06m5j20
5350c3j04K98k34K8J52j03l5J3pN0o2N6j21J43J6j35N0jo9K21k33J17J57l0r4
5375D0o6O5j54J56j50Q4L9l9P6m8L3j10M4J04r7k7J09J3o2j06J4pP4rN4M5l9j22
5403h6K86j59j30K9N3o2J10J6j94J89r1R9k9m5J1L1k7o0R0j1j52J9P4o5J04J04
5429A04j08q2J97j07k0P4k7n6NJ66k81J28PmQ3r4n7L8J01r5L0J65j94p2l8O7J68
5456I8j9j15N6J19k37J55Qj02LJ36j86L5P7o2J01j23Q6q4P3Ll4l8N7pJ40r2k9
$$ plain form
5483 19 -10 -31 4 -48 173 -126 45 61 13 -33 60 -52 -115 37 -20 -54 10 -7 82 126 -59 -16 85 37 -104 -12
5509 -12 74 -13 95 17 -101 77 111 -11 72 82 14 27 42 -98 49 -19 -43 -88 86 14 -69 209 -103 -16 52 -34
5535 -34 -109 -64 37 -13 116 46 -31 22 -93 125 10 26 11 27 -16 -60 30 -153 -8 46 20 -109 65 96 34 -70
5561 -70 103 157 8 -40 -136 -104 5 23 35 94 -72 24 80 59 -104 79 -56 -109 70 41 -18 89 -14 8 -91
5586 -91 77 11 -56 -63 -276 -34 1 -77 -22 -44 -107 -70 -14 -25 -75 112 -81 -100 64 -44 -99 76 -30 -49 -2 93
5612 93 -7 -15 -17 78 2 5 -51 87 143 -38 53 5 10 -42 82 5 14 55 36 -32 141 38 -57 7 -56 26 -4 16 -4 4
5642 4 62 -79 -2 -46 -180 18 3 -79 -56 -1 -97 53 -8 -130 33 44 -127 -53 1 -114 -24 43 -50 69 -25 95
5668 95 10 128 -126 12 -129 52 26 62 -27 35 -60 -113 23 -2 56 -79 120 143 -11 89 60 -77 -4 2 46
$$ packed form
5483A9k9k1L5n2K21k99J71J6m8m6R3j12o3J52n7l4O4j7Q9M4j85M3J01m8j41R2
5509a2Q6q7J08p8j18J78L4j22Q3J0o8J3J5j40J47o8k4m5J74p2q3K78l12Q7O8q6
5535c4p5M5J01n0J29p0p7N3j15K18j15J6j5J6m3m4R0j83J45N4k6j29J74L1o2j04
5561g0J73N4j49m8r6L2J09J8J2N9j66R6N6k1j63J83j35n3J79k9n9J07j03K2r9
5586i1J68o6o7pk13K42L5p8N5k2o3L7N6j1n0J87j93j9J64j08n5J75j06j9M7R5
5612I3j00qkR5p6Ln6J38N6j81R1m8Nn2J24p7RM1j9o8J73j03r5O4o3Q2l0K0k0Q
5642DN8j41P7m4j34J98j5q2K3N5r6J50o1j22J63J1j71P4N4j15R0O7r3J19r4J20
5668I5q5J18k54J38j41J81k6L6q9O2r5n3J36k5N8j35J99K3j54J00k9j37P3OM4
$$ plain form
5693 46 -53 1 -106 -57 85 -54 -13 -18 -4 -46 111 -64 -1 -20 79 -49 71 -55 -66 75 -171 -63 4 -78 -168
5718 -168 95 69 -37 88 -47 -91 247 27 29 21 193 -108 48 102 -57 53 58 -28 66 131 87 -111 -9 -24 -33
5743 -33 -4 -7 67 -175 90 -120 -15 55 -46 74 40 -83 -6 -60 -16 73 -109 -34 97 50 -8 -58 84 -91 36
5768 36 -35 -100 2 23 -28 142 -10 -41 77 19 -30 -72 6 109 -11 -39 20 38 79 58 -42 63 27 72 -10 -17 -46
5795 -46 -69 41 -113 2 37 -100 -22 19 -46 4 -55 -140 -134 88 86 22 74 -6 -37 9 61 -23 -80 -17 -13 -62 -36 -115 -6
5824 -6 54 -103 30 60 11 4 -93 -51 -27 -25 18 -50 -77 44 -4 7 86 68 -13 -25 104 98 -70 -82 -32 -6 -9 -49 68 16
5854 16 -21 91 -87 72 -3 -109 52 -24 66 75 -50 -129 -28 36 -82 19 16 22 98 14 61 -30 15 -20 -108 51 -154
5881 -154 -54 43 25 -36 61 -60 -78 -31 -3 -80 -123 208 -44 54 0 -48 -3 56 1 30 -99 -112 -23 89 38 88 94
$$ packed form
5693D6r9N4j07M9J42j39M1nJ4m2J57j75O3j9R9j28J20j26j1J41k46J08O7q2r0
5718a68K63k6j06J25j35m4L38k20KqJ72l01J56N4j59J10Nq6R4O5m4j98J02j5r
5743c3K9lP4k42K65k10J05P0j01J20l4j23P7n4M4Q9j82P5J31m7n8n0J42j75J27
5768C6p1o5J02K1n1J70j52l1J18n8m9m2P8J03j20k8N9J8M1k1j00J05l6M5q2pk9
5795d6k3J10j54J15L5j37P8M1o5N0n9q5OK22ko4N2q0l1M6N2q4n7O3Mm9K6p9J09
5824fO0j57J33L0m9pr7M2K4KM3o8k7J21m8J1P9j8q1j2J29oj68j2N0K6lm0J17n2
5854A6l7J12j78J59p5j06J61p6R0Rj25p9J01O4j18J01lOP6q4M7r1M5l5q8J59k05
5881a54J00R7j8o1R7j21j8M7K8p7m3L31k52R8n4m8M5N9n5K9j29j3Q9J12n1N0O
$$ plain form
5908 94 -13 14 46 -9 -23 99 35 -71 -66 41 50 84 32 36 44 -68 -62 -3 5 51 3 63 -107 82 -50 -78 82 -66
5936 -66 -8 -107 -66 -36 109 52 -38 78 120 36 9 41 99 -71 -12 109 -101 39 -36 -35 45 131 -67 -37 -21 -6 -63
5963 -63 -64 -87 27 23 -1 -45 -43 59 81 -4 84 28 26 -137 -2 38 -63 -61 31 -12 -41 -10 -22 -57 37 -45 -82 15 -19 -18 -1
5994 -1 23 -202 -37 38 -78 -22 13 -39 -75 -42 -29 -23 8 -201 126 -76 -162 -53 77 -70 -65 123 -35 -1 68 -54
6020 -54 -27 12 37 -15 -46 -3 -98 95 92 -87 -72 -17 38 -8 65 59 -23 4 -17 128 1 -46 -23 9 -142 -89 53 -55
6048 -55 -18 30 42 -58 51 -83 -49 -75 -59 -38 58 43 -38 103 20 -27 4 56 -93 46 92 40 130 -3 -129 67
6074 67 2 -2 52 15 -30 52 -119 -13 -63 52 20 -46 171 54 -18 72 13 -152 25 -76 -166 15 -54 -83 -125 -139
6100 -139 -25 32 -72 -15 92 -198 -50 73 2 -52 -26 -82 -70 -83 36 -130 -22 57 -140 -54 48 2 -107 55
$$ packed form
5908I4j07K7L2n5j4J22o4j06NJ07RL4n2MQj12ON9QM6m8O0j70J89j32k8J60j48
5936f6N8r9M1L0J45n7r0J16M2q4k7L2N8j70N9J21k10J40p5JQ0Q6j98L0J6J5n7
5963f3jk3J14mk4m4KJ02K2q5Q8n6kj63J35M0j01KR2m3k9L1j2l5R4q2l7R7l4JJ7
5994aK4k25J65P5j16N6L5n2l6L3J3OL1k09L27k02q6J09J30j47NJ88j58L4O9j22
6020e4K7L9K5n2l1M3r5J93lj79J5N5N5m6P3oq2K7k1J45j27m7K3L2j51N3J42j08
6048e5L7M8J2j00J09j34L4k6J6K1R6j5q1J41q3m7L1N2j49J39M6n2R0j33j26J96
6074F7o5mN4l7m5Q2j71J06n0J15l2o6K17j17p2R0n9j65J77j01r0J81o9k9m2j4
6100a39J14N7j04N7J07k90J48J23p1n4K6n6J2j3J19j66J08P9j97Q6J02m6j09J62
$$ [...]
8191A1
##END NTUPLES=NMR FID
##END=
